##TITLE=1H ikalashn
Cl-Ac
18.12.2024
##JCAMPDX= 6.0         $$ Bruker NMR JCAMP-DX V2.0
##DATA TYPE= NMR SPECTRUM
##DATA CLASS= NTUPLES
##ORIGIN= UXNMR, Bruker Analytische Messtechnik GmbH
##OWNER= root
$$ TOPSPIN		Version 1.3
$$ 2024-12-18 16:16:13.250 +0400  Irina@DPX200
$$ Compression mode = diff/dup
##.OBSERVE FREQUENCY= 200.131300845
##.OBSERVE NUCLEUS= ^1H
##.ACQUISITION MODE= SIMULTANEOUS
##.ACQUISITION SCHEME= undefined
##.AVERAGES= 16
##.DIGITISER RES= 18
##SPECTROMETER/DATA SYSTEM= spect
##.PULSE SEQUENCE= zg
##.SOLVENT NAME= CDCl3
##.SHIFT REFERENCE= INTERNAL, CDCl3, 1, 17.49637
##AUDIT TRAIL= $$ (NUMBER, WHEN, WHO, WHERE, WHAT)
$$ ##TITLE= Audit trail, TOPSPIN		Version 1.3
$$ ##JCAMPDX= 5.01
$$ ##ORIGIN= Bruker BioSpin GmbH
$$ ##OWNER= Irina
$$ $$ F:/spectra/data/iren/nmr/1H/4/pdata/1/auditp.txt
$$ ##AUDIT TRAIL=  $$ (NUMBER, WHEN, WHO, WHERE, VERSION, WHAT)
(   1,<2024-12-18 16:15:51.671 +0400>,<Irina>,<DPX200>,<TOPSPIN 1.3>,
      <created by zg
	started at 2024-12-18 16:14:44.375 +0400,
	POWCHK disabled, PULCHK disabled
       terminated by command 'halt'
       configuration hash MD5:
       BE 6D 3F 07 2A EA 11 49 91 17 2B D3 AF B3 58 0D
       data hash MD5: 16K
       0B 2B 38 69 3F D5 9E BE 69 96 23 EC C4 23 A2 D9>)
(   2,<2024-12-18 16:15:51.984 +0400>,<Irina>,<DPX200>,<TOPSPIN 1.3>,
      <Start of raw data processing
       efp BC_mod = 2 LB = 0.02 FT_mod = 6 PKNL = 1 PHC0 = 89.5294 PHC1 = 15.73927 SI = 32K 
       data hash MD5: 32K
       B9 60 6F 13 7F 42 77 77 9A 01 13 70 9B 28 E7 38>)
(   3,<2024-12-18 16:15:55.375 +0400>,<Irina>,<DPX200>,<TOPSPIN 1.3>,
      <apk 
       data hash MD5: 32K
       AE 2F CA 1D 8E D0 48 EE 5A 2B E6 71 C0 57 48 64>)
(   4,<2024-12-18 16:15:58.015 +0400>,<Irina>,<DPX200>,<TOPSPIN 1.3>,
      <abs n ABSG = 5 
       data hash MD5: 32K
       12 15 0D 86 A2 0B F8 C4 D3 39 00 69 3E DD A1 9E>)
$$ ##END=
$$ 
$$ $$ hash MD5
$$ $$ 0E BB 0A 73 CA 3A 08 63 36 15 A9 38 9B D0 0B F9
##$RELAX= 
##$RELAX= 
##$RELAX= 
##$RELAX= 
##$RELAX= 
##$RELAX= 
##$RELAX= 
##$RELAX= 
##$RELAX= 
$$ Bruker specific parameters
$$ --------------------------
##$DU= <F:/spectra>
##$EXPNO= 4
##$NAME= <1H>
##$PROCNO= 1
##$TYPE= <nmr>
##$USER= <iren>
##$AMP= (0..31)
100 100 100 100 100 100 100 100 100 100 100 100 100 100 100 100 100 100 
100 100 100 100 100 100 100 100 100 100 100 100 100 100 
##$ANAVPT= -1
##$AQSEQ= 0
##$AQ_mod= 1
##$AUNM= <au_zg>
##$AUTOPOS= <>
##$BF1= 200.13
##$BF2= 200.13
##$BF3= 200.13
##$BF4= 200.13
##$BF5= 200.13
##$BF6= 200.13
##$BF7= 200.13
##$BF8= 200.13
##$BYTORDA= 1
##$CFDGTYP= 0
##$CFRGTYP= 5
##$CHEMSTR= <none>
##$CNST= (0..63)
1 1 145 1 1 1 1 1 1 1 1 1 1 1 1 1 1 1 1 1 1 1 1 1 1 1 1 1 1 1 1 1 1 1 
1 1 1 1 1 1 1 1 1 1 1 1 1 1 1 1 1 1 1 1 1 1 1 1 1 1 1 1 1 1 
##$CPDPRG= <>
##$CPDPRG1= <>
##$CPDPRG2= <>
##$CPDPRG3= <>
##$CPDPRG4= <mlev>
##$CPDPRG5= <mlev>
##$CPDPRG6= <mlev>
##$CPDPRG7= <mlev>
##$CPDPRG8= <mlev>
##$CPDPRGB= <>
##$CPDPRGT= <>
##$D= (0..63)
$$ [...]
##$SW_h= 4401.40845070422
##$TD= 16384
##$TD0= 1
##$TE= 300
##$TE2= 300
##$TE3= 300
##$TEG= 300
##$TL= (0..7)
0 120 120 120 120 120 120 120 
##$TP= (0..7)
150 150 150 150 150 150 150 150 
##$TP07= 0
##$TPNAME0= <>
##$TPNAME1= <>
##$TPNAME2= <>
##$TPNAME3= <>
##$TPNAME4= <>
##$TPNAME5= <>
##$TPNAME6= <>
##$TPNAME7= <>
##$TPOAL= (0..7)
0.5 0.5 0.5 0.5 0.5 0.5 0.5 0.5 
##$TPOFFS= (0..7)
0 0 0 0 0 0 0 0 
##$TUNHIN= 0
##$TUNHOUT= 0
##$TUNXOUT= 0
##$USERA1= <user>
##$USERA2= <user>
##$USERA3= <user>
##$USERA4= <user>
##$USERA5= <user>
##$V9= 5
##$VALIST= <valist>
##$VCLIST= <CCCCCCCCCCCCCCC>
##$VD= 0
##$VDLIST= <DDDDDDDDDDDDDDD>
##$VPLIST= <PPPPPPPPPPPPPPP>
##$VTLIST= <TTTTTTTTTTTTTTT>
##$WBST= 1024
##$WBSW= 25
##$XGAIN= (0..3)
0 0 0 0 
##$XL= 0
##$YL= 0
##$YMAX_a= 536706
##$YMIN_a= -451892
##$ZGOPTNS= <>
##$ZL1= 120
##$ZL2= 120
##$ZL3= 120
##$ZL4= 120
##$ABSF1= 17.49637
##$ABSF2= -4.496376
##$ABSG= 5
##$ABSL= 3
##$ALPHA= 0
##$AQORDER= 0
##$ASSFAC= 0
##$ASSFACI= 0
##$ASSFACX= 0
##$ASSWID= 0
##$AUNMP= <proc_1d>
##$AXLEFT= 0
##$AXRIGHT= 0
##$AXTYPE= 0
##$AXUNIT= <>
##$AZFE= 0.1
##$AZFW= 0.1
##$BCFW= 0
##$BC_mod= 2
##$BYTORDP= 0
##$COROFFS= 0
##$CY= 7568.61572265625
##$DATMOD= 1
##$DC= 0
##$DFILT= <>
##$DTYPP= 0
##$F1P= 17.9538593292236
##$F2P= -4.03888763876832
##$FCOR= 0.5
##$FTSIZE= 32768
##$FT_mod= 6
##$GAMMA= 0
##$GB= 0
##$INTBC= 0
##$INTSCL= 5.656564e-011
##$ISEN= 128
##$LB= 0.02
##$LEV0= 0
##$LPBIN= 0
##$MAXI= 945.577
##$MC2= 0
##$MEAN= 0
##$ME_mod= 0
##$MI= -402.1523
##$NCOEF= 0
##$NC_proc= -6
##$NLEV= 6
##$NOISF1= 8.587773
##$NOISF2= 6.764455
##$NSP= 0
##$NTH_PI= 0
##$NZP= 0
##$OFFSET= 17.49637
##$PC= 1
##$PHC0= 124.4061
##$PHC1= -37.54155
##$PH_mod= 1
##$PKNL= yes
##$PPARMOD= 0
##$PPDIAG= 0
##$PPIPTYP= 0
##$PPMPNUM= 100
##$PPRESOL= 1
##$PSCAL= 0
##$PSIGN= 0
##$REVERSE= no
##$SF= 200.13
##$SI= 32768
##$SIGF1= 16.12182
##$SIGF2= -4.496377
##$SINO= 3.521527
##$SIOLD= 32768
##$SREGLST= <1H.CDCl3>
##$SSB= 0
##$STSI= 32768
##$STSR= 0
##$SW_p= 4401.40845070422
##$SYMM= 0
##$S_DEV= 0
##$TDeff= 16384
##$TDoff= 0
##$TI= <>
##$TILT= no
##$TM1= 0
##$TM2= 0
##$TOPLEV= 0
##$USERP1= <user>
##$USERP2= <user>
##$USERP3= <user>
##$USERP4= <user>
##$USERP5= <user>
##$WDW= 1
##$XDIM= 32768
##$YMAX_p= 496114634
##$YMIN_p= -1855727
$$ End of Bruker specific parameters
$$ ---------------------------------
##NTUPLES= NMR SPECTRUM
##VAR_NAME=  FREQUENCY,     SPECTRUM/REAL,   SPECTRUM/IMAG
##SYMBOL=    X,             R,               I
##VAR_TYPE=  INDEPENDENT,   DEPENDENT,       DEPENDENT
##VAR_FORM=  AFFN,          ASDF,            ASDF
##VAR_DIM=   32768,         32768,           32768
##UNITS=     HZ,            ARBITRARY UNITS, ARBITRARY UNITS
##FACTOR=    0.134324425510551, 1,           1
##FIRST=     4401.40845070422, 180651,       -1972893
##LAST=      0,             49098,           -1739429
##MIN=       0,             -1855727,        0
##MAX=       4401.40845070422, 496114634,    0
$$ Real data points
##PAGE= N=1
##DATA TABLE= (X++(R..R)), XYDATA
$$ [...]
10929A2571957o45664n67643l69245k79550l21132l03628j91704j43517j70724
10920I579150j15615o311m7838j77348n8576L15904M67862J52750j91269r3443
10910I825266K23655K47972J7439j7387J88981K18304n5496k58267j94752j77087
10900A0018628m28622o47847n13807k42131k29119m11681m12280j61259M4110
10891G015992L4582n5565j01673j42538j87316j59900q8849r7098j54747r7462
10881E965426N4815P6147p4386j33318L3464J60585n827k55535j97035J31580
10871E755916K87360N4711k66647k98453o0692J36569J14873k4976j00881n3911
10861E543869L8389P5350M2971J4190K6373L043j20488k32260j52161P7088J81945
$$ plain form
10929 12571957 11926293 11358650 10989405 10709855 10388723 10085095 9893391 9749874 9579150
10920 9579150 9463535 9457224 9409386 9232038 9173462 9489366 9957228 10109978 9918709 9825266
10910 9825266 10048921 10296893 10314332 10296945 10485926 10704230 10648734 10390467 10195715 10018628
10900 10018628 9590006 8942159 8428352 8186221 7957102 7545421 7133141 6971882 7015992
10891 7015992 7050574 6995009 6893336 6750798 6563482 6403582 6314733 6217635 6062888 5965426
10881 5965426 6020241 6096388 6022002 5888684 5922148 6082733 6076906 5821371 5624336 5755916
10871 5755916 6043276 6097987 5831340 5532887 5472195 5608764 5723637 5698661 5597780 5543869
10861 5543869 5582258 5657608 5700579 5714769 5741142 5744185 5623697 5391437 5239276 5316364 5498309
10850E498309L0317j50708q4955J47390K25780N8858j02530o1128M8486J2534
10840E622353j04143o5575J37172K29372M5284k11294k34030l0698J02909o0j69107
10829E322183j65090p599R2392M1789m2847l2922N7030J32143J34791P5139K0784
10818E627793N7708J77561K25443Q4796j04268q8364J18936K18287O5713j04285
10808F279320n0201J10470J33085M7203L7762P3799o167j28558p8020P5761M8580
10797F543034j29925r8551K04464L52861J11497j36785m33K66680J91012j19861
10787G183993j60151J25035K63668N0902j44572k7544J62907J07978o1152k0733
10777G480331K15640L58723K88932J54380J04771J49125K20104K20767Q9006n8819
$$ plain form
10850 5498309 5528626 5377918 5292963 5440353 5666133 5724991 5622461 5561333 5609819 5622353
10840 5622353 5518210 5452635 5589807 5819179 5864463 5653169 5419139 5388441 5491350 5491290 5322183
10829 5322183 5157093 5149494 5241886 5283675 5240828 5207906 5264936 5397079 5531870 5607009 5627793
10818 5627793 5685501 5863062 6088505 6173301 6069033 5980669 6099605 6317892 6383605 6279320
10808 6279320 6229119 6339589 6472674 6519877 6557639 6631438 6625271 6496713 6418693 6494454 6543034
10797 6543034 6413109 6314558 6519022 6871883 6983380 6846595 6846162 7112842 7303854 7183993
10787 7183993 7023842 7148877 7412545 7463447 7318875 7291331 7454238 7562216 7501064 7480331
10777 7480331 7695971 8054694 8343626 8498006 8602777 8751902 8972006 9192773 9281779 9222960
10767I222960J4903L17518N03867L20117Q684o914K75475M73349M07467K99448
10757A1836874L43173M25158M07538L98317N34497P01449O98044N63553N28755
10748A6437358O96588R43658J114717J176918J189003J223663J317280J424426
10740B5523611J446652J366841J297066J306417J272287J038104O74647M08526
10732C4334151K76705M6422m19506q75745r49900o15419k16560j6519Q4365K93893
10722C1941887N67881O91677O38244O12839P10147P40078N14161J43291j27763
10713C6432442k83113n15465q60404j075165r60370o35574l73573k67474j91329
10704C1269975k8407J92624L72537M44239L91105K42446O7469q4244k46788m88125
$$ plain form
10767 9222960 9237863 9555381 10059248 10379365 10388049 10381135 10656610 11129959 11537426 11836874
10757 11836874 12180047 12605205 13012743 13411060 13945557 14647006 15345050 15908603 16437358
10748 16437358 17133946 18077604 19192321 20369239 21558242 22781905 24099185 25523611
10740 25523611 26970263 28337104 29634170 30940587 32212874 33250978 33925625 34334151
10732 34334151 34610856 34657278 34237772 33362027 32412127 31796708 31580148 31563629 31647994 31941887
10722 31941887 32509768 33201445 33839689 34452528 35162675 35902753 36416914 36560205 36432442
10713 36432442 36149329 35633864 34773460 33698295 32737925 32102351 31728778 31461304 31269975
10704 31269975 31241568 31434192 31806729 32250968 32642073 32884519 32951988 32867744 32620956 32132831
10694C2132831p83260r93601j003915q40744o21502m19590k26422k7812J46512
10685B7362497K66658L38728L55400K62216M7999j68108k58148l01854n35803
10676B7369585j010483j435764j506097j277503j046993r33477q03043n88750
10668A8767475m21052l73894l28172k13175j61592k56970l33881k49287j73587
10659A6255865l33990n96081o25377m07134k54278k82582k47858j6015J61900
10650A3654450N6933j47379j46743J8214R1208L8385K7724O3061j5603j87684
10640A3452566k46777j72456j76980l04985l24223j51961m9224j73525k61776
10631A1590659o5867J74561R1738j78629j97826L7267Q0080k02416l90885k24939
$$ plain form
10694 32132831 31349571 30355970 29352055 28511311 27889809 27470219 27243797 27215985 27362497
10685 27362497 27629155 27967883 28323283 28585499 28633498 28465390 28207242 27905388 27369585
10676 27369585 26359102 24923338 23417241 22139738 21092745 20159268 19356225 18767475
10668 18767475 18346423 17972529 17644357 17431182 17269590 17012620 16678739 16429452 16255865
10659 16255865 15921875 15325794 14700417 14293283 14039005 13756423 13508565 13492550 13654450
10650 13654450 13711383 13564004 13417261 13435475 13526683 13565068 13592792 13655853 13640250 13452566
10640 13452566 13205789 13033333 12856353 12551368 12227145 12075184 12025960 11852435 11590659
10631 11590659 11524792 11699353 11791091 11612462 11414636 11451903 11531983 11329567 10938682 10713743
10621A0713743n0915k29261n05643m12620k4441J68582q25k21129k35036j09723
10611I092732L0957J63452K14165R2176q6526j22433q6183j99913l79266l29825
10601H389336j28628j86746n11493n90122k52940l2787k67550m64113j38457K64940
10591F081440O3761m58494m52581R2105L24546o1931l80648j50337J69324O9833
10581E297018j70363j05574O8686l0082k11955q7961J72056J36381j09995j59862
10571D798349n1181j46086l64289k55644J59493L17957R21l32529k89573o0597
10561C776821M8715R3015J93916K04378R985j68265j04992N9282P7744j0229l5113
10550D145257l0139j11290j97499j39922m028L3283l5482q8407q8562o4126P153
$$ plain form
10621 10713743 10662828 10433567 9927924 9515304 9490863 9659445 9658620 9437491 9202455 9092732
10611 9092732 9123689 9287141 9501306 9593482 9506956 9384523 9298340 9098427 8719161 8389336
10601 8389336 8260708 8073962 7562469 6972347 6719407 6686620 6419070 5954957 5816500 6081440
10591 6081440 6145201 5686707 5234126 5326231 5650777 5588846 5208198 5057861 5227185 5297018
10581 5297018 5126655 5021081 5089767 5059685 4847730 4759769 4931825 5068206 4958211 4798349
10571 4798349 4747168 4601082 4236793 3981149 4140642 4458599 4459520 4126991 3837418 3776821
10561 3776821 3825536 3918551 4112467 4316845 4326830 4158565 4053573 4112855 4190599 4180370 4145257
10550 4145257 4115118 4003828 3806329 3666407 3662379 3695662 3660180 3571773 3483211 3419085 3426238
10539C426238J06978R9403o7280k14046j71135k2527O9286J11400J52034J01097
10529C591448p2715j61083k2314J17810K342j98012j55065L3805k436k41398k64242
10518B628140L6524K52399J11402j21564j19111K7618P1390K4176J4866l066r7862
10507B824912j25644M2774K23168J49622j04507k21450q8764R8457J47615O3474
10497C009657m8466r9648n6989J3871l460r3429r0660M7510J23415J4102r7106
10486B718797l0464N6480m9693j88925p1019J74054J48954j35060k30949J2621
10476B404796J93848L2852j65985m7570J89160J35549j48901k57548q8374O7514
10466B315341L7464l9720m6978m7189m9363M8179J90001J52922p3028j92123n5153
$$ plain form
10539 3426238 3533216 3632619 3565339 3351293 3180158 3157631 3226917 3338317 3490351 3591448
10529 3591448 3518733 3357650 3335336 3453146 3455488 3257476 3102411 3136216 3133780 2892382 2628140
10518 2628140 2664664 2917063 3028465 2906901 2787790 2815408 2886798 2910974 2925840 2922774 2824912
10507 2824912 2699268 2742042 2965210 3114832 3010325 2788875 2700111 2798568 2946183 3009657
10497 3009657 2961191 2861543 2804554 2818425 2814965 2721536 2630876 2678386 2801801 2815903 2718797
10486 2718797 2688333 2744813 2695120 2506195 2435176 2609230 2758184 2623124 2392175 2404796
10476 2404796 2598644 2631496 2465511 2417941 2607101 2742650 2593749 2336201 2247827 2315341
10466 2315341 2352805 2313085 2266107 2218918 2169555 2217734 2407735 2560657 2487629 2295506 2240353
10455B240353Q1625l0526k19028j77753K8113Q9316k4425m2257J14506J88361
10445B248285L3309j23952n7554Q6416M4098j22421j30754N4689J64000M9238
10435B245354r9269o4144Q1994J23370K8388m3167j212O3550L3069q2870j73912
10424B111151j55744n2374K6884O416n0545j0881J26028J84736N4022j16122r6036
10413B027535Q9366J76532K8412j80931k13620o3427R2907J35366P8823j6132
10403B154831r1487q9616r176N7302L0457l5007k5935N6818J02121N4098k9675
10392B174731q5826j04415p0370L7189J53114J50649J8104r2689p1380o848l9815
10381B062444j36833j40909j2628J10878J08537K2580k0837L0850J12641J17828
$$ plain form
10455 2240353 2321978 2291452 2072424 1894671 1922784 2012100 1987675 1945418 2059924 2248285
10445 2248285 2281594 2157642 2100088 2186504 2230602 2108181 1977427 2032116 2196116 2245354
10435 2245354 2146085 2081941 2163935 2287305 2315693 2272526 2271314 2334864 2367933 2285063 2111151
10424 2111151 1955407 1903033 1929917 1936333 1885788 1874907 2000935 2185671 2239693 2123571 2027535
10413 2027535 2116901 2293433 2321845 2140914 1927294 1863867 1956774 2092140 2170963 2154831
10403 2154831 2063344 1973728 1964552 2021854 2052311 2017304 1991369 2048187 2150308 2204406 2174731
10392 2174731 2088905 1984490 1914120 1951309 2104423 2255072 2273176 2180487 2109107 2102259 2062444
10381 2062444 1925611 1784702 1772074 1882952 1991489 2014069 1993232 2024082 2136723 2254551
10371B254551M586j45803j88788p3547Q1166J20754M1740k2536J1879Q6403R8618
10360B269023K6345o1965p9431r531N0586j3109j48297j53596K0049J22866m2949
10349A979991k52144j39497K05683L20973R5370m0698J56777K96704L977l84411
10339B242725l07359R9390J99252j25286l15327p3223J90571Q7474j40684j02724
10329A754809J04586J57513O1068J7503O841p8575j04605O8588K13310N3504j99108
10318B055434j27022J71555J89923j53191l48275r6698K36874K16228m2505j46301
10308A956022k1409Q7782L5832p9707j04531P454J47639J20516j13075k77355
10298A759168r9177K34432K72797j2904j64145J9966J54681n0144k59476p6243
$$ plain form
10371 2254551 2259137 2113334 1924546 1850999 1932165 2052919 2094659 2072123 2084002 2170405 2269023
10360 2269023 2295368 2233403 2153972 2144441 2195027 2181918 2033621 1880025 1900074 2022940 1979991
10349 1979991 1727847 1588350 1794033 2115006 2210376 2169678 2326455 2623159 2627136 2242725
10339 2242725 1935366 2034756 2234008 2108722 1793395 1720172 1910743 1998217 1857533 1754809
10329 1754809 1859395 2016908 2077976 2095479 2102320 2023745 1919140 1987728 2201038 2254542 2055434
10318 2055434 1928412 2099967 2289890 2136699 1788424 1691726 1928600 2144828 2102323 1956022
10308 1956022 1934613 2022395 2058227 1978520 1873989 1881443 2029082 2149598 2036523 1759168
10298 1759168 1659991 1894423 2167220 2154316 1990171 2010137 2164818 2114674 1855198 1778955
10288A778955K56369K30561j10481k76129j02545J01472J23799P7104N5605l82
10278B134328o2364j2704R0682Q6926K6018N5923O3544j45152l68018k24786J48268
10267A792665K03622j25390k63899O0182L45850J49950j93874j70563Q4348J17917
10257B000808l7010j0505J80357J77050n2518j68535o7668j3167j08577j16983
10247A783252Q1758K54259J84806k0782j35299q3738O2532J65672P7037j80683
10237B188814l21602j33722J57338J71429m4805j06280O3832J31452l7976j46089
10227A922391o273J35104O8322o934J11369K19226P4524j33297r1851Q9089P3563
10216B455233j16197j50205M8610K09528J74417Q2439N8346M1757r782k6657n402
$$ plain form
10288 1778955 2035324 2265885 2155404 1879275 1776730 1878202 2002001 2079105 2134710 2134328
10278 2134328 2071964 2059260 2149942 2236868 2262886 2318809 2382353 2237201 1869183 1644397 1792665
10267 1792665 1996287 1870897 1606998 1667180 2013030 2162980 1969106 1798543 1882891 2000808
10257 2000808 1963798 1953293 2133650 2310700 2258182 2089647 2021979 2008812 1900235 1783252
10247 1783252 1865010 2119269 2304075 2283293 2147994 2064256 2126788 2292460 2369497 2188814
10237 2188814 1867212 1733490 1890828 2062257 2017452 1911172 1975004 2106456 2068480 1922391
10227 1922391 1916118 2051222 2119544 2112610 2223979 2443205 2517729 2384432 2292581 2381670 2455233
10216 2455233 2339036 2188831 2237441 2446969 2621386 2703825 2762171 2803928 2794146 2767489 2762087
10205B762087m0845j22113j18868j8237M3510K4433K1333L1387o9278k33935k14499
10194B064975L6604J99654L1665k38381k20664O6819K31921P4613j56286j42645
10184A948275P1441J74362K4650j68563j41062N8843J32581m1414k14789j25930
10174A718394R2675R6674j32097k25242J7035K95666K37085n9770j76987J5793
10164A879226K01694R1269j87875k96264j31250Q1104J05686j3600l9769J23591
10154A813812K79782J92458o5387j72289k897J68696N0216k26500k72180q22K35631
10143B000520J38695j35957k25323n9321R3915M1818q0339m0625J43434K26596
10133B103413P5812j39689j60623K7783J77499R9950r4489j51014n923J41865
$$ plain form
10205 2762087 2721242 2599129 2480261 2462024 2505534 2529967 2551300 2582687 2513409 2279474 2064975
10194 2064975 2101579 2301233 2332898 2094517 1873853 1940672 2172593 2247206 2090920 1948275
10184 1948275 2019716 2194078 2218728 2050165 1909103 1967946 2100527 2059113 1844324 1718394
10174 1718394 1811069 1907743 1775646 1550404 1567439 1863105 2100190 2040420 1863433 1879226
10164 1879226 2080920 2172189 1984314 1688050 1556800 1637904 1743590 1729990 1690221 1813812
10154 1813812 2093594 2286052 2220665 2048376 2045479 2214175 2264391 2037891 1765711 1764889 2000520
10143 2000520 2139215 2003258 1777935 1718614 1812529 1854347 1774008 1733383 1876817 2103413
10133 2103413 2179225 2039536 1878913 1906696 2084195 2184145 2089656 1938642 1932719 2074584
10123B074584J05496m3445q1216N3817J59676L6084k17825k93827p9173J68847
10113A883018J59704l5879j16918j2682N1658k3030l2522J33462K19596J2383
10103B238790k22668r9363K37180K78022n3733k74363j14162Q6763N663j17874
10093A964255L8535K47552J03107k29552k27559J27318L06566Q7830j43334r5692
10083B179026p246j05066j48894R0776L20930J69935j63328k14146Q277J14710
10073B244974K8881K5533J29206O3256j48735j25450J67281K40276j10134l72899
10063B142189j13738K89840K43164j07712j55183J47503K45379o0137k99689j39160
10053B192456J12148Q4749o1079j1083J20345L2004j83269j67142R6141K32370
$$ plain form
10123 2074584 2180080 2136635 2055419 2109236 2268912 2304996 2087171 1793344 1714171 1883018
10113 1883018 2042722 2006843 1889925 1877243 1928901 1905871 1873349 2006811 2226407 2238790
10103 2238790 2016122 1916759 2153939 2431961 2378228 2103865 1989703 2076466 2082129 1964255
10093 1964255 2002790 2250342 2353449 2123897 1896338 2023656 2330222 2418052 2274718 2179026
10083 2179026 2171780 2066714 1917820 2008596 2329526 2499461 2336133 2121987 2130264 2244974
10073 2244974 2273855 2299388 2428594 2491850 2343115 2217665 2384946 2625222 2515088 2142189
10063 2142189 2028451 2318291 2561455 2453743 2298560 2446063 2691442 2631305 2331616 2192456
10053 2192456 2304604 2389353 2328274 2317191 2437536 2469540 2286271 2119129 2215270 2447640
10043B447640N2418j84824j75341L2811J70789J04136n8812j21301J029J80683
10033B449228J90804j2267j82556q7092J56466K30548O3203j04839j04267l6301
10023B562927k0854P95P6466Q1998n7212j58451k5120K14355K52475L6675j73733
10012B790321j82780p7423k8359n0732m7907K0520R4553Q5820k8339j39585p9296
10001B356793J53851L03217J50526j43392k11951J675J65239O7600p9928k7453
9991B736177R6069K9811j44954j28464Q0618J60325j2963j59001l2098K11438
9981B836958K62609Q2510j10762j51575n7440O6130J18305O0872k8880l5095J8924
9970C062556n776j11142j16293L3069J22363R623r8372M0336K82602L01616J03004
$$ plain form
10043 2447640 2500058 2315234 2139893 2172704 2343493 2447629 2388817 2267516 2268545 2449228
10033 2449228 2640032 2627765 2445209 2358117 2514583 2745131 2808334 2703495 2599228 2562927
10023 2562927 2542073 2542868 2619334 2701332 2644120 2485669 2460549 2674904 2927379 2964054 2790321
10012 2790321 2607541 2530118 2501759 2451027 2403120 2423640 2518193 2604013 2575674 2436089 2356793
10001 2356793 2510644 2813861 2964387 2820995 2609044 2610719 2775958 2843558 2763630 2736177
9991 2736177 2832246 2862057 2717103 2588639 2669257 2829582 2816619 2657618 2625520 2836958
9981 2836958 3099567 3182077 3071315 2919740 2862300 2928430 3046735 3107607 3078727 3043632 3062556
9970 3062556 3056780 2945638 2829345 2862414 2984777 2994400 2896028 2936364 3218966 3520582 3623586
9959C623586l717P9978J07541p6044k79974k68156o9305J31966K15707J48441
9949C610023k1710j19463L850K11554K09446q417j24221r53J05942Q045q7947
9938C786149L2274J88465J20884m8668m3917P6638N9883n3285l416J93163K42873
9927D551043O2190j13895j31748p8495j9698Q0013J50477P6129j6079J02892L13276
9916D976105K56174m4925j46798Q7535K25678k1827l03211j93035J44787K74082
9906E254565J48725L0913K791j2391M5072K17950K72695L2362k03445m2148L40630
9895F087719M34705J94802N1503J49001J68757k714l0909K32439M15108K26909
9885G927320o0900q7703L3529J4957o6306L4323K13086J55687j11696k26563l5003
$$ plain form
9959 3623586 3619869 3699847 3807388 3731344 3451370 3183214 3113909 3245875 3461582 3610023
9949 3610023 3588313 3468850 3472700 3684254 3893700 3885283 3761062 3760109 3866051 3874096 3786149
9938 3786149 3818423 4006888 4127772 4079104 4035187 4111825 4171708 4118423 4115007 4308170 4551043
9927 4551043 4613233 4499338 4367590 4289095 4269397 4349410 4499887 4576016 4559937 4662829 4976105
9916 4976105 5232279 5187354 5040556 5128091 5353769 5331942 5028731 4835696 4980483 5254565
9906 5254565 5403290 5434203 5436994 5424603 5469675 5687625 5960320 5992682 5789237 5747089 6087719
9895 6087719 6522424 6717226 6768729 6917730 7086487 7083773 7052864 7285303 7700411 7927320
9885 7927320 7866420 7778717 7812246 7827203 7760897 7795220 8008306 8163993 8052297 7825734 7790731
9874G790731K12162K45489Q7075p9519j36527o9930O3282J56004J41065P5370
9864H485202O3124J21868J89732K12138J64398P0514M3380J74765L37710K94943
9854A0157774Q7579N4697L08106M94375L46510J58928L15948O11808N62292K36205
9844A3334222J68099M60255O19706M24955L09078N82351Q61607P18070M18202
9835A7896545M77058Q14500R47384Q12528P91551R98117J128231J051306J017823
9826B5935043J178663J377054J552543J888809K368406K615573K437201K149827
9818D1503119K107244K254742K416779K624632K793948K486721J519843N05025
9810E8212053J42914J28254n42334k125340l658961m146920l649218k899059k339472
$$ plain form
9874 7790731 8002893 8248382 8335457 8255938 8119411 8049481 8112763 8268767 8409832 8485202
9864 8485202 8548326 8670194 8859926 9072064 9236462 9306976 9350356 9525121 9862831 10157774
9854 10157774 10245353 10300050 10608156 11102531 11449041 11607969 11923917 12535725 13098017 13334222
9844 13334222 13502321 13962576 14582282 15007237 15316315 15898666 16760273 17478343 17896545
9835 17896545 18373603 19188103 20135487 20948015 21739566 22737683 23865914 24917220 25935043
9826 25935043 27113706 28490760 30043303 31932112 34300518 36916091 39353292 41503119
9818 41503119 43610363 45865105 48281884 50906516 53700464 56187185 57707028 58212053
9810 58212053 58354967 58483221 57940887 55815547 52156586 48009666 44360448 41461389 39121917
9801C9121917j959184j712988j605260j512097j316739j138544j134237j186900
9793B7555968j080854q66131p40576o67116m40915r3704R6332J4938j44528j78906
9783B3454508q1842P0905K27855L27910L35510L04551K63212J19566j35757k78737
9773B4607681j73138q3314k97289n69294m15468P8406K98183L6080j89110K5243
9763B3317980L39980K58647r0708k09969Q548K22412J96482M4250k7053N6728
9753B4117297K23679L14025K37970J42587K36561M21553M10252K58877L37605
9744B6700406O38937O69338L04887J48053N85437J081027J013525O88024P67888
9735C2597522J131739J165465R07235R62457J388588J591830J369289J198033
$$ plain form
9801 39121917 37162733 35449745 33844485 32332388 31015649 29877105 28742868 27555968
9793 27555968 26475114 25608983 24868407 24201291 23760376 23666672 23763004 23777942 23633414 23454508
9783 23454508 23372666 23443571 23671426 23999336 24334846 24639397 24902609 25022175 24886418 24607681
9773 24607681 24434543 24351229 24053940 23484646 23069178 23147584 23445767 23481847 23292737 23317980
9763 23317980 23657960 23916607 23825899 23615930 23624478 23846890 24043372 24087622 24060569 24117297
9753 24117297 24340976 24655001 24892971 25035558 25272119 25693672 26103924 26362801 26700406
9744 26700406 27339343 28008681 28313568 28461621 29047058 30128085 31141610 31829634 32597522
9735 32597522 33729261 34894726 35801961 36764418 38153006 39744836 41114125 42312158
9727D2312158J376689J660122J873193K146731K424229K459884K400015K628558
9719E9281579L004852L089626L118104L727530M674694N067971N090462O039276
9711I3094094Q096267R540399R071584P600975O742278O849829P638575R154143
9703A57788144J0516551R335532M765836j2147j312474n17721k854491j0040631
9695A67668599j7310026j9278845j6206491j2372507j0262855r000276p445722
9688G5791877o014060n260946m759551m024413l294128k889253k653005k367777
9680D4528744k080234j831160j590745j483386j571010j525538j081849o33470
9672C2731352p11230j050313r51513m60825l23063p28492r95235p06893l44530
$$ plain form
9727 42312158 43688847 45348969 47222162 49368893 51793122 54253006 56653021 59281579
9719 59281579 62286431 65376057 68494161 72221691 76896385 81964356 87054818 93094094
9711 93094094 101190361 110730760 119802344 127403319 134145597 140995426 148634001 157788144
9703 157788144 168304695 177640227 182406063 182393916 181081442 180563721 177709230 167668599
9695 167668599 150358573 131079728 114873237 102500730 92237875 83237599 75791877
9688 75791877 69777817 64516871 59757320 55732907 52438779 49549526 46896521 44528744
9680 44528744 42448510 40617350 39026605 37543219 35972209 34446671 33364822 32731352
9672 32731352 32020122 30969809 30018296 29557471 29234408 28505916 27510681 26803788 26459258
9663B6459258m30890p28941p32488m47965k49584k97259m55747n61078n31141
9654B2024165l99212l41453m59104n47506l84623j68126k31735m06417k40184
9645A8845805J43655R4930m98501r00152o00161o2703L0054k64314m42757l72010
9635A5973846k85616k76825k71806k81391l01210k01658k7308q2277l88836m64978
9625A3391941o6940K71905k875n45656o10309k02349J0329j87665l06271n8677
9615A1693433J97830J24092r5559j70800j51040j80480j89969r8836k5466o9345
9605A1033860j28863j10284q2999q8867m3299M6210J9491j46582k43404j60241
9595A0095022n3062m8387m6511K3345K4622j18558k27494j55005l8063m5910r0535
$$ plain form
9663 26459258 26028368 25299427 24566939 24118974 23869390 23572131 23116384 22555306 22024165
9654 22024165 21624953 21283500 20824396 20276890 19892267 19724141 19492406 19085989 18845805
9645 18845805 18989460 19084390 18585889 17685737 17085576 17022873 17052927 16788613 16345856 15973846
9635 15973846 15688230 15411405 15139599 14858208 14556998 14355340 14328032 14245755 13856919 13391941
9625 13391941 13325001 13596906 13594031 13048375 12438066 12235717 12246046 12058381 11752110 11693433
9615 11693433 11891263 12015355 11919796 11748996 11597956 11417476 11227507 11128671 11103205 11033860
9605 11033860 10904997 10794713 10711714 10622847 10579548 10625758 10645249 10498667 10255263 10095022
9595 10095022 10041960 9993573 9947062 9970407 9995029 9876471 9648977 9493972 9455909 9409999 9319464
9584I319464k3418P4572N1189l6191n0621l9159j09843j76470r2988O2187J00450
9573I079172L3632J0736L1289l270l3341N6016J34168k4417k96499l00152K650
9562H689984J88482J7797j84908o1434K01928J97242l5724j06583N8846J19503
9552I085133o9823j99717l9489J54964N9573j75653j70115O8657J74037K2836
9542H910403r4483K2283J72672J16446m6763q1980O491L9435m2663j63251k70274
9531H568316l20458k28469l0644M0351j25719k71394j28343J18220Q0204k01074
9521G500990k94524o3554J31512L2820j33756q8240N5828N0952o0899q5047k3130
9510G022952L252P545M4734K0272j31839k26163p5611J56307J60875m9392j95084
$$ plain form
9584 9319464 9296046 9370618 9421807 9385616 9334995 9295836 9185993 9009523 8916535 8978722 9079172
9573 9079172 9112804 9123540 9154829 9151559 9118218 9174234 9308402 9283985 8987486 8687334 8689984
9562 8689984 8878466 8896263 8711355 8649921 8851849 9049091 9013367 8906784 8965630 9085133
9552 9085133 9015310 8815593 8776104 8931068 8990641 8814988 8644873 8713530 8887567 8910403
9542 8910403 8815920 8838203 9010875 9127321 9080558 8998578 9005069 9044504 9001841 8838590 8568316
9531 8568316 8247858 8019389 7988745 8029096 7903377 7631983 7503640 7621860 7702064 7500990
9521 7500990 7206466 7142912 7274424 7307244 7173488 7085248 7141076 7192028 7131129 7046082 7022952
9510 7022952 7026204 7033749 7078483 7098755 6966916 6740753 6665142 6821449 6982324 6932932 6737848
9499F737848j80293j51009j38347j0548J82695J81787n5474k21309j12640O4012
9489F296722M4562p5113l0579J59674K20013N0658j19653o8488J09071J38659
9479F725526n5694k37475j59159J00009K13426L2028k08224j94762O1155K76994
9469F553824K74179J27249k3252j18827j35960o2283M2869R3296R6395J08421
9459F955911R2807j5198j24761p5824Q1471J21531J920n6409O3116J71676Q7819
9448G304059o9957r3571j0725J5200j7345K3654J43856J92788Q1524j06124k08766
9437G254593j20423J10442K59854J26562j71488k64116j5707K49189K00306j4607
9427G614605k6159J60241J91906l5666j95789m5274K03910K21811M1732l1568
$$ plain form
9499 6737848 6557555 6406546 6268199 6257651 6440346 6622133 6566659 6345350 6232710 6296722
9489 6296722 6341284 6266171 6235592 6395266 6615279 6665937 6546284 6477796 6586867 6725526
9479 6725526 6669832 6432357 6273198 6373207 6586633 6618661 6410437 6215675 6276830 6553824
9469 6553824 6828003 6955252 6932000 6813173 6677213 6614930 6657799 6751095 6847490 6955911
9459 6955911 7048718 7033520 6908759 6832935 6914406 7035937 7037857 6981448 7044564 7216240 7304059
9448 7304059 7234102 7140531 7129806 7145006 7127661 7151315 7295171 7487959 7569483 7463359 7254593
9437 7254593 7134170 7244612 7504466 7631028 7459540 7195424 7179717 7428906 7629212 7614605
9427 7614605 7588446 7748687 7940593 7904927 7709138 7663864 7867774 8089585 8131317 8099749
9417H099749J18421K75446K01663n3734k10848q0973K10699L61418K53614R1207
9407I266662R8437J94366J41674m5862r3052J03462K83246J98234j7364n1445
9397A0078358J30592K59570J66128L993P763J69104K70299J91490O3131O7595
9387A1408023J68907J59986j5932j38090o850K43319L03872J17278n9259k7279
9377A2153975J23141K23435K62701K88440K49107J14532K5805J17594K66313K37551
9367A4062594N9975J6895K19901M16463L48451J28205O8534K31892L70579L21336
9357A6244825K43243L48895N51079N69815L48746J61910K47620M98634O35790
9348A9850557N76809M74000M43195M40780M28507M86322O64854Q33804Q06347
$$ plain form
9417 8099749 8218170 8493616 8695279 8641545 8430697 8349724 8560423 8921841 9175455 9266662
9407 9266662 9365099 9559465 9701139 9655277 9562225 9665687 9948933 10147167 10129803 10078358
9397 10078358 10208950 10468520 10634648 10638641 10646404 10815508 11085807 11277297 11340428 11408023
9387 11408023 11576930 11736916 11720984 11582894 11576044 11819363 12123235 12240513 12181254 12153975
9377 12153975 12277116 12500551 12763252 13051692 13300799 13415331 13441136 13558730 13825043 14062594
9367 14062594 14122569 14139464 14359365 14775828 15124279 15252484 15321018 15552910 15923489 16244825
9357 16244825 16488068 16836963 17388042 17957857 18306603 18468513 18716133 19214767 19850557
9348 19850557 20427366 20901366 21344561 21785341 22213848 22700170 23365024 24198828 25005175
9339B5005175N93798M36870N44637Q40451J026672R29018P22993P21773R55382
9330C1776769J122789J027413Q68141R23263J108590J121872R43433Q67568J019123
9321D0778961J165965J111333R70542R00379Q27308O52768M96601M95105N40750
9312D7939712M68086L39172K94325K72097J53221M6510J25429K86774K99036K09239
9302E0433601K49665L94803M04948L07205M03734P27153R23895Q32736P56611
9293E5434351R33037J136503J114046J056145J245828J522233J538247J364541
9285F5344931J368698J586794J686219J556101J489302J685759J956582K060338
9277G8734724K017039J940202J836327J728573J730100J833193J852178J726909
$$ plain form
9339 25005175 25598973 26035843 26580480 27420931 28447603 29376621 30099614 30821387 31776769
9330 31776769 32899558 33926971 34795112 35718375 36826965 37948837 38892270 39759838 40778961
9321 40778961 41944926 43056259 44026801 44927180 45754488 46407256 46903857 47398962 47939712
9312 47939712 48407798 48746970 49041295 49313392 49466613 49513123 49638552 49925326 50224362 50433601
9302 50433601 50683266 51078069 51483017 51790222 52193956 52921109 53845004 54677740 55434351
9293 55434351 56367388 57503891 58617937 59674082 60919910 62442143 63980390 65344931
9285 65344931 66713629 68300423 69986642 71542743 73032045 74717804 76674386 78734724
9277 78734724 80751763 82691965 84528292 86256865 87986965 89820158 91672336 93399245
9269I3399245J643330J685802J638460J365420J124900J183731J324857J129794
9261A04495539O41760L27156L82479M93237L74330J68682J24389J91224J88502
9252A07387298J48137K16384L55152M04054L61271L66809M50296N09458N15343
9243A10714202N36351N65637N24547M51683M90175O45606P48036P22921P15231
9234A16114389Q40952R83196R81253Q96683R17971J065588J163120J096872R65113
9225A25025137R31233J015330J086715J038084R25905R04338J012173J094187
9217A33033102J014798Q85040R21814J104283J182571J075006J014737J167627
9209A41398978J337268J266786J046093R45352R74001R13994P22062N74898N25602
$$ plain form
9269 93399245 95042575 96728377 98366837 99732257 100857157 102040888 103365745 104495539
9261 104495539 105137299 105464455 105846934 106340171 106714501 106883183 107007572 107198796 107387298
9252 107387298 107535435 107751819 108106971 108511025 108872296 109239105 109689401 110198859 110714202
9243 110714202 111250553 111816190 112340737 112792420 113282595 113928201 114676237 115399158 116114389
9234 116114389 116955341 117938537 118919790 119816473 120734444 121800032 122963152 124060024 125025137
9225 125025137 125956370 126971700 128058415 129096499 130022404 130926742 131938915 133033102
9217 133033102 134047900 134932940 135854754 136959037 138141608 139216614 140231351 141398978
9209 141398978 142736246 144003032 145049125 145994477 146968478 147882472 148604534 149179432 149705034
9200A49705034M35992K78415J82162J20146j07382m63691o09552m38192l30150
9191A48772782n98103r82957j058995r02189r28446j201615j364558j249492j113934
9182A39372493j164603j226176j072180q00943o59432o80224p03360o40157n34845
9173A31890573m36044l49027k73068j95643r9516k9869o9040j85702k18398r7601
9163A29936665J9784m7803k48279l63979k92421j40395n3193n2234n7998j0336
9153A28689811O4501J00165R6258J36154K47299K99498J64621m9956j04535Q482
9143A29652298R254k64002o02919p51170p92209r70313j252003j372643j294548
9134A22361745j300802j547680j794662j748009j485727j336749j435500j595150
$$ plain form
9200 149705034 150141026 150419441 150601603 150721749 150614367 150150676 149541124 149102932 148772782
9191 148772782 148174679 147191722 146132727 145230538 144302092 143100477 141735919 140486427 139372493
9182 139372493 138207890 136981714 135909534 135108591 134449159 133768935 133065575 132425418 131890573
9173 131890573 131454529 131105502 130832434 130636791 130537275 130507406 130438366 130252664 130034266 129936665
9163 129936665 129956449 129908646 129660367 129296388 129003967 128863572 128810379 128758145 128700147 128689811
9153 128689811 128754312 128854477 128950735 129086889 129334188 129633686 129798307 129748351 129643816 129652298
9143 129652298 129661552 129397550 128794631 128043461 127251252 126280939 125028936 123656293 122361745
9134 122361745 121060943 119513263 117718601 115970592 114484865 113148116 111712616 110117466
9126A10117466j600063j455406j310002j246348j218556j159617j094494j123595
9118I9909385j283751j447572j429344j224468j071968j190335j483782j627623
9110H9150542j467149j211417j147778j263741j303488j160591j012842j005638
9102G9577898j003733q28000n93927n64110p15490p35916m95490k42544k04386
9093G4194302k52484j70160l3206m2333j25200l8838J83805K29775j5905k98542
9083G3631214l93753m03018n15624p18472r08109j082767j241344j280488j194919
9074F5892720j205201j449042j694699j637998j377404j282605j438515j552747
9066E4254509j441503j275919j240560j247128j159156j056604j065540j106764
$$ plain form
9126 110117466 108517403 107061997 105751995 104505647 103287091 102127474 101032980 99909385
9118 99909385 98625634 97178062 95748718 94524250 93452282 92261947 90778165 89150542
9110 89150542 87683393 86471976 85324198 84060457 82756969 81596378 80583536 79577898
9102 79577898 78574165 77746165 77152238 76588128 75872638 75136722 74641232 74398688 74194302
9093 74194302 73941818 73771658 73738452 73696119 73570919 73532081 73715886 73945661 73929756 73631214
9083 73631214 73237461 72834443 72318819 71600347 70692238 69609471 68368127 67087639 65892720
9074 65892720 64687519 63238477 61543778 59905780 58528376 57245771 55807256 54254509
9066 54254509 52813006 51537087 50296527 49049399 47890243 46833639 45768099 44661335
9058D4661335j035782q98416q28328p99902p12942o37055p14610q57906q14364
9049C7362030n58944l64897m07713n31125n22422m12680l47176l28160k76115
9040C3612798k27170k66724l33006k81269j19851j1352l8837j15690j33232p0341
9030C2015326M4427J57018J78608P7666k7013M573J31157K07519K31095L07884
9020C3328260L85362K86456O9229O0048L76868O85795O50160L98654K86019L73814
9010C6900665M55202M63920N15876N98477N58466M12856L69291M95077O37096
9001D1406926P10006P89666Q72676Q35319P09534P02480Q35520Q66449P06401
8992D8434977N97294O89840P63060O07745L89341L28509K90111M9723k45650k85635
$$ plain form
9058 44661335 43625553 42727137 41898809 41098907 40385965 39748910 39034300 38176394 37362030
9049 37362030 36803086 36438189 36030476 35499351 34976929 34564249 34217073 33888913 33612798
9040 33612798 33385628 33118904 32785898 32504629 32384778 32373426 32334589 32218899 32085667 32015326
9030 32015326 32059753 32216771 32395379 32473045 32446032 32450605 32581762 32789281 33020376 33328260
9020 33328260 33713622 34000078 34069307 34129355 34506223 35192018 35842178 36240832 36526851 36900665
9010 36900665 37355867 37819787 38335663 38934140 39492606 39905462 40274753 40769830 41406926
9001 41406926 42116932 42906598 43779274 44614593 45324127 46026607 46862127 47728576 48434977
8992 48434977 49032271 49722111 50485171 51092916 51482257 51810766 52100877 52150600 51904950 51619315
8982E1619315j23730q7550k40583l28737k26100n5643J13746L11871M21842K97420
8972E1701851J44975L48507Q38064J094198R27260P76558R94249J296093J283378
8963E9405133J120009J232869J598366J813123J749375J687680J819935K005029
8955G2431519K062659K016656J987439K049035K213954K399693K442545K299329
8947H9902829K161231K203659K337530K397649K419207K474596K407692K065069
8939A08369462J656273J497774J491613J279907Q50904N08523K53491k45821r67176
8930A14694950j408751j383106j376850j769846k202648k172161j827170j635177
8922A00919241j589612j348536r47511p38742o99812m26655J39401N48776N48279
$$ plain form
8982 51619315 51495585 51408035 51167452 50838715 50612615 50556972 50670718 50982589 51404431 51701851
8972 51701851 51846826 52195333 53033397 54127595 55054855 55831413 56825662 58121755 59405133
8963 59405133 60525142 61758011 63356377 65169500 66918875 68606555 70426490 72431519
8955 72431519 74494178 76510834 78498273 80547308 82761262 85160955 87603500 89902829
8947 89902829 92064060 94267719 96605249 99002898 101422105 103896701 106304393 108369462
8939 108369462 110025735 111523509 113015122 114295029 115145933 115654456 115907947 115662126 114694950
8930 114694950 113286199 111903093 110526243 108756397 106553749 104381588 102554418 100919241
8922 100919241 99329629 97981093 97033582 96294840 95595028 95168373 95307774 95856550 96404829
8913I6404829M56420O38970J025068J366957J624837J851413J990104K034752
8905A07393350K153291K432410K710760K857442K990350L215865L389226L378763
8897A30521457L354269L530487L791243L863982L745298L655832L653793L585892
8889A59702253L383154L132332K860445K492548K031801J565645J088555N23405
8881A76780138q2691n94237j023951j517831k084485k557938k870089l145469
8873A62903447l464144l733813l873190l930438l931379l792095l487199l146141
8865A33545048k876059k626875k323514j991950j665814j312509r43002o48020
8857A19157305m33853j77862J59822M55590O59836R14342J286666J595613J694791
$$ plain form
8913 96404829 96861249 97500219 98525287 99892244 101517081 103368494 105358598 107393350
8905 107393350 109546641 111979051 114689811 117547253 120537603 123753468 127142694 130521457
8897 130521457 133875726 137406213 141197456 145061438 148806736 152462568 156116361 159702253
8889 159702253 163085407 166217739 169078184 171570732 173602533 175168178 176256733 176780138
8881 176780138 176697447 176103210 175079259 173561428 171476943 168919005 166048916 162903447
8873 162903447 159439303 155705490 151832300 147901862 143970483 140178388 136691189 133545048
8865 133545048 130668989 128042114 125718600 123726650 122060836 120748327 119805325 119157305
8857 119157305 118723452 118545590 118705412 119161002 119820838 120735180 122021846 123617459 125312250
8848A25312250J736413J923963K180644K327274K424716K625691K816060K767434
8840A44114445K580930K591714K827743K948334K780162K532192K364059K121807
8832A64861386J690877J262518R94996P00400J57836m97542j004958j402858j896281
8823A64866374k449246k859617l151577l538037m017682m348781m449257m509679
8815A35542498m646221m726219m626368m406347m124561l728209l252685k898624
8807A03133264k749558k605083k265306j818724j474591j256901j056524q68291
8799H9038286p64922p00007n34382k43307M9307K32662L01301L22354L99420O03496
8789H8704208Q50097R44680Q62283Q47323J066922J309100J272602J047875R89756
$$ plain form
8848 125312250 127048663 128972626 131153270 133480544 135905260 138530951 141347011 144114445
8840 144114445 146695375 149287089 152114832 155063166 157843328 160375520 162739579 164861386
8832 164861386 166552263 167814781 168809777 169510177 169668013 169170471 168165513 166762655 164866374
8823 164866374 162417128 159557511 156405934 152867897 148850215 144501434 140052177 135542498
8815 135542498 130896277 126170058 121543690 117137343 113012782 109284573 106031888 103133264
8807 103133264 100383706 97778623 95513317 93694593 92220002 90963101 89906577 89038286
8799 89038286 88273364 87573357 87038975 86795668 86844975 87077637 87378938 87701292 88100712 88704208
8789 88704208 89554305 90498985 91361268 92208591 93275513 94584613 95857215 96905090 97894846
8780I7894846J142003J151562Q34017M69331L47214L14434M1583m66976r32781
8771A00795233j253987j584903j993440k330159k496542k614486k823944l069089
8763H2628683l198216l175124l086617k997544k888532k721483k509453k311480
8755E9740234k168822k051500j891131j678060j481151j340472j203397j028734
8747D6896967q86818q59009q88171q46414p21021o05870n26850m22099l01580
8738D0839135k65434l18126l17975j90021n4302l9548q1686l4420R2793J42513
8728C9772929L6595j08416j12704O1529K47685K31289j914k21996k46367k10703
8718C9447927l75401o95678q46710p35530o84622r28857j213987j180493r28847
$$ plain form
8780 97894846 99036849 100188411 101022428 101491759 101838973 102153407 102194990 101728014 100795233
8771 100795233 99541246 97956343 95962903 93632744 91136202 88521716 85697772 82628683
8763 82628683 79430467 76255343 73168726 70171182 67282650 64561167 62051714 59740234
8755 59740234 57571412 55519912 53628781 51950721 50469570 49129098 47925701 46896967
8747 46896967 46010149 45151140 44262969 43416555 42695534 42089664 41562814 41140715 40839135
8738 40839135 40573701 40255575 39937600 39747579 39693277 39653729 39572043 39537623 39630416 39772929
8728 39772929 39809524 39701108 39588404 39649933 39897618 40128907 40126993 39904997 39658630 39447927
8718 39447927 39072526 38376848 37530138 36794608 36109986 35181129 33967142 32786649 31857802
8709C1857802q43929r83178j030319q29421n88073n05749n37869o01229o95727
8700B5242308p32666n58893k66561j64978l12530m07462l03338k59180m36842
8691B1799858n39533l08436l6496j31652m27853m55165k29908j96998m34113n19259
8681A8520445k80886r6450k24338l61698j99564J2539j21434m64921n38751k39633
8671A6005309N3878N1825j28773k43156k29774j66466j11994p4460l8469M442
8661A5122362L590j16503k99720l41860j49651R0851J52190O6645J6605K7665
8651A4572174j3750j05571j29955q6245r7755j79559k10336j56800j25312j57358
8641A3309533j67169j26860j26705j93125k20367j50627o8640n7195j00642j71575
$$ plain form
8709 31857802 31013873 30030695 29000376 28170955 27582882 27077133 26539264 25938035 25242308
8700 25242308 24509642 23950749 23684188 23519210 23206680 22799218 22495880 22236700 21799858
8691 21799858 21260325 20951889 20915393 20783741 20355888 19900723 19670815 19473817 19039704 18520445
8681 18520445 18239559 18143109 17918771 17557073 17357509 17370048 17248614 16783693 16244942 16005309
8671 16005309 16059187 16111012 15982239 15739083 15509309 15342843 15230849 15156389 15117920 15122362
8661 15122362 15125952 15009449 14709729 14367869 14218218 14309069 14461259 14527904 14544509 14572174
8651 14572174 14558424 14452853 14322898 14236653 14138898 13959339 13749003 13592203 13466891 13309533
8641 13309533 13142364 13015504 12888799 12695674 12475307 12324680 12256040 12198845 12098203 11926628
8631A1926628k58330k77947j47110K0749K280j86210k61365r9624N9556Qj28293
8620A0650342q7339L1693l2956k56364l43447j79528J4910K3178r2895j34067
8610I593527l1242J05378J27715M482j34005j37374m6368n3931j91703k29075
8600I007404l7107J36592J4076k38003k21516O7550K17067M3374j44142p6391
8590H768904N1119m7131k41959k08813K0038R8051q3998k35031j19445R8896J16364
8579H216995p4301j87757m6011J70262J41556j60234l80464k14230J51327K30130
8569G847273j05160m09072k60664J47975K90965M3654k01213j45258L3804L7421
8559G279725r6543j10204N9948K12857J74798q671j63543j62253k2625R6925M1211
$$ plain form
8631 11926628 11668298 11390351 11243241 11263990 11266270 11080060 10818695 10719071 10778627 10778635 10650342
8620 10650342 10563003 10594696 10561740 10305376 9961929 9782401 9797311 9820489 9727594 9593527
8610 9593527 9562285 9667663 9795378 9799860 9665855 9528481 9482113 9428182 9236479 9007404
8600 9007404 8970297 9106889 9120965 8882962 8661446 8728996 8946063 8989437 8845295 8768904
8590 8768904 8820023 8772892 8530933 8322120 8342158 8440209 8356211 8121180 8001735 8100631 8216995
8579 8216995 8142694 7954937 7908926 8079188 8220744 8060510 7680046 7465816 7617143 7847273
8569 7847273 7742113 7333041 7072377 7220352 7511317 7554971 7353758 7208500 7242304 7279725
8559 7279725 7183182 7072978 7132926 7345783 7520581 7511910 7348367 7186114 7163489 7260414 7301625
8548G301625j43171k26974r3535Q4604Q6056m2780q8249j6226Q564n9649o4204
8537F746061N0521R7569m5564j93924j19095R4360J84340J00521J0794k0646q7583
8526F817354j73980j16072R2698K12881R5270j10004k09671k17566j95211p3820
8516F121879J42572K08315l2978l00471k02342J70243L43197J44991q9917p6295
8506F429194M0633K5956n4160k5844N5880L3388n7039o6084J1944Q3300J39366
8495F616534J83654J01066j53010l38464j89335J61672L03970J00122j51251j51408
8485F483550L9915J69882J26453j387p7945n2058P628k418n7488r164J52512J91139
8473F970619k6808k32518j04768J96950K35415j3584j28375M7058J56946j9002
$$ plain form
8548 7301625 7158454 6931480 6837945 6922549 7008605 6965825 6877576 6861350 6869914 6810265 6746061
8537 6746061 6796582 6894151 6848587 6654663 6535568 6629928 6814268 6914789 6925583 6904937 6817354
8526 6817354 6643374 6527302 6620000 6832881 6928151 6818147 6608476 6390910 6195699 6121879
8516 6121879 6264451 6472766 6439788 6139317 5936975 6107218 6450415 6595406 6505489 6429194
8506 6429194 6469827 6495783 6441623 6415779 6471659 6505047 6448008 6381924 6393868 6477168 6616534
8495 6616534 6800188 6901254 6748244 6409780 6220445 6382117 6686087 6786209 6634958 6483550
8485 6483550 6523465 6693347 6819800 6818413 6740468 6688410 6696038 6693620 6636132 6626968 6779480 6970619
8473 6970619 6943811 6711293 6606525 6803475 7038890 7025306 6896931 6943989 7100935 7081933
8463G081933j67147o879J80001K0245k81121k44603J13573L28429K09884L0873
8453G265188M188K3759j6593m2291k5072n5693j09737m8208Q9883J12684M2337
8442G240445J03261K73520K48278j3645j30222R2252K96520J39246j42161j27764
8432G979730R8664J25838q4936j60457N1260K48405J60168p4786j49609J3488
8422H207765K26598K67534R1489j09898r3424J09987J79678l5942k29441p0306
8412H544040K39419K32802q0835k06126N8725L09588J90511o6105n5464J67014
8402I333569K35818O2525r3790o1515N4095J07395R1866N7494K3685L548P510
8391I822200K4075N8344J32502J95115J42896R959j4686J25413K19879J08146
$$ plain form
8463 7081933 6914786 6907907 7087908 7108153 6827032 6582429 6696002 7024431 7234315 7265188
8453 7265188 7269376 7293135 7276542 7234251 7209179 7153486 7043749 6995541 7085424 7198108 7240445
8442 7240445 7343706 7617226 7865504 7851859 7721637 7813889 8110409 8249655 8107494 7979730
8432 7979730 8078394 8204232 8119296 7958839 8010099 8258504 8418672 8343886 8194277 8207765
8422 8207765 8434363 8701897 8793386 8683488 8590064 8700051 8879729 8843787 8614346 8544040
8412 8544040 8783459 9016261 8935426 8729300 8788025 9097613 9288124 9222019 9166555 9333569
8402 9333569 9569387 9631912 9538122 9476607 9530702 9638097 9729963 9787457 9811142 9814690 9822200
8391 9822200 9846275 9904619 10037121 10232236 10375132 10385091 10370405 10495818 10715697 10823843
8381A0823843m3199L053J73105K18576J20851P0883J14701J17610N5039M8315
8371A1702777J10257J32203J27188K00005K70660J49264p7768q9851J49729K84179
8361A2958643J23313n0284M4811K47297K69368J62412J36912J54878O4508l6416
8351A4075442M9291K22354K17051N5492K349J02921J42792P9069J30680L56571
8341A5434012M92492L53486J21635P1875K21236L90421M43591L58263K07188J41638
8331A8235837K45820L87050L90663L41316M51130O48315O51736M94249N40081
8322B2386197Q39342R40180O19317L32663N21879Q77970Q37273N06850M49154
8313B8310825P03609P35876L91051J91696M64942P85360O49464K33278M8833J79752
$$ plain form
8381 10823843 10780644 10783697 10956802 11175378 11296229 11367112 11481813 11599423 11654462 11702777
8371 11702777 11813034 11945237 12072425 12272430 12543090 12692354 12614586 12524735 12674464 12958643
8361 12958643 13081956 13031672 13076483 13323780 13593148 13755560 13892472 14047350 14111858 14075442
8351 14075442 14124733 14347087 14564138 14619630 14621979 14724900 14867692 14946761 15077441 15434012
8341 15434012 15926504 16279990 16401625 16473500 16694736 17085157 17528748 17887011 18094199 18235837
8331 18235837 18481657 18868707 19259370 19600686 20051816 20700131 21351867 21846116 22386197
8322 22386197 23225539 24165719 24785036 25117699 25639578 26517548 27354821 27861671 28310825
8313 28310825 29014434 29750310 30141361 30333057 30797999 31583359 32232823 32466101 32514934 32694686
8303C2694686L05994K78965K40936K74884L10711L42600M33741N27532N16206
8294C5926255M67140N29862O52836O58786N84163O53595Q85475J017244R18187
8285D2293543Q09991R26470J170524J294378J263920J245572J328982J457692
8277E1791072J594297J780913K025117K250931K393723K471065K546122K673491
8269F9526731K879690L147200L416761L638560L811559L953847M074047M206289
8261I8654684M416201M706422M965393N098872N179238N359513N657586N956246
8253A39994155O231128O622499P202081P814353Q294317Q740098R372009J0151839
8245B04422479J0759039J0993262J1001300J0996476J0924471J0565052R828959
$$ plain form
8303 32694686 33000680 33279645 33520581 33795465 34106176 34448776 34882517 35410049 35926255
8294 35926255 36393395 36923257 37576093 38234879 38819042 39472637 40358112 41375356 42293543
8285 42293543 43103534 44030004 45200528 46494906 47758826 49004398 50333380 51791072
8277 51791072 53385369 55166282 57191399 59442330 61836053 64307118 66853240 69526731
8269 69526731 72406421 75553621 78970382 82608942 86420501 90374348 94448395 98654684
8261 98654684 103070885 107777307 112742700 117841572 123020810 128380323 134037909 139994155
8253 139994155 146225283 152847782 160049863 167864216 176158533 184898631 194270640 204422479
8245 204422479 215181518 226174780 237176080 248172556 259097027 269662079 279491038
8238B79491038Q753292P296544N385311L147321Q48127j448088l912409o544388
8230B93016748q954187j0713572j1754727j2243927j2223225j1628381j0581179
8223B14917550r389945q231695p037740n741772m465829l381549k509253j732052
8215A72427715r36825j01284O98739J360886J894140K450050L123141L780248
8207A84696810M241558M587034N075941N758599O403482O872832P332906P973082
8199B32942244Q742610R541731J0479581J1711595J3141711J4511022J5698845
8192C16769339J6719275J7496474J7905301J8033195J8143356J8280016J8065473
8185D41412429J6983773J4791789J1627343P801033L498267j373458o984212j3095781
$$ plain form
8238 279491038 288244330 295540874 300926185 304073506 304921633 303473545 299561136 293016748
8230 293016748 284062561 273348989 261594262 249350335 237127110 225498729 214917550
8223 214917550 205527605 197295910 190258170 184516398 180050569 176669020 174159767 172427715
8215 172427715 171490890 171389606 172088345 173449231 175343371 177793421 180916562 184696810
8207 184696810 188938368 193525402 198601343 204359942 210763424 217636256 224969162 232942244
8199 232942244 241684854 251226585 261706166 273417761 286559472 301070494 316769339
8192 316769339 333488614 350985088 368890389 386923584 405066940 423346956 441412429
8185 441412429 458396202 473187991 484815334 492616367 496114634 494741176 487756964 474661183
8177D74661183j8825237k3104148k5447579k6173721k5887867k4935008k3387520
8170C06900103k1337533j9021526j6721626j4641713j2841972j1256404r818680
8163B01260649q557573p495382o522220n535871m653459m049163l593314k949807
8155A57903860k092839j391879j031941o96573q7180N61285Q56003R06340J165068
8146A56092144J726514K246365K552999K886247L432632M022960M454413M779235
8138A82193509N081265N249377N188395N028581M911821M747765M362836L716587
8130B20480136K809528J581105R0254j406795k775276m200765n834344p442673
8122B03301170q685602r539818j0125826j0327189j0011939r486910r211570r075958
$$ plain form
8177 474661183 455835946 432731798 407284219 381110498 355222631 330287623 306900103
8170 306900103 285562570 266541044 249819418 235177705 222335733 211079329 201260649
8163 201260649 192703076 185207694 178685474 173149603 168496144 164446981 160853667 157903860
8155 157903860 155811021 154419142 153387201 152690628 152603448 153164733 154020736 154927076 156092144
8146 156092144 157818658 160065023 162618022 165504269 168936901 172959861 177414274 182193509
8138 182193509 187274774 192524151 197712546 202741127 207652948 212400713 216763549 220480136
8130 220480136 223289664 224870769 224961023 223554228 220778952 216578187 210743843 203301170
8122 203301170 194615568 185075750 174949924 164622735 154610796 145123886 135912316 126836358
8114A26836358q501418p358746o252238n671055n353844m830638m167814l730024
8106H0970581l509082l198569k779708k535227k515747k441105k175040j901430
8098E9914673j738877j548903j279350j166255j358799j584675j470512j071746
8090D8695556q11940r14686j123848j060936p16937m54896n42726q11355q79774
8081D1378458o62058m64709n24252o60637n78069l48197l06743n26428p08411
8072C6598954o43463m90534m83471o07546p17281p72034p87799p20475n66298
8063C0810053m46262m40598m64382m38184m30572m83086m65725k98937j57305
8054B7185002k21366l65353l54692k44316k81416m69516n47129m12778k72214
$$ plain form
8114 126836358 118334940 110976194 104723956 99052901 93699057 88868419 84700605 80970581
8106 80970581 77461499 74262930 71483222 68947995 66432248 63991143 61816103 59914673
8098 59914673 58175796 56626893 55347543 54181288 52822489 51237814 49767302 48695556
8090 48695556 47883616 46968930 45845082 44784146 44067209 43612313 43069587 42258232 41378458
8081 41378458 40716400 40251691 39727439 39066802 38488733 38140536 37833793 37307365 36598954
8072 36598954 35955491 35464957 34981486 34373940 33656659 32884625 32096826 31376351 30810053
8063 30810053 30363791 29923193 29458811 29020627 28590055 28106969 27641244 27342307 27185002
8054 27185002 26963636 26598283 26243591 25999275 25717859 25248343 24701214 24288436 24016222
8045B4016222k94532l80139l73051k94626k49322k50326k41464j92711j21665
8036B1618386r7693k04932l92716m35908k18991K6235Q452j75161j92012l1236
8026A9904424j7424k31759l55378k29581j33930k67678l66847j71993P2752r044
8016A8193542l17595m62055l64351k57688k23791j55008q5346j45165k41019j76016
8006A5765508m3456j00842k90192l11440j63049j49780l13510l39424j34328j3724
7996A3905763j40779k49212j56960j02157k67019l86478k02824M3862k619k20454
7986A2221123k36436m7601K2374j31538k98020l31303k81589j95100q7570n3682
7976A0580658j28697j41887J2409J04425r4510l61230l18942o8869m7981l00155
$$ plain form
8045 24016222 23721690 23341551 22968500 22673874 22424552 22174226 21932762 21740051 21618386
8036 21618386 21520693 21315761 20923045 20487137 20268146 20294381 20302833 20127672 19935660 19904424
8026 19904424 19887000 19655241 19299863 19070282 18936352 18668674 18301827 18129834 18202586 18193542
8016 18193542 17875947 17413892 17049541 16791853 16568062 16413054 16327708 16182543 15941524 15765508
8006 15765508 15722052 15621210 15331018 15019578 14856529 14706749 14393239 14053815 13919487 13905763
7996 13905763 13764984 13515772 13358812 13256655 12989636 12603158 12400334 12444196 12441577 12221123
7986 12221123 11984687 11937086 11959460 11827922 11529902 11198599 10917010 10721910 10634340 10580658
7976 10580658 10451961 10310074 10322483 10426908 10332398 9971168 9652226 9583357 9535376 9235221
7966I235221m01938j66743Q0185O5147n5982o8801l7290n6179l4996M7676J2374
7955H618674j78232k73253j53646o3588j78893k87138j80190l0874n7222j27438
7945G088200n0923L7079l8269j11127L906R4476p9310k69653j35211Q7834o3631
7934F563371m21114l84359O2904K83074K1869k26999j11111M2169q2547k15119
7924E532138o9929P5823r8056l21789j95168R2728J02533q8764q2826R0800O5647
7913E103137j42551j58329L9943O5857j59151k49627n0804R3166k5845j23394
7903D392402J5444J16844p4785k91990j71867J31205K06619L4058p6252l9924
7893D241754n3112j55462j54338m649Q9192J6251q1432o8259J670L3883K3949
$$ plain form
7966 9235221 8833283 8666540 8746725 8811872 8755890 8687089 8649799 8593620 8558624 8606300 8618674
7955 8618674 8440442 8167189 8013543 7949955 7771062 7483924 7303734 7272860 7215638 7088200
7945 7088200 7037277 7074356 7036087 6924960 6928866 7023342 6944032 6674379 6539168 6627002 6563371
7934 6563371 6142257 5757898 5820802 6103876 6125745 5898746 5787635 5829804 5747257 5532138
7924 5532138 5462209 5538032 5439976 5118187 4923019 5015747 5118280 5029516 4946690 5037490 5103137
7913 5103137 4960586 4802257 4842200 4908057 4748906 4499279 4448475 4541641 4515796 4392402
7903 4392402 4407846 4524690 4449905 4157915 3986048 4117253 4323872 4357930 4281678 4241754
7893 4241754 4188642 4033180 3878842 3874193 3963385 3979636 3898204 3829945 3831615 3865498 3889447
7882C889447k6530j39366k42279j97445j8293J02247N4785m3885n0958K680J2951
7871C343354j7969j9576J1274K2046K29l1799p5395j28441j35485n1033N9969
7860B977174O9389m4575j41406q8387M5229N3887j15971k46356j29229J04133
7850B483888J28732r1455k06995R328K86953K24980j15165k87008q9664J84226
7840B527820J93164j8835j63894j07346L0372P8301R23r3608q6307m931r836j55205
7828B190618k50309j07797J45194K15125O0749q3278r2211p6823q8143j1215J45040
7817B046950J64547j3535j41351n5794O0747K5353l4507K4284N0253r2294j76539
7806A858114K9008K82147J95706j18130k17335m5693L5861q9505j36132J0522
$$ plain form
7882 3889447 3862917 3723551 3481272 3283827 3265534 3367781 3422566 3378681 3327723 3330403 3343354
7871 3343354 3325385 3305809 3317083 3339129 3339358 3307559 3232164 3103723 2968238 2917205 2977174
7860 2977174 3046563 3001988 2860582 2772195 2817424 2871311 2755340 2508984 2379755 2483888
7850 2483888 2612620 2521165 2314170 2323498 2610451 2835431 2720266 2433258 2343594 2527820
7840 2527820 2720984 2702149 2538255 2430909 2461281 2539582 2540505 2446897 2360590 2355659 2345823 2190618
7828 2190618 1940309 1832512 1977706 2192831 2253580 2170302 2078091 2001268 1913125 1901910 2046950
7817 2046950 2211497 2197962 2056611 2000817 2061564 2086917 2052410 2076694 2126947 2034653 1858114
7806 1858114 1887122 2169269 2364975 2246845 2029510 1983817 2019678 1930173 1794041 1804563
7796A804563Q1208n5607j28891N5317K71353K57645R8640j7207r9042j70098r8911
7785A998970J18521K03938J0097j88221j17667N0254J8342j20800p6428J18222
7775B015228J82558P6735K6577J14596J89203J57874Q0853O67p5060p8966L309
7764B693574K8508p2180j15946J8749J14526k0886j55848k5418J22778q1585l91744
7753B114528k62980J76986K38553j86737m00150m7928K95640J09824k28488j47091
7743A662157J68137J86435m2145p8242Q6131R5626n6920n0486J18418J25725o6497
7732B148339j50508m1796J4108o1099o5813M9820J08603J05872K11144L28850
7722B647520J69151j63846k01984J23257L06664Q1449j51015j5922K34675K16575
$$ plain form
7796 1804563 1885771 1830164 1701273 1756590 2027943 2285588 2384228 2367021 2267979 2097881 1998970
7785 1998970 2117491 2321429 2331526 2143305 2025638 2075892 2094234 1973434 1897006 2015228
7775 2015228 2197786 2274521 2301098 2415694 2604897 2762771 2843624 2844291 2769231 2690265 2693574
7764 2693574 2722082 2649902 2533956 2552705 2667231 2646345 2490497 2465079 2587857 2506272 2114528
7753 2114528 1851548 2028534 2267087 2080350 1680200 1632272 1927912 2037736 1809248 1662157
7743 1662157 1830294 2016729 1974584 1896342 1982473 2078099 2021179 1970693 2089111 2214836 2148339
7732 2148339 1997831 1956035 1970143 1909044 1843231 1893051 2001654 2107526 2318670 2647520
7722 2647520 2816671 2652825 2450841 2574098 2880762 2962211 2811196 2795274 3029949 3246524
7712C246524M9319L4787Q4829k6352j50521m0184J07091o0369l79352l76165o2093
7701B427514O6916j51250l05987j29996P3874l1244k73780k75873j3762K15945
7691A602357K10139J1732k12776k79051j04978J42707J74417l5937j77989m8768
7681A281853J49356J41399k874l7896L5746J7886j09631j52917m4428O4657P9953
7670A423104Q3087J19104R8482l07m6616O618O324j27551k03254m2999J84134
7659A500126J81411j1830q1321N2223J23618M423o3177Q0500J58027j01212m09309
7648A433479k78267J71660K94327j19137m90629l12289J16137J98717o4985j96537
7638G52476m1224Q2603j0656j20103p7608M431J7865K5912K8407q8772k41579
$$ plain form
7712 3246524 3295843 3330630 3415459 3389107 3238586 3198402 3305493 3245124 2865772 2489607 2427514
7701 2427514 2494430 2343180 2037193 1907197 1981071 1949827 1676047 1400174 1386412 1602357
7691 1602357 1812496 1824228 1611452 1332401 1227423 1370130 1544547 1508610 1330621 1281853
7681 1281853 1431209 1572608 1569734 1531838 1567584 1585470 1475839 1322922 1278494 1343151 1423104
7670 1423104 1506191 1625295 1723777 1723470 1676854 1683472 1689796 1562245 1358991 1315992 1500126
7659 1500126 1681537 1669707 1588386 1640609 1764227 1768650 1705473 1785973 1944000 1842788 1433479
7648 1433479 1155212 1326872 1621199 1502062 1011433 699144 815281 1013998 949013 752476
7638 752476 711252 793855 783199 663096 585488 589919 607784 633696 662103 573331 331752
7627C31752j49362J81784L44836J25494j44674j05620R7590J33356K9140M136
7617H48432J2802j03377k03666n6944J75189J47813p0292j13291K9783L0629j15290
7606E81788m9325K31077K52798j12182l34616p7913K30793J31239j11684n0996
7596F90979J10129p0801l70584k08628K92854L92541q4232m41866k03945K14281
7586C20728K60670N1826j6283L8788q597o2558Q6084K64290J44479j76812l03880
7575E98735j59736k9479k8564K3107J66746J75028k6483j70881n2682J57370J79096
7564H32257R67j70619j89436o3847J10179K09099J66245N4371J88J4797K5383
7553I89584L9993J04093J27588j0288j90351j67299J3587L5027j65726k45604
$$ plain form
7627 331752 182390 364174 709010 834504 689830 584210 681800 815156 844296 848432
7617 848432 861234 757857 554191 497247 672436 820249 749957 636666 666449 697078 581788
7606 581788 532463 763540 1016338 904156 569540 491627 722420 853659 741975 690979
7596 690979 801108 730307 359723 151095 443949 836490 752258 310392 106447 320728
7586 320728 581398 633224 616941 655729 647132 584574 670658 934948 1079427 902615 598735
7575 598735 438999 409520 380956 404063 570809 745837 719354 548473 495791 653161 832257
7564 832257 833224 662605 473169 409322 519501 728600 894845 949216 949404 964201 989584
7553 989584 1029577 1133670 1261258 1250970 1060619 893320 906907 941934 776208 530604
7543E30604j3873K14331J11603j19258p5010J87311K50507O208k01986j24335
7533G66102P3626J26177J8121r2941r8281R952J53767J91162O4606p4431n1897
7522A085963N3130L1746r0414q4219P5757J37675j5716j72369j34225N911P8895
7511I72134R0665R5139M0541p5505j01861K4865J23750M4565q8743j05009n4692
7500I65849l3444M1026K02370K09741r4974l81694k16020K39025L77510K8939
7490A338328k93387j63282J73424K40005J6272j45122q5399J5411j0571r8928
7480I86751j01258J6543J52123J61521k343j92766j84347M1981K25020J45411
7470A248636o6827j01119J00191K57019J38702j17492j94035k5606J20532L6172
$$ plain form
7543 530604 516731 731062 842665 723407 648397 835708 1086215 1092423 890437 766102
7533 766102 839728 965905 984026 891085 792804 802756 956523 1147685 1212291 1137860 1085963
7522 1085963 1139093 1170839 1080425 996206 1071963 1209638 1193922 1021553 887328 893239 972134
7511 972134 1062799 1157938 1198479 1122974 1021113 1045978 1169728 1214293 1125550 1020541 965849
7500 965849 932405 973431 1175801 1385542 1290568 908874 692854 931879 1309389 1338328
7490 1338328 1044941 881659 1055083 1295088 1311360 1166238 1080839 1096250 1085679 986751
7480 986751 885493 902036 1054159 1215680 1213337 1020571 836224 878205 1103225 1248636
7470 1248636 1181809 1080690 1180881 1437900 1576602 1459110 1265075 1239469 1360001 1396173
7460A396173j14057l8095K03931K31535q0716l43470j82732J91791K69911k5427
7450A508844k61718j51779Q8886J44365L2922l9282j7310O387k1303q2791j29794
7439A077427q1165P3751J51041k3836k70963k25019Q9963K36790M8415j05555
7429I70849K8697J45506l9593k23922m5302K12224O9396k74967k36014J51540
7419G58414K87092L4535r5565R9142J76879p4266j98466Q6314L05949K3479l72411
7408A031096k98347O8443J51764m6773o2198J42533J43137j30109k40150J216
7398G60612K28649J45165n5733r8026l4726k8183n8922o5461r1805j14237J2639
7387E99972K64670L63373J68094q5883j36494o1029p5541j58302j26428K1943
$$ plain form
7460 1396173 1282116 1244021 1447952 1679487 1598771 1255301 1072569 1264360 1534271 1508844
7450 1508844 1247126 1095347 1184233 1328598 1361520 1322238 1304928 1311315 1290012 1207221 1077427
7439 1077427 996262 1070013 1221054 1197218 926255 701236 791199 1027989 1076404 970849
7429 970849 999546 1145052 1105459 881537 836235 1048459 1117855 842888 606874 758414
7419 758414 1045506 1080041 984476 1083618 1260497 1186231 987765 1074079 1380028 1403507 1031096
7408 1031096 732749 801192 952956 906183 843985 986518 1129655 999546 759396 760612
7398 760612 989261 1134426 1078693 980667 945941 917758 858836 793375 701570 587333 599972
7387 599972 864642 1228015 1396109 1310226 1173732 1112703 1037162 878860 752432 774375
7377G74375Q5142m2501k18110k24448k5965J70293J32571q9549j75951L1870K49540
7366F67267J34319j72565k37089j3843R8914n9734j60004O405J41333j5368j81482
7355B08153R12L21556L14540r84j95685j22626l8446p5901p3420L3287P6596m230
7343D43752n1665J695L7671K5227O4631J11615O496j64334j21578R9820J18098
7332E71428j61895l22396r1879J88577J08980j53392j51543J07740K25277O4121
7322C85018j05518q6539R492L8139J6215j0235m0366k9127N8476J05600j6011
7311C25144j77409j23402J14382K12098K6271j91096j67257J8775R1168l8737
7301H9937j90459j53040P8508K80658K20948n2559k17295p8015J52771J59478
$$ plain form
7377 774375 859517 817016 598906 374458 348493 518786 651357 561808 385857 417727 667267
7366 667267 801586 629021 391932 378089 477003 417269 257265 263670 405003 389635 208153
7355 208153 209065 530621 845161 844177 648492 525866 487420 411519 338099 371386 447982 443752
7343 443752 392087 393782 431453 456680 521311 632926 639422 475088 353510 453330 571428
7332 571428 409533 87137 -4742 183835 292815 139423 -12120 95620 320897 385018
7322 385018 279500 192961 202453 240592 256807 246572 206206 177079 235555 341155 325144
7311 325144 147735 24333 138715 350813 377084 185988 18731 37506 128674 89937
7301 89937 -100522 -253562 -175054 105604 326552 273993 56698 -21317 131454 290932
7291B90932j5782q9085j7909j3929r6412m3379J41395J43846j10474k43028j8496
7280g2321K33468J37488j18760j15153J10977J75731K400j15450n5465j6955j02065
7269F3895j51879p4347J4041N3148J22240J81923O1964j89370k66238n4767J71347
7258f8043J57336j158q9096p2875p204J02965J79857P2748j44491j58309R7922
7247F9652K51403M9660k04372j30301J02612P2556j74757k16091K1716J48462
7237i460l0594k18053j27308J06457K03734J33230M2160J1179K7397M1985j9000
7226A61727j43415j43259R4709L11993J64259k04317k91780j1131J52062o3493
7216B7355k54855m4123K63931J84957j44822k22532j331J16742j960p8086J8122
$$ plain form
7291 290932 275150 186065 168156 154227 57815 14436 155831 299677 189203 -53825 -72321
7280 -72321 161147 298635 179875 64722 175699 351430 353830 238380 182915 165960 63895
7269 63895 -87984 -162331 -148290 -95142 27098 209021 270985 81615 -184623 -239390 -68043
7258 -68043 89293 88135 -961 -73836 -81040 21925 201782 274530 130039 -28270 69652
7247 69652 321055 370715 166343 36042 138654 211210 36453 -179638 -157922 -9460
7237 -9460 -40054 -258107 -385415 -278958 -75224 58006 100166 111345 138742 180727 161727
7226 161727 18312 -124947 -30238 281755 446014 241697 -50083 -61214 90848 27355
7216 27355 -227500 -271623 -7692 177265 32443 -190089 -191420 -74678 -76638 -154724 -136602
7205a36602Q5042L2103K8475J10209Q0808o9085o9381J39774K39631N9828j22172
7194C78630o2268M4219m9673j84371r8255P8831N4148r7303p2699R8635R1993
7183A81887j30383k19575j2076J93941J11581j00859j16523O5170J65912O5715
7173B04790n9115l6016O1448N3175p0173j28507j0882J49306J42599k1329j18354
7162A66942k3018J30333J64619Q6833j2967j33759k62621k40754K5926L00117
7152B01651K42538r0646k72244r9587J23628O1362j56401j69376M2257J46526
7142B9708n691j51388l3484J94909J96301m8282k14500j04611J02120J57356Q4331
7131B06769L7070j802j23096k00717k7749K68606L03849J1133k15391j10340Q5310
$$ plain form
7205 -136602 -51560 -19457 9018 119227 200035 130950 61569 201343 440974 500802 378630
7194 378630 316362 360581 310908 126537 28282 107113 161261 63958 -8741 89894 181887
7183 181887 51504 -168071 -180147 13794 125375 24516 -92007 -26837 139075 204790
7173 204790 145675 109659 171107 224282 154109 25602 14720 164026 306625 285296 166942
7162 166942 143924 274257 438876 525709 512742 378983 116362 -124392 -98466 201651
7152 201651 444189 353543 81299 -18288 105340 166702 10301 -159075 -116818 29708
7142 29708 24017 -127371 -160855 34054 230355 182073 -32427 -137038 -34918 122438 206769
7131 206769 243839 242037 118941 -81776 -109525 159081 462930 474063 258672 148332 233642
7120B33642P3518k6352J3731O6383q0612k46496j40676P4111M7225q4782P9380
7109I072L86422K69180k25703l52908J30995M79961J25699l95052l13324J65307
7099B79649K88517k7324k30020j34869p4971j43198o2099J69422K07416J5786
7089B88309o4489J8197m9521k43590j33699K76209L68581q6339m45427j77526
7079b49295K87365K73472q9218j95245K6610J41333K8681j2604R9496J12129l7213
7068C85511j13196m1325o936n9329n5325k2940j29967k53049o8352L31161M22052
7057C88305M4117k88120j56133J32998Q6237j69089j28570K28057L65953J5333
7047E19088l98559l45436Q6365L36290J29292j96772j88129J13896K72970R3559
$$ plain form
7120 233642 307160 280808 294539 360922 280310 33814 -106862 -32751 14474 -70308 9072
7109 9072 395494 664674 438971 86063 217058 697019 822718 427666 114342 279649
7099 279649 568166 540842 310822 175953 100982 -42216 -104315 65107 272523 288309
7089 288309 223820 242017 192496 -51094 -184793 91416 459997 373658 -71769 -249295
7079 -249295 38070 311542 222324 27079 53689 195022 223703 211099 310595 422724 385511
7068 385511 272315 230990 224054 164725 109400 86460 -43507 -296556 -364908 -33747 388305
7057 388305 432422 144302 -11831 121167 207404 38315 -90255 137802 503755 519088
7047 519088 120529 -224907 -138542 197748 327040 130268 -57861 56035 329005 422564
7037D22564j33214j09133L2291M785j34568j15264M1392N1802j09165j39195N5959
7026a31746J73489L2338j08638l625J56435R7064n0572J334J65613J21562j20157
7015C33097k19859o0091J03364R4927N6239J09859J13343n5124k13490j22720
7005A39545J23266J96609j5216k58144k45061q803J59560P6192j21439j60717
6995a14208J8690J93256J44896o8315j94754r0684J30758K38087J31471m6542
6985C42655p1034O9599J24645o0149k46308j05097K38546L07727k1918l06743
6975B71923k03819L7423N2869l4958P6879K51861J33090j77354k27062L5413J75934
6964C92199k649j86040j27824p011j6690m3992J5308K6695o6142p1424P6720J52374
$$ plain form
7037 422564 289350 180217 212508 217293 82725 -32539 8853 60655 -48510 -187705 -131746
7026 -131746 41743 74081 -34557 -38182 118253 215317 164745 166079 331692 453254 333097
7015 333097 113238 53147 156511 251438 307677 417536 530879 475755 262265 139545
7005 139545 262811 459420 444204 186060 -59001 -67804 91756 167948 46509 -114208
6995 -114208 -95518 97738 242634 174319 -20435 -111119 19639 257726 389197 342655
6985 342655 271621 341220 465865 405716 159408 54311 292857 600584 578666 271923
6975 271923 68104 105527 158396 123438 200317 452178 585268 407914 180852 216265 392199
6964 392199 389550 203510 75686 68675 51985 7993 23301 49996 -16146 -87570 -10850 141524
6952A41524O8803O2759K00473J64141j46720k97281k6657K17466o358l40504k07928
6941a70282J98350K66255K3864M752K15421J45140k07688k54173J05890K47846
6931E75375p1539k79522m6765J13989j54239l16055Q0776M59792J32344m48036
6921D6120l59994K68226M93317R8619j94378m2637O5431j44887k36738M2825K45456
6910B81360M7527j61027j0956J92473Q8249p3305L0018J33924q3280k99137r2406
6899E3440K20152Q5248k65005j69260K68305K90287k00632m09125M5583M90773
6889D09766K92769j73984k17425R6788K05776k625j50639p2928K1392R039j296
6878D16633L4924K8693k4706m6076m5816n5313Q653J58231J69688q4163k99804
$$ plain form
6952 141524 210327 273086 473559 637700 490980 193699 167042 384508 378150 37646 -170282
6941 -170282 28068 294323 318187 322939 538360 683500 475812 221639 327529 575375
6931 575375 503836 224314 177549 291538 137299 -178756 -97980 361812 494156 46120
6921 46120 -313874 -45648 447669 546288 351910 309273 374704 229817 -6921 35904 281360
6910 281360 328887 167860 156904 349377 437626 364321 394339 528263 444983 145846 53440
6899 53440 273592 358840 93835 -75425 192880 483167 282535 -126590 -81007 409766
6889 409766 702535 528551 311126 407914 613690 611065 460426 387498 408890 417929 416633
6878 416633 451557 480250 455544 409468 363652 308339 316992 475223 644911 560748 260944
6867B60944j26266K39803K85022m3161k59768q6027J86845K07591L7458p2207
6857F30234n3086J8817Q1336N7655r7768k26450j04180J64044K04565n4025k24932
6846C96210n3690J93960J75919k2521j13319n3293K6950R5584J39956N4906j22127
6835G18535j30379Q6181J85205k0823j84467r895J71868l6294l20031j33553K98652
6824F24999K74424j93084l50563N4906L88374K15767n7134j1205R0302o9650k14352
6813G52784m0168J42436k9077k54934r7409J99050J37769j25156q5823J56916
6803G56388R4006k00614j56639K24528K96896r1101k79968P0836L78431J32930
6793A225693k44420j55478J62899J12222j99637j62945K58296M40449J06878k66068
$$ plain form
6867 260944 134678 374481 659503 616342 356574 270547 457392 664983 702441 630234
6857 630234 577148 595965 677301 734956 637188 410738 306558 470602 675167 621142 396210
6846 396210 342520 536480 712399 689878 576559 523266 550216 645800 785756 840662 718535
6835 718535 588156 674337 859542 838719 654252 644357 816225 779931 459900 326347 624999
6824 624999 899423 706339 355776 410682 799056 1014823 957689 946484 1036786 967136 752784
6813 752784 712616 855052 825975 571041 473632 672682 810451 685295 599472 756388
6803 756388 850394 649780 493141 717669 1014565 923464 643496 714332 1092763 1225693
6793 1225693 981273 825795 988694 1100916 901279 738334 996630 1437079 1543957 1277889
6783A277889k20769N4628J35083j1646j14300n9928L1455O3169N5819M2279L4540
6772A288219O1005J19635J28718K5789j10866j35846k5721R1568J09697O5865
6762A618063M7216M5888m881p9636o2159P2957J89944J73259Q6701N9133R6493
6751B242978J22463J28863J47708J40783P2211K7924Q7974J45912O5070m8325
6741C133561J3146J83069J93993K5179o6938r504j6397j25505o6532K04193K84693
6730C752958l2447l15522j25085K55350K49050r7770k24206L5499K59582J71994
6720C929403k272k5661J4907K1243Q3906J86302J26222p2194q1694J69935K92849
6709D642946P7254q4279J84702N71637N24079J25798l3864K32367M87516M00399
$$ plain form
6783 1277889 1057120 1111748 1246831 1235185 1120885 1060957 1092412 1155581 1211400 1253679 1288219
6772 1288219 1349224 1468859 1597577 1623366 1512500 1376654 1350933 1442501 1552198 1618063
6762 1618063 1665279 1711167 1706286 1626650 1564491 1637448 1827392 2000651 2087352 2146485 2242978
6751 2242978 2365441 2494304 2642012 2782795 2855006 2882930 2970904 3116816 3181886 3133561
6741 3133561 3146707 3329776 3523769 3548948 3482010 3472506 3456109 3330604 3264072 3468265 3752958
6730 3752958 3720511 3404989 3279904 3535254 3784304 3686534 3462328 3497827 3757409 3929403
6720 3929403 3927131 3901470 3916377 3937620 4021526 4207828 4334050 4261856 4180162 4350097 4642946
6709 4642946 4720200 4635921 4820623 5392260 5916339 6042137 6008273 6240640 6728156 7128555
6699G128555J94422J95115L34948L70780L18365L72592N37226O14271N31998M57654
6689A1055926N37216O84875P27590O60721O28887O86523P33447P25555P82301
6680A7223041R71023J144827J186337J275897J643723K134981K350511K203671
6672C0134011J980187J839537J702167J696201K120755K688698K455080J073681
6664D5690317l95053p31647l20967p32302k533446m462289n069351m369304l373939
6655B3702019k668954k142510j695527j449343j351313j176797r32071q12106
6647A1473398p83723o35091m18549m02951n60798n53264l13032j90623l55063
6638G260304m85543l17805j03178j70511l48786k64370r970k6273l73975o05845
$$ plain form
6699 7128555 7322977 7518092 7853040 8223820 8542185 8914777 9452003 10066274 10598272 11055926
6689 11055926 11593142 12278017 13005607 13666328 14295215 14981738 15715185 16440740 17223041
6680 17223041 18194064 19338891 20525228 21801125 23444848 25579829 27930340 30134011
6672 30134011 32114198 33953735 35655902 37352103 39472858 42161556 44616636 45690317
6664 45690317 45295264 44563617 44242650 43510348 40976902 36514613 31445262 27075958 23702019
6655 23702019 21033065 18890555 17195028 15745685 14394372 13217575 12285504 11473398
6647 11473398 10689675 10054584 9636035 9233084 8672286 8119022 7805990 7615367 7260304
6638 7260304 6774761 6456956 6353778 6183267 5834481 5570111 5560141 5533868 5159893 4554048
6628D554048m40919j43124o0386j42313j51169p1206k9717j4610M0647M1057j08433
6617C473875k45765j65978K947j6606j59714j16264Q5209O6479k20377l15543
6607B388263q145K29735k5051m11491l28913R6030K33483k8177j90271n6317n662
6596A893484k05425k59752M0076K52430J5353k95993j77161J66537J89737r3326
6586A525960k15558p0503K2979k3289K3492J62184J22327o9930r0496L4980q0386
6575A341760l92209l20061K50816N63575R7018n28605m33307J86364M05878R516
6565A180745k88523n5530K59626J65325j27708j75975o445P2408R855l9329n7877
6554I36572r7967o7151R1040J79808L1740j58212j16650M6585L3698j09986r0255
$$ plain form
6628 4554048 4113129 3970005 3909619 3767306 3616137 3544931 3515214 3500604 3541251 3582308 3473875
6617 3473875 3228110 3062132 3065079 3048473 2888759 2772495 2857704 2924183 2703806 2388263
6607 2388263 2380118 2609853 2584802 2173311 1844398 1940428 2173911 2145734 1955463 1899146 1893484
6596 1893484 1688059 1428307 1468383 1720813 1736166 1440173 1263012 1429549 1619286 1525960
6586 1525960 1310402 1239899 1262878 1239589 1263081 1425265 1547592 1477662 1387166 1422146 1341760
6575 1341760 949551 629490 880306 1443881 1540899 1012294 578987 765351 1171229 1180745
6565 1180745 892222 836692 1096318 1261643 1133935 957960 951515 1023923 1033778 994449 936572
6554 936572 838605 771454 862494 1042302 1074042 915830 799180 845765 879463 769477 679222
6543F79222P0068M0462j94541k19213J28308M12987K41857j27607j96225L2941
6533H68259J49862J5401j08529o7653k6304j02545j55001o6303M4018L8147l2862
6522E56490p5657j04578j15020j2786J79416K45962Q8916p2811k5327R3551K7647
6511G85803j55283j64461L1660J47351K7214j42655j52525m6712L0041N3120N5424
6500D68977J8646m3412m5494Q317j0294j02452n8031J86301L16269O3515k95200
6489E07142k57063J29336K65291r7024m20588j68976L50473M19282j8577l04948
6479D04348r9674J48450K413k42986r9410K50105K29425j65838l32597j6737L15297
6468C92796K50964J9191j5376L4617r6015k56503j41415J19973J52293l4161j09492
$$ plain form
6543 679222 749290 789752 595211 375998 504306 917293 1159150 1031543 835318 868259
6533 868259 1018121 1033522 924993 857340 831036 728491 573490 507187 551205 589352 556490
6522 556490 480833 376255 261235 248449 427865 673827 762743 689932 664605 758156 785803
6511 785803 630520 466059 497719 645070 672284 529629 377104 330392 360433 413553 468977
6500 468977 487623 444211 398717 407034 396740 294288 236257 422558 738827 802342 507142
6489 507142 250079 379415 644706 547682 127094 -41882 308591 727873 709296 404348
6479 404348 304674 453124 455537 212551 113141 363246 592671 426833 94236 77499 392796
6468 392796 643760 662951 647575 682192 586177 329674 188259 308232 460525 426364 316872
6457C16872l0878n7146j85403j23014J22779J78960l6642j36919N2407J75254
6447B76270l91j45137J7190J55315r0937l91058k07955K75744L94311L4795k40841
6436G7306j13730R8175Q5877r5L3565N4416o7601j62804p9436L0298J2481m427
6424c5975R5404J29271n5598k19615o2400K55756L02089J76k76265k29856K8260
6413f8753K03721J54243m2258j97237j65531O878J16412O5463n357L4903P3577
6402A76061l6167j66597q5993J32927J77060k6784j88878r3262R5570R7747r1577
6391i893k28533j38130J08738K86156K29286L750j45505q0919M7092L0299o5929
6380C6412j7800J47907J51223p6212k31911j07857O5341r188j96224j33144J75186
$$ plain form
6457 316872 285994 228848 43445 -79569 43210 222170 185528 48609 101016 276270
6447 276270 275879 130742 147932 303247 212310 -178748 -386703 -110959 283352 318147 77306
6436 77306 -36424 61751 147628 147533 181098 235514 167913 5109 -74327 -44029 -31548 -35975
6424 -35975 59429 188700 133102 -86513 -148913 106843 408932 409108 132843 -97013 -68753
6413 -68753 134968 289211 246953 49716 -115815 -108937 7475 72938 67581 102484 176061
6402 176061 139894 -26703 -112696 20231 197291 170507 -18371 -111633 -16063 81684 -9893
6391 -9893 -238426 -376556 -267818 18338 247624 251374 105869 24950 72042 102341 36412
6380 36412 18612 166519 317742 241530 9619 -98238 -32897 -42085 -238309 -371453 -196267
6369a96267L28806J26073j40583j20615J02831J70935k0572j86542p2318J68999
6359A60747J58177j91237m95528l48983J33248M11591J98273j67253j79293J51034
6349a69224L39663J25146j83248j74772Q9987K12174L8325j66574j43741Q544
6339b3720L4855q7386j44368k3148J27239J15531l5012j36908q3954M5080J12839
6328i8952P6152k287m1722j7473K4249J1735o7356j25235o1101R7720J96533J34362
6316A26625n007o6094k9109j3037p6396j25993p2290K4225N4604L6332N9529R7569
6304A0958L4011j04258j20794N3644K02813J20237o3546o2923J19061J83898n516
6293C67585k17657k06676n3712J0663m2516o8116j7847K6676L9471P2405J10052
$$ plain form
6369 -196267 132539 258612 118029 -2586 100245 271180 250608 64066 -8252 160747
6359 160747 318924 127687 -367841 -716824 -583576 -171985 26288 -140965 -320258 -169224
6349 -169224 170439 295585 112337 -62435 27552 239726 278051 111477 -32264 -23720
6339 -23720 11135 -76251 -220619 -243767 -116528 -997 -36009 -172917 -256871 -211791 -98952
6328 -98952 -22800 -25087 -66809 -84282 -60033 -48298 -115654 -240889 -301990 -204270 -7737 126625
6316 126625 121618 55524 26415 13378 -63018 -189011 -261301 -237076 -182472 -146140 -86611 10958
6304 10958 44969 -59289 -180083 -126439 76374 196611 133065 70142 189203 373101 367585
6293 367585 149928 -56748 -110460 -99797 -142313 -210429 -228276 -201600 -162129 -89724 20328
6282B0328P9659N154j3159K1045N415n7010l4637R8661J73450O0329j35131k18071
6270F033j48989m0029K1422M0446M1952K1829k2848n8877l4265N1579R7281p924
6258c2390j92595k10083M1315L07229K77569K7841q8735L0665J18646N740j10504
6247A74698k3543J33809J22562l4113j50629j72322j38377k1238J49368J70066
6237B10281m5909k18628o7388K09857K06242l8406j03218R8579J70160p7100k73125
6226G1345r8033J73771J15803j61283k04241N4909K20081P1126j29056q8938P0751
6215I6235N2347j26363j44951J26079L72783K20581k31081m71428k25197J73612
6205a57383K33993k8090j71118r561J55664O9536q2110k9967J19646Q8586r9002
$$ plain form
6282 20328 99987 105141 91982 113027 118442 61432 26795 125456 298906 359235 224104 6033
6270 6033 -142956 -182985 -161563 -121117 -79165 -57336 -80184 -139061 -173326 -121747 -24466 -32390
6258 -32390 -224985 -435068 -393753 -86524 191045 218886 130151 160816 279462 285202 174698
6247 174698 151155 284964 407526 373413 222784 50462 -87915 -109153 40215 210281
6237 210281 164372 -54256 -121644 88213 294455 256049 152831 251410 421570 344470 71345
6226 71345 -26688 147083 262886 101603 -102638 -47729 172352 243478 114422 25484 96235
6215 96235 148582 22219 -122732 3347 376130 596711 365630 -105798 -330995 -157383
6205 -157383 76610 48520 -122598 -132159 23505 93041 10931 -19036 100610 189196 90194
6194I0194j74684o1546N7335O8359M3184K6406l2781j05755p1888O6006J46619
6183E1449Q3175l4253j05577j26333r6197P157J19736J18242L283q9518r1414
6172a60250o0615k4481N4758J24253N5234j20243j86662m7732J32899J83114J27267
6161G7542M6543o0424j58372j26465K5274R4035j170n8564O2628J69395N7050
6150A27472j13281p3371Q9105Q4186q2951j50935o9739k9133m4746N8004K15305
6139I916J33645j62149k48846K8246K52138Q8290j66132p5704K21948K64724P322
6128C53398j78352j32270n4556n5014j4560O5671P735j60905j67844L6014J48047
6117a52636J6270r6709L3498K14036J73331j0070j07336j19209j47453j06744
$$ plain form
6194 90194 -84490 -146036 -88701 -20342 22842 49248 16467 -89288 -161176 -95170 51449
6183 51449 134624 100371 -5206 -131539 -227736 -220579 -100843 17399 20682 -68836 -160250
6172 -160250 -220865 -245346 -190588 -66335 -11101 -131344 -318006 -365738 -232839 -49725 77542
6161 77542 124085 63661 -94711 -221176 -195902 -101867 -103037 -161601 -98973 70422 127472
6150 127472 14191 -59180 29925 114111 31160 -119775 -189514 -218647 -263393 -205389 9916
6139 9916 143561 -18588 -267434 -239188 12950 101240 -64892 -140596 81352 346076 353398
6128 353398 175046 42776 -11780 -66794 -81354 -15683 -7948 -168853 -336697 -300683 -152636
6117 -152636 -136366 -233075 -199577 14459 187790 177720 70384 -48825 -196278 -303022
6107c03022R5476K66618J71707o1863j33741m7717k6283n1912P6612K70921K01429
6096D58225j32472l31533k05334k1128J328L540Q9601N8869j64679k46254L7848
6085d51989L42842K55034m3877r8317O8905P3330j08449j29419M3499M3589k02533
6074b07385k77384K2717L05653K03357o7516j18801K027J9592l9414L6864J81296
6063F1006J38750o6201j52319m3373N2554K5620j1866j1425o8629j53022p9175
6052c08080J39541K10286J17k11451j36777Q2412J10306n8387j17659M9575J95116
6041d5001R7225j14830j69243k6110J23776J48987R4738L4204l2253r4985q9611
6030g3103o044N8166L4056j5981j8231j7068o9761j03694l2117O1543M0851l6195
$$ plain form
6107 -303022 -207546 59072 230779 168916 35175 -12542 -38825 -90737 -14125 256796 458225
6096 458225 325753 -5780 -211114 -232242 -230914 -227374 -137773 -78904 -243583 -489837 -451989
6085 -451989 -109147 145887 102010 3693 72598 145928 37479 -91940 -48441 -4852 -207385
6074 -207385 -484769 -462052 -156399 46958 -20558 -139359 -137332 -117740 -157154 -120290 61006
6063 61006 199756 133555 -18764 -62137 -9583 16037 4171 -7254 -75883 -228905 -308080
6052 -308080 -168539 41747 41864 -169587 -306364 -223952 -113646 -172033 -289692 -240117 -45001
6041 -45001 52224 -62606 -231849 -257959 -134183 14804 109542 143746 111493 16508 -73103
6030 -73103 -79147 -20981 13075 -2906 -21137 -38205 -107966 -211660 -243777 -182234 -141383 -177578
6018a77578o341R3060O9859o0564o2683R6339J42729l4524j50380K465J70370
6007H2752N5817j63841j40828L7913K3194j53628j32068J16025K13499L2931j01313
5996a29547j4026L3280j09809j45756J17350L15507P5235l25643l42604J1289
5986e14724K39691J42028M464K7979N6241l1527p5511M5919J68013J00441q3879
5975G9135j84181j34923j1587R0494R5527q053j05068o5164N7381R3385M0713
5964e2341O7613J89148J84865m3923k60934k14949j854R1815p782j15741q7773
5953b51856J6747O9200L9124R2K7063J00276J13459J5400q6737o3191K7981K1127
5941B8685p1666o3785P2269J18319k5692j38495k7065J42677J14805l6222n2618
$$ plain form
6018 -177578 -183919 -90859 -21000 -81564 -144247 -47908 94821 60297 -90083 -87618 82752
6007 82752 138569 -25272 -166100 -128187 -104993 -258621 -390689 -274664 -61165 -28234 -129547
5996 -129547 -143573 -110293 -220102 -365858 -248508 66999 142234 -183409 -526013 -514724
5986 -514724 -275033 -133005 -128541 -100562 -44321 -75848 -151359 -105440 62573 163014 79135
5975 79135 -105046 -239969 -251556 -161062 -65535 -73588 -178656 -243820 -186439 -93054 -52341
5964 -52341 15272 204420 389285 345362 84428 -130521 -132375 -40560 -48342 -164083 -251856
5953 -251856 -235109 -165909 -126785 -126693 -99630 646 114105 129505 42768 -20423 7558 28685
5941 28685 -42981 -106766 -34497 83822 58130 -80365 -107430 35247 150052 113830 61212
5930F1212O0336O5030q1502j65237r4066k0446k3678K2736J52205J64514l7195
5919A03909k11741j11686J23405J59697m0664j78556n8095J52752J70835l1045
5909G8811k03744j35181R0590J91022L7431j71414j72247j502P3501k9111q9167
5898c31011L9023J73302J02117n9695n7716Q5509J17677l0479j56773j23578k5624
5887b67248L1079P9856J34798R9949l9649j22404m6623N8610M9631J641M3871
5876B3511R5657m178j80914j87063J9633J91603J40443k1541p9302j899Q4362
5865H0312J01785P1111J2533p7595j56994j44691l2698O6025L3223j01987j76646
5854c25622q7698O9874J23951N8567J7758O3591P6119k5484j10667l5584J03723
$$ plain form
5930 61212 121548 186578 105076 -60161 -154227 -174673 -198351 -175615 -23410 141104 103909
5919 103909 -107832 -219518 -96113 63584 22920 -155636 -213731 -60979 109856 78811
5909 78811 -124933 -260114 -169524 21498 58929 -112485 -284732 -286234 -212733 -241844 -331011
5898 -331011 -291988 -118686 -16569 -76264 -133980 -48471 69206 38727 -118046 -241624 -267248
5887 -267248 -236169 -156313 -21515 78434 38785 -83619 -130242 -71632 -22001 -20360 23511
5876 23511 119168 114990 -65924 -252987 -233354 -41751 98692 77151 -2151 -4050 80312
5865 80312 182097 253208 265741 188146 31152 -113539 -146237 -80212 -46989 -148976 -325622
5854 -325622 -413320 -343446 -219495 -160928 -143170 -79579 -3460 -28944 -139611 -175195 -71472
5843g1472J10871J799m8958k7842q1603j89711j34580J12771K63482J23734j11036
5832e2545j67449p9591l8757n3038j7860K8852J318p245J16924K27498J13857
5821G1964r9724j01760R3079J56452o613j20726l8260K7013p1719j33683O464
5810b17513J52955R2443k6403K1529J19815L7424j20822q1767J05406J44667p358
5799B20376j08762p7338p7778j39805q0361J09059J70607J1175j18272m5927M3705
5788i3321k8138j01796J1427J45132M1645j79769j86586L0384J57483P8177K0789
5777a04573J15653J56176k4543k22288j58585P5007J54332J5520q6215j3713N4478
5766c8751k6358q8393N4209K22950J03509k13995k86433K1178K83442J30795j85171
$$ plain form
5843 -71472 39399 41198 -7760 -35602 -117205 -306916 -441496 -328725 -65243 58491 -52545
5832 -52545 -219994 -299585 -338342 -391380 -409240 -380388 -379070 -386315 -269391 -41893 71964
5821 71964 -27760 -129520 -36441 120011 113398 -7328 -45588 -18575 -90294 -223977 -217513
5810 -217513 -64558 27885 1482 23011 142826 180250 59428 -22339 83067 227734 220376
5799 220376 111614 34276 -43502 -183307 -263668 -154609 15998 27173 -91099 -137026 -93321
5788 -93321 -121459 -223255 -211828 -66696 -25051 -204820 -391406 -361022 -203539 -125362 -104573
5777 -104573 11080 167256 142713 -79575 -238160 -163153 -8821 6699 -79516 -93229 -38751
5766 -38751 -65109 -153502 -99293 123657 227166 13171 -273262 -252084 31358 162153 -23018
5755b3018j73805J42553K72616Q130k86807k38415L5829J79871R8698j9660k6391
5744c0399M8395R7047L7672j15842k14640j16450Q5301J43307K9031p757J32629
5733H8294J90822j7079k28504j20777J36708J14909j93097l48716j36495J45554
5723c68381J68330M755q1499k0260P1917J03545O2153j6830m3218M0181J22968
5712D3661M8293j07178j01095P5109J38277l3860j83479q8363Q1849P4241k7242
5701g9787N72R1986J8519j67547j86087N149J47135J02373J2788j9761q5162j90823
5689c50645j50256Q0378K25901P7973j55880j45795P3905J93066J08024J6062
5679b7267L9632M9697n6781j47115o7084R8530J44110K9167j02956j37535q4451
$$ plain form
5755 -23018 -196823 -54270 218346 226476 -60331 -298746 -262917 -83046 15652 -4008 -30399
5744 -30399 17996 115043 152715 36873 -177767 -294217 -208916 -65609 -36578 -44335 88294
5733 88294 279116 262037 33533 -87244 49464 164373 -28724 -377440 -513935 -368381
5723 -368381 -200051 -195296 -276795 -297055 -225138 -121593 -59440 -76270 -119488 -79307 43661
5712 43661 91954 -15224 -116319 -41210 97067 63207 -120272 -208635 -126786 -52545 -79787
5701 -79787 -79215 12771 31290 -136257 -322344 -317195 -170060 -67687 -54899 -74660 -159822 -350645
5689 -350645 -500901 -420523 -194622 -116649 -272529 -418324 -344419 -151353 -43329 -27267
5679 -27267 12365 62062 5281 -141834 -208918 -110388 33722 62889 -40067 -177602 -262053
5668b62053O222R4877J26671P2175l255j5891j482n0807j15292n1249J06419J24934
5656C1269o3558j93685m9752J71917J48770n7662j08799N5203J43598L2138m1410
5645F8029O6019J27965l7968k11863j33504M5603L1122j00076n9225J16936J28255
5634D1293l9985q3233P0721J21688o8182k14807r0187R9506P3654p6220r1802
5623b57554K0322O2440j863m9038m1207k5876J2661Q2541P6583m5451r9236N1142
5611b14536K04336J05610j07461j03307Q3331J08354p2753j14162J04281K34559
5601B28252M6644j68623r6559O3379l7358k59521j84938J64241L13104O2760k17726
5590h6345j63914Q6385J77566M7512r2232j16681q1846m0736K2328Q9734R9055
$$ plain form
5668 -262053 -255831 -160954 -34283 37892 34637 18746 17264 -33543 -148835 -200084 -93665 31269
5656 31269 -32289 -225974 -275726 -103809 44961 -12701 -121500 -66297 77301 109439 68029
5645 68029 134048 262013 224045 12182 -121322 -75719 -44597 -144673 -203898 -86962 41293
5634 41293 1308 -81925 -11204 110484 42302 -172505 -262692 -163186 -89532 -165752 -257554
5623 -257554 -237232 -174792 -176655 -225693 -266900 -292776 -280115 -197574 -120991 -166442 -265678 -214536
5611 -214536 -10200 95410 -12051 -115358 -32027 76327 3574 -110588 -6307 228252
5601 228252 274896 106273 9714 73093 35735 -223786 -408724 -244483 68621 131381 -86345
5590 -86345 -250259 -163874 13692 61204 -31028 -147709 -229555 -270291 -247963 -158229 -59174
5579e9174M4884q938k4139k3063l2120m6014m2758j208P2589J14530N0786q5771
5567d0396j53175p4077N0501P7173J3634j8335K6706P4378O6494L0738m190o4727
5555a5276j55578j95570r9878Q9413K08772J38685m4032j23534N608J88253J96994
5544A93857M5076l5549M7737J06100o813j31168o6315O3177q153k26604k75994
5533b94649q9383M4166l7131j20634j4818J21772P9419l2877M416J34685J41754
5522f3280K1551m9078k2761P192K8528Q5426J06883J5493p4654l4414J1262j00606
5510f8458k04713m6383K02898J43571j56719k10362O5022J65514j33825l41075
5500e84530o0980L05643K10849j32611j35006J77161K58257l694j47729K6845
$$ plain form
5579 -59174 -14290 -23228 -47367 -70430 -102550 -148564 -191322 -192530 -119941 -5411 45375 -40396
5567 -40396 -193571 -267648 -217147 -139974 -126340 -144675 -117969 -43591 22903 53641 49451 -15276
5555 -15276 -170854 -366424 -466302 -376889 -168117 -29432 -73464 -196998 -191390 -3137 193857
5544 193857 238933 203384 251121 357221 350408 219240 152925 216102 207949 -18655 -294649
5533 -294649 -384032 -339866 -376997 -497631 -512449 -390677 -311258 -344135 -339719 -205034 -63280
5522 -63280 -41729 -90807 -113568 -106376 -77848 7578 114461 129954 55300 20886 32148 -68458
5510 -68458 -273171 -319554 -116656 26915 -129804 -340166 -275144 -109630 -243455 -584530
5500 -584530 -645510 -339867 -129018 -261629 -396635 -219474 38783 35089 -112640 -85795
5490h5795J62087K3127j23129m8222L9065o5092j55029R56K16152J83996l4050
5479A14066j56304j16561m1893L3583J34612J67554N9965m6168n401N5081n4004
5468A44530k21153j89205J2355J11643L1641l4702J0952M1128j5754m4096K3038
5457a29623P5060K9259l3806l3087r979n415K0166O4640M3424m8443r0549l6047
5445a54400J989m5780p5894K589J06146J28058J10215J18404P7865q7906k51667
5434g0381k18614k6569Q6516K2306n0239L6919J98678K17307M3924j33923j34193
5423b8269q591M1078m7048r9540K9043K00091J59101p6122k05893p9441P9914
5412c5677J8656j60112j65490L6688J94067J53283L6447n636o624n9427j35711
$$ plain form
5490 -85795 76292 99419 -23710 -71932 -32867 -97959 -252988 -252032 -35880 148116 114066
5479 114066 -42238 -158799 -200692 -167109 -32497 135057 195022 148854 143453 198534 144530
5468 144530 -76623 -265828 -253473 -141830 -110189 -144891 -133939 -92811 -108565 -152661 -129623
5457 -129623 -54563 -25304 -59110 -92197 -102176 -107591 -87425 -22785 20639 -27804 -118353 -154400
5445 -154400 -152411 -198191 -274085 -271496 -165350 -37292 72923 191327 269192 181286 -70381
5434 -70381 -288995 -315564 -229048 -206742 -256981 -220062 -21384 195923 239847 105924 -28269
5423 -28269 -36860 4218 -42830 -142370 -113327 86764 245865 169743 -36150 -115591 -35677
5412 -35677 -17021 -177133 -342623 -305935 -111868 41415 77862 72226 65602 6175 -129536
5401a29536j45822q1166qN8551P5506M0935N247N4715J61625J59061k5504k04636
5389c1032j52568O3097J55058K0974j20537o3131R7574J36410K6232p7571j00735
5378d6229j05130j02418j6141J27556J59938J9176j14359o4388Q2639J22759M1316
5367A04719j4377q663m4868j24399j08533K3898R6877J5283p6540m8862o592o9331
5355b61388j06266N4375K68596K34909k5354j67292m6849P5959j3102j36201n3940
5344a76553J05688N9724j35318j50740Q5786K65789J65690n4026j37238p8508
5334d9706k0438K007K8151K5659l2561n4270K6619R2224K3111o2155J6486J63504
5322A58631J27873o8394j36919K282Q2324n6861j96573j16177M2226M2720m5529
$$ plain form
5401 -129536 -275358 -356524 -356532 -297981 -222475 -181540 -176293 -121578 40047 199108 173604 -31032
5389 -31032 -183600 -120503 34555 55529 -65008 -128139 -30565 105845 132077 54506 -46229
5378 -46229 -151359 -253777 -269918 -142362 17576 36752 -77607 -141995 -59356 63403 104719
5367 104719 90342 81679 36811 -87588 -196121 -172223 -75346 -60063 -136603 -185465 -192057 -261388
5355 -261388 -367654 -313279 -44683 190226 164872 -2420 -49269 26690 13588 -122613 -176553
5344 -176553 -70865 -11141 -146459 -297199 -211413 54376 220066 166040 28802 -49706
5334 -49706 -70144 -68137 -39986 -14327 -46888 -101158 -74539 17685 40796 -21359 -4873 158631
5322 158631 286504 218110 81191 83473 165797 108936 -87637 -203814 -161588 -118868 -164397
5311a64397j8762P5396N5695j9200M7124J87200J42295p9321j88689r1636o727
5300f1022l6640n279J44701J74843k2783j75190o8595P7116j0365j76262j13544
5289b73020R3405J15831n3338j06304M6392J57486R0265J2241N2923R1324J2928
5278B40133q4123p7803j0371L0877M3498K6729n7937j59702j47634k7729L0065
5267a93997l2793n3107P7524K10007J55417l7925j68124j35035K075J24971J25478
5256G4491k0875j73867j37620P7745K30147J51478n5931j95119j94057p8825R7883
5245b24550K08910J13739j19373k24200q2392J17425J72912J15418M2318n9564
5235F0643j57856r2844J33583K29128K3788k19206j90038l264M9613M130Q1091
$$ plain form
5311 -164397 -183159 -107763 -52068 -71268 -24144 163056 305351 226030 37341 -54295 -61022
5300 -61022 -97662 -102941 41760 216603 193820 18630 -49965 27151 16786 -159476 -273020
5289 -273020 -179615 -63784 -117122 -223426 -177034 -19548 70717 82958 135881 227205 240133
5278 240133 156010 78207 67836 98713 142211 168940 111003 -48699 -196333 -224062 -193997
5267 -193997 -226790 -279897 -202373 7634 163051 125126 -42998 -178033 -175958 -50987 74491
5256 74491 53616 -120251 -257871 -180126 50021 201499 145568 -49551 -243608 -322433 -224550
5245 -224550 -15640 98099 -21274 -245474 -327866 -210441 -37529 77889 120207 60643
5235 60643 -97213 -190057 -56474 172654 196442 -22764 -212802 -216066 -166453 -162323 -81232
5224h1232K03215J03339j58425k32787l5542J42878J09899j8570j08475j51203
5214b26903r5353J05630K64943J54628p6775r0859N4916M862k00911j33712K09378
5203c0156K73897j07866l31625j461L58197J51496k88276k61769J48190K87017
5193A97644L7055j02792M2447R5944j04517k31265j05380J8600j1055M297J24246
5182c4776Q5785j50025k03107P8030K78609Q2116j91782j31104R3789Q0678j00076
5171a11863p9157J39166K05679L4530r9985n9888j1386o0781r0812l0820J6117
5160a49200n002p405L9557M3585j7399l8470K0585P1931P0737O9164O5539j0189
5148A53433j16117r8134O1020J70707R5458o3126j32567q3531L786O6676P4387
$$ plain form
5224 -81232 121983 225322 66897 -165890 -201432 -58554 51345 32775 -75700 -226903
5214 -226903 -322256 -216626 48317 202945 126170 35311 90227 95089 -105822 -239534 -30156
5203 -30156 243741 135875 -195750 -197211 160986 312482 24206 -237563 -89373 197644
5193 197644 234699 131907 174354 270298 165781 -65484 -170864 -152264 -163319 -159022 -34776
5182 -34776 51009 -99016 -302123 -224093 54516 136632 -55150 -186254 -92465 -11787 -111863
5171 -111863 -191020 -51854 153825 188355 88370 28482 17096 -43685 -134497 -165317 -149200
5160 -149200 -154202 -161607 -122050 -78465 -95864 -134334 -113749 -41818 28919 98083 163622 153433
5148 153433 37316 -60818 202 170909 266367 203241 70674 -12857 -9071 57605 131992
5137A31992J9230m0707k3589M7642O2569j771n1616n3779q2758j33912p5027J05729
$$ plain form
5137 131992 151222 110515 86926 134568 197137 195366 143750 89971 7213 -126699 -201726 -95997
$$ [...]
##END NTUPLES=NMR SPECTRUM
##END=
