##TITLE=1H ikalashn
Cl-Ac-2
20.12.2024
##JCAMPDX= 6.0         $$ Bruker NMR JCAMP-DX V2.0
##DATA TYPE= NMR FID
##DATA CLASS= NTUPLES
##ORIGIN= UXNMR, Bruker Analytische Messtechnik GmbH
##OWNER= root
$$ TOPSPIN		Version 1.3
$$ 2024-12-20 13:45:17.078 +0400  Irina@DPX200
$$ Compression mode = diff/dup
##.OBSERVE FREQUENCY= 200.131300845
##.OBSERVE NUCLEUS= ^1H
##.DELAY= (6, 6)
##.ACQUISITION MODE= SIMULTANEOUS
##.ACQUISITION SCHEME= undefined
##.AVERAGES= 16
##.DIGITISER RES= 18
##SPECTROMETER/DATA SYSTEM= spect
##.PULSE SEQUENCE= zg
##.SOLVENT NAME= CDCl3
##.SHIFT REFERENCE= INTERNAL, CDCl3, 1, 17.49637
##AUDIT TRAIL= $$ (NUMBER, WHEN, WHO, WHERE, WHAT)
$$ ##TITLE= Audit trail, TOPSPIN		Version 1.3
$$ ##JCAMPDX= 5.01
$$ ##ORIGIN= Bruker BioSpin GmbH
$$ ##OWNER= Irina
$$ $$ F:/spectra/data/iren/nmr/1H/4/audita.txt
$$ ##AUDIT TRAIL=  $$ (NUMBER, WHEN, WHO, WHERE, VERSION, WHAT)
(   1,<2024-12-20 13:44:57.531 +0400>,<Irina>,<DPX200>,<TOPSPIN 1.3>,
      <created by zg
	started at 2024-12-20 13:43:48.078 +0400,
	POWCHK disabled, PULCHK disabled
       terminated by command 'halt'
       configuration hash MD5:
       BE 6D 3F 07 2A EA 11 49 91 17 2B D3 AF B3 58 0D
       data hash MD5: 16K
       CA 03 07 E7 63 0A D4 B4 55 F5 F2 F4 13 BF DC DA>)
$$ ##END=
$$ 
$$ $$ hash MD5
$$ $$ 7A 3F DF 16 F1 55 D1 27 80 F0 75 BF DD E2 4C EC
##$RELAX= 
##$RELAX= 
##$RELAX= 
##$RELAX= 
##$RELAX= 
##$RELAX= 
##$RELAX= 
##$RELAX= 
##$RELAX= 
$$ Bruker specific parameters
$$ --------------------------
##$DU= <F:/spectra>
##$EXPNO= 4
##$NAME= <1H>
##$PROCNO= 1
##$TYPE= <nmr>
##$USER= <iren>
##$AMP= (0..31)
100 100 100 100 100 100 100 100 100 100 100 100 100 100 100 100 100 100 
100 100 100 100 100 100 100 100 100 100 100 100 100 100 
##$ANAVPT= -1
##$AQSEQ= 0
##$AQ_mod= 1
##$AUNM= <au_zg>
##$AUTOPOS= <>
##$BF1= 200.13
##$BF2= 200.13
##$BF3= 200.13
##$BF4= 200.13
##$BF5= 200.13
##$BF6= 200.13
##$BF7= 200.13
##$BF8= 200.13
##$BYTORDA= 1
##$CFDGTYP= 0
##$CFRGTYP= 5
##$CHEMSTR= <none>
##$CNST= (0..63)
1 1 145 1 1 1 1 1 1 1 1 1 1 1 1 1 1 1 1 1 1 1 1 1 1 1 1 1 1 1 1 1 1 1 
1 1 1 1 1 1 1 1 1 1 1 1 1 1 1 1 1 1 1 1 1 1 1 1 1 1 1 1 1 1 
##$CPDPRG= <>
##$CPDPRG1= <>
##$CPDPRG2= <>
##$CPDPRG3= <>
##$CPDPRG4= <mlev>
##$CPDPRG5= <mlev>
##$CPDPRG6= <mlev>
##$CPDPRG7= <mlev>
##$CPDPRG8= <mlev>
##$CPDPRGB= <>
##$CPDPRGT= <>
##$D= (0..63)
0 2 0 0 0 0 0 0 0 0.06 0 0.03 0 0 0 0 0.0002 0 0 0 0 0 0 0 0 0 0 0 0 0 
0 0 0 0 0 0 0 0 0 0 0 0 0 0 0 0 0 0 0 0 0 0 0 0 0 0 0 0 0 0 0 0 0 0 
##$DATE= 1734687892
##$DBL= (0..7)
120 120 120 120 120 120 120 120 
##$DBP= (0..7)
150 150 150 150 150 150 150 150 
##$DBP07= 0
##$DBPNAM0= <>
##$DBPNAM1= <>
##$DBPNAM2= <>
##$DBPNAM3= <>
##$DBPNAM4= <>
##$DBPNAM5= <>
##$DBPNAM6= <>
##$DBPNAM7= <>
##$DBPOAL= (0..7)
0.5 0.5 0.5 0.5 0.5 0.5 0.5 0.5 
##$DBPOFFS= (0..7)
0 0 0 0 0 0 0 0 
##$DE= 6
##$DECBNUC= <off>
##$DECIM= 32
##$DECNUC= <off>
##$DECSTAT= 4
##$DIGMOD= 1
##$DIGTYP= 9
##$DL= (0..7)
0 120 120 120 120 120 120 120 
##$DP= (0..7)
$$ [...]
##$SW= 21.9926040160658
##$SWIBOX= (0..15)
0 0 2 0 0 0 0 0 0 0 0 0 0 0 0 0 
##$SW_h= 4401.40845070422
##$TD= 16384
##$TD0= 1
##$TE= 300
##$TE2= 300
##$TE3= 300
##$TEG= 300
##$TL= (0..7)
0 120 120 120 120 120 120 120 
##$TP= (0..7)
150 150 150 150 150 150 150 150 
##$TP07= 0
##$TPNAME0= <>
##$TPNAME1= <>
##$TPNAME2= <>
##$TPNAME3= <>
##$TPNAME4= <>
##$TPNAME5= <>
##$TPNAME6= <>
##$TPNAME7= <>
##$TPOAL= (0..7)
0.5 0.5 0.5 0.5 0.5 0.5 0.5 0.5 
##$TPOFFS= (0..7)
0 0 0 0 0 0 0 0 
##$TUNHIN= 0
##$TUNHOUT= 0
##$TUNXOUT= 0
##$USERA1= <user>
##$USERA2= <user>
##$USERA3= <user>
##$USERA4= <user>
##$USERA5= <user>
##$V9= 5
##$VALIST= <valist>
##$VCLIST= <CCCCCCCCCCCCCCC>
##$VD= 0
##$VDLIST= <DDDDDDDDDDDDDDD>
##$VPLIST= <PPPPPPPPPPPPPPP>
##$VTLIST= <TTTTTTTTTTTTTTT>
##$WBST= 1024
##$WBSW= 25
##$XGAIN= (0..3)
0 0 0 0 
##$XL= 0
##$YL= 0
##$YMAX_a= 569668
##$YMIN_a= -499470
##$ZGOPTNS= <>
##$ZL1= 120
##$ZL2= 120
##$ZL3= 120
##$ZL4= 120
##$ABSF1= 10
##$ABSF2= 0
##$ABSG= 5
##$ABSL= 3
##$ALPHA= 0
##$AQORDER= 0
##$ASSFAC= 0
##$ASSFACI= 0
##$ASSFACX= 0
##$ASSWID= 0
##$AUNMP= <proc_1d>
##$AXLEFT= 0
##$AXRIGHT= 0
##$AXTYPE= 0
##$AXUNIT= <>
##$AZFE= 0.1
##$AZFW= 0.1
##$BCFW= 1
##$BC_mod= 2
##$BYTORDP= 1
##$COROFFS= 0
##$CY= 7568.61572265625
##$DATMOD= 1
##$DC= 2
##$DFILT= <>
##$DTYPP= 0
##$F1P= 17.9538593292236
##$F2P= -4.03888763876832
##$FCOR= 0.5
##$FTSIZE= 32768
##$FT_mod= 4
##$GAMMA= 1
##$GB= 1
##$INTBC= 1
##$INTSCL= 1
##$ISEN= 128
##$LB= 0.02
##$LEV0= 0
##$LPBIN= 0
##$MAXI= 945.577
##$MC2= 0
##$MEAN= 0
##$ME_mod= 0
##$MI= -402.1523
##$NCOEF= 0
##$NC_proc= 0
##$NLEV= 6
##$NOISF1= 8.587773
##$NOISF2= 6.764455
##$NSP= 1
##$NTH_PI= 0
##$NZP= 0
##$OFFSET= 17.49637
##$PC= 1
##$PHC0= 137.3872
##$PHC1= -59.48403
##$PH_mod= 0
##$PKNL= yes
##$PPARMOD= 0
##$PPDIAG= 0
##$PPIPTYP= 0
##$PPMPNUM= 100
##$PPRESOL= 1
##$PSCAL= 0
##$PSIGN= 0
##$REVERSE= no
##$SF= 200.13
##$SI= 32768
##$SIGF1= 18.5376
##$SIGF2= -6.396296
##$SINO= 400
##$SIOLD= 32768
##$SREGLST= <1H.CDCl3>
##$SSB= 3
##$STSI= 0
##$STSR= 0
##$SW_p= 4401.40845070422
##$SYMM= 0
##$S_DEV= 0
##$TDeff= 0
##$TDoff= 0
##$TI= <>
##$TILT= no
##$TM1= 0
##$TM2= 0
##$TOPLEV= 0
##$USERP1= <user>
##$USERP2= <user>
##$USERP3= <user>
##$USERP4= <user>
##$USERP5= <user>
##$WDW= 1
##$XDIM= 8192
##$YMAX_p= 0
##$YMIN_p= 0
$$ End of Bruker specific parameters
$$ ---------------------------------
##NTUPLES= NMR FID
##VAR_NAME=  TIME,          FID/REAL,        FID/IMAG
##SYMBOL=    X,             R,               I
##VAR_TYPE=  INDEPENDENT,   DEPENDENT,       DEPENDENT
##VAR_FORM=  AFFN,          ASDF,            ASDF
##VAR_DIM=   8192,          8192,            8192
##UNITS=     SECONDS,       ARBITRARY UNITS, ARBITRARY UNITS
##FACTOR=    0.0002272,     1,               1
##FIRST=     0,             0,               0
##LAST=      1.8609952,     -17,             120
##MIN=       0,             -499470,         -499470
##MAX=       1.8609952,     569668,          569668
$$ Real data points
##PAGE= N=1
##DATA TABLE= (X++(R..R)), XYDATA
$$ plain form
0 0 0 0 0 0 0 0 0 0 0 0 0 0 0 0 0 0 0 0 0 0 0 0 11 -16 16 -16 16 -16 20 -32 32 -32 48 -48 51 -64 69 -80 89 -99 113
41 113 -124 137 -154 171 -188 213 -234 258 -284 313 -346 379 -415 457 -503 551 -609 671 -738
60 -738 814 -898 986 -1081 1162 -1193 1050 -238 -3945 53667 569668 342189 -336156 -278426
74 -278426 191994 155103 -266224 -213462 254216 352649 -74934 -334340 -111663 144833 97865
85 97865 8614 50608 26686 -99263 -94327 7531 19142 36168 151504 102520 -173621 -250959
97 -250959 38203 227958 45846 -123096 13522 120657 -86991 -250672 5402 313440
107 313440 147869 -220666 -188197 97244 82294 -112330 -8684 212799 80582 -202976
117 -202976 -152701 88676 97744 -30355 21286 120391 -21969 -218429 -95779 185437 164902
$$ packed form
0@%%%%%%%%%%%%%%%%%%%%%%J1k7L2l2L2l2L6n2O4o4Q0r6R9j15J33j49J69j88K12
41A13k37K61k91L25l59M01m47M92n42N97o59P25p94Q72r60J054j160J280j409
60g38J552j712J884k067K243k355K243j288l707N7612N16001k27479o78345N7730
74b78426M70420l6891m21327N2762M67678R8433m27583k59406K22677K56496m6968
85I7865q9251M1994k3922j25949M936J01858J1611J7026J15336m8984k76141p7338
97b50959K89162J89755j82112j68942J36618J07135k07648j63681K56074L08038
107C13440j65571l68535L2469K85441j4950j94624J03646K21483j32217k83558
117b02976N0275K41377R068j28099N1641R9105j42360j96460J22650K81216k0535
$$ plain form
128 164902 -92792 -115214 83036 52444 -167900 -107363 183062 193286 -85068 -179183 -10283
139 -10283 75143 14 -10742 67560 52205 -60442 -92024 -11181 41989 33077 52086 59610
151 59610 -50695 -144530 -30749 120295 48791 -74858 13067 107787 -50247 -193372 -13601
162 -13601 210129 95804 -150390 -117329 92491 88591 -95718 -84566 127864 145756 -95307
173 -95307 -183254 19129 142713 17197 -68315 18901 50312 -47832 -73130 18603 58549
184 58549 11464 -9086 5504 -22967 -61705 -12995 78021 63604 -42023 -63005 16396 22589
196 22589 -46970 -10480 95594 52607 -85510 -73729 47910 49590 -36435 -17823 62369 28753
208 28753 -75351 -67156 45511 76826 -13641 -57678 10462 36974 -37924 -51160 44536 67092
$$ packed form
128A64902k57694k2422J98250l0592k20344O0537K90425J0224k78354r4115J68900
139a0283Q5426p5129j0756P8302j5355j12647l1582Q0843N3170q912J9009P524
151E9610j10305r3835J13781J51044p1504j23649Q7925R4720j58034j43125J79771
162a3601K23730j14325k46194L3061K09820l900j84309J1152K12430J7892k41063
173i5307q7947K02383J23584j25516q5512Q7216L1411r8144k5298R1733L9946
184E8549m7085k0550J4590k8471l8738M8710R1016j4417j05627k0982P9401O193
196B2589o9559L6490J06074m2987j38117J1781J21639J680q6025J8612Q0192l3616
208B8753j04104Q195J12667L1315r0467m4037O8140K6512p4898j3236R5696K2556
$$ plain form
220 67092 -25741 -52405 17998 24292 -35639 -16265 57768 41860 -42795 -54176 16129 45660
232 45660 -3853 -32260 12568 36611 -19069 -50555 8165 44158 -5563 -29042 14344 15780
244 15780 -34033 -22180 37990 30609 -26669 -28548 17390 24539 -12983 -22884 14812 32685 -7661
257 -7661 -34998 4528 34433 -4353 -29042 9908 23035 -20706 -24187 24136 23917 -25160 -28302
270 -28302 14901 25269 -6185 -22291 -1483 18791 4236 -17555 -1570 22224 3092 -19755
282 -19755 3073 19572 -9506 -18277 17988 23172 -16322 -24331 7183 16719 -2547 -10859 -991
295 -991 7688 664 -14421 -10429 12448 14866 -4998 -7477 1534 -8125 -8180 19802 23066 -12231 -22827
310 -22827 3330 12510 -316 -395 8321 5912 -3920 -13827 -14424 2882 16641 7081 -3256 -2429 -10554
$$ packed form
220F7092r2833k6664P0403O294n9931J9374P4033j5908q4655j1381P0305K9531
232D5660m9513k8407M4828K4043n5680l1486N8720L5993m9721k3479M3386J436
244A5780m9813J1853O0170p381n7278j879M5938P149l7522r901L7696J7873m0346
257g661k7337L9526K9905l8786k4689L8950J3127m3741l481M8323k19m9077l142
270b8302M3203J0368l1454j6106K0808K0274j4555k1791J5985K3794j9132k2847
282a9755K2828J6499k9078q771L6265N184l9494q009L1514R536j9266q312R868
295i91Q679p024j5085L992K2877K418j9864k479R011r659n5K7982L264l5297j0596
310b2827K6157R180j2826p9Q716k409r832r907n97J7306J3759r560j0337Q27q125
$$ plain form
325 -10554 -16662 4081 20014 2157 -11310 1566 4394 -9300 -5823 10615 14003 7348 -3456
338 -3456 -16864 -12874 9030 16424 5965 394 -3900 -12453 -6146 6779 1084 -5110 6997 7608
352 7608 -12631 -15744 2952 11895 9094 4235 -8899 -16643 -2279 11810 7484 4766 6555 -3057
366 -3057 -9923 -1867 1147 -1691 7811 12385 -5246 -16254 -5039 4465 5372 8004 694 -13930
380 -13930 -9767 4857 2766 -2463 6023 8769 -929 -5861 -6730 -6457 7338 18921 4343 -13355
394 -13355 -7041 2270 992 5299 8740 -2832 -9141 -681 -530 -7727 -1015 9465 5110 -2950 -6949
409 -6949 -9178 -557 12478 5660 -9080 -3386 6114 -889 -2544 7330 4671 -4360 1579 5009 -7175
424 -7175 -9439 5157 11293 3038 -6182 -9589 -2114 9194 2689 -12292 -4761 9403 299 -9001
$$ packed form
325a0554o108K0743J5933j7857j3467J2876K828j3694L477J6438L388o655j0804
338c456j3408L990K1904P394j0459n571m294q553O307J2925n695o194J2107O11
352G608k0239l113J8696Q943k801m859j3134p744J4364J4089m326k718J789r612
366c057o866Q056L014k838R502M574j7631j1008J1215R504R07K632p310j4624
380a3930M163J4624k091n229Q486K746r698m932q69K73J3795J1583j4578j7698
394a3355O314R311j278M307L441j1572o309Q460J51p197O712J0480m355q060l999
409f949k229Q621J3035o818j4740N694R500p003j655R874k659r031N939L430j2184
424g175k264J4596O136q255r220l407P475J1308o505j4981P531J4164r104r300
$$ plain form
438 -9001 3992 9069 -4219 -4416 6957 951 -9564 -311 11686 6722 -4608 -7749 753 10990
452 10990 3709 -12633 -7113 10124 2724 -11709 131 11519 -3737 -10738 4851 5302 -11190
465 -11190 -6605 12812 10507 -8316 -12585 3006 15828 5862 -12327 -6335 12140 3729 -14633
478 -14633 -595 19277 2179 -16132 200 9872 -10481 -13954 12580 18624 -8039 -21650 -3207
491 -3207 14767 6319 -10656 -3607 14754 4399 -19678 -8294 19671 10365 -11422 1543 13459
504 13459 -11099 -20798 12043 26755 -4435 -23846 -2228 14643 -1343 -16253 1775 23282
516 23282 4537 -28120 -16181 19235 11755 -15059 1903 25464 -4888 -34891 -1554 34266
528 34266 8999 -22574 -3362 20002 -380 -25229 -5559 28752 18149 -20978 -22252 9911
$$ packed form
438i001J2993N077j3288j97J1373o006j0515R253J1997m964j1330l141Q502J0237
452A0990p281j6342N520J7237p400j4433J1840J1388j5256p001J5589M51j6492
465a1190M585J9417k305j8823m269J5591J2822r966j8189N992J8475q411j8362
478a4633J4038J9872j7098j8311J6332R672k0353l473K6534O044k6663j3611J8443
491c207J7974q448j6975P049J8361j0355k4077J1384K7965r306k1787J2965J1916
504A3459k4558r699L2841J4712l1190j9411K1618J6871j5986j4910J8028K1507
516B3282j8745l2657J1939L5416p480k6814J6962K3561l0352l0003L3337L5820
528C4266k5267l1573J9212K3364k0382k4849J9670L4311j0603l9127j274L2163
$$ plain form
540 9911 8650 -17170 -1607 30440 5872 -36083 -14595 27096 10326 -21454 -442 27409
552 27409 2406 -31377 -12961 25879 22600 -9929 -13239 8132 1656 -21314 -2715 32442 11534
565 11534 -30135 -11617 24001 -2851 -34900 5316 46455 5759 -46397 -19306 32123 18536
577 18536 -24111 -11018 31735 16039 -38375 -27864 35907 36613 -24378 -28469 24482 20214 -32792
590 -32792 -23865 33449 31836 -20568 -30059 4685 14009 -6642 -6633 13940 10062 -16398 -15391 11299
604 11299 9051 -14335 1791 31913 1552 -44811 -12185 45730 20897 -35436 -14639 34373
616 34373 9611 -41383 -17094 41273 28304 -32048 -31737 22550 23498 -29810 -25342 38388 35423
629 35423 -37385 -43413 27188 38843 -21211 -28557 25976 28902 -24584 -32513 16299 32026 -5290
$$ packed form
540I911j261k5820J5563L2047k4568m1955K1488M1691j6770l1780K1012K7851
552B7409k5003l3783J8416L8840l279l2529l310K1371o476k2970J8599L5157k0908
565A1534m1669J8518L5618k6852l2049M0216M1139m0696n2156K7091N1429j3587
577A8536m2647J3093M2753j5696n4414J0511O3771P06o0991m091N2951m268n3006
590c2792Q927N7314j613n2404r491L4744R324k0651RK0573l878k6460J007K6690
604A1299k248k3386J6126L0122l0361m6363L2626N7915k4833n6333K0797M9012
616C4373k4762n0994K4289N8367j2969o0352L11N4287R48n3308M468O3730k965
629C5423p2808o028P0601J1655o0054p346N4533K926n3486p929M8812J5727l7316
$$ plain form
642 -5290 -21632 7049 16299 -15672 -21605 18354 26916 -16283 -26688 13387 18248 -20421 -16376
655 -16376 24888 16996 -24500 -16601 20780 11894 -20233 -6422 28264 11211 -33220 -20118 34852
668 34852 29919 -30705 -31525 32170 33422 -36992 -41633 33441 46099 -24818 -43980 15567 35065
681 35065 -15578 -33403 13233 34074 -8629 -33929 4545 32740 -2122 -29363 5604 30389
693 30389 -6144 -29106 6902 26982 -5674 -19090 9151 12902 -14975 -12493 16443 11909 -18278
706 -18278 -14138 18590 15420 -22292 -22181 22847 28684 -21372 -32404 20388 34262 -19259 -32833
719 -32833 20663 34444 -17329 -31418 15933 29604 -14650 -29898 12397 32641 -7752 -34573
731 -34573 1737 32350 -2006 -34907 -914 34278 3351 -30228 -4105 22418 -476 -17632
$$ packed form
642e290j6342K8681R250l1971n933L9959Q562m3199j0405M0075M861l8669M045
655a6376M1264p892m1496P899L7381q886l2127J3811L4686j7053m4431J3102N4970
668C4852m933o0624q20O3695J252p0414m641P5074J2658p0917j9162N9547J9498
681C5065n0643j7825M6636K0841m2703k5300L8474K8195l4862k7241L4967K4785
693C0389l6533k2962L6008K0080l2656j3416K8241L751k7877K482K8936m534l0187
706a8278M140L2728l170l7712J11M5028N837n0056j1032N2792J3874n3521j3574
719c2833N3496J3781n1773j4089M7351J3671m4254j5248M2295K0244m0393k6821
731c4573L6310L0613l4356l2901L3993L5192l0927l3579K6123K6523k2894j7156
$$ plain form
743 -17632 5657 17605 -5472 -14766 6839 14639 -6398 -14282 8162 17875 -8027 -22032 6843
756 6843 24602 -6169 -25943 4882 22300 -9908 -23155 12148 24367 -12038 -25385 8226
768 8226 22693 -6897 -21387 7713 26526 -1847 -28098 -3956 26544 7811 -20886 -3048
780 -3048 20585 -1238 -23470 697 22279 49 -17882 959 12907 -6630 -16736 4783
792 4783 19736 961 -19471 -6409 15824 6682 -12801 -1906 16642 1102 -18615 -1430
804 -1430 17772 1821 -11841 5218 12480 -9771 -19191 3934 19549 3330 -14318 -5427 9402
817 9402 319 -15501 -3202 18823 8423 -15287 -7677 11005 1349 -11528 4646 17224 -2039
830 -2039 -16898 -1555 13859 4283 -8371 -2232 8176 1331 -12024 -6010 11551 8731 -8858
$$ packed form
743a7632K3289J1948k3077r294K1605P800k1037p884K2444R713k5902j4005K8875
756F843J7759l0771j9774L0825J7418l2208j3247L5303J2219l6405j3347L3611
768H226J4467k9590j4490K9100J8813k8373k6251K4142L0500j8733k8697J7838
780c048K3633k1823k2232K4167K1582k2230j7931J8841J1948j9537j0106K1519
792D783J4953j8775k0432J3062K2233r142j9483J0895J8548j5540j9717J7185
804a430J9202j5951j3662J7059P262k2251r420K3125J5615j6219j7648Q891J4829
817I402r083j5820J2299K2025j0400k3710P610J8682r656j2877J6174J2578j9263
830b039j4859J5343J5414r576j2654O139J0408o845j3355O014J7561k820j7589
$$ plain form
843 -8858 -7410 6197 -109 -11358 1997 15406 590 -14695 -3027 10525 2616 -6646 576
856 576 9682 3645 -9017 -8495 5051 9694 -222 -3163 3786 -933 -11539 -2859 11194 3963 -8383
871 -8383 -1669 6133 -3242 -9766 493 10238 4840 -5822 -7461 895 6310 1637 -1265 4021 2589
886 2589 -7281 -4818 6982 4893 -4472 61 6985 -2019 -10318 -2832 5979 3705 -1678 -2633 -907
901 -907 186 -1867 -2392 2920 4683 -2361 -3878 3710 3011 -5045 -759 9018 3246 -8119 -4792 4562
917 4562 4893 529 -1774 -2132 -718 98 -1951 -1356 2204 966 -2548 -701 456 -3228 -388 6453
933 6453 2080 -6590 -2944 4966 3003 -1236 347 1697 530 170 -1277 -2118 988 2458 -179 36
949 36 1003 -3610 -4628 2294 3865 -2918 -3339 2312 1281 -2240 -453 1161 -175 1156 1597 -1689
$$ packed form
843h858J448J3607o306j1249J3355J3409j4816j5285J1668J3552p909r262P222
856E76R106o037j2662N22J3546M643r916k941O949m719j0606Q680J4053p231j2346
871h383O714P802r375o524J0259R745n398j0662j639Q356N415m673k902N286j432
886B589r870K463J1800k089r365M533O924r004q299P486Q811k274n383r55J726
901i07J093k053n25N312J763p044j517P588o99q056M286R777n772j1365L327R354
917D562L31m364k303l58J414Q16k049N95L560j238l514J847J157l684K840O841
933F453m373q670L646P910j963m239J583J350j167l60j447q41L106J470k637K15
949C6R67m613j018O922J571o783m21N651j031l521J787J614j336J331M41l286
$$ plain form
965 -1689 -1282 2675 2716 131 -130 -1460 -1809 2554 3163 -3752 -4511 2851 3355 -2162 -2170 125 -1788 -1715
983 -1715 1268 289 -888 1777 1754 -1510 -1776 -158 277 2792 3843 -1283 -3768 1911 3599 -1298
999 -1298 -1671 1787 174 -2059 367 227 -2677 -423 3008 326 -2882 -2587 -1372 1065 3246 422
1015 422 -2607 832 2897 -2027 -2421 3503 3366 -1162 -573 638 -2089 -630 4386 2786 -3168 -4091
1031 -4091 -1629 873 2533 412 -2668 -482 1656 -2638 -3709 2452 3799 -1151 -1035 1940 -1386
1046 -1386 -3119 3043 5603 -1 -3121 -687 1055 444 -723 -528 2726 3712 -2873 -7083 -976 4091
1062 4091 360 -519 2541 -1645 -6924 -1209 5716 2544 -2004 90 1772 -1056 -2926 -696 3986
1077 3986 5537 -216 -5140 -1138 3051 -632 -1361 4159 1821 -6408 -3988 4177 1774 -4256 -422
$$ packed form
965a689M07L957M1k585k61j330l49M363O09o915p59P362N04n517qK295j913P3
983a715K983r79j177K665k3l264k66J618M35K515J051n126k485N679J688m897
999a298l73L458j613k233K426j40k904K254L431k682l208K95J215K437K181k824
1015D22l029L439K065m924l94N924j37m528N89J211k727J459N016j600n954r23
1031d091K462K502J660k121l080K186K138m294j071O161J347m950J16K975l326
1046a386j733O162K560n604l120K434J742o11j167J95L254R86o585m210O107N067
1062D091l731q79L060m186n279N715O925l172m548K094J682k828j870K230M682
1077C986J551n753m924M002M189l683p29N520k338q229K420Q165k403o030L834
$$ plain form
1092 -422 4813 883 -5649 -4505 2341 5809 1381 -3607 -579 3408 -927 -3122 3890 5522 -3060
1107 -3060 -4630 2965 2102 -4592 -498 7316 2484 -6951 -6486 1242 4185 341 -2375 629 2152
1122 2152 -3252 -5401 3177 7075 -1820 -5229 3313 4170 -5504 -3830 7723 7153 -4184 -6398 1024
1137 1024 3336 -1375 -3166 1804 4753 -935 -6347 -1400 3782 -1249 -3923 4183 4812 -6743 -7371
1152 -7371 6024 8577 -2810 -5579 2824 4313 -2977 -4102 3304 6838 -25 -5949 -1054 4525
1166 4525 -757 -5237 2768 6348 -4710 -8939 3173 7621 -3400 -6572 3765 5871 -3951 -6343
1180 -6343 2168 6251 -45 -4243 1183 5148 -1744 -6388 3295 9611 -2207 -10474 1182 9136
1194 9136 -2104 -8809 2534 8594 -2189 -8955 -1268 5490 1289 -3744 -496 3783 -456 -5139
$$ packed form
1092d22N235l930o532J144O846L468m428m988L028L987m335k195P012J632q582
1107c060j570P595q63o694M094P814m832r435M65P728K943l844k716L004J523
1122B152n404k149Q578L898q895l409Q542Q57r674J674J1553n70j1337k214P422
1137A024K312m711j791M970K949n688n412M947N182n031k674Q106O29j1555o28
1152g371J3395K553j1387k769Q403J489p290j125P406L534o863n924M895N579
1166D525n282m480Q005L580j1058m229J2112M448j1021l172J0337K106r822k392
1180f343Q511M083o296m198N426L965o892m644R683O316j1818q267J1656P954
1194I136j1240o705J1343O060j0783o766P687O758m201n033L248M279m239m683
$$ plain form
1208 -5139 759 6984 203 -6595 1350 7616 -2229 -7804 3519 9024 -2243 -7782 1750 5818
1222 5818 -2495 -6225 1555 5757 -1516 -7000 504 7709 -777 -9846 -383 10374 479 -10670
1236 -10670 -116 11357 1783 -8888 -1067 7479 909 -5856 -242 5954 1161 -5444 -1690 5242
1250 5242 1359 -6671 -2224 6659 1009 -8546 -1526 8450 1172 -8150 -845 6572 28 -5044 1410
1265 1410 5372 -1164 -4959 1537 6755 302 -6748 -723 7934 1219 -9193 -2036 9507 1932
1279 1932 -9902 -2588 8084 1014 -8180 -1191 6809 909 -6548 -1455 6021 2422 -5433 -2368
1293 -2368 6825 3983 -6798 -4400 7625 5533 -6378 -4435 5645 2803 -5565 -1511 5022 696
1307 696 -5166 -1404 3638 93 -4365 -750 5060 1626 -5980 -3297 6034 3927 -5606 -2526 6860
$$ packed form
1208e139N898O225o781o798P945O266r845n575J1323N505j1267n539R532M068
1222E818q313l730P780M202p273n484P504P205q486r069R463J0757r895j1149
1236a0670J0554J1473r574j0671P821Q546o570o765N614O196m793o605L754O932
1250E242l883q030M447Q883n650r555P020R976p278r322P305P417o544n072O454
1265A410L962o536l795O496N218o453p050O025Q657o715j0412P157J1543p575
1279A932j1834P314J0672p070r194O989Q000n900p457N093P476l599p855L065
1293b368R193k842j0781K398J2025k092j1911J943J0080k842q368M054O533m326
1307F96n862L762N042l545m458L615N810l434p606K683R331k107r533L080R386
$$ plain form
1322 6860 2580 -6745 -1477 7416 1661 -6205 -889 5824 802 -6292 -2054 6008 3338 -6129 -5762
1337 -5762 4361 4922 -4826 -5229 5178 5172 -5034 -4514 4278 3409 -3261 -978 4757 1229 -4227 -1492
1353 -1492 4351 2973 -3059 -3298 2622 3113 -3465 -4001 3750 4095 -4382 -4511 3275 2262 -4580 -1374
1369 -1374 5314 1744 -5119 -2241 4109 3078 -2630 -2370 3194 3819 -2417 -4483 2385 5345 -1521
1384 -1521 -4042 1872 2268 -4136 -2637 4350 2456 -4348 -2889 2970 1900 -3053 -2562 2446 3331 -1691
1400 -1691 -3908 1250 4876 32 -3502 1386 3196 -2447 -2932 3545 3393 -2912 -2568 2391 1355 -3266
1416 -3266 -2555 2152 2753 -1197 -3749 -556 2722 191 -2446 785 3077 -1425 -3206 1997 3268
1431 3268 -1651 -1897 3124 2507 -2219 -2038 1897 2275 -804 -2517 -612 1699 355 -1949 -240 2088
$$ packed form
1322F860m280r325N268Q893n755p866N316O713n022p094M238Q062k670r467L67
1337e762J0123N61r748m03J0407oj0206N20Q792q69o670K283N735l528n456K735
1353a492N843j378o032k39N920M91o578n36P751L45q477j29P786j013o842L206
1369a374O688l570o863K878O350j031n708K60N564O25o236k066O868K960o866
1384a521k521N914L96o404J499O987j894o804J459N859j070m953M91N008Q85n022
1400a691k217N158L626m844l534M888J810n643m85O477j52o305L44M959j036m621
1416c266P11M707O01l950k552L193L278k531k637L231K292m502j781N203J271
1431C268m919k46N021o17m726J81L935L78l079j713J905K311j344k304J709K328
$$ plain form
1447 2088 -927 -3191 617 2514 -1825 -2370 2621 3026 -2203 -2678 1827 2856 -164 -1585 -41 1665
1463 1665 744 -1544 -601 1857 774 -2134 -396 1764 -990 -3017 697 2051 -1596 -2249 1361 2150
1479 2150 -591 -1624 -392 615 698 56 52 1400 1114 -990 -369 1315 -467 -2097 1024 2703 -1008
1496 -1008 -2748 511 1698 -875 -1805 -207 457 -68 -500 -614 268 752 -375 -499 1273 573 -1347
1513 -1347 299 2310 -29 -2006 529 2455 244 -1275 -170 243 -388 -480 -639 -387 445 415 -744
1530 -744 -382 -175 -1163 -204 1848 177 -2010 22 2160 515 -990 655 1242 -122 -336 12 -91
1547 -91 356 646 -235 -440 -145 -736 -799 1002 501 -1806 -941 1183 -251 -1797 194 1701 499 -350
1565 -350 -192 -716 -393 1007 1036 528 400 -31 -382 520 723 -1123 -916 1105 554 -1690 -849 927 40
$$ packed form
1447B088l015k264L808J897m339n45M991M05n229m75M505J029l020j421J544J706
1463A665r21k288R43K458j083k908J738K160k754k027L714J354l647o53L610P89
1479B150k741j033J232J007Q3o42mJ348k86k104O21J684j782j630L121J679l711
1496a008j740L259J187k573r30J598O64n25m32j14Q82M84j127j24J772p00j920
1513a347J646K011k339j977K535J926k211j519J105M13o31r2j59K52Q32l0j159
1530g44L62K07r88R59K052j671k187K032K138j645j505J645N87j364k14L48j03
1547i1M47K90q81k05K95n91o3J801n01k307Q65K124j434j546J991J507j202q49
1565c50J58n24L23J400K9n08j28m31l51R02K03j846K07K021n51k244Q41J776q87
$$ plain form
1584 40 -758 -225 -426 -778 176 797 -128 -193 347 132 284 550 -137 -216 1470 836 -1667 -981 1489 1266
1604 1266 -245 -168 -105 -1310 -926 412 122 -175 161 -61 -570 -359 -489 -495 1007 1427 -536 -1202 734
1623 734 785 -125 685 1213 -403 -871 439 214 -736 24 838 104 -843 -1331 -1015 429 1158 -614 -1573
1642 -1573 227 879 -886 -628 1028 422 -225 615 635 -651 -395 1184 934 -229 -402 -302 218 722
1660 722 -251 -984 25 378 -1018 -971 797 547 -1173 -239 648 -558 -1108 837 1504 100 -721 -8
1678 -8 552 754 219 -378 329 1181 -438 -1369 74 678 -437 -67 922 -920 -2036 -241 1252 -86
1696 -86 -1080 35 502 23 -528 -505 421 1489 202 -645 355 884 -540 -363 1346 628 -1245 -448
1714 -448 1165 -125 -1396 -237 967 127 -1015 -1133 -69 712 33 -891 87 895 -401 -560 1164
$$ packed form
1584D0p98N33k01l52R54O21r25o5N40k15J52K66o87p9J686o34k503O86K470k23
1604A266j511P7O3j205L84J338k90k97L36k22n09K11j30oJ502M20j963o66J936
1623G34N1r10Q10N28j616m68J310k25r50P60Q14p34r47m88L16J444P29j772r59
1642a573J800O52j765K58J656o06o47Q40K0j286K56J579k50j163j73J00N20N04
1660G22r73p33J009L53j396M7J768k50j720R34Q87j206n50J945O67j404q21P13
1678hN60K02n35n97P07Q52j619r31J443O04j115L70R89j842j116J795J493j338
1696h6r94J115M67m79n51K3R26J068j287q47J000N29j424J77J709p18j873P97
1714d48J613j290j271J159J204q40j142j18J064P81o79r24R78Q08j296j59J724
$$ plain form
1731 1164 911 -1358 -615 1913 1094 -1108 -352 1215 626 -876 -689 101 343 -102 -656 -153 442 -588
1749 -588 -1191 424 775 -1069 -772 1338 664 -1494 -472 1996 1184 -918 -683 768 825 -106 -350 251
1767 251 891 -135 -1051 301 776 -1253 -1524 1093 1367 -1506 -1641 1018 892 -1160 -962 910 761
1784 761 -157 -545 292 868 212 -468 375 1268 -540 -1391 926 1484 -1150 -1688 1052 1321 -1371 -1870
1802 -1870 461 1037 -678 -877 31 498 -292 -619 482 1232 -141 -1044 815 1760 -510 -1726 940
1819 940 2079 -455 -1443 613 1002 -764 -1053 329 410 -635 -1026 -68 717 -236 -1113 209 1272 -710
1837 -710 -1780 825 2203 -389 -1802 749 2010 -202 -1093 348 976 -363 -817 320 963 -155
1853 -155 -1248 -260 1295 -315 -2270 -529 1889 222 -1876 -114 1432 -260 -1341 494 1451 249
$$ packed form
1731A164k53k269P43K528q19k202P56J567n89j502J87P90K42m45n54N03N95j030
1749e88o03J615L51j844K97K110o74k158J022K468q12k102K35J451N7r31k44O01
1767B51O40j026r16J352M75k029k71K617K74k873j35K659j26k052J98J872j49
1784G61r18l88Q37N76o56o80Q43Q93j808q51K317N58k634n38K740K69k692m99
1802a870K331N76j715j99R08M67p90l27J101P50j373r03J859R45k270j216K666
1819I40J139k534r88K056L89j766k89J382Q1j045l91R58P85r53q77J322J063j982
1837g10j070K605J378k592j413K551J261k212q91J441O28j339m54J137O43j118
1853a55j093R88J555j610j955J741K418j667k098J762J546j692j081J835R57j202
$$ plain form
1869 249 -589 219 739 88 -403 579 1532 -75 -1838 -415 1529 106 -1958 -167 1745 -176 -1986
1886 -1986 -277 1182 -256 -1039 239 1067 -148 -1231 61 1424 531 -1070 -250 1678 875 -1582
1902 -1582 -596 1794 685 -1382 -404 1040 -27 -1421 -236 792 -266 -1002 -288 784 123 -1060
1918 -1060 -549 1252 746 -1278 -649 1784 1107 -1239 -520 1356 513 -791 301 1005 -268 -1338 -166
1935 -166 1059 221 -999 -714 856 511 -1448 -1297 1048 992 -1203 -725 1294 578 -1163 -401 1504
1952 1504 632 -594 76 820 136 -906 -226 1126 900 -1000 -1394 351 886 -946 -1241 740 645 -1102
1970 -1102 -599 1042 197 -1174 -124 1338 533 -709 -266 911 817 -417 -768 753 1130 -590 -1140
1987 -1140 564 1030 -711 -1089 580 301 -1085 -577 809 8 -1183 -557 631 625 -475 -741 266
$$ packed form
1869B49q38Q08N20o51m91R82R53j607j763J423J944j423k064J791J912j921j810
1886a986J709J459j438p83J278Q28j215j083J292J363q93j601Q20J928q03k457
1902a582R86K390j109k067R78J444j067j394J185J028j058p36P14J072o61j183
1918a060N11J801n06k024O29K433o77k346P19J876q43j304J092P04j273j070J172
1935a66J225q38j220K85J570l45j959J51K345n6k195M78K019p16j741P62J905
1952A504q72j226O70P44o84j042O80J352k26j900l94J745N35j832k95J981r5j747
1970a102N03J641q45j371J050J462q05j242M43J177r4j234l51J521L77j720n50
1987a140J704M66j741l78J669k79j386N08J386q01j191O26J188oj100k66J007
$$ plain form
2004 266 1127 -123 -729 609 1115 -171 -693 676 851 -806 -531 909 476 -1080 -701 455 507 -615
2022 -615 -842 -9 700 -126 -1066 -103 790 38 -802 494 919 -443 -602 842 651 -652 -264 763
2040 763 563 -490 -527 124 578 21 -736 -468 478 -29 -991 -145 578 -488 -819 724 951 -653 -679
2059 -679 663 896 -163 -245 585 686 -60 -381 129 822 351 -881 -430 562 -90 -918 81 646 -576
2078 -576 -998 232 570 -285 -573 169 370 123 -237 -83 393 523 -127 50 747 254 -607 -1 817 -281
2098 -281 -809 235 629 -417 -787 9 271 -398 -680 -266 225 338 -32 -152 305 309 -446 -68 814 421
2118 421 -658 146 969 -40 -673 192 585 -157 -533 -295 -60 87 -147 -317 -26 79 -264 -352 223 179
2138 179 -596 12 876 104 -551 153 740 183 -51 245 301 11 -118 -37 -38 7 -190 -444 42 -11 -617 -293
$$ packed form
2004B66Q61j250o06J338N06j286n22J369J75j657K75J440m33j556L79J156N2j122
2022f15k27Q33P09q26r40R63Q93p52q40J296M25j362j59J444j91j303L88J027
2040G63k00j053l7O51M54n57p57K68R46n07r62Q46P23j066l31J543K27j604k6
2059f79J342K33j059q2Q30J01p46l21N10O93m71j232M51R92o52q28R99N65j222
2078e76m22J230L38q55k88P42K01k47l60J54M76J30o50J77O97m93q61O06Q18j098
2098b81n28J044L94j046l70P96K62o69k82M14M91J13l70j20M57Mp55L78Q82l93
2118D21j079Q04Q23j009o33Q65L93p42l76K38K35J47k34j70K91J05l43q8N75m4
2138A79p75O08Q64p72o55P04N87n57k34K96N6k90j29Q1jM5j97k54M86n3o06L24
$$ plain form
2160 -293 532 -10 -1103 -291 580 78 -456 6 428 63 34 201 57 295 183 -64 225 420 -275 -393
2180 -393 420 209 -645 -499 394 -72 -663 -141 189 -188 -216 -14 0 -89 114 142 166 235 -78 -263 633 666
2202 666 -232 -212 557 339 -441 -206 332 10 -500 -71 -90 -504 -318 -14 -96 -65 -57 -216 107 353 -446 -395
2224 -395 524 644 -339 -52 567 328 -250 128 297 -225 -235 200 150 -182 -416 -311 -42 -61 -309 -579 164
2245 164 314 -430 -490 364 376 -213 165 551 -40 -386 404 496 -4 -76 147 263 104 -196 -489 145 371
2266 371 -362 -658 138 173 -695 -457 363 -103 -588 160 544 -69 -270 172 403 189 -148 -136 288 563 -56
2287 -56 -294 239 558 -525 -389 281 26 -769 -198 468 -329 -681 -6 275 -46 -283 -138 154 164 64
2307 64 -236 201 546 -23 -170 635 423 -452 -148 642 -77 -814 -167 608 20 -713 -247 97 -37 -138
$$ packed form
2160b93Q25n42j093Q12Q71n02n34M62M22l65k9J67j44K38j12k47K89J95o95j18
2180c93Q13k11q54J46Q93m66n91N22L30l77k8K02J4q9K03K8K4O9l13j85Q96L3
2202F66q98K0P69k18p80K35N38l22n10M29j9m14J86L04q2L1Qj59L23K46p99N1
2224c95R19J20r83K87O19k39n78L78J69n22j0M35n0l32k34J05K69j9k48k70P43
2245A64J50p44o0Q54J2n89L78L86n91l46P90R2n00p2K23J16j59l00k93O34K26
2266C71p33k96P96L5q68K38Q20m66m85P48L84o13k01M42K31k14l37J2M24K75o19
2287e6k38N33L19j083J36O70k55p95N71O66p97l52O75K81l21k37J45K92J0j00
2307F4l00M37L45n69j47Q05k12q75L04P90p19p37O47P75n88p33M66L44j34j01
$$ plain form
2327 -138 -396 -22 378 -267 -473 403 600 -510 -306 943 412 -639 -150 709 204 -521 -133 354 76
2346 76 -211 -446 -30 27 -331 -528 78 333 -593 -565 599 374 -716 -255 1033 492 -674 -72 791 301
2366 301 -199 51 338 389 -161 -368 145 563 -347 -791 438 508 -1033 -825 666 532 -759 -506 593
2385 593 266 -388 -99 468 287 -21 -208 307 446 -70 -409 417 629 -591 -756 634 475 -774 -653
2404 -653 554 390 -899 -440 358 104 -360 -317 246 465 -270 -381 494 766 -322 -807 571 1133 -511
2423 -511 -773 609 764 -668 -628 451 300 -507 -425 171 -10 -529 -563 148 583 -197 -717 341 925 -395
2443 -395 -825 680 911 -521 -439 621 379 -541 -254 517 392 -486 -522 160 437 -371 -1030 181 896
2462 896 -430 -1343 214 898 -452 -879 503 739 -424 -393 604 461 -269 -208 432 709 -65 -655 109
$$ packed form
2327a38k58L74M00o45k06Q76J97j110K04J249n31j051M89Q59n05p25L88M87k78
2346G6k87k35M16N7l58j97O06K55r26K8J164k25j090M61J288n41j166O02Q63m90
2366C01n00K50K87N1n50k07N13M18r10m44J229P0j541K08J491j34j291K53J099
2385E93l27o54K89N67j81l08j87N15J39n16l39Q26K12j220j65J390j59j249J21
2404f53J207j64j289M59P98k54m64M3N63K19p35j11Q75K72j088m85J378N62j644
2423e11k62J382J55j432M0J079j51q07Q2N96j81n19l4P11M35p80n20J058N84j320
2443c95m30J505K31j432Q2J060k42r20K87P71j25q78l6O82K77q08o59J211P15
2462H96j326r13J557O84j350m27J382K36j163L1R97j43p30O1O40K77p74n90P64
$$ plain form
2481 109 808 -148 -867 83 852 -315 -1089 234 660 -603 -729 570 504 -661 -534 533 522 -232 -504
2500 -504 308 975 105 -941 -36 1232 178 -1027 253 953 -478 -1022 375 641 -631 -720 327
2517 327 475 -462 -749 -8 610 85 -622 -49 1075 297 -920 9 1088 69 -696 481 937 -408
2535 -408 -689 496 494 -523 -565 -24 544 -265 -957 -448 671 203 -956 -300 905 60 -926 238 1043
2554 1043 -151 -667 591 922 -185 -680 250 669 125 -532 -444 490 377 -661 -521 556 164 -1043
2572 -1043 -328 873 -265 -872 323 905 -274 -788 309 833 187 -391 -70 598 567 -304 -371 590 439
2591 439 -669 -376 668 22 -1133 -112 731 -395 -886 72 621 -127 -686 -239 262 203 -350 -217 652
2610 652 663 -406 -446 684 274 -830 -150 1126 174 -1025 -243 810 -67 -698 -175 390 -32 -419 -521
$$ packed form
2481A09O99r56p19R50P69j167p74J323M26j263j26J299o6j165J27J067j1p54k72
2500e04Q12O67q70j046R05J268j054j205J280P00j431n44J397K66j272q9J047
2517C27J48r37k87P41O18n25p07N73J124p78j217R29J079j019p65J177M56j345
2535d08k81J185kj017m2N41N68q09o92N09J119m68j159O56J205q45r86J164Q05
2554A043j194n16J258L31j107m95R30M19n44o57Q8R34j13j038J40J077l92j207
2572a043P15J201j138o07J195N82j179n14J097N24o46n78L21O68l1q71o7R61j51
2591D39j108K93J044o46j155J021Q43j126m91R58N49p48n59M47N01n9n53J33Q69
2610F52J1j069m0J130m10j104O80J276r52j199P82J053q77o31N23N65m22l87j02
$$ plain form
2629 -521 101 393 -246 -397 541 394 -669 -274 1054 420 -690 -65 1096 251 -701 18 350 148 -323
2648 -323 -392 -67 174 -358 -395 180 180 -659 -560 726 358 -845 -239 983 344 -746 57 846 319 -173
2668 -173 36 140 174 -56 -255 131 499 -309 -485 500 477 -792 -713 731 408 -844 -438 490 195 -368
2688 -368 -22 274 -1 17 40 49 439 -16 -396 238 634 -456 -646 625 655 -749 -580 610 263 -554
2708 -554 -155 301 -128 -323 -132 -63 192 -12 -185 211 598 -250 -659 483 854 -420 -646 665 708 -342
2728 -342 -320 264 -34 -175 0 26 -141 -174 -211 -34 202 -131 -545 206 634 -97 -710 446 696 -397 -314
2749 -314 521 240 -178 31 182 -50 -3 134 -33 163 -86 -644 -40 630 -61 -1007 165 723 -275 -671
2769 -671 317 257 -221 94 560 51 -253 58 218 199 -1 -112 -38 663 105 -743 -191 713 -150 -634 140
$$ packed form
2629e21O22K92o39j51R38j47j063L95J328o34j110O25J161q45r52P19L32k02m71
2648c23o9L25K41n32l7N75%q39R9J286l68j203O06J222o39j090Q03P89n27m92
2668a73K09J04L4k30j99L86L68q08j76R85k3j269P9J444l23j252M06R28k95n63
2688c68L46K96k75J8K3RL90m55l80O34L96j090j90J271L0j404J69J190l47q17
2708e54L99M56m29j95J91O9K55k04j73L96L87q48m09J142L71j274k26J311M3j050
2728c42K2N84k98j41J75K6j67l3l7J77K36l33m14P51M28p31o13J156K50j093Q3
2749c14Q35k81m18K09J51k32M7J37j67J96k49n58O04O70o91r46J172N58r98l96
2769f71R88o0m78L15M66n09l04L11J60j9k00j11P4P01n58q48N52R04q63m84P74
$$ plain form
2790 140 278 -404 -311 306 13 -433 195 308 -53 -175 -80 74 527 260 -417 -171 752 117 -602 -38 388
2811 388 -370 -335 380 154 -610 -245 317 -50 -391 -268 -30 27 245 -368 -167 614 272 -519 -99 792 181
2832 181 -281 514 498 -490 -137 583 33 -484 -202 162 11 -123 -306 -438 333 191 -448 -269 572 136
2852 136 -538 210 308 -452 -246 717 515 -261 -43 395 116 -118 -282 -271 245 239 -276 -552 201 230 -455 -50
2874 -50 476 -366 -603 453 357 -554 -364 699 270 -208 -144 0 69 279 56 -327 346 431 -223 -105 386
2895 386 -240 -664 162 548 -422 -563 334 482 -341 -390 -80 -24 193 17 -129 228 491 -111 -195 347 132
2916 132 -416 198 669 -447 -840 406 600 -432 -610 -36 -1 -250 -232 -223 -246 229 -53 -219 274 237 -482
2937 -482 39 738 -10 -728 264 880 -186 -453 390 438 -173 -230 -56 -96 -40 86 -125 -144 -17 -370 -147
$$ packed form
2790A40J38o82R3O17k93m46O28J13l61j22R5J54M53k67o77K46R23o35p19N64M26
2811C88p58L5P15k26p64L65N62l67l41J23K38N7K18o13K01P81l42p91M20Q91o11
2832A81m62P95j6r88L53P20n50n17K82L64j51j34j83j32P71j42o39J79Q41m36
2852A36o74P48R8p60K06R63k02p76K18M38k79k34j64J1N16on15k76P53K9o85M05
2874e0N26q42k37J056r6r11J90J063m29m78O4J44O9K10k23l83O73Q5o54J18M91
2895C86o26m24Q26L86r70j41Q97J48q23m9L10N6K17j76j46L57K63o02q4N42k15
2916A32n48O14M71j116l93J246J94j032j78N74L5k49J8Rk3M75k82j66M93l7p19
2937d82N21O99p48p18R92O16j066k67Q43M8o11n7J74m0N6J26k11j9J27l53K23
$$ plain form
2958 -147 450 -114 -965 25 775 -149 -764 297 627 -216 -186 250 143 -188 24 144 95 -66 -279 -140
2978 -140 509 55 -1019 -192 973 11 -991 -13 848 -60 -646 -25 263 -186 71 352 184 104 70 12
2998 12 358 62 -573 -195 737 279 -1044 -221 876 25 -753 97 191 -558 -347 231 39 -240 -86 308
3018 308 363 17 -355 -278 787 489 -664 -287 947 398 -795 -1 566 -226 -628 183 69 -338 -125
3037 -125 185 290 -189 -525 -270 521 421 -574 -603 680 515 -543 -101 722 -29 -473 454 474 -433 -445
3057 -445 340 180 -84 -378 -251 355 419 -617 -771 401 427 -803 -557 676 154 -628 98 629 -256
3076 -256 -467 427 622 -118 -286 -10 343 488 -342 -551 131 520 -473 -769 451 266 -709 -83 736 -209
3096 -209 -711 312 626 -196 -370 109 456 280 -40 -436 369 746 -233 -549 521 492 -567 -263 570
$$ packed form
2958a47N97n64q51R90P50r24o15J061L30q43L0M36j07l31K12J20m9j61k13J39
2978a40O49m54j074Q27J165r62j002R78Q61r08n86O21K88m49K57K81j68q0l4n8
2998A2L46k96o35L78R32m58j323Q23J097q51p78Q50R4p49K11N78j92k79J54L94
3018C08N5l46l72P7J065k98j153L77J234n49j193P94N67p92m02Q11j14m07K13
3037a25L10J05m79l36K55P91j00r95k9J283j65j058M42Q23p51m44R27K0r07j2
3057d45P85j60k64k94J27O06O4j036j54J172K6j230K46J233n22p82P26N31q85
3076b56k11Q94J95p40j68K76L53J45q30k09O82L89r93k96J220j85r75O26Q19r45
3096b09n02J023L14q22j74M79L47j76l20l96Q05L77r79l16J070k9j059L04Q33
$$ plain form
3115 570 -19 -768 62 610 -220 -868 -58 344 198 -324 -534 104 604 44 -609 370 649 -223 -387 704
3135 704 321 -668 2 969 -15 -813 -136 502 169 -435 -394 15 322 -53 -581 -33 602 -150 -582 324
3155 324 418 -767 -253 1082 242 -818 -115 921 303 -421 -218 217 277 54 -378 -211 504 39 -548
3174 -548 19 425 -604 -619 679 503 -822 -238 915 350 -561 -128 304 328 62 -286 -236 526 309 -264
3194 -264 -62 439 -405 -741 442 490 -843 -639 852 564 -748 -522 279 254 -142 -176 -150 184 350 -179
3214 -179 33 450 58 -567 399 716 -484 -727 672 639 -714 -617 375 168 -189 -314 -157 -46 174 -102
3234 -102 -69 216 -1 -359 149 627 -221 -653 424 921 -404 -559 529 483 -134 -248 17 47 -39 99
3254 99 -386 2 92 -282 -77 341 -172 -892 192 903 -331 -681 293 755 -248 -356 174 157 -108 174
$$ packed form
3115E70n89p49Q30N48q30o48Q10M02j46n22k10O38N00n60o53R79K79q72j64J091
3135G04l83r89O70R67r84p98O77O38l33o04M1M09L07l75n28N48O35p52m32R06
3155C24R4j185N14J335q40j060P03J036o18p24K03M35O0k23m32J67P15m65n87
3174e48N67M06j029j5J298j76j325N84J153n65r11M33M32K4k66l48N0P62k17n73
3194b64K02N01q44l36J183M8j333K04J491k88j312K26Q01k5l96l4K6L34J66n29
3214a79K12M17l92o25R66L17j200k43J399l3j353R7R92k07l57j25J57J11K20k76
3234a02L3K85k17l58N08M78q48m32J077M97j325j55J088m6o17j14K65L0q6J38
3254I9m85L88R0l74K05M18n13p20J084P11j234l50R74M62j003j08N30j7k65K82
$$ plain form
3274 174 43 -12 8 -25 51 330 -8 -853 23 647 -211 -1074 155 813 -142 -475 71 277 -142 47 141
3295 141 -24 89 249 119 160 129 -467 -198 633 70 -843 36 950 -45 -750 -53 225 -262 -76 102 -251
3316 -251 -228 146 65 91 -40 -150 -168 598 314 -737 -312 895 388 -701 -97 465 -10 -277 227 -33
3336 -33 -428 -103 125 -66 -120 -172 -106 283 257 -655 -549 695 604 -519 -220 533 -14 -291 232 210 -238 -64
3358 -64 303 -8 -182 24 -2 66 155 -399 -441 395 569 -648 -564 439 181 -395 163 266 -317 -181 385
3379 385 97 -224 38 235 320 315 -185 -480 149 628 -322 -650 219 276 -328 2 284 -320 -385 315 188 -418
3401 -418 -141 324 328 -98 -21 -282 111 654 -97 -440 135 483 -267 -300 408 -45 -423 67 388 -462 -541 249
3423 249 336 -267 -193 -332 -66 433 83 -609 102 674 172 -202 337 171 -244 154 537 -290 -523 370 266
$$ packed form
3274A74j31n5K0l3P6K79l38q45Q76O24q58q63J229O58r55l33N46K06m19J89R4
3295A41j65J13J60j30M1l1n96K69Q31n63r13Q79R14r95p05O97K78m87J86J78l53
3316b51K3L74q1K6j31j10j8P66k84j051M25J207n07j089O04N62m75k67N04k60
3336c3l95L25K28j91n4n2O6L89k6r12J06J244r1j123K99P53n47k77N23k2m48J74
3358f4L67l11j74K06k6O8Q9n54m2Q36J74j217Q4J003k58n76N58J03n83J36N66
3379C85k88l21K62J97Q5nn00k95O29M79r50l28Q69N7o04L30K82o04o5P00j27o06
3401d18K77M65Mm26P7k61L93N43p51l43N75L48p50l3P08m53l78M90L21q50p9P90
3423B49Q7o03P4j39K66M99l50o92P11N72n02l74N39j66m15L98L83q27k33Q93j04
$$ plain form
3444 266 -125 -255 -70 -16 203 68 -397 -151 396 19 -449 21 285 -208 -32 521 -105 -621 300 710
3464 710 8 -347 -109 242 214 313 -256 -290 397 161 -398 -179 356 -277 -390 239 64 -622 96 664 -67
3485 -67 -371 2 298 53 149 37 -224 219 545 -139 -197 322 -8 -212 157 111 -577 -257 529 60 -674
3506 -674 -71 348 -54 -243 18 -240 -19 486 131 -248 200 240 -196 212 273 -323 -293 533 320 -613 -331
3527 -331 437 58 -326 -54 -115 -53 5 -58 -460 143 342 -228 -23 268 -192 -341 663 518 -656 -432 596
3548 596 541 -208 -110 94 -187 45 192 -134 -219 182 -100 -249 129 -170 -496 104 492 -383 -572 465 523
3569 523 -452 -241 348 67 32 214 -51 -276 180 233 16 -15 -63 -266 189 540 -351 -873 308 569 -348
3590 -348 -373 335 102 -105 9 128 -206 59 388 133 -74 141 -89 37 418 -117 -650 25 696 -244
$$ packed form
3444B66l91j30J85N4K19j35m65K46N47l77m68M70K64m93J76N53o26n16R21M10
3464G10p02l55K38L51k8R9n69l4O87k36n59K19N35o33j13O29j75o86P18N68p31
3485f7l04L73K96k45R6j12k61M43L26o84n8N19l30k04L69m6o88L20P86m69p34
3506f74O03M19m02j89K61k58K21N05l55l79M48M0m36M08O1n96L0Q26k13r33K82
3527c31P68l79l84K72o1O2N8o3m02O03J99n70K05K91m60j49J004j45j174K24J028
3548E96n5p49R8K04k81K32J47l26q5M01k82j49L78k99l26O00L88q75j89J037N8
3569E23r75K11N89k81l5J82k65k25M56N3k17l1m8k03M55L51q91n22J181K61r17
3590c48k5P08k33k07J14J19l34K65L29k55k07K15k30J26L81n35n33O75O71r40
$$ plain form
3610 -244 -615 219 78 -352 -55 25 -228 -175 233 63 -317 -166 79 104 458 77 -663 -32 797 -47 -639
3631 -639 118 565 -90 -116 255 -168 -472 88 252 -147 -172 -33 -19 84 -49 -525 -259 661 167 -642 79
3652 79 662 -58 -407 108 123 -182 212 372 -325 -438 53 172 149 -76 -383 -364 466 196 -789 -321 426
3673 426 90 -339 227 303 -358 -152 447 95 -289 153 352 116 38 -87 -102 422 327 -547 -393 446 310
3694 310 -424 -172 251 -253 -271 472 21 -524 -144 448 82 -149 59 34 224 341 -272 -392 299 299 -444
3715 -444 -104 328 -7 -464 266 238 -584 -377 365 204 -426 -216 129 223 167 -241 -456 195 533 -284 -327
3736 -327 346 197 -337 148 438 -452 -366 464 341 -443 -283 60 136 178 -198 -376 11 418 -49 -349 38
3757 38 113 -361 32 520 -206 -505 305 499 -382 -278 381 371 99 -137 -223 -108 333 15 -670 -175 310
$$ packed form
3610b44l71Q34j41m30K97Q0k53N3M08j70l80J51K45K5L54l81p40O31Q29q44n92
3631f39P57M47o55k6L71m23l04N60J64l99k5J39J4J03j33m76K66R20m94q09P21
3652G9N83p20l49N15J5l05L94J60o97j13M91J19k3k25l07J9Q30k70r85M68P47
3673D26l36m29N66P6o61K06N99l52l84M42J99k36p8j25j5N24r5q74J54Q39j36
3694C10p34K52M23n04j8P43m51n45L80N92l66k31K08k5J90J17o13j20O91%p43
3715d44L40M32l35m57P30k8q22K07P42j61o30K10L45R4n6m08k15O51L38q17m3
3736c27O73j49n34M85K90q90Q6Q30j23p84J60L43P6M2l76j78L87M07m67l00L87
3757C8P5m74L93M88p26k99Q10J94q81J04O59j0k72k36q6J15M41l18o85M95M85
$$ plain form
3778 310 -398 -281 326 -51 -542 111 557 -249 -702 199 395 23 -53 59 -142 269 159 -293 -22 295
3798 295 35 -224 351 116 -384 30 750 -206 -672 90 508 -105 -273 41 -23 99 125 -204 -191 236 187
3819 187 -92 103 187 -306 -62 500 118 -710 -6 611 -117 -451 -66 -57 -32 50 -120 -339 6 186 -109 113
3841 113 257 -6 -138 373 241 -560 -157 699 148 -298 -28 288 24 89 53 -226 -191 337 -21 -250 99
3862 99 -31 -265 229 369 -517 -416 575 344 -391 -162 398 147 -106 165 -72 -171 184 234 -246 -79 -11
3883 -11 -206 12 354 -484 -534 344 369 -486 -250 319 102 -251 96 77 -266 80 271 -14 -296 146 -45
3904 -45 204 222 -184 -298 202 549 -243 -536 189 198 -219 -15 13 -189 -123 286 -66 -265 64 68 -123 23 185
3927 185 -441 135 619 -113 -558 233 466 -215 -137 169 -52 -91 401 29 -399 -96 165 -43 -1 -13 -299
$$ packed form
3778C10p08J17O07l77m91O53M46q06m53R01J96l72p6J12k01M11j10m52K71L17
3798B95k60k59N75k35n00M14P20r56m66P62M18o13j68L14o4J22K6l29J3M27m9
3819A87k79J95Q4m93K44N62l82q28P04O17p28l34L85RK5Q2j70k19L45J80k95K22
3841A13J44k63j32N11j32q01M03Q56n51m46K70L16k64O5l6k79L5N28l58k29L49
3862I9j30k34M94J40q86J01R91k31p35K29N60k51k53K71k37r9L55N0m80J67O8
3883a1j95K18L42q38n0Q78K5q55K36N69k17l53L47j9l43L46J91k85k82M42j91
3904d5K49J8m06j14N00L47p92k93P25Rm17K04K8k02O6M09l52j99L29Mj91J46J62
3927A85o26N76M84p32m45P91K33o81P8L06k21l9M92l72m28L03K61k08M2j2k86
$$ plain form
3948 -299 -16 457 127 -422 -36 431 -126 -260 310 268 -104 112 380 -349 -176 325 62 -210 -185 -165 15
3969 15 335 96 -538 -219 406 41 -530 118 101 -125 -49 250 -106 -360 248 149 -62 114 0 -24 272 225
3991 225 -266 -418 324 139 -499 -221 241 -217 -195 202 -198 -283 248 385 -142 -143 166 -1 116 129 -243 -276
4013 -276 465 389 -292 -194 269 -52 -246 119 36 -358 -83 280 -230 -407 -93 49 42 87 -123 -342 213 403
4035 403 -130 -279 262 114 -293 161 174 -269 -67 482 125 -260 -54 130 -51 -81 -46 -271 6 373 -17
4056 -17 -458 38 174 -179 -108 197 -205 30 369 311 -278 -103 369 96 -31 56 -148 -32 325 74 -425
4077 -425 -48 276 -183 -239 94 -33 -263 157 214 -384 -335 416 335 -186 -16 -70 30 214 174 -151 -158 352 102
4100 102 -238 -64 -10 -321 29 368 -162 -482 258 387 -190 -71 10 -101 3 273 -264 -206 200 398 -173
$$ packed form
3948b99K83M73l30n49L86M67n57j34N70m2l72K16K68p29J73N01k63k72K5K0J80
3969A5L20k39o34L19O25l65n71O48j7k26P6K99l56k54O08r9k11J76j14k4K96m7
3991B25m91j52P42j85o38K78M62m58K2L97m00q5N31J37n27jL09j67J17J3l72l3
4013b76P41p6o81R8M63l21j94L65q3l94K75L63n10j77L14J42pM5k10k19N55J90
4035D03n33j49N41j48m07M54J3m43K02N49l57l85K06J84j81l0L5k25K77L67l90
4056a7m41M96J36l53P1L05m02K35L39n8n89J75M72k73j27Q7k04J16L57k51m99
4077d25L77L24m59n6L33j27k30M20N7n98M9P51q1n21J70n4J00J84m0l25pN10k50
4100A02l40J74N4l11L50L39n30l20P40J29n77J19Q1j11J04K70n37N8M06J98n71
$$ plain form
4121 -173 92 211 -98 -25 244 -71 -452 43 392 -124 -277 111 -13 -122 -8 -90 -266 72 272 -148 -289
4142 -289 184 -159 -132 197 121 -226 28 530 50 -287 187 310 -48 -75 38 -262 -61 323 -106 -298 13
4163 13 -116 -139 169 113 -329 -182 336 208 -467 -75 254 64 -153 41 -77 -47 264 139 -196 -14 163
4184 163 -40 -16 71 -275 -282 301 102 -360 -228 301 173 -233 95 -19 -76 108 312 -114 -19 236 43 20
4206 20 210 -67 -149 310 409 -267 -369 254 154 -264 -66 39 -244 -57 103 -210 -142 16 161 -107 61
4227 61 95 -169 203 485 -210 -174 126 290 -298 -90 151 64 -99 280 -78 -248 -86 198 -116 -135 -79 -134
4249 -134 -28 362 -92 -322 237 354 -116 -175 228 129 -43 98 215 -125 -4 368 16 -351 10 -33 -45
4270 -45 73 33 -384 -138 329 -137 -360 127 256 -12 -57 190 -135 -223 233 297 -136 -136 116 89 133 41 -139
$$ packed form
4121a73K65J19l09P3K69l15l81M95L49n16j53L88j24j09J14q2j76L38K00m20j41
4142b89M73l43K7L29p6l47K54N02m80l37M74J23l58k7J13l00K01L84m29j92L11
4163A3j29k3L08n6m42J47N18j28o75L92L29j90k17J94j18L0L11j25l35J82J77
4184A63k03K4Q7l46pN83j99m62J32N29j28m06L28j14n7J84K04m26R5K55j93k3
4206B0J90k77q2M59R9o76j02O23j00m18J98J05k83J87J60l13O8J58J45k68J68
4227F1L4k64L72K82o95L6L00J64n88K08K41q7j63L79l58j70J62K84l14j9N6n5
4249a34J06L90m54k30N59J17m70n9M03r9j72J41J17l40J21L72l52l67L61m3j2
4270d5J18m0m17K46M67m66k23M87J29k68m5K47l25q8M56O4m33%K52k7M4r2j80
$$ plain form
4293 -139 -118 249 -48 -387 17 181 -73 -143 222 34 -260 154 258 -103 -188 15 116 50 41 -14 -167 318
4315 318 145 -148 -40 337 -105 -245 92 165 -297 11 316 -190 -313 79 259 -65 -76 -1 -57 104 209
4336 209 -268 -167 291 115 -158 99 196 -176 -56 336 4 -328 14 183 -159 -131 -39 11 -39 99 -102 -296
4358 -296 192 166 -138 -49 155 -51 13 198 296 -247 57 288 70 -221 -89 74 48 171 -123 -227 131 109
4380 109 -238 -177 105 -102 -138 43 5 -360 -152 207 87 -208 -72 128 110 86 98 -130 43 280 20 -263
4402 -263 18 117 -225 25 170 -214 -99 256 97 -325 -204 102 -10 10 -29 -130 -145 221 25 -184 53
4423 53 181 -63 49 138 -150 -436 191 286 -221 -198 153 -62 -160 -5 -126 -149 27 126 -96 -77 30 13 -7
4446 -7 67 -68 -167 157 397 -144 -278 196 249 -81 67 -85 -87 -16 212 -59 -181 -14 15 -40 -191 19 -119
$$ packed form
4293a39K1L67k97l39M04J64k54p0L65j88k94M14J04l61q5K03J01o6rn5j53M85
4315C18j73k93J08L77m42j40L37P3m62L08L05n06j23L92J80l24j1P5n6J61J05
4336B09m77J01M58j76k73K57R7l72J20L92l32l32L42J69l42K8R2N0n0J38k01j94
4358b96M88k6l04Q9K04k06O4J85R8n43L04K31k18k91J32J63k6J23k94j04L58k2
4380A09l47O1K82k07l6J81l8l65K08L59j20k95J36K00j8k4J2k28J73K37k60k83
4402b63K81R9l42K50J45l84J15L55j59m22J21L06j12K0l9j01j5L66j96k09K37
4423E3J28k44J12Q9k88k86O27R5n07K3L51k15r8J55j21k3J76R9k22J9J07j7k0
4446gP4j35r9L24K40n41j34M74N3l30J48j52kP1K28k71j22J67K9n5j51K10j38
$$ plain form
4469 -119 -152 269 60 -206 167 219 -91 -58 12 -47 -34 166 104 -110 -49 79 -17 -67 166 -267 -74 231 180 -320
4493 -320 -18 248 -209 -160 -40 13 -4 123 105 -48 -43 316 114 -207 67 -37 -244 182 117 -264 -181 131 113
4516 113 -188 -82 43 -130 -186 161 -96 -155 198 123 -127 -41 32 -70 162 174 -177 -229 160 146 -171 -188 231
4539 231 -114 -9 45 30 -221 -21 94 -77 -150 20 -38 118 177 54 -59 60 159 -162 -135 155 127 -69 34
4562 34 33 -133 -43 272 48 -116 42 33 -96 148 -18 -212 -85 276 -175 -350 -9 101 -121 -30 320 -53
4584 -53 -110 253 43 -135 0 111 -13 58 103 -204 -32 267 -38 -353 -2 52 -140 -153 -2 -117 -193 16
4606 16 25 -121 -124 108 68 -180 111 -114 -84 146 153 -127 -23 343 -16 -94 -48 -28 -142 157 159 -154 -198 102 85
4631 85 50 -32 -116 -83 65 135 -189 -86 183 6 -180 -3 79 -80 -24 77 136 -36 71 48 -154 -70 33 -20
$$ packed form
4469a19l3M21k09k66L73N2l10L3P0n9J3K00o2k14O1J28r6n0K33m33J93L05n1n00
4493c20L02K66m57M9J20N3j7J27j8j53NL59k02l21K74j04k07M26o5l81Q3L12j8
4516A13l01J06J25j73n6L47k57n9L53p5k50Q6P3j02K32J2l51n2L89j4l17j7M19
4539B31l45J05N4j5k51K00J15j71p3J70n8J56N9j23j13J19R9l21K7K90k8j96J03
4562C4jj66R0L15k24j64J58rj29K44j66j94J27L61m51j75L41J10k22R1L50l73
4584e3n7L63k10j78J35J11j24P1M5l07J72K99l05l15L51N4j92j3J51j15p6K09
4606A6Rj46lK32m0k48K91k25L0K30Pk80J04L66l59p8M6K0j14K99Kl13m4L00j7
4631H5l5q2q4L3J48P0l24J03K69j77j86J77Q2j59N6J01N9j72J07k3k02Q4J03n3
$$ plain form
4655 -20 6 110 -148 -138 76 177 -96 -116 183 52 93 183 56 -332 -86 232 60 -103 71 98 38 75 -40
4678 -40 -119 95 183 -215 -26 84 70 -84 128 -82 -206 -99 137 53 -159 17 64 77 -14 -42 -205 175 136
4701 136 -60 -155 4 99 82 -23 19 -110 -88 147 -24 -193 114 222 10 -86 -1 -103 -64 159 43 -177 136
4724 136 83 -87 -109 95 23 -162 25 48 -298 -134 204 -93 -254 64 136 -37 136 -33 -201 -111 65 54
4746 54 -130 85 94 -149 -85 242 -15 -103 98 186 -22 -67 105 -102 42 62 -110 -231 120 108 -138 -37 -136
4769 -136 -236 18 161 -36 -286 89 113 -149 -127 72 15 23 125 27 -47 45 154 -200 -140 33 -29 -10 104 -98
4793 -98 -231 -73 156 83 -118 15 -36 -79 -2 -37 -128 -34 81 -3 -69 94 -30 -81 42 57 -123 0 182 31
4817 31 -158 -14 36 -2 36 21 -258 -93 19 65 -122 -3 33 -61 136 319 -41 17 112 13 -97 24 170 76
$$ packed form
4655b0K6J04k58J0K14J01k73k0K99j31M1R0j27l88K46L18j72j63J74K7o0L7j15
4678d0p9K14Q8l98J89J10j4j54K12k10j24J07K36q4k12J76M7J3r1k8j63L80l9
4701A36j96r5J59R5j7j05M2j29K2K35j71j69L07J08k12r6Q5j02L9K23j16k20L13
4724A36n3j70k2K04p2j85J87K3l46J64L38k97j61L18P2j73J73j69j68R0J76j1
4746E4j84K15Rk43O4L27k57q8K01Q8k08m5J72k07J44K0j72j21L51j2k46J01r9
4769a36j00K54J43j97k50L75K4k62K2J99n7QJ02r8p4R2J09l54O0J73o2J9J14k02
4793i8j33J58K29p3k01J33n1m3P7l5r1R4J15q4o6J63j24n1J23J5j80J23J82j51
4817C1j89J44N0l8L8j5k79J65J12M6j87J19L6r4J97J83l60N8R5r9j10J21J46r4
$$ plain form
4841 76 -77 70 -61 -60 -220 29 -198 -35 85 -15 42 45 -140 -68 242 73 -187 -118 6 143 1 168 52
4864 52 -83 71 124 63 -80 162 69 5 66 -71 -71 85 121 -123 -187 84 112 -38 -101 121 -87 -95 82 32 -60
4889 -60 -33 78 51 102 -9 -22 -23 116 -16 -113 37 52 -60 -139 -24 45 -122 95 136 -167 -67 14 94 1 -43
4914 -43 -29 -68 301 160 -1 148 334 -63 -180 130 123 -107 -61 44 -138 -104 95 1 -64 -104 -29 -240 5 -8
4938 -8 -130 27 148 99 -129 -39 53 -94 -8 102 -17 -145 50 80 -115 -42 185 38 -160 -85 -143 -95 19 -28
4962 -28 -148 -97 94 30 -7 77 23 -95 169 271 -27 -232 220 -44 39 -8 -2 -95 150 7 -188 -330 47 -48
4986 -48 -51 71 -139 -141 -93 125 -138 -212 74 181 -198 78 169 -65 -46 146 84 -74 16 97 -89 -68 -78 -89 11
5011 11 79 -20 -236 -20 51 -108 -185 54 32 40 -27 -16 -115 -4 147 -14 0 38 -128 40 235 75 -119 -43 169
$$ packed form
4841G6j53J47j31Jj60K49k27J63J20j00N7Lj85P2L10j69k60O9J24J37j42J67j16
4864E2j35J54N3o1j43K42r3o4O1j37%J56L6k44o4K71K8j50o3K22k08qJ77n0r2
4889f0K7J11k7N1j11j3jJ39j32r7J50J5j12p9J15O9j67K17M1l03J00Q1Q0r3m4
4914d3J4l9L69j41j61J49J86l97j17L10pk30M6J05j82L4J99r4o5m0P5k11K45j3
4938hj22J57J21m9k28R0R2j47Q6J10j19j28J95L0j95P3K27j47j98P5n8M8J14m7
4962b8j20N1J91o4l7Q4n4j18K64J02k98k05M52k64Q3m7Or3K45j43j95j42L77r5
4986d8lJ22k10kM8K18k63p4K86J07l79K76R1k34J9J92o2j58R0Q1j86K1j0j1J00
5011A1O8r9k16K16P1j59p7K39k2Qo7J1r9J11J51j61J4L8j66J68J95j60j94P6K12
$$ plain form
5036 169 -45 -103 63 -18 -119 45 39 -102 -152 115 30 -168 -35 98 16 22 99 8 -104 120 115 -111 10 -87 50
5061 50 -67 -75 -67 0 -54 67 -134 -226 -145 -5 -8 18 -53 -164 85 60 -113 -51 114 -19 102 -3 -144 -63 112
5086 112 112 -103 -139 53 69 -148 44 -22 -170 -101 158 -170 -116 -22 86 -130 -84 43 -126 142 82 4 -91 21
5110 21 -105 -130 52 174 -124 44 173 65 -214 -94 89 -100 -30 107 -57 -102 -10 62 -109 -107 -20 -88 57
5133 57 -41 0 -6 194 -44 -162 -64 47 5 -74 32 82 -70 81 -25 -224 -37 26 -232 -134 21 -40 10 -61 110
5158 110 -162 65 202 -14 -26 64 60 50 56 41 -109 -62 87 93 102 26 90 52 70 140 -41 -65 -3 151 -64 -33 55
5185 55 -107 -39 108 -5 -28 -17 58 49 -34 67 0 7 0 -16 46 170 205 -147 -100 -6 12 17 63 -55 -101 1 114 -41
5213 -41 -42 115 32 -26 159 36 -118 124 108 -1 -81 18 96 6 -31 63 59 6 71 -48 -164 0 -41 -144 97 -41
$$ packed form
5036A69k14n8J66q1j01J64oj41n0K67q5j98J33J33q2OP7r1j12K24nk26J21r7J37
5061E0j17qQO7n4J21k01r2Q1J40lK6p1j11K49k5j73O2J65j33J21j05j41Q1J75
5086A12%k15l6J92J6k17J92o6j48O9K59l28N4R4J08k16M6J27j69K68o0p8r5J12
5110B1j26k5J82J22k98J68J29j08k79J20J83j89P0J37j64m5R2P2j71KQ7o8J45
5133E7r8M1oK00k38j18R8J11m2p9J06N0j52J51j06j99J87O3k58R8J55o1N0p1J71
5158A10k72K27J37k16j2R0mj0Oj5j50M7J49ORp6O4l8J8P0j81k4O2J54k15L1Q8
5185E5j62O8J47j13k3J1P5rq3J01o7Ppj6O2J24L5l52M7R4J8NM6j18m6J02J13j55
5213d1jJ57q3n8J85j23j54K42j6j09q0R9P8r0l7R4mn3O5j19j16J64m1j03K41j38
$$ plain form
5239 -41 -115 -10 132 -3 -87 72 -6 -223 -146 108 -81 10 168 43 -125 40 55 42 -18 45 10 -23 77 58
5263 58 -136 -61 194 134 -5 -21 6 -102 98 116 -81 -20 142 -21 -21 -39 107 106 -99 106 -72 -124 197 41
5287 41 -103 -7 -8 -106 -91 30 4 -201 -53 -27 -90 -122 28 -34 109 -36 -61 -15 110 120 -56 -132 147 109 -56
5312 -56 145 -53 -155 -33 109 -100 -115 -20 -15 76 0 -61 -69 -20 207 -77 5 103 -35 -83 106 -16 -3 34 42 16
5338 16 -104 52 -14 -63 -73 -130 -154 -41 27 -10 -55 8 117 -16 2 -9 -133 -99 11 67 -5 16 43 116 -64 85
5364 85 58 -107 78 39 -108 -51 74 8 -26 34 -47 23 -14 56 -63 -9 150 69 -114 13 -106 20 91 22 -149
5389 -149 7 147 -6 -62 12 11 -77 -8 13 53 -15 60 56 -77 -28 -2 -88 -67 55 -12 -55 47 139 2 22 -12 -115
5416 -115 -23 119 35 -202 71 91 -114 -4 1 3 -51 158 -80 -96 -66 46 -83 -86 -121 -45 31 144 -30 -43 -109 59
$$ packed form
5239d1p4J05J42j35q4J59p8k17P7K54j89R1J58j25j68J65J5j3o0O3l5l3J00j9
5263E8j94P5K55o0j39j6K7j08K00J8j97O1J62j63%j8J46jk05K05j78n2L21j56
5287D1j44R6jr8J5J21k6k05J48K6o3l2J50o2J43j45k5M6J25J0j76p6K79l8j65
5312e6K01j98j02J22J42k09j5R5NR1p6o1qM9K27k84Q2R8j38m8J89j22J3L7Qk6
5338A6j20J56o6m9j0n7k4J13O8l7m5O3J09j33J8j1j24L4J10N6p2K1K7P3j80J49
5364H5k7j65J85l9j47N7J25o6l4O0q1P0l7P0j19N4J59q1j83J27j19J26P1o9j71
5389a49J56J40j53n6P4jq8O9K1M0o8P5mj33M9K6q6K1J22o7m3J02R2j37K0l4j03
5416a15R2J42q4k37K73K0k05J10NKn4K09k38j6L0J12j29ll5P6P6J13j74j3o6J68
$$ plain form
5442 59 135 -168 63 23 -39 126 26 38 1 37 -55 -193 -59 38 -9 59 -9 -62 -29 34 51 -119 -206 88 -53 -21
5468 -21 92 -64 -74 -8 32 -95 32 -21 -1 -6 82 -61 -71 114 -21 -120 -14 70 -1 1 100 -18 -32 126 3 -116
5494 -116 -13 101 10 -52 171 -32 -57 34 62 -113 -19 113 8 -113 -56 45 -30 -94 30 33 -42 72 52 37 -11
5519 -11 29 22 -39 90 44 91 44 119 -44 102 108 30 -56 36 -15 49 21 130 129 -126 -21 -112 -96 97 -218 -9 14
5546 14 52 -90 -59 67 30 -19 160 162 -14 -50 88 66 -129 77 -29 -107 1 23 -259 -114 71 50 -95 49
5570 49 33 -144 80 155 -29 67 119 49 -12 -46 13 76 43 164 -40 -44 144 -53 -197 -41 2 -119 -110 -2 -144
5595 -144 -206 39 -21 -89 -17 89 -42 -100 173 -47 -12 113 36 -121 -13 6 -118 -52 144 -92 -161 22 107 -28
5619 -28 -105 -17 33 -109 -80 81 -101 151 49 -19 76 15 15 -50 153 189 21 9 275 -54 -223 -69 -86 33 -104
$$ packed form
5442E9P6l03K31m0o2J65j00J2l7L6r2j38J34R7m7O8o8n3L3O3J7j70q7K94j41L2
5468b1J13j56j0O6M0j27J27n3K0nQ8j43j0J85j35r9J06Q4p1KR9j18j4J58j23j19
5494a16J03J14r1o2K23k03k5R1K8j75R4J32j05j21N7J01p5o4J24Lp5J14k0j5m8
5519a1M0po1J29m6M7m7P5j63J46Op8q6R2n1O4k8J09jk55J05r1J6J93l15K09K3
5546A4L8j42L1J26l7m9J79Kj76l6J38k2j95K06j06p8J08K2k82J45J85k1j45J44
5570D9j6j77K24P5j84R6N2p0o1l4N9O3l3J21k04mJ88j97j44J56M3j21RJ08j42
5595a44o2K45o0o8P2J06j31n8K73k20L5J25p7j57J08J9j24O6J96k36o9J83Q5j35
5619b8p7Q8N0j42K9J61j82K52j02o8R5o1%o5K03L6j68j2K66l29j69J54j7J19j37
$$ plain form
5644 -104 87 -171 -12 -72 14 -19 -70 36 16 -49 -20 -66 91 33 -19 -31 -72 20 103 -54 0 -3 29 -24 -40 -65 -100
5671 -100 -64 77 78 -10 -18 -59 78 73 -134 -152 11 -97 -71 7 92 -88 35 49 -57 -63 43 -2 -36 18 46 -30 -76
5698 -76 87 -2 -2 177 114 -96 -32 -81 -78 -79 -80 34 -12 97 146 21 -107 109 44 8 10 97 -52 14 44 -66 -166
5725 -166 30 -2 152 89 -17 -37 -127 85 -30 30 6 -26 -33 27 143 -92 42 207 129 -142 9 75 49 -24 42
5750 42 -42 -68 89 4 -17 91 -79 -83 100 -2 -11 -57 26 -40 -117 -42 42 -15 110 21 -86 -13 -8 84 -20 48 -24 -48
5778 -48 -39 28 -122 -56 17 -39 8 -6 180 15 7 -19 -44 54 89 9 -59 -205 94 46 -11 -47 -24 -64 -28 98 -93 -112
5806 -112 -15 84 -78 -56 97 -241 16 56 -76 -40 -99 34 10 77 19 -17 92 36 139 61 49 60 13 115 67
5831 67 -22 20 95 14 -93 88 78 -43 -113 21 -131 87 126 76 -30 55 170 -117 -30 -54 37 32 61 11 -54 -98
$$ packed form
5644a04J91k58J59o0Q6l3n1J06k0o5K9m6J57n8n2j2m1R2Q3j57N4lL2n3j6k5l5
5671a00L6J41Jq8qm1J37nk07j8J63j08K6P8Q5j80J23J4j06oJ06m5l4N4K8p6m6
5698g6J63q9%J79o3k10O4m9LjjJ14m6J09M9j25j28K16o5l6KQ7j49O6L0j10j00
5725a66J96l2J54o3j06k0r0K12j15O0k4l2pO0J16k35J34J65p8k71J51O6k6p3O6
5750D2q4k6J57q5k1J08j70mJ83j02rm6Q3o6p7P5Q4n7J25q9j07P3NR2j04O8p2k4
5778d8RO7j50O6P3n6M7j4J86j65qk6k5R8L5q0o8j46K99m8n7l6K3m0L6J26j91j9
5806a12R7R9j62K2J53l38K57M0j32L6n9J33k4O7n8l6J09n6J03p8j2J1m7J02m8
5831F7q9M2P5q1j07J81j0j21p0J34j52K18L9n0j06Q5J15k87Q7k4R1nK9n0o5m4
$$ plain form
5857 -98 66 -18 -50 -112 39 -41 -34 36 -59 74 45 94 -83 83 -11 9 -153 82 18 -14 34 -69 117 -16 43 -49
5883 -49 42 66 -34 -89 78 99 -118 -31 -40 -21 -76 -83 -89 -190 -23 0 -1 -37 178 136 -24 88 -93 -8 57 190 -140
5910 -140 31 72 -49 -54 27 -64 -131 -23 89 -241 -158 88 65 -75 21 22 50 33 86 -74 15 62 -30 -5 119 42
5936 42 -7 -46 89 -5 -96 21 218 -1 -33 -39 -104 -6 117 36 -226 -126 -17 -130 -108 106 -7 -45 0 -14 -41
5961 -41 -7 55 107 -5 84 0 -28 85 6 -45 -78 64 -105 -35 86 -150 70 41 167 -101 -19 37 134 -147 41
5986 41 93 -10 -6 -33 -154 59 99 65 35 60 48 -100 -7 45 -11 -59 69 34 66 -128 -29 -158 14 99 41 -147
6012 -147 17 63 -97 -69 149 11 -26 163 116 -182 31 75 -8 -68 -64 35 -53 46 42 30 63 69 -75 -42 9 21 10
6039 10 -12 -11 -100 -105 88 -65 -78 123 123 -39 -57 29 38 -46 76 -60 -65 -50 -92 -50 0 -26 -104 -85 -3 32 -59 1 23 -41
$$ packed form
5857i8J64q4l2o2J51q0PP0r5J33k9M9j77J66r4K0j62K35o4l2M8j03J86j33N9r2
5883d9R1K4j00n5J67K1k17Q7rJ9n5poj01J67K3jl6K15m2j60J12j81Q5O5J33l30
5910a40J71M1j21nQ1r1o7J08J12l30Q3K46k3j40R6JK8j7N3j60Q9M7r2K5J24p7
5936D2m9l9J35r4r1J17J97k19l2oo5R8J23q1k62J00J09j13K2K14j13l8M5j4k7
5961d1L4O2N2j12Q9q4k8J13p9n1l3J42j69P0J21k36K20k9J26k68Q2N6R7k81J88
5986D1N2j03Mk7j21K13M0l4l0K5j2j48R3N2n6m8J28l5L2j94R9j29J72Q5n8j88
6012a47J64M6j60K8K18j38l7J89m7k98K13M4q3o0MR9q8R9mj2L3Oj44L3N1J2j1
6039A0k2Jq9nJ93j53j3K01%j62j8Q6Rq4J22j36nJ5m2M2N0k6p8J9Q2L5r1O0K2o4
$$ plain form
6069 -41 94 110 -46 -79 145 45 -74 94 128 63 -70 -31 29 -153 55 44 -182 -81 -28 -51 -65 41 2 51
6093 51 64 -8 -130 -58 21 85 29 -52 -11 -14 94 80 -37 19 24 -100 -78 -58 2 -86 -79 -30 -64 -207 29 123 4 -36
6121 -36 8 -58 -70 128 -25 -55 108 76 -3 74 -34 37 -44 47 -26 -96 3 9 149 -71 -56 106 -112 120 -75 -49
6147 -49 6 169 -65 -112 35 -87 9 63 22 -93 12 116 29 -87 -96 44 -49 25 -54 17 3 -61 -127 -18 -25 -22 -188
6174 -188 -42 60 -5 93 85 -6 -126 -69 0 -55 -112 91 48 -64 94 -29 -113 27 85 6 17 138 -14 -58 10
6199 10 49 -14 -79 29 44 -26 -100 1 -89 6 51 -97 -65 88 -25 -161 -58 54 -41 99 107 -73 -40 78 -48
6224 -48 -81 -61 -14 -52 -40 33 -63 -176 91 30 -90 202 125 31 -10 207 22 -23 34 174 -30 25 73 -11 -30 -44
6250 -44 88 -76 -20 -45 113 25 82 -61 -33 91 -106 -91 78 92 -91 -106 31 137 7 60 188 -36 81
$$ packed form
6069d1J35J6j56l3K24j00j19J68L4o5j33L9O0j82K08j1k26J01N3k3j4J06l9M9
6093E1J3p2j22P2P9O4n6q1M1lJ08j4j17N6Nj24K2K0O0q8PM9l4j43K36R4j19m0
6121c6M4o6j2J98j53l0J63l2p9P7j08P1q1R1p3p0R9OJ40k20J5J62k18K32j95K6
6147d9N5J63k34m7J47j22R6N4m1j15J05J04q7j16rJ40r3P4p9P1j4o4o6J09pLj66
6174a88J46J02o5R8qr1j20N7O9n5n7K03m3j12J58j23q4J40N8p9J1J21j52m4O8
6199A0L9o3o5J08J5p0p4J01r0R5M5j48L2J53j13j36J03J12r5J40Qj80L3J18j26
6224d8l3K0M7l8J2P3r6j13K67o1j20K92p7r4m1K17j85m5N7J40k04N5M8q4j9j4
6250d4J32j64N6k5J58q8N7j43K8J24j97J5J69J4j83j5J37J06j30N3J28k24J17
$$ plain form
6273 81 58 20 -70 90 -39 -18 42 41 -100 -88 49 85 20 -43 58 43 144 171 -9 -64 -26 143 -147 -67 79 64
6299 64 -36 60 -74 12 192 -25 9 -1 -122 -30 -40 -63 -42 -89 79 85 -47 -12 18 23 -70 27 63 22 195 52 -9
6326 -9 -116 44 130 -45 -12 43 -73 -128 -54 -113 -7 43 -36 -43 -34 -18 -113 -43 88 13 -4 -33 62 36 -17 53 -136 -79
6354 -79 -102 -6 -61 -63 57 -116 -74 -44 -109 -149 183 46 -99 31 76 9 -93 7 86 32 82 40 -39 55 58 -38 -71
6381 -71 60 -5 -58 -34 38 -134 -109 130 -37 -95 97 115 -78 75 36 -46 23 67 -80 -83 -69 1 -20 156 65 10
6407 10 -54 -16 25 -51 -85 42 39 -65 47 -36 -98 -22 47 -53 -25 -59 -1 -84 18 -27 -190 21 -46 14 -108 42
6433 42 16 37 -11 -67 -43 77 3 92 -109 -41 -79 -208 32 18 -78 69 87 -36 -61 51 91 -56 -1 -18 51 13
6459 13 73 84 -166 24 66 -85 -113 84 -132 -57 29 31 -17 72 11 -204 -28 50 7 -141 44 102 -92 -133 5
$$ packed form
6273H1k3l8r0J60j29K1O0jj41J2J37L6o5o3J01j5J01K7j80n5L8J69k90Q0J46j5
6299F4j00R6j34Q6J80k17L4j0j21R2j0k3K1m7J68Oj32L5L0Nr3R7L6m1J73j43o1
6326ij07J60Q6j75L3N5j16n5P4n9J06N0p9pRJ6r5P0J31p5j7k9R5k6n3P0j89N7
6354g9k3R6n5kJ20j73M2L0o5m0L32j37j45J30M5o7j02J00P9n4N0m2p9R4Lr6l3
6381g1J31o5n3K4P2j72K5K39j67n8J92J8j93J53l9q2O9M4j47lJ4P0k1J76r1n5
6407A0o4L8M1p6l4J27lj04J12q3o2P6O9j00K8l4N8q3J02m5j63K11o7O0j22J50
6433D2k6K1m8n6K4J20p4Q9k01O8l8j29K40j4r6J47J8j23k5J12M0j47N5j7O9l8
6459A3O0J1k50J90M2j51k8J97k16P5Q6Km8Q9o1k15J76P8m3j48J85N8j94m1J38
$$ plain form
6484 5 67 23 101 -94 -30 89 46 25 -47 204 -20 15 57 47 -174 -41 -38 -99 44 102 -62 18 -20 -13 -14 145 -51
6511 -51 -21 -30 -22 65 87 -5 49 -106 -43 135 14 -47 -81 57 -103 -3 -53 -82 -106 -94 29 -174 -10 4 -48 -33 75
6538 75 136 21 64 -37 86 -24 93 15 -32 -36 -113 54 -50 9 -124 8 47 -117 31 -44 65 92 97 14 -131
6563 -131 57 39 18 37 15 21 -130 -45 -112 86 4 46 -38 -195 45 -5 -16 -77 149 103 -125 146 21 -69 49
6588 49 -12 74 39 90 -72 90 49 0 -14 -35 44 -73 -77 65 -17 -56 23 57 -147 13 110 6 -16 36 -111 -113 73
6615 73 61 -94 -55 19 41 -47 -42 60 63 101 53 -18 -65 25 63 -40 -121 97 -18 -44 100 105 -89 25 53 56 65 -114
6643 -114 18 198 143 18 46 20 110 -35 -50 20 56 36 110 75 -82 -85 81 -33 -68 23 -18 -15 48 8 -104 94
6669 94 71 -114 -38 96 -7 -114 -88 -28 -154 108 192 52 37 68 -52 -39 16 21 -54 -195 127 -76 -17 74 82 -186
$$ packed form
6484EO2m4P8j95O4J19m3k1p2K51k24L5M2j0k21J33Lo1J43N8j64Q0l8PjJ59j96
6511e1L0rQQ7K2r2N4j55O3J78j21o1l4J38j60J00n0k9k4J2J23k03J64J4n2J5J08
6538G5O1j15M3j01J23j10J17p8m7mp7J67j04N9j33J32L9j64J48p5J09K7Nq3j45
6563a31J88j8k1J9k2Oj51Q5o7J98q2M2q4j57K40n0j1o1K26m6k28K71j25r0J18
6588D9o1Q6l5N1j62J62m1m9j4k1P9j17mJ42q2l9P9L4k04J60R7j04k2N2j47kJ86
6615G3j2j55L9P4K2q8NJ02LL8m8p1m7R0L8j03q1K18j15k6J44Nj94J14K8LRj79
6643a14J32J80n5j25K8k6R0j45j5P0L6k0P4l5j57lJ66j14l5R1m1LO3m0j12J98
6669I4k3j85P6J34j03j07K6O0j26K62Q4j40j5L1j20J3N5Np5j41L22k03N9R1Qk68
$$ plain form
6695 -186 11 -38 -47 -19 54 177 50 -12 -17 121 -132 125 -1 7 0 57 -88 -46 102 6 -71 -85 -64 55 -13 80 -167
6722 -167 -56 -62 -29 16 38 -68 -64 -11 126 -80 -86 134 -2 23 125 57 -137 -23 -34 -4 -120 113 -29 -42 -72
6747 -72 -80 -113 -18 175 -69 39 100 -45 -71 29 -17 51 56 21 178 -9 69 74 43 -22 123 19 -74 -68 -113 -80 -3 -11
6775 -11 -67 30 63 54 -72 63 -69 -142 16 67 70 -51 -31 87 -167 59 -50 -128 93 101 66 -127 -27 -5 -154
6800 -154 -25 134 25 -2 127 82 -153 145 25 98 14 -33 -39 38 83 41 -170 52 7 -144 86 122 -35 -60
6824 -60 21 95 -87 42 191 104 -8 -3 -175 -124 51 -17 9 0 37 0 -96 149 -89 0 164 36 -46 -32 14 151
6850 151 -48 2 -57 -30 -83 -11 -77 -93 70 -79 0 -24 99 -87 -75 141 31 -138 25 64 -77 -100 -84 -11 141
6875 141 45 -2 -83 71 -38 -105 -36 -23 -98 -38 51 -144 -110 -20 111 -66 -133 103 -27 18 104 23 -47 29 -79 -2
$$ packed form
6695a86J97m9rK8P3J23j27o2nJ38k53K57j26QpN7j45M2J48r6p7j4K1J19o8R3k47
6722a67J11oL3M5K2j06MN3J37k06oK20j36K5J02o8j94J14j1L0j16K33j42j3l0
6747g2ql3R5J93k44J08O1j45k6J00m6O8Nl5J57j87P8Nl1o5J45j04r3Om5L3P7q
6775a1n6R7L3rj26J35j32p3J58N1Lj21K0J18k54K26j09p8K21Ql5j93J00K2j49
6800a54J29J59j09k7J29m5k35K98j20P3q4m7oP7M5m2k11K22m5j51K30L6j57k5
6824f0Q1P4j82J29J49q7j12Nj72N1J75o8K6rL7l7r6K45k38Q9J64j28q2J4M6J37
6850A51j99N0n9K7n3P2o6j6J63j49P9k4J23j86J2K16j10j69J63L9j41k3J6P3J52
6875A41r6m7q1J54j09o7O9J3p5O0Q9j95L4R0J31j77o7K36j30M5Q6q1p0P6j08P7
$$ plain form
6901 -2 -63 174 -60 1 -26 -25 -25 -80 68 20 -103 -31 -3 -110 -34 -59 1 -54 110 -10 3 -34 -51 -101 53 99 9 30
6929 30 47 -33 -73 19 62 10 93 -11 -81 -28 -52 2 -79 -110 50 -7 -108 33 -64 -3 22 115 -20 -95 129 -14 -91
6956 -91 -117 33 4 -105 53 36 66 98 86 -48 83 -2 -173 37 -9 -45 32 4 -12 -69 50 -91 11 -76 -20
6981 -20 99 82 115 72 43 -189 36 -91 -62 -58 11 19 -42 14 -69 -18 -29 46 3 113 25 -2 71 136 -34 9 22 25 -11
7010 -11 35 16 -125 24 33 -161 -118 98 -140 -185 -37 76 -41 -44 -23 -64 -40 54 -151 44 -77 37 -35 -98 107
7035 107 107 -69 115 65 -52 -29 99 -76 -26 45 -70 60 -33 -3 -121 36 -31 -189 -105 -118 9 -242 94 85
7059 85 -34 -35 -60 31 -117 28 59 -150 10 212 -21 -17 41 53 -5 6 -59 -192 -13 150 -82 -121 35 -15 -25
7084 -25 56 -36 -140 -67 118 -28 -100 76 45 -110 100 164 -96 -31 58 -84 -8 47 -53 -88 32 5 -24 -166 -62
$$ packed form
6901bo1K37k34O1k7J%n5J48m8j23P2K8j07P6k5O0n5J64j20J3l7j7n0J54M6r0K1
6929C0J7q0m0R2M3n2Q3j04p0N3k4N4q1l1J60n7j01J41r7O1K5R3j35p5K24j43p7
6956i1k6J50k9j09J58j7L0L2j2j34J31q5j71K10m6l6P7k8j6n7J19j41J02q7N6
6981b0J19j7L3m3k9k32K25j27K9MO9Qo1N6q3N1j1P5m3J10q8k7P3O5j70M3J3Ll6
7010a1M6j9j41J49Rj94M3K16k38m5J48J13j17lK1m1K4R4k05J95j21J14p2o3K05
7035A07%j76J84n0j17K3J28j75N0P1j15J30r3L0j18J57o7j58Q4j3J27k51L36r
7059H5j19jk5R1j48J45L1k09J60K02k33MN8J2n8J1o5j33J79J63k32l9J56n0j0
7084b5Q1r2j04P3J85j46p2J76l1j55K10O4k60O5Q9j42P6N5j00l5J20k7k9j42J04
$$ plain form
7109 -62 60 33 74 -11 -123 37 214 -88 -107 -90 125 -75 -86 125 -136 -117 36 25 126 -110 -51 -63 -76 1
7133 1 -172 71 -12 83 -30 52 109 -89 2 168 46 -7 73 30 -51 -55 -19 -75 -37 -107 -53 108 6 151 -194 -42
7159 -42 -21 -139 -138 -19 29 -42 137 185 -16 -22 20 122 -114 -42 70 -105 -105 -19 -31 -83 69 44 -97 4 -58 -88
7185 -88 -32 12 -5 -171 -5 146 -71 -88 75 53 54 72 95 -13 8 -20 -28 -58 147 52 -73 14 -12 -51 -11 53 -151
7212 -151 -64 -109 47 -33 163 1 -111 45 54 -40 -99 78 171 -13 -12 139 -5 -46 104 -9 -19 50 159 -30
7236 -30 -51 2 1 -173 -64 50 -34 11 22 68 -8 -23 39 52 36 -8 -15 94 47 -16 -37 75 133 48 -81 83 -4 -26
7264 -26 88 -56 -45 152 21 -106 59 -37 -66 -68 -24 -4 47 -82 31 67 22 122 -30 73 102 4 -15 -27 35
7289 35 1 -59 85 -73 -130 -115 48 -116 -69 -35 -17 44 21 90 -33 -66 51 -12 48 -68 26 3 49 -15 -29 -65 34
$$ packed form
7109f2J22k7M1q5j12J60J77l02j9J7K15k00j1K11k61J9J53j1J01k36N9j2j3P7
7133Aj73K43q3R5j13Q2N7j98R1J66j22n3Q0m3q1mL6n6L8p0N4J61j02J45l45J52
7159d2K1j18JJ19M8p1J79M8k01oM2J02k36P2J12j75%Q6j2n2J52k5j41J01o2l0
7185h8N6M4j7j66J66J51k17j7J63k2JJ8K3j08K1k8ql0K05r5j25Q7k6l9M0O4k04
7212a51Q7m5J56q0J96j62j12J56Rr4n9J77R3j84JJ51j44m1J50j13j0O9J09j89
7236c0k1N3jj74J09J14q4M5J1M6p6j5O2J3j6m4pJ09m7o3k1J12N8q5j29J64q7k2
7264b6J14j44J1J97j31j27J65r6k9kM4K0N1j29J13L6m5J00j52J03K9r8j9j2O2
7289C5l4o0J44j58n7J5J63j64M7L4J8O1k3O9j23l3J17o3O0j16R4k3M6o4j4l6R9
$$ plain form
7316 34 37 -19 19 -100 9 68 -19 -62 39 5 -208 -23 12 -47 -102 -69 122 -71 76 -21 127 -38 49 62 -103
7341 -103 26 83 -83 -44 -37 86 -93 -74 40 84 -137 35 46 -38 -120 124 -10 115 4 -122 49 60 90 -12
7365 -12 42 -43 6 -103 -116 -96 14 -48 110 -130 87 62 101 -90 -105 -41 -127 52 3 -47 38 142 -106 -29 -75 122
7391 122 -16 41 213 5 11 12 -29 -23 60 -49 68 -133 17 -102 -92 -105 115 30 -38 54 -79 -2 20 -46 4 -33
7417 -33 -15 -40 84 91 -106 64 106 -62 -56 20 24 -22 -8 1 -94 -75 12 64 -31 13 27 -64 -194 38 122 -86 -21 -43 -77
7446 -77 -7 134 -98 -55 2 87 -104 88 23 -83 -34 -37 -31 -39 48 -127 -111 34 28 -26 -59 -86 -31 -106 39 129 -142 37
7474 37 112 -14 86 -106 103 27 58 -16 -91 -43 60 -41 -98 103 -9 -123 -115 15 -13 -26 -21 0 -75 -111 -124 103
7500 103 174 28 56 19 122 145 -101 -73 -122 -130 -24 5 -19 -69 -32 -148 -69 -85 58 -42 -73 43 0 21 -67 71
$$ packed form
7316C4Ln6L8j19J09N9q7m3J01l4k13J85L5n9n5L3J91j93J47r7J48j65Q7J3j65
7341a03J29N7j66L9PJ23j79J9J14M4k21J72J1q4q2K44j34J25j11j26J71J1L0j02
7365a2N4q5M9j09j3K0J10o2J58k40K17k5L9j91j5O4q6J79m9n0Q5J04k48P7m6J97
7391A22j38N7J72k08OJm1OQ3j09J17k01J50j19J0j3K20q5o8R2j33P7K2o6N0l7
7417c3J8k5J24Pj97J70M2j68OP6Mm6J4Rr5J9Q7N2r5M4J4r1j30K32Q4k08O5k2l4
7446g7P0J41k32M3N7Q5j91J92o5j06M9lOqQ7j75J6J45on4l3k7N5p5J45R0k71J79
7474C7P5j26J00j92K09p6L1p4p5M8J03j01n7K01j12j14QJ30k8j3NK1p5l6j3K27
7500A03P1j46K8l7J03K3k46K8m9qJ06K9k4n0L7j16P9j6J43j00l1J16m3K1q8J38
$$ plain form
7526 71 67 43 64 10 30 39 -24 -194 4 111 59 -190 64 36 -21 62 22 96 -44 78 -89 48 -52 -22 -117 -16
7552 -16 5 -31 -85 47 10 -118 48 92 22 -100 -75 5 -75 61 -53 -66 -63 -117 -91 -46 37 -67 -72 124 4 55 7
7579 7 77 -39 59 53 -12 -1 13 -71 -123 19 -38 126 -24 -141 -70 -109 -70 -11 -76 7 89 -119 -93 -30 -125 -61 -119 151
7607 151 59 -7 -58 77 170 32 3 -123 -31 -31 -51 -49 -9 98 -130 -60 -13 -29 -53 59 -94 -108 -65 62 22 -77 137
7634 137 -14 -73 104 135 4 -42 141 -64 48 9 8 -129 -144 39 8 -28 160 -44 -55 110 47 25 46 -83
7658 -83 -38 16 27 -68 0 -15 92 -29 66 125 -12 57 79 91 -57 -45 49 -51 31 89 7 -26 -2 -29 -65 31 122 -67
7686 -67 -7 97 73 -113 -4 90 -49 -57 105 -48 24 44 -94 -178 132 37 -40 -67 26 -35 -82 63 -45 66 -67
7711 -67 102 -24 74 -20 32 -16 28 -13 -57 32 6 21 21 62 -18 56 22 39 -174 -29 -48 -33 47 34 42 -68 30 60 -25
$$ packed form
7526G1mk4K1n4K0Ro3j70J98J07n2k49K54k8n7Q3m0P4j40J22j67J37j00L0r5J01
7552a6K1l6n4J32l7j28J66M4p0j22K5Q0q0J36j14j3Ln4K6M5Q3j04nJ96j20N1m8
7579GP0j16R8oo5J1J4q4n2J42n7J64j50j17P1l9L9N9o5Q3Q2k08K6O3r5O4n8K70
7607A51r2o6n1J35R3j38k9j26R2%k0KM0J07k28P0M7j6k4J12j53j4M3J27m0r9K14
7634A37j51n9J77L1j31m6J83k05J12l9jj37j5J83l1l6J88k04j1J65o3k2K1j29
7658h3M5N4J1r5O8j5J07j21R5N9j37O9K2J2j48J2R4j00Q2N8q2l3K4k7l6R6R1j89
7686f7O0J04k4j86J09R4j39qJ62j53P2K0j38q4L10r5p7k7R3o1m7J45j08J11j33
7711f7J69j26R8r4N2m8M4m1m4Q9k6J5%M1q0P4l4J7k13J45j9J5Q0j3Qj10R8L0q5
$$ plain form
7740 -25 -68 141 -30 -78 185 3 -122 -70 -96 -51 -120 22 62 20 -7 -14 -99 -19 45 60 46 54 44 43 173 -9 -87 27
7768 27 -9 207 -105 122 97 27 -14 188 28 -113 -10 -88 -138 -9 66 -54 -83 58 -73 -26 -23 1 1 6 18 14 -51
7795 -51 59 115 -53 29 28 87 -9 58 51 91 43 31 63 108 34 -90 -39 43 -12 -38 6 -57 10 103 -6 63 21 142 -44
7824 -44 0 64 129 29 -94 -106 14 36 117 -14 -78 -95 97 -57 -11 -67 -54 -88 -98 51 -27 54 -79 -89 -55 -96
7850 -96 20 3 -22 -21 25 -52 106 100 -148 -79 147 -32 75 -11 -28 60 28 70 -75 -100 119 -38 -136 69 18 -27
7876 -27 105 80 -17 47 101 -19 -86 186 -12 -2 22 3 100 8 90 41 -76 39 29 -64 -94 1 -132 -71 102 -29
7902 -29 -105 -40 41 -136 -58 147 -72 -23 52 139 -23 -36 87 -49 107 -31 1 -90 -51 -29 -74 -69 116 -11 84 7
7928 7 61 -80 -68 -40 8 59 38 -93 -19 261 -9 -85 77 28 71 13 86 -51 -57 45 66 -13 -80 51 -49 -142 71
$$ packed form
7740b5m3K09j71m8K63j82j25N2k6M5o9J42M0m2k7pq5Q0O4J5j4Qj0jJ30j82p8J14
7768B7l6K16l12K27k5p0m1K02j60j41J03p8n0J29P5j20k9J41j31M7LK4%NJ2mo5
7795e1J10N6j68Q2jN9r6O7pM0m8j2L2M5p4j24N1Q2n5k6M4o3O7R3j09O9m2J21j86
7824d4M4O4O5j00j23j2J20K2Q1j31o4j7J92j54M6n6J3l4j0J49p8Q1j33j0L4m1
7850i6J16j7k5JM6p7J58ok48O9K26j79J07q6j7Q8l2M2j45k5K19j57r8K05n1m5
7876b7J32k5r7O4N4j20o7K72j98J0K4j9R7r2Q2m9j17J15j0r3l0R5j33O1J73j31
7902b9p6O5Q1j77P8K05k19M9P5Q7j62j3J23j36J56j38L2r1L9K2m5NJ85j27R5p7
7928GN4j41J2K8M8N1k1j31P4K80k70p6J62m9M3n8P3j37oJ02K1p9o7J31j00r3K13
$$ plain form
7955 71 73 91 39 34 -80 -56 57 133 -66 -8 22 -48 71 145 49 -91 130 43 -40 -14 27 71 51 148 -208 -16 21
7982 21 26 -109 -25 1 0 65 32 -18 -115 -57 -39 -43 -71 147 16 -34 107 98 -113 39 16 63 -47 -24 30 -18 95 -47
8010 -47 -38 -67 120 -98 -90 177 -23 -50 56 -100 108 -8 16 103 -72 10 100 -41 150 163 -29 -86 -13 -65 -77
8035 -77 -69 37 -50 124 10 22 -3 120 43 -243 27 42 -69 62 78 -62 -79 -48 -11 13 52 49 37 -143 4 54
8061 54 -130 -22 -63 -79 -44 -105 100 -7 22 29 -150 99 58 -79 -62 165 85 -126 134 79 -78 -118 132 -108
8085 -108 -64 109 -7 -58 -14 54 -87 -31 22 -71 -59 73 -19 -41 20 -52 41 37 20 -9 -78 18 42 -49 1 11 -28 -93
8113 -93 12 83 -55 87 155 12 33 -4 13 -53 98 103 -65 9 178 -33 0 -41 -56 -38 39 -74 -129 33 140
8138 140 77 -17 -27 89 62 42 -16 -48 33 -45 129 8 27 -4 -176 30 47 -101 9 -7 -101 1 14 119 3
$$ packed form
7955G1KJ8n2nj14K4J13P6j99N8L0p0J19P4r6j40K21q7q3K6M1M4k0R7l56J92L7
7982B1Nj35Q4K6jO5l3n0r7N8J8mk8K18j31n0J41rk11J52k3M7j10K3N4m8J13j42
8010d7Rk9J87k18QK67k00k7J06j56K08j16K4Q7j75Q2R0j41J91J3j92n7P3n2j2
8035g7QJ06q7J74j14J2k5J23p7k86K70J5j11J31J6j40j7L1L7K4L9lj2j80J47N0
8061E4j84J08m1j6L5o1K05j07K9Pj79K49m1j37J7K27q0k11K60n5j57m0K50k40
8085a08M4J73j16n1M4O8j41N6N3r3J2J32r2k2O1p2R3mj7k9o9R6K4r1N0J0l9o5
8113i3J05P1j38J42O8j43K1l7J7o6J51Nj68P4J69k11L3m1j5J8P7j13n5J62J07
8138A40o3r4j0J16k7k0n8l2Q1p8J74j21J9l1j72K06J7j48J10j6r4J02J3J05j16
$$ plain form
8163 3 -22 37 81 -54 209 189 -44 -34 102 -102 110 10 15 4 -44 -23 -28 -60 99 -25 -22 72 65 -34 -11 -15 -39 -17
$$ packed form
8163Ck5N9M4j35K63k0k33J0J36k04K12j00Nj1m8K1nl2J59j24LR4pr9K3mk4K2
8191a7
$$ Imaginary data points
##PAGE= N=2
##DATA TABLE= (X++(I..I)), XYDATA
$$ plain form
0 0 0 0 0 0 0 0 0 0 0 0 -16 16 -16 16 -16 32 -32 47 -48 64 -65 81 -97 113 -144 161 -192 215 -255 289 -322
31 -322 369 -420 481 -545 610 -685 769 -853 955 -1061 1180 -1310 1452 -1605 1773 -1955
47 -1955 2157 -2375 2616 -2883 3176 -3502 3861 -4271 4730 -5251 5849 -6551 7376 -8366
61 -8366 9583 -11125 13139 -15904 19942 -26432 38544 -68892 307376 316300 -499470 -310339
73 -310339 212760 220721 -232541 -148523 272736 296197 -190889 -368136 -44144 252472 124463
84 124463 -46907 -32371 -9246 -102086 -68478 60139 82750 35071 74445 16480 -184927
95 -184927 -189921 118830 263572 25939 -171655 -27835 100988 -61806 -180659 65809
105 65809 299129 72682 -286475 -193280 145687 141943 -87383 -30740 162917 30014 -228502
$$ packed form
0@%%%%%%%%%%j6L2l2L2l2M8o4P9r5J12j29J46j78K10k57L05l53M07m70N44o11
31c22O91p89R01j026J155j295J454j622J808k016K241k490K762l057L378l728
47a955M112m532M991n499O059o678P363q132R001r981J1100j2400J3927j5742
61h366J7949k0708K4264k9043L5846m6374O4976j07436L76268Q924q15770J89131
73c10339N23099P961m53262Q4018M21259K3461m87086j77247L23992K96616j28009
84A24463j71370J4536K3125r2840L3608J28617K2611m7679L9374n7965k01407
95a84927m994L08751J44742k37633j97594J43820J28823j62794j18853K46468
105F5809K33320k26447l59157R3195L38967l744k29326N6643J93657j32903k58516
$$ plain form
116 -228502 -128191 150730 143967 -39597 -31279 64415 -39618 -177861 -28701 221348 147852
127 147852 -135045 -150694 71962 73554 -123922 -67394 190100 154155 -145961 -205335 24808
138 24808 128671 16862 -32005 34516 21320 -77209 -79979 27487 81141 38575 11474 6016
150 6016 -64776 -110764 13409 146579 55176 -90345 -22049 79282 -43520 -153395 26724
161 26724 212257 56793 -188323 -118423 113337 102873 -87579 -79677 113872 110401 -121616
172 -121616 -172569 58710 174092 10929 -100615 -2138 52660 -37754 -59915 40133 73966
183 73966 1253 -35367 -10736 -14730 -34589 10571 76098 39511 -66060 -73718 21167 41754
195 41754 -26400 -9942 74471 28293 -97878 -68546 67868 67698 -34487 -28356 49455 19354
$$ packed form
116b28502J00311K78921o763j83564Q318R5694j04033j38243J49160K50049p3496
127A47852k82897j5649K22656J592j97476N6528K57494l5945l00116n9374K30143
138B4808J03863j11809m8867O6521j3196r8529k770J07466N3654m2566k7101n458
150F016p0792m5988J24173J33170r1403j45521O8296J01331j22802j09875J80119
161B6724J85533j55464k45116O9900K31760j0464j90452P902J93549l471k32017
172a21616n0953K31279J15382j63163j11544R8477N4798r0414k2161J00048L3833
183G3966p2713l6620K4631l994j9859M5160O5527l6587j05571p658R4885K0587
195D1754o8154J6458Q4413m6178j26171K9332J36414j70j02185O131P7811l0101
$$ plain form
207 19354 -71998 -46432 65665 78005 -26629 -69776 6608 43237 -24917 -42277 43627 59682
219 59682 -38555 -65740 16628 36236 -25242 -16365 49240 27547 -53944 -50195 30350 53740
231 53740 -4987 -35555 8782 33948 -16172 -43105 15580 50391 -4953 -37309 7309 19440
243 19440 -26038 -18866 36782 25476 -35127 -32752 19770 25179 -15014 -22862 14135 27814 -11076
256 -11076 -33608 6868 36866 -1949 -30181 8209 27251 -14050 -22039 23737 24049 -25758 -26677
269 -26677 19976 26156 -11894 -25623 82 18739 1952 -19013 -4069 18922 1859 -21812
281 -21812 -617 20185 -4963 -17094 15740 21969 -16852 -23082 13460 22472 -3238 -12516 725
294 725 8188 -105 -11559 -5882 13490 12395 -10508 -14557 435 -1710 -4484 14727 15360 -17927
$$ packed form
207A9354r1352K5566J12097J2340j04634m3147P6384L6629o8154j7360Q5904J6055
219E9682r8237k7185Q2368J9608o1478Q877O5605k1693q1491L749Q0545K3390
231E3740n8727l0568M4337K5166n0120k6933N8685L4811n5344l2356M4618J2131
243A9440m5478P172N5648j1306o0603K375N2522N409m0193p848L6997J3679l8890
256a1076k2532M0476K9998l8815k8232L8390J9042m1301p989M5776L12m9807r19
269b6677M6653O180l8050j3729K5705J8657j6787k0965J4944K2991j7063k3671
281b1812K1195K0802k5148j2131L2834O229l8821o230L6542R012k5710r278J3241
294G25P463q293j1454N677J9372j095k2903m049J4992k145k774J9211O33l3287
$$ plain form
308 -17927 -24928 7739 19561 918 -3665 5961 2898 -6966 -9663 -3683 11492 19396 4270 -11005
322 -11005 -7626 -6212 -8314 7679 19335 -1368 -18075 -3180 5436 -6844 -4690 11277 10174
335 10174 -2868 -10859 -13566 -4127 16401 19087 1085 -7648 -5788 -7343 -634 11565 6024 -4664
349 -4664 2889 5044 -11829 -12984 8039 14373 2175 -6435 -12740 -13540 2629 16056 6771 -2876
363 -2876 -1319 -5621 -9550 1080 7899 3075 5966 8782 -6536 -14798 975 12403 6899 2364
377 2364 -3427 -13394 -7310 8866 6700 -3510 1353 4004 -6382 -10154 -4493 -172 8414 14125
391 14125 -1439 -17254 -6314 8880 6444 4173 5966 -3578 -9584 939 5065 -2304 1444 9883
405 9883 2535 -7969 -8166 -4907 2288 10731 2510 -12530 -6388 6727 1055 -4296 4628 3974 -5972
$$ packed form
308a7927p001L2667J1822j8643m583R626l063r864k697N980J5175P904j5126j5275
322a1005L379J414k102J5993J1656k0703j6707J4895Q616j2280K154J5967j103
335A0174j3042p991k707R439K0528K686j8002q733J860j555O709J2199n541j0688
349d664P553K155j6873j155K1023O334j2198q610o305q00J6169J3427r285r647
363b876J557m302l929J0630O819m824K891K816j5318q262J5773J1428n504m535
377B364n791r967O084J6176k166j0210M863K651j0386l772N661M321Q586N711
391A4125j5564j5815J0940J5194k436k271J793r544o006J0523M126p369L748Q439
405I883p348j0504j97L259P195Q443q221j5040O142J3115n672n351Q924o54r946
$$ plain form
420 -5972 -1599 4855 -3985 -5519 8859 12545 46 -8294 -6277 2045 9821 2710 -11220 -4504
434 -4504 10384 2187 -10066 910 8028 -5689 -8659 4048 1484 -8784 100 11617 3780
447 3780 -8054 -6724 3480 10384 2685 -10940 -4826 12720 6541 -9828 -554 11980 -2375
460 -2375 -12080 3064 6862 -9042 -6484 11591 7357 -12114 -12749 5091 13891 1224 -14493 -6836
474 -6836 12169 6099 -11801 -553 18818 2641 -17454 -1028 13347 -4361 -10399 13150 16402
487 16402 -11535 -21537 1298 17811 4735 -13094 -6402 10590 2227 -18497 -6923 20470
499 20470 10443 -15404 -5028 11676 -6269 -15766 14213 26014 -7672 -25474 1081 19916
511 19916 1882 -13634 2561 19128 -368 -27982 -11967 23476 14882 -16684 -6028 17893
$$ packed form
420e972M373O454q840j534J4378L686j2499q340K017Q322P776p111j3930O716
434d504J4888q197j2253J0976P118j3717k970J2707k564j0268Q884J1517p837
447C780j1834J330J0204O904p699j3625O114J7546o179j6369R274J2534j4355
460b375r705J5144L798j5904K558J8075m234j9471o35J7840Q800j2667j5717P657
474f836J9005o070j7900J1248J9371j6177k0095J6426J4375j7708o038K3549L252
487A6402k7937j0002K2835J6513j3076j7829O692J6992q363k0724J1574K7393
499B0470j0027k5847J0376J6704j7945r497K9979J1801l3686j7802K6555J8835
511A9916j8034j5516J6195J6567j9496k7614J6015L5443q594l1566J0656K3921
$$ plain form
523 17893 -6205 -31984 1918 36127 6315 -28260 -6647 20551 1717 -20921 293 29453
535 29453 12997 -25215 -21481 14939 16791 -11139 -3461 23620 1625 -36189 -12145 31352 12878
548 12878 -24051 -6003 22330 -1106 -30889 -7468 30410 19524 -17203 -19079 7391 7657 -12526
561 -12526 1027 29602 8250 -31909 -13014 26314 4844 -27517 6132 41171 -1951 -49663
573 -49663 -14890 38734 19614 -27174 -15359 25821 10943 -36443 -21801 38750 34187 -29308
585 -29308 -33048 23569 24389 -27370 -19442 35860 29216 -27639 -32491 11754 22559 -3734 -8975
598 -8975 9739 6523 -17440 -14858 12799 12617 -12014 -3909 21451 -2458 -39972 -6457 47445
611 47445 18473 -40000 -18051 34384 12106 -36703 -10754 43786 23938 -36805 -31351 25991
$$ packed form
523A7893k4098k5779L3902L4209k9812l4575K1613K7198j8834k2638K1214K9160
535B9453j6456l8212L734L6420J852k7930P678K7081k1995l7814K4044M3497j8474
548A2878l6929J8048K8333k3436k9783K3421L7878j0886l6727j876K6470K66k0183
561a2526J3553K8575k1352m0159J8895L9328k1470l2361L3649L5039m3122m7712
573d9663L4773N3624j9120m6788J1815M1180j4878m7386J4642O0551m563o3495
585b9308l740N6617Q20n1759P928N5302o644n6855m852M4245J0805k6293n241
598h975J8714l216k3963K582K7657j82k4631Q105K5360k3909l7514L3515N3902
611D7445k8972n8473K1949N2435k2278m8809K5949N4540j9848o0743N454N7342
$$ plain form
623 25991 27753 -24776 -23279 33935 28786 -40471 -41768 31535 41688 -23798 -33820 22447 27032
636 27032 -26487 -30790 21807 34072 -9295 -26426 5534 18659 -10332 -16915 18851 25472 -17313
649 -17313 -27801 14028 22288 -16611 -16944 22435 15598 -26460 -18578 21586 13733 -20503 -9080
662 -9080 23326 7383 -31355 -15022 35423 26308 -31859 -30530 31570 32792 -33856 -36068 37356
675 37356 45288 -29172 -45926 19363 39087 -15706 -34121 14042 32773 -12150 -35241 5514
687 5514 32825 -3551 -31339 3309 29501 -5897 -29646 7211 29334 -5148 -22319 7704
699 7704 16335 -11286 -11550 16820 12830 -17270 -13110 18109 13934 -20987 -19277 22096 24757 -23240
713 -23240 -31874 19972 33053 -20028 -33868 20005 33842 -18980 -32785 17042 30978 -14301
$$ packed form
623B5991J762n2529J497N7214n149o9257j297P3303J0153o5486j0022N6267M585
636B7032n3519m303N2597J2265m3367j7131L1960J3125k8991o583L5766O621m2785
649a7313j0488M1829Q260l8899l33L9379o837m2058P882M0164p853l4236J1423
662i080L2406j5943l8738J6333N0445r115n8167J329O2100J222o6648k212P3424
675C7356P932p4460j6754O5289J9724n4793j8415M8163J8731m4923k3091M0755
687E514K7311l6376k7788L4648K6192l5398k3749L6857K2123l4482j7171L0023
699G704Q631k7621k64K8370l990l0100M160L1219m175l4921J710M1373K661m7997
713b3240q634N1846J3081n3081j3840N3873J3837n2822j3805M9827J3936m5279
$$ plain form
725 -14301 -28217 15006 32035 -9571 -33269 4759 33707 -1420 -33410 664 34572 1428
737 1428 -33820 -5262 25357 1306 -20455 2731 16971 -6470 -16611 6041 14672 -6170
749 -6170 -13599 7861 16638 -7319 -18943 8539 24357 -5979 -25169 5531 24219 -7050 -22494
762 -22494 11031 23100 -13470 -26266 9265 23286 -8010 -22070 7121 23096 -5728 -28078
774 -28078 -962 28302 7395 -22800 -5263 20920 1276 -21249 2444 24351 537 -19942
786 -19942 101 14680 -4118 -14512 6020 18034 -2989 -20965 -5157 16752 6562 -14414
798 -14414 -5002 13887 692 -17957 -708 19352 2746 -14002 1913 11940 -7530 -14814
810 -14814 8722 21137 614 -17088 -5549 10769 2503 -12236 -1261 17349 5367 -18557
$$ packed form
725a4301j3916M3223J7029m1606k3698L8028K8948l5127l1990L4074L3908l3144
737A428l5248K8558L0619k4051k1761K3186J4240k3441j0141K2652Q631k0842
749f170p429K1460Q777k3957j1624K7482J5818l0336j9190L0700J8688l1269j5444
762b2494L3525J2069l6570j2796L5531J4021l1296j4060K9191J5975k8824k2350
774b8078K7116K9264k0907l0195J7537K6183j9644k2525K3693K1907k3814k0479
786a9942K0043J4579j8798j0394K0532J2014k1023j7976J5808K1909j0190k0976
798a4414R412J8889j3195j8649J7249K0060j6606j6748J5915J0027j9470p284
810a4814K3536J2415k0523j7702J1539J6318q266j4739J0975J8610j1982k3924
$$ plain form
822 -18557 -9978 11715 4124 -11031 1919 14142 -4174 -17730 638 16452 3920 -10158
834 -10158 -2828 8412 2000 -9409 -2584 12926 8224 -10342 -8946 6651 3191 -8646 1154
847 1154 13051 -1797 -16678 -2878 11975 2582 -8500 -978 7692 818 -9704 -5883 8064
860 8064 10770 -1256 -6054 1681 897 -7259 97 12729 4261 -9926 -3368 6406 -1684 -8487 1884
875 1884 9806 1526 -9379 -7501 2535 7095 816 -3791 833 1408 -5962 -3336 8302 6437 -4581
890 -4581 -1636 6110 -1263 -8645 72 9074 4110 -3509 -3658 -571 433 -997 -1732 1990 2976 -3501
906 -3501 -5291 2248 3129 -4425 -1700 7152 1754 -8680 -3589 7336 6157 -969 -2837 -1154 672
921 672 1820 -31 -314 2235 1164 -2849 -1496 939 -1810 -857 4215 413 -7536 -3305 5644 2979
$$ packed form
822a8557Q579K1693p591j5155J2950J2223j8316j3556J8368J5814j2532j4078
834a0158P330J1240o412j1409O825J5510m702j8566J396J5597l460j1837R800
847A154J1897j4848j4881J3800J4853r393j1082P522Q670o874j0522L821J3947
860H064K706j2026m798P735p84q156P356J2632q468j4187O558R774q090o803J0371
875A884P922q280j0905J878J0036M560o279m607M624N75p370K626J1638j865j1018
890d581K945P746p373p382Q717R002m964p619j49L087J004j430p35L722R86o477
906c501j790P539Q81p554K725Q852n398j0434N091J0925j179p126j868J683J826
921F72J148j851k83K549j071m013J353K435k749R53N072l802p949M231Q949k665
$$ plain form
937 2979 -2916 -1294 1329 -103 -590 -358 -361 2107 3440 293 -911 712 -1650 -2687 3188 4460
953 4460 -2862 -3986 2198 1704 -3183 -1490 923 -546 -708 422 -1743 -1580 2303 2272 -1110 -1144 -506
970 -506 -324 2741 3214 -2652 -3244 4055 4606 -2291 -2939 890 -197 -1047 1411 790 -1631 23 457
987 457 -2675 -2693 454 951 1567 1805 -2147 -3940 1930 4442 -1020 -2074 2351 1649 -1366 775 1729
1004 1729 -1185 66 3037 123 -3549 -1892 533 1450 1955 -728 -3857 -729 2016 -2029 -2929 2918
1020 2918 3267 -2369 -1894 1189 -215 273 4322 2301 -3601 -3193 1296 3245 2851 137 -2707 -1093
1036 -1093 1528 -1552 -3245 2227 3528 -2561 -3367 812 -904 -2734 2439 4554 -1656 -4579 -279
1051 -279 2515 1285 143 528 2256 2480 -2705 -5343 1266 6429 1361 -2180 415 -1470 -5667 -253
$$ packed form
937B979n895J622K623j432m87K32lK468J333l147j204J623k362j037N875J272
953D460p322j124O184m94m887J693K413j469j62J130k165J63L883l1l382l4O38
970e06J82L065M73n866n92P299N51o897o48L829j087q50K458o21k421J654M34
987D57l132j8L147M97O16K38l952j793N870K512n462j054M425p02l015K141R54
1004A729k914J251K971k914l672J657K425R17N05k683l129L128K745m045r00N847
1020B918L49n636M75L083j404M88M049k021n902M08M489J949l94k714k844J614
1036a093K621l080j693N472J301o089q06M179j716j830N173K115o210k923M300
1051b79K794j230j142L85J728K24n185k638O609N163n068l541K595j885m197N414
$$ plain form
1067 -253 6222 1713 -4435 -2230 807 -1418 -2646 509 3940 3339 -2007 -5394 -414 4790 1375
1082 1375 -1290 2991 1813 -5270 -2680 5622 3268 -3974 -1232 4192 -264 -6225 -3133 3735 4812
1097 4812 -830 -5383 -1814 2751 -308 -3057 2750 4618 -3483 -4994 3473 4041 -2696 -105 6649
1112 6649 1509 -7403 -4508 4453 5932 186 -3294 -553 1310 -2798 -4419 2925 6010 -2828 -6973
1127 -6973 1905 4240 -4465 -3546 7116 5831 -5943 -6910 2906 5511 -238 -2124 2280 4330 -1253
1142 -1253 -5711 -477 5074 231 -3842 2391 3526 -6343 -6660 6213 7688 -4977 -7831 2275
1156 2275 4464 -2983 -3739 3907 5975 -1240 -6134 -393 5758 1115 -4031 2189 6065 -3677 -7752
1171 -7752 3904 8432 -3357 -7547 3034 5483 -4463 -6665 2879 6071 -1428 -5540 154 4435
$$ packed form
1067b53O475m509o148K205L037k225j228L155L431o01n346l387M980N204l415
1082A375k665M281j178p083K590Q302k354p242K742N424m456n961L092O868J077
1097D812n642m553L569M565l059k749N807J868q101j511Q467N68o737K591O754
1112F649n140q912K895Q961J479n746l480K741J863m108j621P344L085q838m145
1127f973Q878K335q705R19J0662j285j1774r67R816K605n749j886M404K050n583
1142a253m458N234N551m843m073O233J135r869l17J2873J475j2665k854J0106
1156B275K189p447p56P646K068p215m894N741O151m643n146O220L876r742m075
1171g752J1656M528j1789m190J0581K449r946k202R544L192p499m112N694M281
$$ plain form
1185 4435 -1296 -5348 2936 8366 -2421 -9754 2110 10626 -968 -8417 2867 8898 -2658 -8994
1199 -8994 396 7127 1303 -4910 -1448 2945 -622 -4751 197 5713 -563 -7127 353 7039 -1719
1214 -1719 -7339 3438 8991 -2590 -8126 2320 7173 -1605 -5412 2514 6188 -1421 -6449 923
1228 923 6954 -1182 -9107 -205 9647 69 -10974 -687 10753 635 -10391 -1737 8172 1106
1242 1106 -6198 65 6455 1194 -5079 -1119 5697 1984 -5578 -1594 6763 1685 -7762 -1363 8324
1257 8324 821 -8866 -1595 6754 15 -6229 310 4824 -1559 -5177 1400 6004 -288 -6410 -166
1272 -166 7984 1474 -8090 -1085 9993 2408 -9396 -2332 9173 1815 -8177 -1381 7140 429
1286 429 -7245 -1563 5741 1501 -6129 -2693 5850 2911 -7066 -4085 7577 5260 -6787 -4695 6494
$$ packed form
1185D435n731m052Q284N430j0787p333J1864Q516j1594p449J1284O031j1556o336
1199h994R390O731n824o213L462M393l567m129M948N516o276o564P480O686q758
1214a719n620J0777N553j1581n536J0446M853q778l807P926L674p609n028P372
1228I23O031q136p925Q902R852r578j1043J0287J1440j0118j1026Q654R909p066
1242A106p304O263O390n261o273L960O816l713p562L984Q357n078r447O399R687
1257H324p503r687P271Q349o739o244O539M514o383l618O577M604o292o122O244
1272a66Q150o510r564P005J1078p585j1804P064J1505p358r992O796Q521o711
1286D29p674N682P304m240p630L436Q543k939r977K981J1662k317j2047K092J1189
$$ plain form
1301 6494 4099 -4984 -1473 5707 1274 -4981 -961 4244 645 -3956 -654 4272 586 -6112 -3158
1316 -3158 5639 3359 -6089 -3622 5976 2337 -6834 -1766 7254 2093 -6352 -781 6365 1137 -5462
1331 -5462 -774 6513 2794 -6015 -4591 5195 5450 -4673 -5637 4678 4744 -5761 -5447 4272 3797 -4031
1347 -4031 -2234 3746 935 -4421 -1071 4766 2586 -3240 -2848 3127 3701 -2506 -3157 3924 4116 -4137
1363 -4137 -4570 3578 3325 -4000 -2118 4528 1089 -5900 -2590 4403 2504 -3549 -2634 2821 3196 -2746
1379 -2746 -3991 2884 5565 -1406 -4462 1863 3457 -2603 -1971 4667 2768 -4360 -2853 3344 2120
1394 2120 -3406 -2520 2422 2462 -2570 -4029 1195 4185 -832 -4357 474 3120 -1658 -2675 3652 3740
1410 3740 -2891 -2737 2769 2280 -2623 -1520 2927 2559 -1777 -3396 -96 2843 293 -2767 -179 2303
$$ packed form
1301F494k395r083L511P180m433o255M020N205l599m601L302M926l686o698K954
1316c158Q797k280r448K467R598l639r171N068R020n161q445N571P146n228o599
1331e462M688P287l719q809J424R786K55j0123r64J0315O6j0505L14R719m75p828
1347d031J797N980k811n356L350N837k180n826L92N975N74o207o51P081J92q253
1363d137m33Q148k53p325J882O646l439o989L310O993j899o053R15N455L75n942
1379b746j245O875K681o971l056O325J594o060O32O638j899p128J507O197j224
1394B120n526Q86M942M0n032j459N224K990n017l525M831K646m778j017O327Q8
1410C740o631J54N506m89m903J103M447l68m336j619L300K939k550l060K588K482
$$ plain form
1426 2303 -1653 -3529 1391 3079 -1944 -2373 2561 2397 -2513 -1927 2585 2596 -810 -1963 540 2504
1442 2504 975 -1634 -217 1905 -498 -3072 447 2641 -1477 -2653 1707 2298 -2834 -3255 1733
1457 1733 2663 -1113 -2274 68 1916 892 -1256 -369 2057 1283 -1668 -404 2187 -91 -2242 1044
1473 1044 2566 -1315 -2415 1148 1729 -1530 -2512 -442 631 323 -395 -423 531 533 -1160 -764 1331 393
1491 393 -1194 1217 2868 -732 -2439 1079 2527 -723 -1803 461 989 43 -687 -646 43 402 -810
1508 -810 -1259 344 208 -1578 -434 1835 -76 -2006 595 2779 243 -1555 266 987 197 -98
1524 -98 358 310 697 440 -802 -581 -58 -887 -359 1042 -44 -2319 -402 1878 -13 -1758 -13 1159
1542 1159 -319 -744 241 379 654 927 65 -267 319 69 -129 1116 675 -1467 -969 1145 199 -1810
$$ packed form
1426B303l956j876M920J688n023m29M934j64m910N86M512J1l406j153K503J964
1442B504j529k609J417K122k403k574L519K194m118j176M360N91n132m21M988
1457A733R30l776j161K342J848j024k148Q87K426p74k951J264K591k278k151L286
1473A044J522l881j100L563N81l259r82K070J073l08p18k8R54Kj693L96K095r38
1491C93j587K411J651l600j707L518J448l250j080K264N28r46p30M1O89L59j212
1508h10m49J603j36j786J144K269j911j930K601K184k536j798J821P21p90k95
1524i8M56m8L87k57j242K21N23q29N28J401j086k275J917K280j891j745J745J172
1542A159j478m25R85J38K75K73q62l32N86k50j98J245m41k142M98K114r46k009
$$ plain form
1560 -1810 -121 1475 -191 -1511 -835 -584 -326 923 817 -192 -341 -212 -303 517 921 -262 -485 1402
1578 1402 1078 -1139 -509 1337 477 -994 -317 -229 -522 72 617 -468 -922 -158 -199 -258 113 -285 -412
1597 -412 889 786 -1219 -586 1978 1646 -553 -505 265 -473 -29 1148 692 -232 -154 -418 -762 -641 -319
1616 -319 -457 505 811 -1233 -1764 166 847 -262 83 720 -475 -897 734 914 -18 351 1150 247
1634 247 -721 -699 56 1054 1234 -590 -1590 112 711 -902 -1185 512 380 -914 -91 325 -794 -313
1652 -313 1035 861 -342 -456 279 638 901 139 -614 230 962 -432 -635 864 636 -1174 -826 542
1670 542 -419 -1191 438 989 -794 -1293 -250 530 507 -38 -519 147 914 -169 -1005 561 1411 93
1688 93 84 727 -425 -1485 355 1712 -2 -1213 -250 413 -490 -805 -499 238 680 -504 -1250 75
$$ packed form
1560a810J689J596j666j320O76K51K58J249j06j009j49J29r1Q20M04j183k23J887
1578A402l24k217O30J846q60j471O77Q8k93N94N45j085m54P64m1n9L71l98j27
1597d12J301j03k005O33K564l32k199M8P70p38M44J177m56r24P8k64l44J21L22
1616c19j38R62L06k044n31J930O81j109L45O37j195m22J631J80r32L69P99r03
1634B47r68K2P55R98J80j824j000J702N99j613k83J697j32j294Q23M16j119M81
1652c13J348j74j203j14P35L59K63p62p53Q44P32j394k03J499k28j810L48J368
1670E42r61p72J629N51j783m99J043P80k3n45m81O66P67j083q36J566Q50j318
1688I3rO43j152j060J840J357j714j211R63O63r03l15L06P37M42j184p46J325
$$ plain form
1706 75 927 -345 -474 1307 786 -1135 -232 1539 415 -964 259 1348 218 -1130 -655 285 732
1723 732 -113 -1166 -310 538 -646 -1022 557 496 -1413 -615 1725 949 -1368 -577 1462 693 -809 -300
1741 -300 862 984 171 -375 87 745 -332 -957 237 713 -931 -1017 958 370 -1808 -866 1540 701
1759 701 -1677 -1130 825 927 -105 -309 456 1040 104 -691 443 1105 -406 -967 1404 1463 -1368 -1606
1777 -1606 1071 1005 -1252 -1217 637 424 -908 -852 105 611 -146 -630 312 1039 -387 -999 936 1887 -715
1796 -715 -1118 1424 1708 -1081 -1515 1068 1348 -748 -1154 24 406 -487 -922 51 610 -616 -1490 257
1814 257 1352 -733 -1752 873 2049 -491 -1510 751 1591 -427 -756 797 898 -340 -736 234
1830 234 832 -204 -1027 -149 770 -759 -1789 388 1997 -730 -2262 388 1814 -458 -1423 469
$$ packed form
1706G5Q52j272j29J781n21j921R03J771j124j379J223J089j130j348M75R40M47
1723G32q45j053Q56Q48j184l76J579o1j909P98K340p76k317P91K039p69j502N09
1741c00J162J22q13n46M62O58j077o25J194M76j644q6J975n88k178R42K406q39
1759G01k378N47J955J02j032k04P65N84r36p95J134O62j511n61K371N9k831k38
1777a606K677o6k257L5J854k13j332N6R57N06p57m84R42P27j426o12J935R51k602
1796g15m03K542K84k789m34K583K80k096m06J178L82q93m35R73N59j226q74J747
1814B57J095k085j019K625J176k540j019K261Q40k018l29J553J01j238l96R70
1830B34N98j036q23Q78R19j529j030K177J609k727j532K650J426k272r65J892
$$ plain form
1846 469 1195 -75 -520 840 1224 51 -996 89 1450 15 -1649 -130 2010 308 -2010 -411
1862 -411 1299 -515 -1758 199 1226 -451 -1326 -189 618 -80 -347 460 1069 -77 -1474 146 1996
1879 1996 694 -1477 43 2049 69 -2108 -214 1369 -133 -1363 171 790 -561 -1336 -75
1894 -75 1141 91 -1384 -580 1433 643 -1555 -458 1964 1021 -1343 -190 1670 380 -1012 -43
1910 -43 1191 -103 -1023 20 906 41 -1124 -649 786 383 -1616 -918 1407 743 -1645 -794 1390
1927 1390 686 -897 63 1182 46 -1025 450 1495 409 -917 -326 1003 619 -1316 -1103 1145
1943 1145 919 -1397 -1129 981 474 -1637 -777 1265 413 -1074 -320 835 197 -544 32 1214 1015
1960 1015 -870 -1082 779 1327 -518 -877 934 761 -1155 -973 625 41 -1487 -538 967 43 -1030
$$ packed form
1846D69P26j270m45J360L84j173j047J085J361j435j664J519K140j702k318J599
1862d11J710j814j243J957J027j677q75J137Q07o98k67Q07O09j146j397J620J850
1879A996j302k171J520K006j980k177J894J583j502j230J534O19j351p75J261
1894g5J216j050j475Q04K013p90k198J097K422r43k364J153J860j290j392R69
1910d3J234j294r20J043Q86q65j165M75J435m03j999O98K325o64k388Q51K184
1927A390p04j583R60J119j136j071J475J045j086j326N91J329l84j935K13K248
1943A145k26k316K68K110n07k111Q60K042q52j487P54J155o38p41N76J182j99
1960A015j885k12J861N48j845l59J811j73j916J82J598n84j528R49J505r24j073
$$ plain form
1977 -1030 -589 500 524 -633 -653 694 1120 -285 -900 857 1310 -497 -697 912 764 -731 -465 978
1995 978 169 -1113 -476 796 446 -803 -907 108 630 -473 -1098 265 1054 -409 -1005 537 1015
2012 1015 -479 -544 1129 730 -963 -416 809 827 -418 -515 389 464 -289 -1109 -176 694 -274 -1084 133
2031 133 826 -645 -1022 563 686 -618 -305 832 620 -391 -295 674 796 154 -533 1 658 267 -685
2050 -685 -34 518 -352 -834 317 649 -956 -1077 459 577 -522 -539 293 545 -220 -445 22 753 355
2069 355 -563 -202 753 302 -540 213 785 -423 -900 385 642 -385 -839 62 125 -225 -529 -319 80
2088 80 139 -237 -134 473 180 -393 145 854 72 -420 524 958 -347 -604 483 547 -197 -547 -142 163
2108 163 74 -358 -672 118 -30 -548 -376 491 121 -809 16 726 -12 -489 529 738 26 -284 119 354
$$ packed form
1977a030M41J089K4j157k0J347M26j405o15J757M53j807k00J609j48j495K66J443
1995I78q09j282O37J272l50j249j04J015N22j103o25J363P89j463n96J542M78
2012A015j494o5J673l99j693N47J225J8j245r7R04P5p53q20R33Q70r68q10J217
2031A33O93j471l77J585J23j304L13J137k12j011R6R69J22o42o87N34O57l91r52
2050f85O51N52q70m82J151L32j605j21J536J18j099j7Q32K52p65k25M67P31l98
2069C55r18L61R55m51q42P53N72j208m77J285K57j027m54R01O3l50l04K10L99
2088H0N9l76J03O07k93n73N38P09p82m92R44M34j305k57J087O4p44l50M05L05
2108A63q9m32l14P90j48n18J72Q67l70r30Q25P10p38m77J018K09p12l10M03K35
$$ plain form
2128 354 88 41 -165 124 118 -371 -278 111 -128 -855 -317 522 -21 -831 -181 563 1 -438 197 421 -28
2149 -28 107 201 231 329 32 -233 280 426 -189 -28 594 98 -929 -275 639 33 -781 -156 -32 -253 -391
2170 -391 -89 -208 -84 -80 -34 156 355 -9 -203 531 632 -437 -124 724 243 -495 -102 393 -74 -479 -4
2191 -4 -56 -340 -173 -52 -168 -118 -244 -286 401 544 -446 -380 590 525 -343 -36 672 366 -209 95 226 -184
2213 -184 -149 152 10 -177 -103 -187 -104 48 -484 -651 362 253 -623 -425 443 246 -443 -66 291 46 -31
2234 -31 618 403 -108 -51 61 97 226 -162 -384 130 305 -614 -601 202 138 -586 -279 286 -90 -526 188 289
2256 289 -210 -103 184 458 204 -45 -154 431 580 -55 -388 265 438 -493 -390 313 -103 -747 -54 423
2276 423 -252 -551 30 233 -55 -252 -159 184 524 25 -483 253 608 -75 -250 554 350 -516 14 747
$$ packed form
2128C54k66m7k06K89om89R3L89k39p27N38Q39n43q10O50P44n62m39O35K24m49
2149b8J35R4L0R8k97k65N13J46o15J61O22m96j027O54R14o06q14O25J24k21j38
2170c91L02j19J24MM6J90J99l64j94P34J01j069L13Q48m81p38L93M95m67m05M75
2191dn2k84J67J21j16N0j26m2O87J43r90O6R70o5q68L07P08l06n75L04J31m10
2213a84L5L01j42j87P4q4Q3J52n32j67J013j09q76J98Q68j97o89L77L57k45p7
2234c1O49k15n11N7J12L6J29l88k22N14J75r19J3Q03o4p24L07N65l76m36P14J01
2256B89m99J07K87K74k54k49j09N85J49o35l33O53J73r31J03P03m16o44O93M77
2276D23o75k99N81K03k88j97R3L43L40m99n08P36L55o83j75Q04k04q66N30P33
$$ plain form
2296 747 -39 -686 -106 381 -251 -477 -158 162 33 -247 -522 -53 278 -144 -286 336 431 -379 -139 653
2316 653 230 -614 244 941 12 -413 -38 407 170 -127 -434 26 192 -393 -687 24 236 -565 -383 568
2336 568 387 -628 -308 905 278 -443 119 685 389 -108 -49 256 326 -2 -302 210 335 -366 -604 489
2356 489 329 -908 -540 761 235 -932 -345 658 139 -428 -9 436 165 -73 -228 362 609 -147 -457
2375 -457 443 498 -656 -625 705 643 -801 -658 414 236 -843 -200 378 47 -251 -250 108 217 -90 -323
2395 -323 397 748 -263 -503 769 720 -506 -665 885 662 -657 -356 478 125 -438 -229 157 -5 -425
2414 -425 -498 282 478 -438 -900 560 1067 -463 -846 631 808 -627 -551 737 472 -383 -207 421 271
2433 271 -352 -409 128 373 -552 -977 52 642 -671 -1038 383 916 -684 -889 462 560 -641 -118 781
$$ packed form
2296G47p86o47N80M87o32k26L19L20j29k80k75M69L31m22j42O22R5q10K40P92
2316F53m23q44Q58O97r29m25L75M45k37k97l07M60J66n85k94P11K12q01J82R51
2336E68j81j015L20J213o27p21N62N66k96m97N9L05P0l28l00N12J25p01k38J093
2356D89j60j237L68J301n26j167N87J003n19n67M19M45k71k38j55N90K47p56l10
2375d57R00N5j154L1J330o2j444J43J072j78j079O43N78l31k98JL58J09l07k33
2395c23P20L51j011k40J272m9j226j59J550k23j319L01Q34l53n63K09L86j62m20
2414d25p3P80J96r16m62J460N07j530l83J477J77j435P6J288k65q55J76O28j50
2433B71o23n7N37K45r25m25J029N90j313l67J421N33j600k05J351R8j201N23Q99
$$ plain form
2452 781 556 -267 -235 546 566 -75 -608 373 915 -359 -1123 275 1144 -437 -1117 211 684 -529 -784
2471 -784 362 335 -483 -321 485 465 -137 -505 175 869 26 -746 208 1070 -190 -976 393 863 -572
2490 -572 -742 621 488 -706 -689 355 366 -502 -679 158 747 -58 -899 3 1175 196 -872 181 921
2509 921 -195 -846 528 820 -350 -603 450 604 -631 -691 23 492 -82 -762 -251 648 6 -1185
2527 -1185 -265 993 -56 -877 218 815 -263 -782 656 784 -294 -603 268 549 -30 -503 -205 795
2545 795 248 -1035 -485 660 -62 -1171 -24 855 -167 -893 319 849 -349 -731 357 681 72
2562 72 -529 -52 651 448 -456 -366 735 341 -857 -318 734 -168 -1130 76 813 -501 -1195 44 675
2581 675 -292 -792 -181 434 261 -292 -412 677 520 -481 -235 803 231 -953 129 976 -58 -922
$$ packed form
2452G81k25q23L2P81K0o41n33R81N42j274p64J398Q69j581o80J328M73j213k55
2471g84J146k7q18J62Q06k0o02l68O80O94q43p72R54Q62j260p86J369M70j435
2490e72j70J363j33j194J7J044J1q68j77Q37N89q05q41R02J172r79j068J053P40
2509I21j116o51J374K92j170k53J053J54j235o0P14M69n74o80N11Q99o42j191
2527a185R20J258j049q21J095N97j078n19J438J28j078l09Q71K81n79m73K98J000
2545G95n47j283N50J145p22j109J147Q79j022p26J212N30j198l82J088L24o09
2562G2o01M77P03k03r04R0J101l94j198N39J052r02r62J206P37j314o94J239O31
2581F75r67n00O11O15j73n53j20J089j57j001K46J038n72j184J082Q47j034q64
$$ plain form
2599 -922 218 710 -383 -862 -232 231 183 -405 -237 355 386 -462 -517 632 417 -627 -59 1164 178
2618 178 -987 23 1051 197 -618 -120 532 49 -448 -377 126 457 -255 -598 122 334 -869 -558 859
2637 859 301 -799 -292 914 169 -823 73 742 250 -306 115 306 320 25 -244 211 264 -500 -532 568
2657 568 394 -830 -520 860 205 -1111 -228 618 91 -536 -165 276 191 -62 -52 99 383 -65 -467 448
2677 448 598 -529 -486 804 488 -843 -470 678 214 -691 -441 43 -48 -154 -161 -56 319 -128 -401 129
2697 129 570 -363 -519 812 853 -590 -661 634 425 -493 -217 419 27 -276 -163 0 -42 -107 -218 -96
$$ packed form
2599i22J140M92j093m79O30M63m8n88J68N92L1q48n5J149k15j044N68J223r86
2618A78j165J010J028q54q15M98O52m83m97P1N03L31p12l43P20K12j203L11J417
2637H59n58j100N07J206p45r92Q96O69m92n56M21J91J4k95k69M55N3p64l2J100
2657E68j74j224L10J380o55j316Q83Q46n27o27L71M41q5k53J0J51K84m48m02R15
2677D48J50j127M3J290l16j331L73J148m64r05K50M84r1j06pJ05L75m47k73N30
2697A29M41r33j56J331M1j443p1J295k09r18K76O36l92l03J13J63m2o5j11J22
$$ [...]
8191A20
##END NTUPLES=NMR FID
##END=
