##TITLE=1H ikalashn
5238-N
18.9.2024
##JCAMPDX= 6.0         $$ Bruker NMR JCAMP-DX V2.0
##DATA TYPE= NMR SPECTRUM
##DATA CLASS= NTUPLES
##ORIGIN= UXNMR, Bruker Analytische Messtechnik GmbH
##OWNER= root
$$ TOPSPIN		Version 1.3
$$ 2024-09-18 09:12:24.406 +0400  Irina@DPX200
$$ Compression mode = diff/dup
##.OBSERVE FREQUENCY= 200.131392401
##.OBSERVE NUCLEUS= ^1H
##.ACQUISITION MODE= SIMULTANEOUS
##.ACQUISITION SCHEME= undefined
##.AVERAGES= 64
##.DIGITISER RES= 18
##SPECTROMETER/DATA SYSTEM= spect
##.PULSE SEQUENCE= zg
##.SOLVENT NAME= CDCl3
##.SHIFT REFERENCE= INTERNAL, CDCl3, 1, 17.95386
##AUDIT TRAIL= $$ (NUMBER, WHEN, WHO, WHERE, WHAT)
$$ ##TITLE= Audit trail, TOPSPIN		Version 1.3
$$ ##JCAMPDX= 5.01
$$ ##ORIGIN= Bruker BioSpin GmbH
$$ ##OWNER= Irina
$$ $$ F:/spectra/data/iren/nmr/1H/4/pdata/1/auditp.txt
$$ ##AUDIT TRAIL=  $$ (NUMBER, WHEN, WHO, WHERE, VERSION, WHAT)
(   1,<2024-09-18 09:08:59.437 +0400>,<Irina>,<DPX200>,<TOPSPIN 1.3>,
      <created by zg
	started at 2024-09-18 09:04:46.093 +0400,
	POWCHK disabled, PULCHK disabled
       configuration hash MD5:
       BE 6D 3F 07 2A EA 11 49 91 17 2B D3 AF B3 58 0D
       data hash MD5: 16K
       EE DF 25 76 53 FA 88 7C 7B 16 A7 0E 7A 28 3A 69>)
(   2,<2024-09-18 09:11:49.203 +0400>,<Irina>,<DPX200>,<TOPSPIN 1.3>,
      <Start of raw data processing
       efp BC_mod = 2 LB = 0.02 FT_mod = 6 PKNL = 1 PHC0 = 106.1883 PHC1 = 2.633538 SI = 32K 
       data hash MD5: 32K
       09 2C 65 C1 9E 82 BD 54 78 30 8F EF CD 88 BC 7C>)
(   3,<2024-09-18 09:11:51.859 +0400>,<Irina>,<DPX200>,<TOPSPIN 1.3>,
      <apk 
       data hash MD5: 32K
       02 BB 13 7D D3 92 E2 C9 64 76 3D 94 97 E1 F5 2A>)
(   4,<2024-09-18 09:12:05.703 +0400>,<Irina>,<DPX200>,<TOPSPIN 1.3>,
      <pk fgphup PHC0 = 36.08018 PHC1 = -59.6 
       data hash MD5: 32K
       F4 6D 79 32 E0 38 36 38 D4 ED CA B7 87 36 4A D2>)
(   5,<2024-09-18 09:12:10.515 +0400>,<Irina>,<DPX200>,<TOPSPIN 1.3>,
      <abs n ABSG = 5 
       data hash MD5: 32K
       00 2F 07 50 77 30 9A A3 82 9A 78 51 FE 1F 7F 49>)
$$ ##END=
$$ 
$$ $$ hash MD5
$$ $$ E2 7A D4 9E C0 B0 B5 65 79 3E A4 D2 5F 8A 00 53
##$RELAX= 
##$RELAX= 
##$RELAX= 
##$RELAX= 
##$RELAX= 
##$RELAX= 
##$RELAX= 
##$RELAX= 
##$RELAX= 
$$ Bruker specific parameters
$$ --------------------------
##$DU= <F:/spectra>
##$EXPNO= 4
##$NAME= <1H>
##$PROCNO= 1
##$TYPE= <nmr>
##$USER= <iren>
##$AMP= (0..31)
100 100 100 100 100 100 100 100 100 100 100 100 100 100 100 100 100 100 
100 100 100 100 100 100 100 100 100 100 100 100 100 100 
##$ANAVPT= -1
##$AQSEQ= 0
##$AQ_mod= 1
##$AUNM= <au_zg>
##$AUTOPOS= <>
##$BF1= 200.13
##$BF2= 200.13
##$BF3= 200.13
##$BF4= 200.13
##$BF5= 200.13
##$BF6= 200.13
##$BF7= 200.13
##$BF8= 200.13
##$BYTORDA= 1
##$CFDGTYP= 0
##$CFRGTYP= 5
##$CHEMSTR= <none>
##$CNST= (0..63)
1 1 145 1 1 1 1 1 1 1 1 1 1 1 1 1 1 1 1 1 1 1 1 1 1 1 1 1 1 1 1 1 1 1 
1 1 1 1 1 1 1 1 1 1 1 1 1 1 1 1 1 1 1 1 1 1 1 1 1 1 1 1 1 1 
##$CPDPRG= <>
##$CPDPRG1= <>
##$CPDPRG2= <>
##$CPDPRG3= <>
$$ [...]
##$SW_h= 4401.40845070422
##$TD= 16384
##$TD0= 1
##$TE= 300
##$TE2= 300
##$TE3= 300
##$TEG= 300
##$TL= (0..7)
0 120 120 120 120 120 120 120 
##$TP= (0..7)
150 150 150 150 150 150 150 150 
##$TP07= 0
##$TPNAME0= <>
##$TPNAME1= <>
##$TPNAME2= <>
##$TPNAME3= <>
##$TPNAME4= <>
##$TPNAME5= <>
##$TPNAME6= <>
##$TPNAME7= <>
##$TPOAL= (0..7)
0.5 0.5 0.5 0.5 0.5 0.5 0.5 0.5 
##$TPOFFS= (0..7)
0 0 0 0 0 0 0 0 
##$TUNHIN= 0
##$TUNHOUT= 0
##$TUNXOUT= 0
##$USERA1= <user>
##$USERA2= <user>
##$USERA3= <user>
##$USERA4= <user>
##$USERA5= <user>
##$V9= 5
##$VALIST= <valist>
##$VCLIST= <CCCCCCCCCCCCCCC>
##$VD= 0
##$VDLIST= <DDDDDDDDDDDDDDD>
##$VPLIST= <PPPPPPPPPPPPPPP>
##$VTLIST= <TTTTTTTTTTTTTTT>
##$WBST= 1024
##$WBSW= 25
##$XGAIN= (0..3)
0 0 0 0 
##$XL= 0
##$YL= 0
##$YMAX_a= 4072174
##$YMIN_a= -2246400
##$ZGOPTNS= <>
##$ZL1= 120
##$ZL2= 120
##$ZL3= 120
##$ZL4= 120
##$ABSF1= 17.95386
##$ABSF2= -4.038887
##$ABSG= 5
##$ABSL= 3
##$ALPHA= 0
##$AQORDER= 0
##$ASSFAC= 0
##$ASSFACI= 0
##$ASSFACX= 0
##$ASSWID= 0
##$AUNMP= <proc_1d>
##$AXLEFT= 0
##$AXRIGHT= 0
##$AXTYPE= 0
##$AXUNIT= <>
##$AZFE= 0.1
##$AZFW= 0.1
##$BCFW= 0
##$BC_mod= 2
##$BYTORDP= 0
##$COROFFS= 0
##$CY= 7568.61572265625
##$DATMOD= 1
##$DC= 0
##$DFILT= <>
##$DTYPP= 0
##$F1P= 17.9538593292236
##$F2P= -4.03888763876832
##$FCOR= 0.5
##$FTSIZE= 32768
##$FT_mod= 6
##$GAMMA= 0
##$GB= 0
##$INTBC= 0
##$INTSCL= 1.483618e-010
##$ISEN= 128
##$LB= 0.02
##$LEV0= 0
##$LPBIN= 0
##$MAXI= 945.577
##$MC2= 0
##$MEAN= 0
##$ME_mod= 0
##$MI= -402.1523
##$NCOEF= 0
##$NC_proc= -4
##$NLEV= 6
##$NOISF1= 8.587773
##$NOISF2= 6.764455
##$NSP= 0
##$NTH_PI= 0
##$NZP= 0
##$OFFSET= 17.95386
##$PC= 1
##$PHC0= 88.4967
##$PHC1= 28.71943
##$PH_mod= 1
##$PKNL= yes
##$PPARMOD= 0
##$PPDIAG= 0
##$PPIPTYP= 0
##$PPMPNUM= 100
##$PPRESOL= 1
##$PSCAL= 0
##$PSIGN= 0
##$REVERSE= no
##$SF= 200.13
##$SI= 32768
##$SIGF1= 16.12182
##$SIGF2= -4.496377
##$SINO= 3.521527
##$SIOLD= 32768
##$SREGLST= <1H.CDCl3>
##$SSB= 0
##$STSI= 32768
##$STSR= 0
##$SW_p= 4401.40845070423
##$SYMM= 0
##$S_DEV= 0
##$TDeff= 16384
##$TDoff= 0
##$TI= <>
##$TILT= no
##$TM1= 0
##$TM2= 0
##$TOPLEV= 0
##$USERP1= <user>
##$USERP2= <user>
##$USERP3= <user>
##$USERP4= <user>
##$USERP5= <user>
##$WDW= 1
##$XDIM= 32768
##$YMAX_p= 279365829
##$YMIN_p= -463335
$$ End of Bruker specific parameters
$$ ---------------------------------
##NTUPLES= NMR SPECTRUM
##VAR_NAME=  FREQUENCY,     SPECTRUM/REAL,   SPECTRUM/IMAG
##SYMBOL=    X,             R,               I
##VAR_TYPE=  INDEPENDENT,   DEPENDENT,       DEPENDENT
##VAR_FORM=  AFFN,          ASDF,            ASDF
##VAR_DIM=   32768,         32768,           32768
##UNITS=     HZ,            ARBITRARY UNITS, ARBITRARY UNITS
##FACTOR=    0.134324425510551, 1,           1
##FIRST=     4401.40845070423, -118847,      -1032863
##LAST=      0,             -522209,         -1955578
##MIN=       0,             -463335,         0
##MAX=       4401.40845070423, 279365829,    0
$$ Real data points
##PAGE= N=1
##DATA TABLE= (X++(R..R)), XYDATA
$$ [...]
10729A2278960q7112n2523N745J8925k0853o4083o8866k8322L8191R3039R8466
10718A2211567N2530R77n010L4546O6938N2827K3015M0552J03806J33225Q4519
10707A2799492K7261N2335J35721J71466J24847O9037O9099J14459J76947K47727
10697A3988391K93855K66091J86124J48195J96655K73727L17884L33179L32493
10688A6336594L07184K89448L35489L95089L21046Q8020j20575j51372r6068j38199
10678A7566656k77169l53489k90314j66690q4790q3769j47883j95975j20400N7798
10668A5903975J56246Q1203L027J07415K79886K73376J15909O8266J92821K72054
10658A7454178K04917J72567K87702L62942K12748l9173j60012j42406j34188
$$ y = [12278960, 12191848, 12139325, 12145070, 12163995, 12143142, 12079059, 12010193, 11981871, 12020062, 12113101, 12211567, 12264097, 12265074, 12260064, 12294610, 12361548, 12414375, 12437390, 12477942, 12581748, 12714973, 12799492, 12826753, 12879088, 13014809, 13186275, 13311122, 13380159, 13449258, 13563717, 13740664, 13988391, 14282246, 14548337, 14734461, 14882656, 15079311, 15353038, 15670922, 16004101, 16336594, 16643778, 16933226, 17268715, 17663804, 17984850, 18072870, 17952295, 17800923, 17704855, 17566656, 17289487, 16935998, 16645684, 16478994, 16394204, 16310435, 16162552, 15966577, 15846177, 15903975, 16060221, 16141424, 16144451, 16251866, 16531752, 16805128, 16921037, 16989303, 17182124, 17454178, 17659095, 17831662, 18119364, 18482306, 18695054, 18655881, 18495869, 18353463, 18219275]
10649A8219275j73056j95529k06404k49882k92574k95272l10683l59743l26690
10640A5809442j51757n885o3336k06981j98565n8871j1633r5840j21400j6610
10630A4878564O3621K8518j1607J9611L3251j8745k8292N6758J08199L9744l3707
10619A5135915n734L0267l3031j01076m0241P3446P4831j5601m3377J9606O8037
10608A5163042P3207J01313J40908J04061O407k8687L3298R4778J02688J15008
10598A5906023J58150J68934J28198J11938J48206J53428Q4744L5317Q7144J68173
10588A7150255J58638P1235K5922Q3472J83870K30749J87022J05488Q4923J58915
10578A8440489K28684J79411O5797O8527K29047L59727L03227J60904J38998K58571
$$ y = [18219275, 18046219, 17850690, 17644286, 17394404, 17101830, 16806558, 16495875, 16136132, 15809442, 15657685, 15651800, 15588464, 15381483, 15182918, 15124047, 15112414, 15016574, 14895174, 14878564, 14942185, 14970703, 14959096, 14978707, 15011958, 14993213, 14964921, 15021679, 15129878, 15169622, 15135915, 15130181, 15160448, 15127417, 15026341, 14986100, 15059546, 15134377, 15118776, 15075399, 15095005, 15163042, 15236249, 15337562, 15478470, 15582531, 15588938, 15560251, 15593549, 15688327, 15791015, 15906023, 16064173, 16233107, 16361305, 16473243, 16621449, 16774877, 16859621, 16894938, 16982082, 17150255, 17308893, 17380128, 17406050, 17489522, 17673392, 17904141, 18091163, 18196651, 18281574, 18440489, 18669173, 18848584, 18914381, 18982908, 19211955, 19571682, 19874909, 20035813, 20174811, 20433382]
10568B0433382L64365L66040L17243K77261K43434K29333K76606L60306L93637
10559B3261607L59792L41796L88901M46868M60274M57059M83194N26216N53930
10550B7279637N71553N98008O33011O73708P12046P02491O03504M68667M11947
10541C2654572M53163M91155M71693M77298N82538P21339P93353Q21304Q94151
10532C8360566J011016J089274J087179J019031Q85869O89750M82578L03433J06335
10523D5035031j43966l48061l73711k54280j42246p5138N2695K66159M28264M52082
10513D4896829M51404N82087Q32337J062342J176742J179417J126598J097157
10505E2404913J141009J186544J067581P17432K75378o9828k76846m19506n33884
$$ y = [20433382, 20797747, 21163787, 21481030, 21758291, 22001725, 22231058, 22507664, 22867970, 23261607, 23621399, 23963195, 24352096, 24798964, 25259238, 25716297, 26199491, 26725707, 27279637, 27851190, 28449198, 29082209, 29755917, 30467963, 31170454, 31773958, 32242625, 32654572, 33107735, 33598890, 34070583, 34547881, 35130419, 35851758, 36645111, 37466415, 38360566, 39371582, 40460856, 41548035, 42567066, 43452935, 44142685, 44625263, 44928696, 45035031, 44891065, 44543004, 44169293, 43915013, 43772767, 43697629, 43750324, 44016483, 44444747, 44896829, 45348233, 45930320, 46762657, 47824999, 49001741, 50181158, 51307756, 52404913, 53545922, 54732466, 55800047, 56517479, 56792857, 56723029, 56446183, 56026677, 55492793]
10496E5492793n97433o07535n78487m95084l62118k65060k80773l46669l17401
10487E1642233j51668L7880J25561J00960N6340R1242K15785L17913K71931J19011
10477E2827188O3037K13461M18104M64355L70435L27850M04322M81946M85733
10468E6056431M89759N52306O07757N97304N76884O09607O55153O54710O43838
10459F1443749O92187P87419Q54228Q51078P98917P53909P80659Q95642J011614
10450F8869402J010166R00977Q26200Q63928R17633Q64292P29283O34097O34370
10441G6250348O92110P60076Q13857Q32799Q18596Q13245Q52447R25412J006260
10432H3765150J079866J116698J093234J069507J158244J363396J542775J606985
$$ y = [55492793, 54895360, 54287825, 53709338, 53214254, 52852136, 52587076, 52306303, 51959634, 51642233, 51490565, 51528445, 51654006, 51754966, 51811306, 51902548, 52118333, 52436246, 52708177, 52827188, 52890225, 53103686, 53521790, 53986145, 54356580, 54684430, 55088752, 55570698, 56056431, 56546190, 57098496, 57706253, 58303557, 58880441, 59490048, 60145201, 60799911, 61443749, 62135936, 62923355, 63777583, 64628661, 65427578, 66181487, 66962146, 67857788, 68869402, 69879568, 70780545, 71606745, 72470673, 73388306, 74252598, 74981881, 75615978, 76250348, 76942458, 77702534, 78516391, 79349190, 80167786, 80981031, 81833478, 82758890, 83765150, 84845016, 85961714, 87054948, 88124455, 89282699, 90646095, 92188870, 93795855]
10424I3795855J663349J860028K163407K414810K563998K717580K961652L240534
10416A13381213L420191L394185L121416K626818J984568J275168N68244m4691
10408A29727112m55431o16570n71176l82572r8396K00712M26314O08718Q83669
10399A29722380J280683J649292J890306K119281K462143K822050L028240L104717
10391A48079092L175844L177253K897876K297614J575112R14499L53993q7375
10383A62383908l44893m03848l07251o0144L24774P10900R54273J122430J395703
10374A65775852J764407K052878K239104K482813K803826L017989L063659L101099
10366A86301627L183803L127481K846273K522684K265833J896420J293363O70694
$$ y = [93795855, 95459204, 97319232, 99482639, 101897449, 104461447, 107179027, 110140679, 113381213, 116801404, 120195589, 123317005, 125943823, 127928391, 129203559, 129771803, 129727112, 129271681, 128655111, 128083935, 127701363, 127602967, 127803679, 128229993, 128838711, 129722380, 131003063, 132652355, 134542661, 136661942, 139124085, 141946135, 144974375, 148079092, 151254936, 154432189, 157330065, 159627679, 161202791, 162117290, 162471283, 162383908, 162039015, 161635167, 161327916, 161267772, 161592546, 162303446, 163257719, 164380149, 165775852, 167540259, 169593137, 171832241, 174315054, 177118880, 180136869, 183200528, 186301627, 189485430, 192612911, 195459184, 197981868, 200247701, 202144121, 203437484, 204108178]
10358B04108178K44389j13062n82855j011997j170099j187453j338774j544278
10350A97404049j517402j311927j258009j371655j300584r27051n74068m65721
10342A88677632l89635j01204K91783N95783Q82604J292577J718982J981862K148841
10333A97099225K397025K672151K756566K597295K304892J871152J154351J73679
10325B13026336p96615j494955j894587k117289k258317k357892k443501k518188
10317A97144992k546926k506621k436194k411728k472314k576541k643897k652563
10309A76898208k674032k774077k907506k975576k964037k935661k900907k809045
10301A53957367k671120k561059k468011k288399k017049j802893j735721j712192
$$ y = [204108178, 204352567, 204239505, 203656650, 202644653, 201474554, 200287101, 198948327, 197404049, 195886647, 194574720, 193316711, 191945056, 190644472, 189717421, 189143353, 188677632, 188287997, 188186793, 188478576, 189074359, 189956963, 191249540, 192968522, 194950384, 197099225, 199496250, 202168401, 204924967, 207522262, 209827154, 211698306, 212852657, 213026336, 212229721, 210734766, 208840179, 206722890, 204464573, 202106681, 199663180, 197144992, 194598066, 192091445, 189655251, 187243523, 184771209, 182194668, 179550771, 176898208, 174224176, 171450099, 168542593, 165567017, 162602980, 159667319, 156766412, 153957367, 151286247, 148725188, 146257177, 143968778, 141951729, 140148836, 138413115, 136700923]
10293A36700923j608907j459724j350623j264503j164310j118845j193355j304280
10285A26236376j339358j343127j415345j495195j440411j284226j206297j239387
10277A15473030j204028r86355p06130n21719m04085k14944P3617L46888N05020
10268A12361294N69091O13695O23226M48550n0620q09604j567373k115937k475032
10259A07597290k752705k919072k852106k571769k276074k117290k053603j958842
10251H8095829j789883j603888j476172j440644j471748j504067j491947j441981
10243G5875499j368957j266071j160134j129836j194588j248130j194864j091448
10235F6221471j046473j044084r98104r23824r00560r03312q40621p35088o86981
$$ y = [136700923, 135092016, 133632292, 132281669, 131017166, 129852856, 128734011, 127540656, 126236376, 124897018, 123553891, 122138546, 120643351, 119202940, 117918714, 116712417, 115473030, 114269002, 113282647, 112576517, 112054798, 111650713, 111435769, 111509386, 111856274, 112361294, 112930385, 113544080, 114167306, 114615856, 114565236, 113755632, 112188259, 110072322, 107597290, 104844585, 101925513, 99073407, 96501638, 94225564, 92108274, 90054671, 88095829, 86305946, 84702058, 83225886, 81785242, 80313494, 78809427, 77317480, 75875499, 74506542, 73240471, 72080337, 70950501, 69755913, 68507783, 67312919, 66221471, 65174998, 64130914, 63132810, 62208986, 61308426, 60405114, 59564493, 58829405, 58142424]
10226E8142424o72827n76860m22109l49299l40880k13393M5269J92427J13284
10217E5918036L3787J58777L17351K16903j12378m05672n88716q08089j067092
10208E3662907j146287r58585p23050o52759o64865n65261l83725l25709m40790
10199D7801876n35800m58890l21147l33170n04401o38932o17695n47351n76360
10190D3268130o80066p30711p02363o80382p06726p38556p39550p00344n97846
10181C6991586m54174l90277m69490n38705m21183k25492k09586l46060l37223
10172C3599396j23928k1462j85538l02813q8849K16576K17308n738n1425J45630
10162C3399157K66455J85337J50461L10194M54917L92288K66513L03219M60932
$$ y = [58142424, 57469597, 56892737, 56470628, 56121329, 55780449, 55567056, 55612325, 55804752, 55918036, 55951823, 56110600, 56427951, 56644854, 56532476, 56126804, 55538088, 54729999, 53662907, 52516620, 51558035, 50834985, 50182226, 49517361, 48952100, 48568375, 48242666, 47801876, 47266076, 46807186, 46486039, 46152869, 45648468, 45009536, 44391841, 43844490, 43268130, 42588064, 41857353, 41154990, 40474608, 39767882, 39029326, 38289776, 37589432, 36991586, 36537412, 36147135, 35677645, 35138940, 34717757, 34492265, 34282679, 33936619, 33599396, 33475468, 33454006, 33268468, 32965655, 32876806, 33093382, 33310690, 33304952, 33253527, 33399157, 33665612, 33850949, 34001410, 34311604, 34766521, 35158809, 35425322, 35728541, 36189473]
10153C6189473N33717M44168K59656K5489k68163o10080r51628j228645j374545
10144C3019442j376822j314513j254271j148622r57100p98847q01370q56569p61152
10135B3750176n66533n13931o17722o23391m39452k91666l33038m08067l61027
10126A9595349k90691l13843l41561k90132k62434l15201l04178j80743j64587
10117A7131979l58180m76111k84283l9366j00572l32771l43175j43432q5659k29986
10107A4738444k83038j57379r7487j91605k26762j32468j22905k56830k83482
10098A2986488j04596J7255p9496j77587j06104n8026j90519k74922j02489Q2768
10088A1992772l0244k60614k18406L5308R5691j08624k30967j04923K6435l3122
$$ y = [36189473, 36723190, 37167358, 37427014, 37452503, 37184340, 36574260, 35622632, 34393987, 33019442, 31642620, 30328107, 29073836, 27925214, 26968114, 26169267, 25367897, 24511328, 23750176, 23183643, 22669712, 22051990, 21428599, 20989147, 20697481, 20364443, 19956376, 19595349, 19304658, 18990815, 18649254, 18359122, 18096688, 17781487, 17477309, 17296566, 17131979, 16773799, 16297688, 16013405, 15974039, 15873467, 15540696, 15197521, 15054089, 14968430, 14738444, 14455406, 14298027, 14200540, 14008935, 13782173, 13649705, 13526800, 13269970, 12986488, 12881892, 12899147, 12819651, 12642064, 12535960, 12477934, 12287415, 12012493, 11910004, 11992772, 11962528, 11701914, 11483508, 11518816, 11614507, 11505883, 11274916, 11169993, 11196428, 11163306]
10078A1163306j43840j38743r0950j04131j07167l5253O697o1635j24420o6281
10068A0297583J7912j4291j10364j20898m3126N676j0634l4930n8687j18276j70866
10057I639099j25823j1524K4054p7720j84614j50365k0517K9370o2610j60391
10047H898959j22930j182M5579j0078l6362K6184N3917m7693j53265r4293O1487
10036H620323J00548m946p0050j2994K8408l3499p1856J6301R9474K5575r7085
10025H600199n4627J18398J76566M1449q2509j7872J46675K14754J42312L8012
10015I323357k411L5779J21519J93775J83698R6141L7887R6854K19518K78725
10005A0584842K48037K31424L09292M26574M76598M53814M62992N75465P24443
$$ y = [11163306, 11019466, 10880723, 10789773, 10685642, 10578475, 10543222, 10549919, 10488284, 10363864, 10297583, 10315495, 10301204, 10190840, 10069942, 10026816, 10032492, 10021858, 9986928, 9928241, 9809965, 9639099, 9513276, 9501752, 9525806, 9448086, 9263472, 9113107, 9092590, 9121960, 9059350, 8898959, 8776029, 8774847, 8820426, 8810348, 8773986, 8800170, 8854087, 8806394, 8653129, 8558836, 8620323, 8720871, 8715925, 8645875, 8632881, 8661289, 8627790, 8555934, 8572235, 8671709, 8697284, 8600199, 8545572, 8663970, 8840536, 8881985, 8799476, 8781604, 8928279, 9143033, 9285345, 9323357, 9320946, 9356725, 9478244, 9672019, 9855717, 9951858, 9989745, 10086599, 10306117, 10584842, 10832879, 11064303, 11373595, 11800169, 12276767, 12730581, 13193573, 13769038, 14493481]
9996A4493481P76219O85863N38321M28286L44968K11392N403k15117l99675n54367
9986A6314774o85565p53512p28641o60766o37046o75296p01706o44058n19329
9977A0308855m12522l77907l75455l19258j96800j13854j72721l12594l50288
9968G677456k16784o8267p7370j84916j92387p0731p242j09358k32324k02439
9958F315638p2251j1075m3321o4181n2158p9871j34246j15104k9206m206o8600
9947E641419r7031l7871j1236q3465j25990l6310O5183L0281o6437o9945j9110
9936E189488n0689j17365o1364P1362O7911q8153j69034q0823j5234j06400j93752
9925D445947j04970L8672K2372j08590j35254j7505P1893L1990n4149r4276r8448
$$ y = [14493481, 15269700, 15955563, 16493884, 16922170, 17267138, 17478530, 17483933, 17268816, 16869141, 16314774, 15629209, 14875697, 14147056, 13486290, 12849244, 12173948, 11472242, 10828184, 10308855, 9896333, 9518426, 9142971, 8823713, 8626913, 8513059, 8340338, 8027744, 7677456, 7460672, 7392405, 7315035, 7130119, 6937732, 6867001, 6859759, 6750401, 6518077, 6315638, 6243387, 6232312, 6188991, 6124810, 6072652, 5992781, 5858535, 5743431, 5714225, 5710019, 5641419, 5544388, 5506517, 5495281, 5411816, 5285826, 5249516, 5314699, 5344980, 5278543, 5208598, 5189488, 5138799, 5021434, 4960070, 5031432, 5099343, 5011190, 4842156, 4761333, 4746099, 4639699, 4445947, 4340977, 4379649, 4402021, 4293431, 4158177, 4140672, 4212565, 4244555, 4190406, 4096130, 3997682]
9914C997682r0595n1257J3412M9096L0080j3101m6315n0070p847N4897N9865j5829
9902C930018p4393l7426J5716k3412r3624o0221L8729M2684m6088m9135P8275
9891C721123J48325M2875q9561p3618K5332L7127l6635o0712j091N1687N2630
9880C817482L9541J7756m9891j31345j26795j2561J03790J07679N445r4093r8225
9869C578783k4260K0478k6775q5316l7954P0271O8531o4199j22305J5605J58449
9858C551308P2751j38692j74538J528J14179K1455p7803J011J18729N8470j01288
9847C447110j11934L8756J10455k548j15648o0836N7912N6280l1421l3349N1045
9836C405822L7460j26701k33177j09393J05474J46836K66j06901o3866p504n0187
$$ y = [3997682, 3907087, 3855830, 3869242, 3918338, 3948418, 3935317, 3889002, 3838932, 3831085, 3885982, 3945847, 3930018, 3855625, 3818199, 3833915, 3810503, 3716879, 3656658, 3695387, 3738071, 3691983, 3642848, 3721123, 3869448, 3912323, 3822762, 3749144, 3774476, 3811603, 3774968, 3714256, 3713165, 3764852, 3817482, 3857023, 3874779, 3824888, 3693543, 3566748, 3554187, 3657977, 3765656, 3771101, 3677008, 3578783, 3554523, 3575001, 3548226, 3462910, 3424956, 3495227, 3563758, 3499559, 3377254, 3392859, 3551308, 3624059, 3485367, 3310829, 3312357, 3426536, 3447991, 3370188, 3371199, 3489928, 3548398, 3447110, 3335176, 3373932, 3484387, 3481839, 3366191, 3305355, 3363267, 3419547, 3388126, 3354777, 3405822, 3443282, 3316581, 3083404, 2974011, 3079485, 3226321, 3226587, 3119686, 3055820, 3048316, 2998129]
9825B998129r5842m6031L702n0032r2172K6404J86698J47195n6463j40447j5650
9814B865491Q7723J6776o6752L674J02321L7020j15750j43272l9555K5663J499
9803B774838j4516M228j0585m6390k2587K6313j0177r0624n2702R6083J44519
9792B798400M039j45180j33821l1844K3297M0697P0387N1990n3914j20540l4269
9781B469242Q9109O9735m1941n6282K8894L5504p0966j13848j1155P9544K1093
9770B498929q8185q9975j0995J3865l4941o0167j5874M5976O9548M4016j6734
9759B355463p2296o6234Q56N1492L9693J6999K4316O03r9237j74131j03841M3998
9747B017681R2800K2908j4309L8405N1484n2365j41103p5360O5289J04608K9989
$$ y = [2998129, 2902287, 2856256, 2859958, 2809926, 2717754, 2744158, 2930856, 3078051, 3021588, 2881141, 2865491, 2953214, 2969990, 2903238, 2906912, 3009233, 3046253, 2930503, 2787231, 2747676, 2773339, 2774838, 2760322, 2764550, 2753965, 2707575, 2684988, 2711301, 2701124, 2610500, 2557798, 2653881, 2798400, 2802439, 2657259, 2523438, 2491594, 2514891, 2555588, 2625975, 2677965, 2624051, 2503511, 2469242, 2558351, 2628086, 2586145, 2529863, 2558757, 2594261, 2523295, 2409447, 2398292, 2477836, 2498929, 2410744, 2320769, 2309774, 2323639, 2288698, 2228531, 2212657, 2258633, 2328181, 2372197, 2355463, 2283167, 2216933, 2217789, 2269281, 2308974, 2325973, 2350289, 2350892, 2251655, 2077524, 1973683, 2017681, 2110481, 2133389, 2119080, 2157485, 2208969, 2156604, 2015501, 1940141, 2005430, 2110038, 2140027]
9736B140027k4515n282P956l2308o6607m4951l780J1828J3268J8477J4187N209
9724B033509K9771Q4049R6382K5731o5782q7659l0149M0311N9158Q622p1928r5429
9712B026586m966J24583J35529p198j37911j01214L1884P7151J4914m63R1761
9701B250656J50171N7865q0799q6101L7705J18379N9784m9524q0576k0878M7688
9690B404370O2410K6210k4028n3989m7255j1294K9087N1894N2136L8033J9449
9679B547023N0k0865l5731k3694K4239P5577P9032K7039l1823n6648n7358n3663
9667B473178l2618J3796M7282L5195J5205L9443P2307L0446o9000r7120N255J19615
9655B652984J01284j6276o6784J4891J06607P7228l1864p3231j398P1580M0475
$$ y = [2140027, 2115512, 2110230, 2118186, 2085878, 2019271, 1974320, 1970540, 1982368, 1995636, 2014113, 2028300, 2033509, 2063280, 2147329, 2243711, 2269442, 2203660, 2116001, 2085852, 2126163, 2185321, 2193943, 2122015, 2026586, 2021620, 2146203, 2281732, 2274534, 2136623, 2035409, 2067293, 2144444, 2159358, 2158895, 2250656, 2400827, 2458692, 2377893, 2291792, 2329497, 2447876, 2507660, 2458136, 2377560, 2356682, 2404370, 2466780, 2492990, 2468962, 2414973, 2367718, 2356424, 2385511, 2437405, 2489541, 2527574, 2547023, 2547073, 2526208, 2490477, 2466783, 2491022, 2566599, 2645631, 2672670, 2640847, 2584199, 2526841, 2473178, 2440560, 2454356, 2501638, 2536833, 2552038, 2591481, 2663788, 2694234, 2625234, 2528114, 2533369, 2652984, 2754268, 2737992, 2671208, 2686099, 2792706, 2869934, 2838070, 2764839, 2763441, 2835021, 2875496]
9644B875496m7890o9817l273N1179K8031j5560j3552q476o6672j32665r0483M1221
9632B547539J08017M4905k5665R623P7196M5316n5593q0675P73O7553M0505j4741
9620B764753j3095K6985L8955J3079p567Q697N6136R6693Q3728K4140M161Q1357
9608C178022J66175J19487k4987p2683M8551J63323J07257j9628q831J32558J93103
9597C982347P1883q6602j06026J173Q5894N6299l6567p4261o449Q4140P8020j0709
9585D039142l8732M5386R9314J3570q2722k0108J05906O9279r4628j20480M0557
9574D056484J18656k6399j65742r4352K3746l6140j47778o1595J25747J07060
9564C899687j08734j95796m5663P5130j1162j17997m1169J06253J07803k1832
$$ y = [2875496, 2827606, 2757789, 2754516, 2805695, 2833726, 2818166, 2804614, 2796138, 2729466, 2596801, 2506318, 2547539, 2655556, 2700461, 2674796, 2684419, 2761615, 2806931, 2751338, 2670663, 2671436, 2738989, 2779494, 2764753, 2751658, 2778643, 2817598, 2830677, 2823110, 2831807, 2887943, 2984636, 3068364, 3092504, 3096665, 3178022, 3344197, 3463684, 3438697, 3366014, 3414565, 3577888, 3685145, 3665517, 3656686, 3789244, 3982347, 4054230, 3967628, 3861602, 3862775, 3948669, 4004968, 3968401, 3894140, 3887691, 3971831, 4049851, 4039142, 4000410, 4045796, 4145110, 4158680, 4075958, 4055850, 4161756, 4231035, 4136407, 4015927, 4056484, 4175140, 4148741, 3982999, 3888647, 3912393, 3876253, 3728475, 3666880, 3792627, 3899687, 3790953, 3595157, 3549494, 3624624, 3613462, 3495465, 3454296, 3560549, 3668352, 3646520]
9554C646520j19873j30646r0829M10J16905J34966L909j22852r6069J273R458
9543C353172m0791k0306L9411R416p9731q3075r168l509p3178p0386K8456O7686
9531C117997j2086p2835k9595J6182r770j8471M1773M9996o5632j48938m8257
9520B820364J12429J05312n1699j33219m9215N6330N1299j7477m0973o61M4797
9509B897287M4898k314m8535l6420K1761M4901O397j2306L9423P6180J5561o3256
9497B983577l8991M4448N4467n8m027K9539k2851j35042j24537L2455J13491n710
9485B926761j34303o2027J07217J29758N022n5098J9377P3747Q548p2069n1413
9474B895520K8681O9740O3329M9681K6941j0588j6417L8718R1884O4359j8780
$$ y = [3646520, 3526647, 3396001, 3305172, 3305582, 3422487, 3557453, 3561362, 3438510, 3342441, 3343714, 3353172, 3312381, 3292075, 3331486, 3340902, 3261171, 3178096, 3168928, 3165419, 3092241, 3021855, 3050311, 3117997, 3105911, 3033076, 3003481, 3019663, 3009893, 2991422, 3033195, 3083191, 3017559, 2868621, 2820364, 2932793, 3038105, 2986406, 2853187, 2803972, 2860302, 2911601, 2894124, 2853151, 2852490, 2897287, 2942185, 2939871, 2891336, 2854916, 2876677, 2921578, 2927975, 2915669, 2955092, 3031272, 3046833, 2983577, 2944586, 2989034, 3043501, 3043443, 3039416, 3068955, 3046104, 2911062, 2786525, 2818980, 2932471, 2926761, 2792458, 2730431, 2837648, 2967406, 2972428, 2917330, 2936707, 3010454, 3019002, 2946933, 2895520, 2924201, 2993941, 3057270, 3106951, 3133892, 3123304, 3106887, 3145605, 3237489, 3301848, 3283068]
9463C283068n8834j4317O2245J05543R6663M9347m046j3053M6461J20615J27085
9452C800777P0310M3798Q8676J20943N9792l2737l3011N4420R8535L8555l2534
9441D277524j8690M8585R3700J19121J58274J81112J47524R8556Q7738O9190k8167
9430E234467j53625j94263j56984j46825j76358j59924j04904j22960k07351j95921
9420C615352m2226P0427J2898p5588k7040O5176J2779j30949j50217k1334O3867
9409C393145J8612l4888r072K5525J8019L5116J01314J20700M8903j7274j3022
9398C687078j1170n6513n7009L7209J03206M3547k8461K1553J01578M6842p3977
9387C813883n1508J05547J63308L6585q0641l8326M4936J5205n0507L749J26414
$$ y = [3283068, 3224234, 3209917, 3272162, 3377705, 3474368, 3523715, 3519669, 3506616, 3553077, 3673692, 3800777, 3871087, 3914885, 4003561, 4124504, 4184296, 4151559, 4118548, 4172968, 4271503, 4310058, 4277524, 4258834, 4307419, 4401119, 4520240, 4678514, 4859626, 5007150, 5105706, 5193444, 5262634, 5234467, 5080842, 4886579, 4729595, 4582770, 4406412, 4246488, 4141584, 4018624, 3811273, 3615352, 3573126, 3643553, 3656451, 3580863, 3553823, 3618999, 3631778, 3500829, 3350612, 3329278, 3393145, 3411757, 3376869, 3367797, 3393322, 3411341, 3446457, 3547771, 3668471, 3717374, 3700100, 3687078, 3675908, 3619395, 3562386, 3599595, 3702801, 3746348, 3717887, 3739440, 3841018, 3887860, 3813883, 3762375, 3867922, 4031230, 4067815, 3987174, 3948848, 3993784, 4008989, 3958482, 3962231, 4088645]
9376D088645J36694K5759l3138K9692Q6519M8810J2552P0875J35754Q6951j0580
9365D678533n722Q5193J07243L3149Q460R6789J68072J23981O3962J03719J74595
9354E637974J56532R0255Q2243R7919M6899m070P1794J99565J85358M9485J3594
9343F627548J27701J86510Q9417O12L0798M4034m3060m3537J79569M09702L78286
9332G987580J88997J37336K47336L10819K89003L35158M63141N25911N17433N82848
9322A1585562P23476Q03816Q60112J064049J348416J439095J330705J322600J443465
9313B1921296J285824O75786Q8172P99J52181q5770p83660j399056j582154j552470
9303A8720948j601786j644275j452652j059669p06243n35035m96543m80480m35899
$$ y = [4088645, 4225339, 4251098, 4217960, 4247652, 4334171, 4382981, 4395533, 4466408, 4602162, 4689113, 4678533, 4672811, 4758004, 4865247, 4898396, 4906856, 5003645, 5171717, 5295698, 5359660, 5463379, 5637974, 5794506, 5884761, 5967004, 6064923, 6111822, 6107752, 6179546, 6379111, 6564469, 6613954, 6627548, 6755249, 6941759, 7031176, 7031788, 7062586, 7106620, 7063560, 7020023, 7199592, 7609294, 7987580, 8176577, 8313913, 8561249, 8872068, 9161071, 9496229, 9959370, 10485281, 11002714, 11585562, 12309038, 13112854, 13972966, 15037015, 16385431, 17824526, 19155231, 20477831, 21921296, 23207120, 23882906, 23971078, 23971877, 24124058, 24038288, 23254628, 21855572, 20273418, 18720948, 17119162, 15474887, 14022235, 12962566, 12256323, 11721288, 11224745, 10744265, 10308366]
9294A0308366l98246m33009n23103n48638m47549l27393l06284l24564k68101
9285F731479j95864k41743l47074l28655j94274j36867j98765k07551j01007m4215
9275D735464j22722j81854j14258o1166j42476k05153o8668J45408J76416J0114
9265D171105j33545j31156n8764m570K4136K3350j2110k9470P716K2696n6195
9254C823193j33273o7101Q7814J42244N1987m9410q6501j13005j37166q5355J3715
9243C447142J0626j20567k03298j22244L43Q848n4813o2544j8835j4440m8582
9232B821636m9384j5419k1K828L0139M5282j0910r0449q6811k155N5240L8267
9220B738243N714o101l0054n9284j8018R9321J66490Q5888o1947j16349m0230
$$ y = [10308366, 9910120, 9477111, 8954008, 8405370, 7957821, 7630428, 7324144, 6999580, 6731479, 6535615, 6293872, 5946798, 5618143, 5423869, 5287002, 5088237, 4880686, 4779679, 4735464, 4612742, 4430888, 4316630, 4255464, 4112988, 3907835, 3839167, 3984575, 4160991, 4171105, 4037560, 3906404, 3847640, 3843070, 3867206, 3890556, 3878446, 3848976, 3856692, 3879388, 3823193, 3689920, 3622819, 3710633, 3852877, 3904864, 3855454, 3768953, 3655948, 3518782, 3433427, 3447142, 3457768, 3337201, 3133903, 3011659, 3012002, 3020850, 2966037, 2903493, 2884658, 2870218, 2821636, 2772252, 2756833, 2756812, 2759640, 2789779, 2835061, 2824151, 2733702, 2646891, 2644736, 2699976, 2738243, 2743957, 2737856, 2707802, 2648518, 2630500, 2729821, 2896311, 2982199, 2920252, 2803903, 2763673]
9209B763673N4987O6732J1005k8013p149L5500L4224j8987n5619j8386N1166O5517
9197B954650K3911J2825N6755O6700o092o3366n801R1938Q5093n747j9167Q5170
9185C276869J51895P0758n2484o0940K8412Q2847O4413N3307R0730J18957Q7696
9174C912460L1978J9119O8071J34166J47027P6009j8176l1308N3954J37210J43371
9163D673881J25550J53640J78726J19689K6012J8607R8108J50971J34328J14063
9153E793575J20469J14515J10405J75088K73528K74300J63618R8703J75881K91979
9143G592061L20454K86447K72645K81938K93889L36017M00747M12164L68472L86478
9133A0951312N10825O26585O62334P12400Q45433R87900J128504J395712J753961
$$ y = [2763673, 2818660, 2885392, 2896397, 2868384, 2861235, 2896735, 2930959, 2911972, 2856353, 2837967, 2889133, 2954650, 2978561, 2991386, 3048141, 3114841, 3108749, 3045383, 3039582, 3131520, 3216613, 3210866, 3191699, 3276869, 3428764, 3499522, 3447038, 3386098, 3414510, 3497357, 3561770, 3615077, 3705807, 3824764, 3912460, 3944438, 3963557, 4031628, 4165794, 4312821, 4388830, 4370654, 4339346, 4393300, 4530510, 4673881, 4799431, 4953071, 5131797, 5251486, 5277498, 5296105, 5394213, 5545184, 5679512, 5793575, 5914044, 6028559, 6138964, 6314052, 6587580, 6861880, 7025498, 7124201, 7300082, 7592061, 7912515, 8198962, 8471607, 8753545, 9047434, 9383451, 9784198, 10196362, 10564834, 10951312, 11462137, 12088722, 12751056, 13463456, 14308889, 15296789, 16425293, 17821005, 19574966]
9124A9574966J920430J862492K050895K769135L407763L017365J498522l10251
9116C5791317j716831k732342l449719l572986k956054k091865j576078j403346
9108A6292096j221032r86845r04362r19725p84588n28957m22584m98123n14214
9099I511666l89432k99151l16973l09331k35222k26116l00195k97467j79524j14394
9089F843861j75927k23937j76146j39449j66414j38429j6406M0148m8429j16579
9079E682293l3610O5093J5754r3184q5664R834M6533J9466K8467O7643N2732L3
9067E775390m916K4570N987m5764l5460M6238J08414J00926N8020J9436P665N4451
9055F114957J51461K10236J71842J16674J57476K61214K95497K27083J52325J35634
$$ y = [19574966, 21495396, 23357888, 25408783, 28177918, 31585681, 34603046, 36101568, 35791317, 34074486, 31342144, 27892425, 24319439, 21363385, 19271520, 17695442, 16292096, 15071064, 14084219, 13179857, 12260132, 11475544, 10946587, 10524003, 10025880, 9511666, 9122234, 8823083, 8506110, 8196779, 7961557, 7735441, 7435246, 7137779, 6958255, 6843861, 6667934, 6443997, 6267851, 6128402, 5961988, 5823559, 5807153, 5847301, 5798872, 5682293, 5648683, 5713776, 5729530, 5636346, 5550682, 5560516, 5607049, 5626515, 5654982, 5722625, 5775357, 5775390, 5770474, 5795044, 5801031, 5755267, 5719807, 5766045, 5874459, 5975385, 6033405, 6052841, 6060506, 6114957, 6266418, 6476654, 6648496, 6765170, 6922646, 7183860, 7479357, 7706440, 7858765, 7994399]
9045G994399J31049P7986j4693r9347j44153j50989j55773j89975k15070j54563
9035G078871l3386M125j05602k20330j78390k7460O8061P9488J13661J99893K49310
9024G228241K28311K17449K72245L49741L91709L68785K38802j4156k89391m44478
9014H547258m75921n01052n51613n31293m07321k88793k54529k44965k00673j75374
9004D915724k16636k50500j97050j13472j07385j68450j94725j47979q5241n5108
8994C379178m5605l5165l7177p8526j50227j85544j13583L2334J02955Q080j33329
8983B743391j35660k1034N116j24615k22354j32334L0613O3168l2793r4968n4387
8972B024143J3638M1832K8040k9085j17958j59248q9499J4988K0962o2863r5270
$$ y = [7994399, 8125448, 8203434, 8188741, 8089394, 7945241, 7794252, 7638479, 7448504, 7233434, 7078871, 7045485, 7049610, 6944008, 6723678, 6545288, 6517828, 6585889, 6665377, 6779038, 6978931, 7228241, 7456552, 7674001, 7946246, 8295987, 8687696, 9056481, 9295283, 9281127, 8991736, 8547258, 8071337, 7570285, 7018672, 6487379, 6080058, 5791265, 5536736, 5291771, 5091098, 4915724, 4699088, 4448588, 4251538, 4138066, 4030681, 3862231, 3667506, 3519527, 3434286, 3379178, 3333573, 3298408, 3261231, 3182705, 3032478, 2846934, 2733351, 2765685, 2868640, 2876720, 2743391, 2607731, 2586697, 2591813, 2467198, 2244844, 2112510, 2143123, 2206291, 2173498, 2078530, 2024143, 2037781, 2079613, 2107653, 2078568, 1960610, 1801362, 1711863, 1726851, 1747813, 1684950, 1589680]
8961A589680j9155N5019J6493r5323j53837r2699M0926J32478R2446m7848j43743
8950A374437r9513K879J8702m5842n1145M8371J28361Q3882k6149q6661p8765
8939A268557n0113j6484K2275L0555j1472m7183j6272M3104M4354j5481n1980
8928A199860j6989M3669O3579L0852j9719m5218k0239L5756N9621J8904k4918
8917A325158O016O8652L6073r5609j50447j3059J69572J69665Q394p7157J932
8906A449190O5031j7864r6331K804J58839J37891j1743k9424J15623J60332n861
8895A928487j33198j3398J67870J19979r2204j57208P971J73375J66504O9033
8885B237211Q512k2589o3167p3871k4553K9909L6622J4138j1387m3706n7502r089
$$ y = [1589680, 1570525, 1625544, 1642037, 1546714, 1392877, 1300178, 1341104, 1473582, 1566028, 1518180, 1374437, 1274924, 1277803, 1296505, 1250663, 1199518, 1247889, 1376250, 1460132, 1433983, 1347322, 1268557, 1218444, 1201960, 1224235, 1254790, 1243318, 1196135, 1179863, 1222967, 1267321, 1251840, 1199860, 1182871, 1226540, 1290119, 1320971, 1301252, 1256034, 1235795, 1271551, 1331172, 1350076, 1325158, 1331174, 1399826, 1435899, 1340290, 1189843, 1176784, 1346356, 1516021, 1524415, 1447258, 1449190, 1514221, 1496357, 1400026, 1402830, 1561669, 1699560, 1687817, 1658393, 1774016, 1934348, 1928487, 1795289, 1781891, 1949761, 2069740, 1977536, 1820328, 1828299, 2001674, 2168178, 2237211, 2245723, 2223134, 2159967, 2086096, 2061543, 2091452, 2128074, 2142212, 2130825, 2087119, 2029617, 2020528]
8873B020528O0280M8194m1697q1656k2055K2790l1462r3567n6127J4286j2489
8862A827025j06688j20107k1639N4608J2094p5066q0803n536K9882m8246j57964
8851A307560j55952k9247O9832K2343q6551q7706K1758P9589J0330p1244n4047
8840A026665J2449L5775L2181N5315O9758J5080o7604q5464k9769K9937N0390
8829A144713L6471J169k8219j4972J6134j5208j02088j11515J5090J27585O8777
8818A137937p8022j08323m370N9334j637p6888n9888P997L7774J3802k9938o0255
8806H37523m6378O145K4528l6211q9216k7448Q3040P5628m9283j03511K448J24555
8794H01820J11964J6043k5327J1270N3733N8981K5929l5113p1883j5978R4363
$$ y = [2020528, 2080808, 2129002, 2087305, 2005649, 1983594, 2006384, 1974922, 1881355, 1825228, 1839514, 1827025, 1720337, 1600230, 1578591, 1633199, 1645293, 1570227, 1489424, 1483888, 1513770, 1465524, 1307560, 1151608, 1122361, 1192193, 1214536, 1127985, 1040279, 1062037, 1141626, 1151956, 1080712, 1026665, 1039114, 1074889, 1107070, 1162385, 1232143, 1247223, 1179619, 1094155, 1064386, 1094323, 1144713, 1181184, 1182353, 1154134, 1139162, 1155296, 1140088, 1038000, 926485, 941575, 1069160, 1137937, 1059915, 951592, 947222, 1006556, 1004919, 928031, 868143, 876140, 913914, 927716, 897778, 837523, 791145, 797290, 821818, 785607, 696391, 668943, 751983, 827611, 778328, 674817, 677265, 801820, 913784, 929827, 904500, 915770, 969503, 1028484, 1054413, 1019300, 947417, 931439, 1025802]
8783A025802J18823J6507p0089k5008O4101N6787j9898m4400p721J0356R647M6416
8771A181323P8897J2066j06952j13434K1610J23054O2388o0618q1577j0562J3560
8760A119755n0180r4257l9970M4354M9776j9626p0905o5163m9046m0843J4357
8749G98252J23304J72206P6520o3462q8132j7931o216o5474l9842J03726J71398
8738A164349M5815j01177p1048M8440M9902l5918j0277J23119J41567j9337j39106
8727A196329n4338R7915J12717J4566l8630j8491j5753m2866k2676M7930P5463
8716A352166K5734j8461J0137O7122Q0632O0177N9507P6151O2734K7192M1873
8705A844964J22960J69515R0650m8702j01124m1694R569j5948m4272j7399p861
$$ y = [1025802, 1144625, 1161132, 1091043, 1066035, 1130136, 1186923, 1167025, 1122625, 1114904, 1125260, 1134907, 1181323, 1260220, 1272286, 1165334, 1051900, 1073510, 1196564, 1258952, 1198334, 1116757, 1106195, 1119755, 1069575, 975318, 935348, 979702, 1029478, 1009852, 938947, 873784, 824738, 783895, 798252, 921556, 1093762, 1170282, 1106820, 1018688, 1000757, 994541, 929067, 889225, 992951, 1164349, 1210164, 1108987, 1037939, 1086379, 1136281, 1100363, 1090086, 1213205, 1354772, 1335435, 1196329, 1141991, 1239906, 1352623, 1367189, 1328559, 1310068, 1294315, 1251449, 1228773, 1276703, 1352166, 1377900, 1359439, 1369576, 1436698, 1517330, 1577507, 1637014, 1713165, 1775899, 1803091, 1844964, 1967924, 2137439, 2228089, 2179387, 2078263, 2036569, 2046138, 2030190, 1985918, 1968519, 1960658]
8694A960658p3107j18610n0411L4646j0891j22799j09688K7118Q2404k2054j20233
8683A477033q4331j1569j7967l7511K2132P9371J2957j10143j23229j4501P2248
8672A264490N6866l170l7911l5478O42N2951O0269j3069r4892q7307r052M0775
8660A195114L4531K6466L4295K3105l226l283J6029J7250J9830N8257P5759l124
8648A491003j04554p1618Q1846J55191N3200p5606q0966k7378l8284o4284J8062
8637A336612J62392J98185R3914o20J0583M7034J1401n7277o6852j8893J4394
8626A730873Q435q4N993K917j5252j6538J2854L6282K0276p590M657M6561M3777
8613A873161l4903j09780p9063L9634J16012O8482l5515p5129k8821K2440K2897
$$ y = [1960658, 1887551, 1768941, 1718530, 1753176, 1742285, 1619486, 1509798, 1536916, 1619320, 1597266, 1477033, 1392702, 1381133, 1363166, 1325655, 1347787, 1427158, 1440115, 1329972, 1206743, 1192242, 1264490, 1321356, 1318186, 1280275, 1244797, 1245439, 1298390, 1358659, 1345590, 1250698, 1163391, 1154339, 1195114, 1229645, 1256111, 1290406, 1313511, 1310285, 1307002, 1323031, 1340281, 1360111, 1418368, 1494127, 1491003, 1386449, 1314831, 1396677, 1551868, 1605068, 1529462, 1448496, 1421118, 1382834, 1318550, 1336612, 1499004, 1697189, 1791103, 1790483, 1801066, 1848100, 1859501, 1802224, 1735372, 1716479, 1730873, 1739308, 1739224, 1745217, 1748134, 1732882, 1716344, 1729198, 1765480, 1785756, 1778166, 1782823, 1829384, 1873161, 1838258, 1728478, 1649415, 1689049, 1805061, 1873543, 1838028, 1762899, 1734078, 1756518, 1779415]
8602A779415O855K3274N1538L5696k1258m8146j121O8920P7082J7149k9258m162
8590A955984N0303N9455K5089J2716M3863O5932M0519J90j1723l868L08J2242
8578B251010L9261M3533P845r02P3836J49696R3764n5681r9907L2070J52633Q6538
8566B773696n5946n0999P6928R1136o5267j56467j8301J77046J73491o283j32638
8555B806396j01115k395P6811J28373J23392K5768q8512r2707l448M3208J6148
8544B931919J6295O4297N8057j4488k8160M0932M4756o4001j09356J2792J34258
8533C087301R6017K1646P5576J39696K4492j43725r0622J26735J74412k1986j56838
8522C332704l6517J42055J43631L8658J2564N6797N0578r085m1824l2114k76O3065
$$ y = [1779415, 1786270, 1809544, 1861082, 1896778, 1875520, 1827374, 1826253, 1895173, 1972255, 1989404, 1960146, 1955984, 2006287, 2065742, 2090831, 2103547, 2147410, 2213342, 2253861, 2254051, 2242328, 2238460, 2238768, 2251010, 2290271, 2333804, 2341649, 2340747, 2414583, 2564279, 2658043, 2602362, 2502455, 2534525, 2687158, 2773696, 2717750, 2666751, 2743679, 2834815, 2769548, 2613081, 2594780, 2771826, 2945317, 2939034, 2806396, 2705281, 2702886, 2779697, 2908070, 3031462, 3057230, 2968718, 2876011, 2872563, 2915771, 2931919, 2948214, 3012511, 3070568, 3056080, 3027920, 3068852, 3113608, 3049607, 2940251, 2953043, 3087301, 3183318, 3204964, 3280540, 3420236, 3444728, 3301003, 3210381, 3337116, 3511528, 3489542, 3332704, 3296187, 3438242, 3581873, 3620531, 3633095, 3689892, 3740470, 3731385, 3689561, 3657447, 3657171, 3720236]
8510C720236J18912O8515o4913r4847N2850J83339J18734j6329k679J11784J06777
8499D302379l1817r2428J2740J22248R4005m91k4542L1363Q7364J00005P7344
8488D678170L5505n884k3346j0097K5505P3325J07281R0916L5246Q846M7302J01471
8476E164240J14767Q7832L1675n1160r6029j1739J45182J79810M2044o4524P336
8465E549434J12355P6165Q745R5752K31866J81040L734k6587J07865J51443L8922
8454F530734p54J20436J83381O8114k0715P9541K10364J98245J54901K20239K62946
8443H007432J29366k1482M5465K25285K30026O3411k117J12300J83547P5374n4725
8432H993882k9375Q9576J28687L9973q6215j45987r5131K7286J12707Q4237n044
$$ y = [3720236, 3839148, 3907663, 3842750, 3747903, 3800753, 3984092, 4102826, 4086497, 4083818, 4195602, 4302379, 4270562, 4178134, 4190874, 4313122, 4407127, 4406636, 4382094, 4413457, 4500821, 4600826, 4678170, 4713675, 4707791, 4684445, 4674348, 4699853, 4773178, 4880459, 4971375, 5006621, 5015467, 5062769, 5164240, 5279007, 5366839, 5398514, 5347354, 5251325, 5239586, 5384768, 5564578, 5606622, 5542098, 5549434, 5661789, 5737954, 5746699, 5842451, 6074317, 6255357, 6259091, 6232504, 6340369, 6491812, 6530734, 6529980, 6650416, 6833797, 6901911, 6881196, 6960737, 7171101, 7369346, 7524247, 7744486, 8007432, 8136798, 8115316, 8160781, 8386066, 8616092, 8679503, 8677386, 8789686, 8973233, 9048607, 8993882, 8964507, 9054083, 9182770, 9222743, 9136528, 8990541, 8895410, 8922696, 9035403, 9119640, 9114596]
8421I114596l5545K6428J05765J29150Q9587K2868j6561J5158R2921J37677J30928
8410I812972J37768J71294J50707O7703N1281J53081K20716J39171M5713J07355
8400A1057761K25385K02426R0612R6438K10186K25848J04054J9607L9601M6138
8390A2318056J3163O5776J96559K11574O1864m0577L5900J35867R6896M799K745
8379A3102622M8192L7582M786K5038O3702O8696P4801Q8371K5508j04076j24959
8368A3310263M2710K23017K47312K00725K25075K55807J72910N9120P0732J70973
8358A4978644K20352K23882K63941K95526K42584J96180K73362L74727L37936
8349A7407134K39675K66176L63011L21724J65840J22812K22160K57617J78667
$$ y = [9114596, 9079051, 9105479, 9211244, 9340394, 9429981, 9452849, 9436288, 9451446, 9544367, 9682044, 9812972, 9950740, 10122034, 10272741, 10340444, 10391725, 10544806, 10765522, 10904693, 10950406, 11057761, 11283146, 11485572, 11576184, 11672622, 11882808, 12108656, 12212710, 12232317, 12271918, 12318056, 12331219, 12396995, 12593554, 12805128, 12866992, 12826415, 12862315, 12998182, 13095078, 13099877, 13102622, 13150814, 13188396, 13193182, 13218220, 13281922, 13350618, 13425419, 13513790, 13539298, 13435222, 13310263, 13352973, 13575990, 13823302, 14024027, 14249102, 14504909, 14677819, 14736939, 14807671, 14978644, 15198996, 15422878, 15686819, 15982345, 16224929, 16421109, 16694471, 17069198, 17407134, 17646809, 17912985, 18275996, 18597720, 18763560, 18886372, 19108532, 19366149, 19544816]
8340A9544816J79939L24269M05094L08599K16058K89211M13404M27939L91289
8331B2500618M37323N50224O49624P39946Q27012Q42218P88852Q06267R52787
8322B9094871J088373J112832J145588J306543J490478J549515J552125J658542
8314C9998867J856006K010030K075146K075353J980399J775949J544513J303427
8306E4619690Q98283K59292l80057p62749r76698j268197j601422j729280j638905
8297D7419957j569994j587780j499327j260283j110771j168635j201897r99919
8289C7021351p17161o23782p00687p09880n46755l21742j68233j26389j55186
8280C2951536j45783M39K19229L18773K56547K35363M01222O07725O56249O24268
$$ y = [19544816, 19724755, 20049024, 20454118, 20762717, 20978775, 21267986, 21681390, 22109329, 22500618, 22937941, 23488165, 24137789, 24877735, 25704747, 26546965, 27335817, 28142084, 29094871, 30183244, 31296076, 32441664, 33748207, 35238685, 36788200, 38340325, 39998867, 41854873, 43864903, 45940049, 48015402, 49995801, 51771750, 53316263, 54619690, 55517973, 55777265, 55397208, 54634459, 53657761, 52389564, 50788142, 49058862, 47419957, 45849963, 44262183, 42762856, 41502573, 40391802, 39223167, 38021270, 37021351, 36304190, 35680408, 34979721, 34269841, 33723086, 33401344, 33233111, 33106722, 32951536, 32805753, 32806192, 33025421, 33344194, 33600741, 33836104, 34237326, 34845051, 35501300, 36125568]
8270C6125568P29636R66550J127030J147317J188092J352491J539890J634432
8262D5811006J663956J699318J723451J662755J458876J084700N80371P2936l47063
8253E5410306p53729j255970j756813k021138k006970j937437j977637k026363
8245D1674249j930788j734755j574057j463833j345283j236629j178707j111607
8237C0098590r60819p83692o84368o43624n82332n33533n83588o85626p09510
8228B3931498o52390o17809o03259n11512l77819l58782m46808m30779k40233
8219A9692107j01781j98623l70919l55194j74277o2754r7248j36138r3875n6269
8209A8045029j03482j90610k40010k27977j64393r2298r5560j94424k65284j97531
$$ y = [36125568, 36855204, 37821754, 38948784, 40096101, 41284193, 42636684, 44176574, 45811006, 47474962, 49174280, 50897731, 52560486, 54019362, 55104062, 55684433, 55757369, 55410306, 54656577, 53400607, 51643794, 49622656, 47615686, 45678249, 43700612, 41674249, 39743461, 38008706, 36434649, 34970816, 33625533, 32388904, 31210197, 30098590, 29137771, 28354079, 27669711, 27026087, 26443755, 25910222, 25326634, 24641008, 23931498, 23279108, 22661299, 22058040, 21546528, 21168709, 20809927, 20363119, 19932340, 19692107, 19590326, 19391703, 19020784, 18665590, 18491313, 18428559, 18331311, 18195173, 18101298, 18045029, 17941547, 17750937, 17510927, 17282950, 17118557, 17026259, 16930699, 16736275, 16470991, 16273460]
8199A6273460q6589j02285k03986k00537q5956o1458j72494j95017j0324J55983
8189A5310797O1829j78728k72504j58015j3470M6549N4852L2621l5523r3354o8981
8178A4686073j7537l6379p3693r021J06635J01674k9074j03793m2883L3197L7060
8167A4652259L3513O1261M4533k5940k1423J00552J79720R1300n7742j03821m9065
8156A4905147K6200J18248K11283J87843J6784j02196M968J93264J94782K7931
8146A5784254m6965N4794J40290P8651j3546m042N5685P1268P0953J08329J33834
8135A6433505Q6793J9992K2580Q6747J38445J44532J22092R5221R4330J42136
8125A7386373K01820K02557J45553J09114J25034J43634J48308J89547K59829
$$ y = [16273460, 16186871, 16084586, 15880600, 15680063, 15594107, 15532649, 15360155, 15165138, 15154814, 15310797, 15372626, 15193898, 14921394, 14763379, 14749909, 14796458, 14851310, 14883931, 14848408, 14755054, 14686073, 14668536, 14632157, 14558464, 14549443, 14656078, 14757752, 14728678, 14624885, 14582002, 14615199, 14652259, 14685772, 14747033, 14791566, 14765626, 14744203, 14844755, 15024475, 15115775, 15058033, 14954212, 14905147, 14931347, 15049595, 15260878, 15448721, 15465505, 15363309, 15368277, 15561541, 15756323, 15784254, 15737289, 15792083, 15932373, 16011024, 15997478, 15993436, 16049121, 16120389, 16191342, 16299671, 16433505, 16520298, 16540290, 16562870, 16649617, 16788062, 16932594, 17054686, 17149907, 17244237, 17386373, 17588193, 17790750, 17936303, 18045417, 18170451, 18314085, 18462393, 18651940, 18911769]
8116A8911769K62124J74356J19583J79963K60180K46786J90715J98685K41223
8107B0785384K22029J65965J75879K46751K80094K56290K41728K41998J99598
8098B2815716J35548J45795K42544L30064L50799L32083K86979K06619J56076
8089B5002223K24330L57450L99598L31398K98299L56471L79822L01085K49965
8080B7900641L24702M06953L69878L15261M02422N57037N75058M51723L81150
8071C1684825M47221N27747N24300M95203N11091N37827N26198M93887M61835
8062C6210134M11543L49412L20801L28474L27316L19271L54831M24228M54667
8053C9500677M34429M28023M51733M56643M51561N00929N73599N54655M56421
$$ y = [18911769, 19173893, 19348249, 19467832, 19647795, 19907975, 20154761, 20345476, 20544161, 20785384, 21007413, 21173378, 21349257, 21596008, 21876102, 22132392, 22374120, 22616118, 22815716, 22951264, 23097059, 23339603, 23669667, 24020466, 24352549, 24639528, 24846147, 25002223, 25226553, 25584003, 25983601, 26314999, 26613298, 26969769, 27349591, 27650676, 27900641, 28225343, 28632296, 29002174, 29317435, 29719857, 30276894, 30851952, 31303675, 31684825, 32132046, 32659793, 33184093, 33679296, 34190387, 34728214, 35254412, 35748299, 36210134, 36621677, 36971089, 37291890, 37620364, 37947680, 38266951, 38621782, 39046010, 39500677, 39935106, 40363129, 40814862, 41271505, 41723066, 42223995, 42797594, 43352249, 43808670]
8044D3808670M44573N79088P06616P10666O86210P33352P62186O80978O13398
8035D9725737P09474Q67359Q84003P92533P94393R09402R60953R02041Q91427
8026E7437322J005018J112068J110627J076762J094167J120148J112392J122852
8018F6191356J171074J175598J108570J081085J176852J322953J416634J467802
8010G6111924J535201J630823J756211J923968K097777K242409K454995K851056
8002I2604364L268327L334275K961122K534763K428964K556032K624659K625729
7994A14938235K762688L055791L354686L667463M143159M745180N258696N651664
7986A47577562O140536O838435P597689Q278289Q929466R592174J0107785J0221708
$$ y = [43808670, 44253243, 44832331, 45538947, 46249613, 46935823, 47669175, 48431361, 49112339, 49725737, 50435211, 51302570, 52186573, 52979106, 53773499, 54682901, 55643854, 56545895, 57437322, 58442340, 59554408, 60665035, 61741797, 62835964, 63956112, 65068504, 66191356, 67362430, 68538028, 69646598, 70727683, 71904535, 73227488, 74644122, 76111924, 77647125, 79277948, 81034159, 82958127, 85055904, 87298313, 89753308, 92604364, 95872691, 99206966, 102168088, 104702851, 107131815, 109687847, 112312506, 114938235, 117700923, 120756714, 124111400, 127778863, 131922022, 136667202, 141925898, 147577562, 153718098, 160556533, 168154222, 176432511, 185361977, 194954151, 205061936, 215283644]
7978B15283644R727678Q463221O363607L625166O70082k127952m559149o417208
7970B31029089p461061p653849p268344o631429n884630n065873m258932l539895
7962A83265076k888927k249950j597410r19931k54447K78740O41226J031046J630053
7953A78935476K257357K636037K985248L829071N065343N814267N585640N085279
7945B12193718N282552O030270O292994N573004M398568L410349K688035K171508
7937B48040998K100732K650095L536480M346792M943194N219688M759209L162035
7929B78759223O06606k253746m912973p277512r350401j0920624j1669990j1503838
7921B21476745j0722402r840234r171633q604397p874168p002447o263730n746275
$$ y = [215283644, 225011322, 233474543, 239838150, 243463316, 244133398, 242005446, 237446297, 231029089, 223568028, 215914179, 208645835, 202014406, 196129776, 191063903, 186804971, 183265076, 180376149, 178126199, 176528789, 175608858, 175354411, 175633151, 176274377, 177305423, 178935476, 181192833, 183828870, 186814118, 190643189, 195708532, 201522799, 207108439, 212193718, 217476270, 223506540, 229799534, 235372538, 239771106, 243181455, 245869490, 248040998, 250141730, 252791825, 256328305, 260675097, 265618291, 270837979, 275597188, 278759223, 279365829, 277112083, 272199110, 264921598, 255571197, 244650573, 232980583, 221476745, 210754343, 200914109, 191742476, 183138079, 175263911, 168261464, 161997734, 156251459]
7913A56251459n239454m633139m121558l846050l619485l239799k842210k665590
7905A26044174k648891k548571k325881k132110k006346j863574j706308j583955
7897A09228538j419150j148967r61162j080778j372855j497420j446246j546131
7889I8755829j867210k025172j747100j294410j072604j076596j011018p90503
7881H7871216o13811o05462o53164o19982n27125m79352n26798o36962p33337
7872H2475223p49328o88728o20935n83034n24637l92656k25450j08137o8179o2451
7862G8451688l8478K6275J12620J64217J48119J24929J93201L41849M38661M07276
7852H0370357L34224L41120M23255M87623M96840N00673N56313O72180Q02422
$$ y = [156251459, 151012005, 146378866, 142257308, 138411258, 134791773, 131551974, 128709764, 126044174, 123395283, 120846712, 118520831, 116388721, 114382375, 112518801, 110812493, 109228538, 107809388, 106660421, 105699259, 104618481, 103245626, 101748206, 100301960, 98755829, 96888619, 94863447, 93116347, 91821937, 90749333, 89672737, 88661719, 87871216, 87257405, 86651943, 85998779, 85378797, 84851672, 84372320, 83845522, 83208560, 82475223, 81725895, 81037167, 80416232, 79833198, 79308561, 78915905, 78690455, 78582318, 78514139, 78451688, 78413210, 78439485, 78552105, 78716322, 78864441, 78989370, 79182571, 79524420, 79963081, 80370357, 80704581, 81045701, 81468956, 81956579, 82453419, 82954092, 83510405, 84182585, 84985007]
7843H4985007Q61048P84133O14769M80359M51423M71709M55176L89689L13222
7834H9806535K58045K56594L29978M32690M87808N10049N91465P21297P52026
7825I4146487O26382M99396N10927N68378N24804M65579N98404R03915J133221
7816I9977493J179149J229167J461111J769571J934371J944638J995742K206830
7808A13698072K486428K697781K848071L044985L317625L574127L755515L949211
7800A39371815M271173M680073N021757N253749N489578N778430N987769O000720
7792A81855064N895008N780833N564983N055561M240608L271570K197945R27043
7784B14788615n25722j939095l105952l998584m651347n036541n156660n130018
$$ y = [84985007, 85846055, 86630188, 87244957, 87725316, 88176739, 88648448, 89103624, 89493313, 89806535, 90064580, 90321174, 90651152, 91083842, 91571650, 92081699, 92673164, 93394461, 94146487, 94772869, 95272265, 95783192, 96351570, 96876374, 97341953, 97940357, 98844272, 99977493, 101156642, 102385809, 103846920, 105616491, 107550862, 109495500, 111491242, 113698072, 116184500, 118882281, 121730352, 124775337, 128092962, 131667089, 135422604, 139371815, 143642988, 148323061, 153344818, 158598567, 164088145, 169866575, 175854344, 181855064, 187750072, 193530905, 199095888, 204151449, 208392057, 211663627, 213861572, 214788615, 214262893, 212323798, 209217846, 205219262, 200567915, 195531374, 190374714, 185244696]
7776A85244696n062122m915057m610778m195268l795649l461913l145302k803490
7768A53255117k448702k109481j801278j519215j229948r04148n76294l16779
7760A42349272j21328J00592L94087O97295R57399J218884J530924J854131K143153
7751A51124409K443985K810474L186374L476015L686008L890301M085130M177802
7743A78880498M094828L807620L276680K469821J424986K14209j123721k521122
7735A90523799l796326m765619n432003n929211o277958o355636o146590n853160
7727A45967296n654715n484746n180222m763878m422544m239416m103319l903605
7719A08214851l681953l528540l426011l289441l110146k957978k847424k699142
$$ y = [185244696, 180182574, 175267517, 170656739, 166461471, 162665822, 159203909, 156058607, 153255117, 150806415, 148696934, 146895656, 145376441, 144146493, 143242345, 142666051, 142349272, 142227944, 142328536, 142722623, 143419918, 144377317, 145596201, 147127125, 148981256, 151124409, 153568394, 156378868, 159565242, 163041257, 166727265, 170617566, 174702696, 178880498, 182975326, 186782946, 190059626, 192529447, 193954433, 194168642, 193044921, 190523799, 186727473, 181961854, 176529851, 170600640, 164322682, 157967046, 151820456, 145967296, 140312581, 134827835, 129647613, 124883735, 120461191, 116221775, 112118456, 108214851, 104532898, 101004358, 97578347, 94288906, 91178760, 88220782, 85373358, 82674216]
7711H2674216k469491k238618k101816k025125j898316j710789j572092j539284
7703F7118685j522545j416098j246701j120296j073044j051563j009771r52400
7695E7726267q96940q52398q28754q26961q35875q63394r24390r65526q80794
7686D9851235o71985n09786n26719o21057o05229m90890m48494n06419n02702
7677D4967954l77147k99539m03344n72859o38860o38266p04226q07834q12953
7668C9712926p32017p14232p78650p65221o08833m79887n38353o78607o69114
7659C3748012m84616l43425m04334n56024n76393m24993k78866k90503m05711
7650B9983147m65178m18871l57449l54561l72693l48808k95401k66374k73517
$$ y = [82674216, 80204725, 77966107, 75864291, 73839166, 71940850, 70230061, 68657969, 67118685, 65596140, 64180042, 62933341, 61813045, 60740001, 59688438, 58678667, 57726267, 56829327, 55976929, 55148175, 54321214, 53485339, 52621945, 51697555, 50732029, 49851235, 49179250, 48669464, 48142745, 47521688, 46916459, 46425569, 45977075, 45470656, 44967954, 44590807, 44291268, 43887924, 43315065, 42676205, 42037939, 41333713, 40525879, 39712926, 38980909, 38266677, 37488027, 36722806, 36113973, 35634086, 35095733, 34417126, 33748012, 33263396, 32919971, 32515637, 31959613, 31383220, 30958227, 30679361, 30388858, 29983147, 29517969, 29099098, 28741649, 28387088, 28014395, 27665587, 27370186, 27103812, 26830295]
7641B6830295k89597k98936k97081k73199k41441k54343l24489l64063k81811
7632B4205335j31140p3887j73329l00319k96221j75043r1700j29518k02896j99857
7622B2431425j49895j68583k59536k82272j60773k4931m5067j87651k65743k09192
7612B0677782j35920j36375j45744r7697n8301r8144j49822j23965p5071j08248
7602A9548495j90611k07961j59854j39450j50304j10249l0176j9541r4339j38759
7592A8307251r3997l8806l9548n9857o6086q4813j06506p3604j6808m9743j63520
7581A7513963j95017q8233r179p9054j71614j36611n8305r1213j77557j59414
7571A6347766p0210o6926j38951j42095q6288j19691k24940k08775m2215N8480
$$ y = [26830295, 26540698, 26241762, 25944681, 25671482, 25430041, 25175698, 24851209, 24487146, 24205335, 24074195, 24000308, 23826979, 23526660, 23230439, 23055396, 22963696, 22834178, 22631282, 22431425, 22281530, 22112947, 21853411, 21571139, 21410366, 21385435, 21340368, 21152717, 20886974, 20677782, 20541862, 20405487, 20259743, 20162046, 20103745, 20005601, 19855779, 19731814, 19656743, 19548495, 19357884, 19149923, 18990069, 18850619, 18700315, 18590066, 18559890, 18540349, 18446010, 18307251, 18213254, 18174448, 18134900, 18075043, 18008957, 17924144, 17817638, 17744034, 17727226, 17677483, 17513963, 17318946, 17230713, 17221534, 17142480, 16970866, 16834255, 16775950, 16684737, 16507180, 16347766, 16277556, 16210630, 16071679, 15929584, 15843296, 15723605, 15498665, 15289890, 15247675, 15306155]
7561A5306155k0598j14983p6804j1373n7319j32921r5503M9K670q4513j41542
7550A4573318j34990j15920r0830n1872n8451j32526j55572l7153R7897P6621
7540A3970522m5705q3831l0205k8648q2726n4032M7534M6356q2017j49493r0854
7529A3416901q3474k04982k47518o7078J24516O6895j34946j85823o4496j2062
7519A2607933j12712j85031j08491M835K9368K090l306l095j6781R2N0081M7669
7507A2312652l5544r3586m3126M2104M6980j8863o5714o8397p1304r3163j10837
7496A1801202j11642r9770p5797n4116o5013j00541j04824o0668l2233o9036j20226
7485A0907336j07829m1665O999J2625N666j688k7498o2442o5138k7451K946j2116
$$ y = [15306155, 15285557, 15170574, 15093770, 15082397, 15025078, 14892157, 14796654, 14796703, 14799373, 14714860, 14573318, 14438328, 14322408, 14231578, 14179706, 14121255, 13988729, 13833157, 13796004, 13893901, 13970522, 13924817, 13840986, 13810781, 13782133, 13699407, 13645375, 13692909, 13739265, 13657248, 13507755, 13416901, 13333427, 13128445, 12880927, 12813849, 12938365, 13005260, 12870314, 12684491, 12619995, 12607933, 12495221, 12310190, 12201699, 12206534, 12235902, 12237992, 12234686, 12231591, 12214810, 12214902, 12264983, 12312652, 12277108, 12183522, 12140396, 12182500, 12229480, 12210617, 12144903, 12076506, 12005202, 11912039, 11801202, 11689560, 11589790, 11513993, 11459877, 11394864, 11294323, 11189499, 11128831, 11096598, 11027562, 10907336, 10799507, 10757842, 10764841, 10777466, 10783132, 10781444, 10753946, 10691504, 10626366, 10598915, 10601861, 10589745]
7473A0589745m1330j9875N4104R0752J6450j00484j08467J2769R3432J2345j05173
7462A0494268o9737P0183J03428l197o9403j8787J9373j4190K020R3386P7506
7451A0684850r9829j91005m0253J11991J3132j57500r6918P5424K7587j65296
7441A0162183j27242J29685J78817p9410k12062J0682K12665N9609j71334q7137
7431A0076456J50372J41870n0794n9420J15398J33812m8560j10390M4097J22153
7421A0514994k2635j41703m8572O6196j135j10087l8906J33062J65680K6042j08165
7410A0434771j15669l1588M7990M9679j7624l8858O0250J40214J4654k00005j78720
7399A0165094R6309K43459O5086j24405j3806J92240J41261n6011l5581J70691
$$ y = [10589745, 10548415, 10528540, 10582644, 10673396, 10689846, 10589362, 10480895, 10493664, 10587096, 10599441, 10494268, 10424531, 10494714, 10598142, 10594945, 10525542, 10506755, 10526128, 10511938, 10513958, 10607344, 10684850, 10585021, 10394016, 10353763, 10465754, 10478886, 10321386, 10224468, 10299892, 10327479, 10162183, 10034941, 10164626, 10343443, 10264033, 10051971, 10062653, 10275318, 10334927, 10163593, 10076456, 10226828, 10368698, 10317904, 10258484, 10373882, 10507694, 10459134, 10348744, 10392841, 10514994, 10492359, 10350656, 10302084, 10368280, 10367145, 10257058, 10218152, 10351214, 10516894, 10542936, 10434771, 10319102, 10287514, 10335504, 10385183, 10367559, 10328701, 10388951, 10529165, 10543819, 10343814, 10165094, 10261403, 10504862, 10569948, 10445543, 10431737, 10623977, 10765238, 10709227, 10673646, 10844337]
7389A0844337J99489R386m8084J39492K46388R5080k6504J15374K70906J33000
7379A1978864j26674j42308M3415Q4965p2264j36489n031N5000j27736l24867
7369A1226875k64960m9530K1360j07947k20277j80642r6165r9476j51376j42337
7359I935525p6810m6174o7528o2357j095L2504k5640r9046p3311K0336L9078m9780
7347I525702j05222k3655R8525J08470J8741l7035j9500j2680m6481l6757N6879
7336I526987J37624J09084J6964k9428j4295p319l7631o2374m9441k1110j1573
7325I557488k9070o0497p9497o1388k2498k0466p4772j20052r6182n0015o6655
7314H876396j24129j21189m9274j6300o7723j10034p9713o4982j49515k37141
$$ y = [10844337, 11043826, 11053212, 11005128, 11144620, 11391008, 11486088, 11459584, 11574958, 11845864, 11978864, 11852190, 11709882, 11753297, 11838262, 11765998, 11629509, 11624478, 11679478, 11551742, 11226875, 10961915, 10912385, 10933745, 10825798, 10605521, 10424879, 10328714, 10229238, 10077862, 9935525, 9858715, 9812541, 9745013, 9682656, 9681561, 9714065, 9688425, 9589379, 9516068, 9536404, 9575482, 9525702, 9420480, 9396825, 9495350, 9603820, 9622561, 9585526, 9566026, 9553346, 9506865, 9470108, 9526987, 9664611, 9773695, 9790659, 9761231, 9746936, 9739617, 9701986, 9639612, 9590171, 9569061, 9557488, 9528418, 9467921, 9388424, 9327036, 9304538, 9284072, 9209300, 9089248, 8993066, 8943051, 8876396, 8752267, 8631078, 8581804, 8565504, 8497781, 8387747, 8308034, 8243052, 8093537, 7856396]
7304G856396j80334k2424N1956j3910r4231j00508q4758q6080n0842J5898r100
7293G282063j52589k24872q2662J08298Q0757j35222k52727j52901k5585l4471
7283F410089q0648k6910M2340k3500j55503j54987j6816N3729l9040j39674r0210
7272E778870L7407P0009j1140p6175n7404k3201m2660q6449r4515o5065l5912
7261E393765l1255o0779j19928j56601r7702L7691J09858K0714j37473j88216
7251D770074r9965m388M292l2980n8468q2895j05851p8658j6748k3723j12490
7240D158200j32843l271J12173L0772j46230j70126k7173N1823l9020j42114j17638
7229C574553l8702j2751n011L8519N5581j0782q5918q6414n5221n6985n4986j3083
$$ y = [7856396, 7676062, 7653638, 7705594, 7691684, 7597453, 7496945, 7412187, 7326107, 7275265, 7291163, 7282063, 7129474, 6904602, 6821940, 6930238, 7010995, 6875773, 6623046, 6470145, 6444560, 6410089, 6329441, 6302531, 6344871, 6321371, 6165868, 6010881, 5994065, 6047794, 6008754, 5869080, 5778870, 5816277, 5886286, 5875146, 5798971, 5741567, 5718366, 5675706, 5589257, 5494742, 5429677, 5393765, 5362510, 5301731, 5181803, 5025202, 4927500, 4965191, 5075049, 5095763, 4958290, 4770074, 4670109, 4665721, 4670013, 4637033, 4578565, 4495670, 4389819, 4311161, 4294413, 4270690, 4158200, 4025357, 4022086, 4134259, 4165031, 4018801, 3848675, 3821502, 3873325, 3834305, 3692191, 3574553, 3535851, 3523100, 3518089, 3556608, 3612189, 3601407, 3515489, 3429075, 3373854, 3316869, 3261883, 3248800]
7217C248800L7n7471q2921O836J04006O8330m1260p1808k7737k6569p2608p4391
7205B973244l7643m1264o2022k4916J3010n1367j32501n4862J23772J58499J3502
7194B877452p2385J3184P8588k4051j46423j12301l113K3326j729J3457N182r8628
7182B552559j63984m0070J42719J29722o2502j70077q5560J4711j9404r9068p6459
7171B122587K7854Q0104K3629o6460q2606o668O0577J9467p3779o3118O0316J07806
7159B209709j5319j27678m4972J10285R4310o8619j41597o2862k207l6851m6527
7148A867672K7536P3700K8881k0230k7379o2590j25088r9252J9826P7375K5325
7137A785776O256O8818N4629q8993j49857p37J43730O5876q4229m9159Q8832N7516
$$ y = [3248800, 3248837, 3191366, 3108445, 3115281, 3219287, 3287617, 3246357, 3174549, 3146812, 3120243, 3047635, 2973244, 2935601, 2894337, 2832315, 2807399, 2820409, 2769042, 2636541, 2581679, 2705451, 2863950, 2877452, 2805067, 2818251, 2896839, 2872788, 2726365, 2614064, 2610951, 2634277, 2632548, 2646005, 2651187, 2552559, 2388575, 2348505, 2491224, 2620946, 2558444, 2388367, 2302807, 2317518, 2298114, 2199046, 2122587, 2150441, 2230545, 2254174, 2187714, 2105108, 2098440, 2159017, 2178484, 2104705, 2041587, 2101903, 2209709, 2194390, 2066712, 2021740, 2132025, 2226335, 2157716, 2016119, 1953257, 1951050, 1914199, 1867672, 1895208, 1968908, 1997789, 1977559, 1950180, 1887590, 1762502, 1663250, 1683076, 1760451, 1785776, 1792032, 1860850, 1915479, 1826486, 1676629, 1675892, 1819622, 1885498, 1801269, 1752110, 1840942, 1898458]
7125A898458j27357j89665n5717N1906K715o7030l0912L9745M9573K2767q836
7114A585647p0551j25305p1057O9207J28351M1401n5004m6312K517J232j4639
7103A445487P977K2284j5177m4466j2956K1895J987k2647M376L3082P51m8555
7091A394038m1040M482K6004K2308K2499J6450q733k7111k9191m4522o1173k0814
7079A253197N4809N5648k9993o1081K9310J01316K9155q7949r1009j1256J9667
7068A261814N70J2915L2267j4237p2839m5383J4251j0783p2524l7165N7636O0797
7056A187319j1436q564N6559K3211r1609q7840M1732N3559j15886j89916n084
7045H52045J84090J06355q5059q2724O6634P9051o4189j06593K1938R5592k474
$$ y = [1898458, 1771101, 1581436, 1525719, 1577625, 1580340, 1513310, 1482398, 1522143, 1571716, 1594483, 1585647, 1515096, 1389791, 1318734, 1387941, 1516292, 1557693, 1502689, 1456377, 1458894, 1460126, 1445487, 1453464, 1475748, 1460571, 1416105, 1403149, 1425044, 1427031, 1404384, 1408760, 1441842, 1442593, 1394038, 1352998, 1357480, 1383484, 1405792, 1428291, 1444741, 1436008, 1408897, 1379706, 1335184, 1274011, 1253197, 1308006, 1363654, 1333661, 1272580, 1301890, 1403206, 1432361, 1344412, 1253403, 1242147, 1261814, 1262384, 1275299, 1307566, 1293329, 1220490, 1175107, 1189358, 1178575, 1106051, 1068886, 1126522, 1187319, 1175883, 1167319, 1223878, 1247089, 1155480, 1067640, 1109372, 1162931, 1047045, 857129, 852045, 1036135, 1142490, 1057431, 974707, 1041341, 1120392, 1056203, 949610, 971548, 1067140, 1064666]
7034A064666q7822p465R9469M3770j01271j22416O595J03909N0352o5155r0622
7023H94010j1415M4169k0028j29827j20868M1092J90202J62579M191j06540r2653
7012H54912k8673J0883K9605L6708J3575k6378l9501l0486m2925o5565m1952K0609
7000F90812N2012L6978K5921K1148k7769r7295q9636M545P1803M9518N026p942
6988G35121l0523o9649l8242P8524J39305M9904p4423q2488r011K1454N708J3256
6976G38936J6828m6566j09436n7670N8839Q7030J8430j4347J9980J3658n6767
6965F68915p3444L021M8255j0888o8984l0042L1472J6063k6281p79N6182M6537
6953F60027j4989l0942J7329N6314M2748K292l3012m6903k4619J6156J7215l2496
$$ y = [1064666, 976844, 969379, 1068848, 1112618, 1011347, 888931, 895526, 999435, 1049787, 984632, 894010, 882595, 926764, 906736, 776909, 656041, 697133, 887335, 1049914, 1054105, 947565, 854912, 826239, 837122, 866727, 903435, 917010, 890632, 851131, 820645, 777720, 712155, 670203, 690812, 742824, 779802, 805723, 826871, 799102, 701807, 612171, 616716, 688519, 738037, 743063, 735121, 704598, 634949, 596707, 675231, 814536, 864440, 790017, 707529, 698518, 719972, 725680, 738936, 755764, 709198, 599762, 542092, 600931, 687961, 706391, 692044, 712024, 725682, 668915, 595471, 598492, 646747, 635859, 566875, 536833, 568305, 584368, 558087, 557308, 613490, 660027, 645038, 614096, 631425, 687739, 730487, 732779, 699767, 652864, 628245, 644401, 661616, 629120]
6941F29120n3245N494O2985K4425n6318n6432Q637M528r1004j27085m899J57361
6929E03567J74129L5492r2090q0297K3193P7043J8070p4178p5940L4312J45546
6918F88847J35896M518j33943j67121p9323M6350R6307K5808q1419q7644L0137
6907D78413J32235R1079l5320q7109k4933L7714K0628k0060j0338K1784J1833
6896F15926k6168l0582o28M038l5813o4717l5204K0803L5828K558j4582K5092
6884D96551O8740M0234l7163n7964R984O5237J9030o8513p8260o580M7434L9067
6872E37797J5708O393j6641n2975n3291j1978J0312j1503k7047m648K0007K4696
6860D36830M0965O9858N0066l0430p8371k5035O1165P0619P70o8829r5555q8670
$$ y = [629120, 575875, 581369, 644354, 668779, 612461, 556029, 564666, 569194, 478190, 351105, 346206, 503567, 677696, 713188, 621098, 540801, 563994, 641037, 659107, 584929, 508989, 543301, 688847, 824743, 829261, 695318, 528197, 448874, 495224, 591531, 617339, 535920, 448276, 478413, 610648, 701727, 666407, 579298, 554365, 592079, 612707, 592647, 582309, 604093, 615926, 589758, 559176, 558548, 562586, 526773, 462056, 426852, 447655, 483483, 486041, 471459, 496551, 565291, 605525, 568362, 510398, 520382, 585619, 604649, 536136, 457876, 451296, 498730, 537797, 553505, 559898, 543257, 490282, 436991, 425013, 435325, 423822, 396775, 392127, 412134, 436830, 477795, 547653, 597719, 567289, 488918, 463883, 525048, 595667, 596437, 527608, 432053, 343383]
6848C43383n0485J6537P1749P1867K4950l0872o6371n3138J8865Q4955N5177l7024
6836D49593m8413M6265P9656m3611j54983o5902J17767J43718Rq9965l3522K4127
6824D24739j3653m6301R277O8931M7823l232k9347o9454j18648o8161R0132J70744
6812D62850O0374q1261o5356K7015M992r0471o1157Q8614J35597k706j34789r0650
6800B53052M6757J00886M1392l6862o4527l6041K2105N2041M150p5738p7953J1031
6788B40293P3794L6212k7686l2186j3343l2443m5427R346O8309K8816o5414p3658
6776A66613J9458Q0590M3389k188J2860J5945n5072j03752j9543J09297R6521
6765C64118n1466j23384j6567J05613O2217p8204j18805l0979L7941J5592j1657
$$ y = [343383, 292898, 309435, 381184, 453051, 478001, 447129, 380758, 327620, 346485, 431440, 486617, 449593, 401180, 447445, 527101, 483490, 328507, 262605, 380372, 524090, 524099, 434134, 400612, 424739, 411086, 364785, 374062, 442993, 490816, 487584, 458237, 388783, 270135, 201974, 292106, 462850, 523224, 441963, 376607, 403622, 408614, 318143, 256986, 345600, 481197, 478491, 343702, 253052, 299809, 400695, 442087, 405225, 340698, 304657, 326762, 378803, 382953, 307215, 229262, 240293, 314087, 350299, 322613, 290427, 277084, 244641, 199214, 208560, 276869, 305685, 240271, 166613, 186071, 266661, 310050, 307862, 320722, 336667, 281595, 177843, 158300, 267597, 364118, 312652, 189268, 172701, 278314, 340531, 262327, 143522, 112543, 150484, 166076, 154419]
6754A54419J9203M4288Q092l2446j7278J2699N170n381K0879L7278j101l8806
6742B07016j7642O027l3877o5843J0027J21179J06906j9104p7404n662N6322J0950
6730B98895n2320l8595m900k2735l0917L4024Q0250k017j26426j11365M0015J33799
6718A97708O7522l8595l9262L6892O6592K2060k0022k4664m8298j17375j40855
6707c8297k8342J33945J44592l2335j68983p0478J27765J40730l7556j24384K091
6696D8748J10047K587j47723q0315J18635J51620j4362j16400k9912O6603K5664
6685A35192m1506J005P1105K7663q2186j10355m4176O505j441j0249J6331N2943
6673B0831P4613O8935J3355p8280j19586m8528O5302R5562K4801m4968l7298J9005
$$ y = [154419, 173622, 217910, 226002, 193556, 176278, 188977, 194147, 188766, 209645, 246923, 245822, 207016, 189374, 195401, 161524, 95681, 105708, 226887, 333793, 314689, 237285, 231623, 287945, 298895, 246575, 207980, 203080, 180345, 149428, 183452, 263702, 261685, 135259, 23894, 63909, 197708, 265230, 226635, 187373, 224265, 290857, 312917, 292895, 268231, 219933, 102558, -38297, -66639, 67306, 211898, 179563, 10580, -59898, 67867, 208597, 171041, 46657, 48748, 158795, 161382, 13659, -66656, 51979, 203599, 189237, 72837, 42925, 109528, 135192, 93686, 94691, 165796, 193459, 111273, 918, -43258, -36753, -38194, -48443, -32112, 20831, 95444, 164379, 177734, 99454, -20132, -68660, -3358, 92204, 117005, 72037, 34739, 53744]
6661E3744N5036M0944o490m5934l8777P717L2235r118p6594q9623k3195P0691
6649b9364J21609R5220J5216m5890l3653J0921l814p3563q1057J9541J00974M6447
6637A42587n2970k7825R5558J20673k0151j60154j38462n839Q2137O8816J1401
6626A15771k8944l1650k022K7197J8338j2284q791K8302L3395q065k5226R969
6614A15990K0636l8208q0657k4769O1148O3127N53k7803j7390l3032n4308q715
6602b3428O0009L3314o2607o5294N2461J11839J3807r1934n2773M3528M3548j273
6590F1197M2681J04393O979j85539k02336J3316J84710J07752o1505q1719J2725
6579B654L0011m6019p3220j9682J4539R740M3070R5513N2275p5221j24832l5405
$$ y = [53744, 108780, 149724, 143234, 97300, 58523, 66240, 98475, 89357, 12763, -76860, -100055, -29364, 92245, 187465, 202681, 156791, 123138, 134059, 130245, 56682, -24375, -4834, 96140, 142587, 89617, 61792, 157350, 278023, 257872, 97718, -40744, -46583, 35554, 104370, 115771, 86827, 55177, 53155, 80352, 98690, 86406, 77615, 105917, 139312, 131247, 106021, 115990, 136626, 98418, 17761, -7008, 54140, 117267, 117820, 90017, 72627, 39595, -14713, -23428, 36581, 69895, 7288, -58006, -5545, 106294, 120101, 28167, -24606, 18922, 62470, 61197, 103878, 208271, 215250, 29711, -172625, -159309, 25401, 133153, 71648, -10071, 2654, 32665, -13354, -86574, -106256, -91717, -81977, -38907, 56606, 108881, 33660, -91172, -126577]
6567a26577N8153M9954P717N908r599p2018p4471M5913J43512O3621r8035j27610
6555a33532j1852P4886N6758K1925J5426k1845q1986n9573M8782R6434J8252n5783
6543c2108j6847M7269J7243n0887l5225L4464L5789k7062l2864M1749P4714o143
6531E0092j06947j01644K279Q9731Q1064K919n9744n3292m277J7545r485k8249
6519a20008J0959O5634N5841j2539m6731k89N5052K7942o2802j08730n2618M0508
6507a47781P2015L2164q776j3036j2448k0368J2237R4975J26352K4276j18033
6496D1577j32850k0323M9829n448p5020n3128M977J5281J3526N2358O9802K893
6484c6526o4115k3237O0764M7672l7954m7181L7731P6570P514o8715p0631l6542
$$ y = [-126577, -68424, -18470, -10753, -4845, -14444, -86462, -160933, -115020, 28492, 92113, -5922, -133532, -145384, -70498, -13740, 8185, 23611, 1766, -80220, -139793, -91011, 5423, 23675, -32108, -48955, -1686, 15557, -35330, -70555, -36091, -302, -27364, -60228, -18479, 56235, 50092, -56855, -158499, -156220, -66489, 14575, 17494, -42250, -95542, -99819, -82274, -91759, -120008, -109049, -43415, 12426, -113, -46844, -47133, 7919, 35861, -26941, -135671, -188289, -147781, -75766, -43602, -52378, -65414, -77862, -98230, -85993, 8982, 135334, 159610, 41577, -91273, -111596, -61767, -67215, -142235, -195363, -190386, -175105, -161579, -109221, -39419, -36526, -100641, -123878, -63114, -15442, -53396, -100577, -62846, 13724, 21238, -47477, -118108, -154650]
6472a54650l048N6136J15937Q1131m5902j21549o6045K0055K7751m946m996L33
6460i9793k4744j9238N5796R9965K1337q8112q1682R709M1717l1j404N8065O9693
6447D1278l350o0920m2661j6806l4349l4405K5599O5243O583q3936q5891j525
6435b25140N9803M2882j457j6581r203o767j0087j1311j3013n261L6200R5870
6423f4065R8614l71j20105j22164M959J06944O5310l5555m0543L3482L1768p1947
6411a13673j15746r165J13864J06375K8314J3563L7144p986q6748p6318j909m830
6399a17115p6800m7841J12262J96250O8218j11127j13895L1513J11048M0064n8794
6388C3783o7585j6064Q788r367k5135j3538K135n945k4404j6469J4145J6836j8891
$$ y = [-154650, -157698, -101562, 14375, 95506, 49604, -71945, -137990, -117935, -90184, -95130, -100126, -99793, -124537, -143775, -87979, 11986, 33323, -54789, -136471, -126762, -85045, -85076, -86480, -28415, 41278, 37928, -22992, -65653, -82459, -116808, -151213, -125614, -60371, -53788, -137724, -223615, -225140, -165337, -122455, -123912, -140493, -149696, -156463, -166550, -177861, -190874, -196135, -159935, -64065, 34549, 34178, -85927, -208091, -203132, -96188, -30878, -66433, -106976, -73494, -41726, -113673, -229419, -238584, -124720, -18345, 9969, 23532, 60676, 52690, -34058, -110376, -112285, -117115, -193915, -241756, -129494, 66756, 134974, 23847, -90048, -58535, 52513, 92577, 33783, -33802, -49866, -41078, -50445, -75580, -89118, -86983, -92928, -117332, -133801, -119656, -102820, -121711]
6375a21711k3906L7213P2415p359j09270o6185Q7096J33173N704r9560m0259M8232
6363h4417k420j00883n6656R0273J35660M2198l1725j6609j5643p7268r4777j734
6351b14001J02983J09617M5780n894k6336k8306p764J1921j5946o1051k7026P9662
6339c6361J11435p463j43912j37325k1589N4621N0098L6897L7439M695m9670m8670
6327a49805J2292M4011J2906j045N0314Q3301J4248q3279o7785N0964J04843M397
6315G5362j27050j26961j8379M6107J9283L206N4978R2533M8679j2326k1237k7696
6303F499p8996q7112K2959J23026M3631j23979j23407O6453J78528O7609p8780
6292A6431o3224K2319M001o2728k1338Q2529P8431k5067o2153j569K2160l1214
$$ y = [-121711, -145617, -108404, -35989, -43348, -152618, -218803, -131707, 1466, 7170, -92390, -132649, -84417, -86837, -187720, -244376, -154103, -18443, 23755, -7970, -24579, -40222, -117490, -212267, -214001, -111018, -1401, 44379, 38485, 12149, -16157, -23921, -12000, -27946, -88997, -116023, -36361, 75074, 67611, -76301, -213626, -235215, -180594, -130496, -93599, -56160, -51465, -101135, -149805, -137513, -93502, -80596, -81641, -31327, 51974, 66222, -17057, -84842, -33878, 70965, 75362, -51688, -178649, -197028, -150921, -131638, -128432, -73454, 19079, 67758, 55432, 34195, 6499, -72497, -159609, -136650, -13624, 30007, -93972, -217379, -150926, 27602, 95211, 16431, -46793, -24474, -20473, -83201, -104539, -22010, 56421, 31354, -30799, -32368, -10208, -41422]
6280d1422m5929J9580N4648N650l0857N415L9788K8838M5040J01071P5003o2285
6268A94540j27203o66J37359O5890j09117j04807Q2113J55796j6861k00085j53238
6257g6279K6185R1085J4496l0482K6233P4692L8154j4067m094L7384M7525K7392
6245B58224L261l1491p5834q3921k9895L7482O0669M9332L6537J1263l7014n7692
6233A40921j1305L7217K214o9854n1494O1519J24575N1734p1620j27675j01869
6222a5637k7543Q0705J64868J23398k5115r9830k894J11837O7386n4564n7109
6211B65502L7933M2813m9417m3830J01820J73749M9631r4242o7487M9399Q0627
6200E46498M5576P0191J31857J09649J7381j8246K4295M9178K7649K2979M2432
$$ y = [-41422, -87351, -67771, -13123, -7473, -38330, -32915, 6873, 35711, 80751, 181822, 256825, 194540, 67337, 66671, 204030, 269920, 160803, 55996, 138109, 293905, 277044, 76959, -76279, -50094, 40991, 55487, 25005, 51238, 125930, 164084, 150017, 145923, 183307, 230832, 258224, 261485, 229994, 154160, 70239, 40344, 77826, 138495, 187827, 224364, 235627, 198613, 140921, 129616, 166833, 169047, 99193, 47699, 109218, 233793, 285527, 213907, 86232, -15637, -43180, 37525, 202393, 325791, 300676, 200846, 197952, 309789, 377175, 322611, 265502, 303435, 346248, 296831, 253001, 354821, 528570, 578201, 483959, 416472, 465871, 546498, 592074, 662265, 794122, 903771, 921152, 902906, 927201, 976379, 1004028, 1027007, 1069439]
6189A069439K9868M752M5280J22996J17171J9135l6356J9084J01230J41255J77326
6178A811180K12080J46580l8499j83894j64947q3133j00979j87368j91515j01064
6168A118441m9337r2030j43098j36594j03994p1371j5953M3603M0037j9449m2814
6157E27441j0917j9110r7548j24588k2308Q2965L8379q5518r4757K0634O7792
6146B82465m4010j58588j06107N8341J52179J07720R961m9796n6650l5983j5979
6135A43553j6222k5322j2102J2185m419n5299n6795J2252M7132j6262p2691j4123
6123e8113P1057L8152m9301j1454J23558J33526l5169j69094j25721k7308o009
6112a15876N702P5138Q7823l2979j25494m1795P4973K8691p3053j0089J26024
$$ y = [1069439, 1099307, 1104059, 1149339, 1272335, 1389506, 1408641, 1372285, 1391369, 1492599, 1633854, 1811180, 2023260, 2169840, 2131341, 1947447, 1782500, 1699367, 1598388, 1411020, 1219505, 1118441, 1069104, 977074, 833976, 697382, 593388, 522017, 506064, 549667, 589704, 570255, 527441, 516524, 497414, 399866, 275278, 252970, 335935, 374314, 288796, 194039, 214673, 282465, 238455, 79867, -26240, 32101, 184280, 292000, 301961, 252165, 195515, 159532, 143553, 127331, 102009, 89907, 102092, 97673, 42374, -14421, -2169, 44963, 28701, -43990, -58113, 12944, 51096, 1795, -9659, 113899, 247425, 212256, 43162, -82559, -109867, -115876, -110174, -35036, 52787, 19808, -105686, -147481, -72508, -43817, -116870, -126959, -935]
6101i35O2198j55597j84839N6325K38190J37261m7122o4482J0686l939o3075l0737
6089d6066L8656J4054n4208l1901M6728M8899j5506l1984N388J2954r287l990
6077b6263N231k4476k6713O0102J30029O1197m8939k4491Q1015O9321n6164j02656
6065I7193l1599k346n5494n0042L3198L1822o8487n9775J01011J51414l7472j90087
6053h0664n5546J62598J26842r5109j74405o0974Q141l1102j550J15756J06423
6042B0410o7308j42852P422J39356L8261j21929p6863Q9556J04249l7250r0234
6031a37182J6121Q2714p512j11319q1740J3947M4964J7059k70j2339l7662j8118
6019b31337P3082J22769K6918j14158j12921K2666R5172J6633p0749l0547O5214
$$ y = [-935, 61263, -94334, -279173, -222848, 15342, 152603, 105481, 40999, 51685, 47746, -15329, -46066, -7410, 6644, -47564, -79465, -32737, 16162, 656, -31328, -25940, -12986, -22273, -26263, -21032, -45508, -72221, -12119, 117910, 179107, 130168, 105677, 186692, 256013, 199849, 97193, 65594, 63248, 7754, -42288, -9090, 22732, -45755, -105530, -4519, 146895, 109423, -80664, -136210, 26388, 153230, 58121, -116284, -177258, -169117, -200219, -201769, -86013, 20410, -46898, -189750, -182328, -42972, -4711, -126640, -203503, -113947, -9698, -46948, -137182, -121061, -38347, -45859, -157178, -238918, -224971, -180007, -162948, -163218, -175557, -213219, -231337, -158255, -35486, -8568, -122726, -235647, -212981, -117809, -101176, -171925, -202472, -137258]
6008a37258P1361o811n2500l2432k0309m6965m7061K4611J07762J06195M647j08152
5996a36912j24132k7680P5982P3521j4757o3551k3178J8720k672j8397L6797Q2448
5984a23811K0039p9620p5759J1150M3327N851O254M2930m953j21401j18762N3818
5972c40937J84677J10490m1571p6547j9829j336q550L3944O3969r305r0835l5359
5960b31189P3828M2072q4495p2428Q8705J38276j9864j38614l1959J16038O2553
5949e7077r2675q7581O3250J09162j1904q7722j653Q3011J5820q5103l8883Q7769
5937a03586Q3688o1252j30787j9100J03731N4465q6875j10879oO3419o244p5397
5925b88823j8600Q5121Q7795j375n0901j0999L8404K4493l2204o8662m8698J4302
$$ y = [-137258, -65897, -72708, -125208, -157640, -177949, -224914, -271975, -247364, -139602, -33407, -28760, -136912, -261044, -288724, -212742, -139221, -153978, -217529, -240707, -221987, -224659, -243056, -206259, -123811, -103772, -183392, -259151, -248001, -204674, -198823, -192569, -149639, -154592, -275993, -394755, -340937, -156260, -45770, -87341, -163888, -183717, -185053, -193603, -159659, -95690, -104995, -195830, -231189, -157361, -115289, -199784, -272212, -183507, -45231, -65095, -203709, -235668, -119630, -57077, -149752, -237333, -174083, -64921, -76825, -164547, -166200, -83189, -67369, -152472, -191355, -103586, -19898, -81150, -211937, -231037, -127306, -72841, -159716, -270595, -270601, -207182, -213426, -288823, -307423, -222302, -134507, -135882, -186783, -197782, -159378, -134885, -167089, -235751, -284449, -270147]
5913b70147O0195L3091l4714m2526L0525P4290J1977p4263p6396k5814n982O429
5901c13335O4086R8735K5893o9244m7120M1583M3196j5925J4879R8842M7698j11432
5889a22144j23787N8574J53441J060j68531j16965L3674N3893j3762j361N5133
5878a90775K2601m5117j6218M8385J2581n6859j3028P0163J8542j01158p5263
5867c26146P3138J16978J9459k9941K0851J4391q6877j19348l2145K2850o364
5856c33154J9217J24039J27606j7446r7462M26Q6903P230r5884n8224K3130O236
5844b07383l0738K0814O0027k2574j01371l5104N4598K662p6248P303J40092P7341
5832a10581j11749j31386N1828J61963O4651o5555p5200l0056j1957J7287O6061
$$ y = [-270147, -209952, -176861, -211575, -254101, -223576, -149286, -137309, -211572, -287968, -313782, -319764, -313335, -249249, -150514, -124621, -193865, -240985, -199402, -156206, -172131, -157252, -58410, -10712, -122144, -245931, -187357, -33916, -32856, -201387, -318352, -284678, -230785, -244547, -245908, -190775, -168174, -213291, -229509, -181124, -168543, -225402, -238430, -168267, -149725, -250883, -326146, -253008, -136030, -116571, -146512, -125661, -111270, -198147, -317495, -349640, -326790, -333154, -313937, -189898, -62292, -79738, -177200, -176774, -89871, -82641, -178525, -236749, -213619, -207383, -238121, -217307, -157280, -179854, -281225, -316329, -261731, -259069, -335317, -328014, -187922, -110581, -222330, -353716, -301888, -139925, -75274, -140829, -216029, -246085, -258042, -240755, -174694]
5821a74694N7392k559r960L0303J971p5746m4608Q6446R8774o8557j76345n8949
5809c36532J08542J02544r937m0257j305k0721o8614k2932P7702Q4000o603n6901
5797a91014k9894k2636o4220o6289L081N7277M0315O243J0333L0371L2634K3747
5785a70052P298k8151n5344k5498L7280M2658l0508q3707l3188O6353R3247J8756
5773a60856o5468p1273j2251L8090M7335M1815L7052J0523l4626m1481J0705M4490
5761a55945o631p4869n2795K3490K5534m4327m8562M1692Q3682J2039m0329J6650
5749b20371N6738l2692j19066l6725J04703P9412p1134r5656M9215J30178K9921
5738a25477p1268j5690P5229K8991q3592q1476K2251N7505j7301o1348J2512J06940
$$ y = [-174694, -117302, -119861, -129821, -99518, -97547, -173293, -217901, -131455, -32681, -101238, -277583, -336532, -227990, -125446, -135383, -175640, -176945, -197666, -266280, -289212, -211510, -127510, -134113, -191014, -220908, -243544, -307764, -374053, -370972, -313695, -273380, -267137, -256804, -226433, -193799, -170052, -162754, -190905, -246249, -271747, -234467, -191809, -222317, -306024, -339212, -272859, -179612, -160856, -226324, -297597, -309848, -271758, -224423, -182608, -145556, -135033, -169659, -211140, -200435, -155945, -162576, -237445, -290240, -266750, -241216, -285543, -334105, -292413, -208731, -196692, -237021, -220371, -163633, -196325, -315391, -352116, -247413, -168001, -239135, -334791, -285576, -155398, -125477, -196745, -212435, -137206, -108215, -191807, -273283, -251032, -193527, -210828, -272176, -259664, -152724]
5726a52724R5452J506n0768j4654K5468j5191r2619r0823M588P1820K9657l7239
5714b25527j4045N8393N8224q152k7236J1128K010n9109m0389Q4575J46425L7306
5702B3603j06894j14931k8694Q463j0689l391J5137k4385p6446m0293N0244P3198
5690b35078K7291J6320M3037R301p2483o7074M4512J03979K3570p6971p0278m286
5678b58160J8478Q873K1872L2554J594k7307p667J7133O037J1050O2017O5334
5666d8192m0039j25156m6411R8137R2676n7732j36003n9134J8862n505l0422K3160
5654c15759N1190k1098o1859M6428J68921J19870k1520m5733K0025l2709j89743
5643b81987j81348O8685K57990J37871j08257j45692K3016J15435K1710q1724
$$ y = [-152724, -57272, -55766, -106534, -121188, -95720, -110911, -203530, -294353, -289765, -217945, -188288, -225527, -239572, -181179, -122955, -131107, -158343, -147215, -145205, -204314, -244703, -160128, -13703, 23603, -83291, -198222, -226916, -218453, -229142, -232533, -217396, -241781, -318227, -358520, -308276, -235078, -207787, -191467, -148430, -139129, -211612, -278686, -234174, -130195, -106625, -183596, -253874, -258160, -239682, -230809, -208937, -176383, -174789, -202096, -209763, -192630, -186593, -175543, -113526, -48192, -88231, -213387, -259798, -161661, -68985, -126717, -262720, -321854, -302992, -308497, -338919, -315759, -264569, -285667, -347526, -301098, -132177, -12307, -33827, -79560, -59535, -92244, -281987, -463335, -394650, -136660, 1211, -107046, -252738, -229722, -114287, -92577, -174301]
5633a74301o1875p805j6705k5776K9723O6545K435p3316l3975O4916O3010m8850
5621b15974j11033l6751P3012R4695M3346N535K178j537q094N495K1540J071l9998
5608a66515m5428j1599N737n887J6343R4673J34656M6601r8686j37795l4586P1185
5596a31301O1361j5204n0551l7688l3496l1884J1160O0834L4035n4535r1139k9532
5584c07940M3951M7232J0347j309J2298J9986K3069K4216l297n2718n3816K1837
5572b16144Q4783M3706m8949o6011P271O0343K9162k2679k0542J0888L365m5491
5560a80298p4467m6531J0143M5736M4699K8636J6845N087r473q550J1948J0779
5548a45446m2068r2491n9325L4447P6081K8367j9421m823J6593l17Q247Q1104
$$ y = [-174301, -236176, -243981, -260686, -286462, -256739, -190194, -187759, -261075, -295050, -230134, -167124, -215974, -327007, -363758, -290746, -196051, -152705, -147170, -144992, -146529, -154623, -149128, -127588, -126517, -166515, -211943, -223542, -217805, -223692, -207349, -112676, 21980, 68581, -30105, -167900, -202486, -131301, -69940, -85144, -135695, -173383, -206879, -238763, -227603, -166769, -132734, -187269, -278408, -307940, -263989, -216757, -206410, -207719, -195421, -175435, -152366, -128150, -131447, -184165, -237981, -216144, -131361, -87655, -136604, -202615, -195344, -135001, -105839, -128518, -149060, -138172, -134807, -180298, -254765, -301296, -291153, -245417, -200718, -172082, -155237, -150150, -159623, -168173, -156225, -145446, -187514, -280005, -339330, -304883, -228802, -200435, -219856, -224679, -208086, -208403, -200156, -119052]
5536a19052J14187J7734j01663q5602J6220K2464p7379j06269M518J10117R3192
5525a11533K1076j2386k8980n7314m0668L5743O5584r253p4727j9985P5747P4627
5513h2069L574r799M3734N8941J104n8122p0426n2288j5438L1634L7658k4007
5501a35504p1402j7168P2899N8261n4755j13389m7462M3658O1943L7392L6164
5490a29363N2204M6591J1987m3821j05444j19145m1267O2211O5538l4916r5895
5479c31320l2791N8658N6858q102k5172K1203M9069J6533l0959m1230j6495Q337
5467b75411J0225L84J1709M8328O0132J2657l7317j5676L1899o766j06186j00801
5455c66823N0322J54489O2734q4056o2215Q0879R9126n9270j65024n9477J13267
$$ y = [-119052, -4865, 12869, -88794, -174396, -158176, -135712, -213091, -319360, -314842, -204725, -111533, -90457, -102843, -131823, -189137, -229805, -194062, -128478, -137731, -212458, -232443, -156696, -82069, -78495, -88294, -44560, 14381, 15485, -42637, -113063, -165351, -180789, -149155, -111497, -135504, -206906, -224074, -151175, -92914, -147669, -261058, -308520, -264862, -202919, -165527, -129363, -77159, -30568, -18581, -62402, -167846, -286991, -328258, -266047, -200509, -235425, -331320, -364111, -305453, -248595, -256697, -281869, -260666, -211597, -195064, -226023, -267253, -283748, -275411, -265186, -264802, -253093, -204765, -144633, -131976, -169293, -184969, -153070, -159836, -266022, -366823, -316501, -162012, -99278, -183334, -245549, -164670, -65544, -124814, -289838, -349315, -236048]
5444b36048J30784l704j11619r3286k240P4059Q9714L1791o1201r6100k9899M8611
5432b59138L4556k6676o754Q5479R7690j8946j08339m3372O9358N3882n7788q2454
5420b62502J8067Q1857J0610q3327o6015K2516O3008L9316J1719r580m1803m1936
5408b58070K8370R1184M1155p3144r5866L208Q0375L5046n2518n9937M284M2612
5396b13301J4618l2164m0804l200M0849M2463K329j9511Q403K3622l4467r8278
5384c09441n0980Q1855J47705Q4163j0154m3683l4813j5862K0201L5888l1005
5373a26126j13081n7439J04655J37529l5804j69667o4826J10080R3954n3238r0022
5362b63985q513M368n9750k8609R6739J13374j9675r3076Q72J03307P4165p713
$$ y = [-236048, -105264, -108968, -220587, -313873, -316113, -242054, -152340, -120549, -181750, -277850, -307749, -259138, -224582, -251258, -258012, -172533, -74843, -93789, -202128, -245500, -176142, -122260, -180048, -262502, -244435, -162578, -151968, -235295, -301310, -278794, -215786, -176470, -164751, -174331, -216134, -258070, -229700, -138516, -97361, -170505, -266371, -263163, -182788, -147742, -200260, -260197, -255913, -213301, -198683, -230847, -271651, -274851, -234002, -191539, -189210, -208721, -200318, -176696, -211163, -309441, -360421, -278566, -130861, -46698, -56852, -100535, -135348, -151210, -131009, -95121, -126126, -239207, -296646, -191991, -54462, -90266, -259933, -324759, -214679, -120725, -173963, -263985, -272498, -268130, -327880, -356489, -259750, -146376, -166051, -259127, -258255, -154948, -80783, -88496]
5350h8496l8880n1848o6812j0749R2340Q0011o2023j09065M0707J56625M0091
5339a8099j32173r5081O8928R0856k7545n5899L8602N3820o0978j11179q909P5467
5327a82190J8646n2917n014O8150J7771r9488j11932J507R3413O2748l1861p2933
5315b94100k3036N1751O9989L3618J6807M3700L7674m7713j17754o5349M4382
5304b50031O0142j7292m8343J163J6191l8025m0196N9668J24328N1401n2528n2079
5292a85601N538P725j9477R043N3990K6547k7085r63O1215K4798q9954j18036
5280b52260j8592N7279J4634m4711p824P2678Q8310M3905Q120j5501n5592p6594
5268a86148k9087M3118N2532L450k0659M040J3830k1271m3059r125K6814j630
$$ y = [-88496, -127376, -179224, -246036, -256785, -164445, -84434, -146457, -255522, -214815, -58190, -18099, -150272, -245353, -176425, -85569, -113114, -169013, -130411, -76591, -137569, -248748, -257657, -182190, -163544, -216461, -221475, -153325, -135554, -235042, -346974, -345467, -252054, -189306, -221167, -294100, -317136, -265385, -195396, -161778, -144971, -101271, -63597, -111310, -229064, -294413, -250031, -189889, -207181, -255524, -254361, -238170, -276195, -316391, -256723, -132395, -80994, -133522, -185601, -180063, -172338, -191815, -182772, -128782, -102235, -129320, -130283, -69068, -44270, -134224, -252260, -270852, -213573, -198939, -243650, -251474, -178796, -90486, -46581, -38461, -53962, -109554, -186148, -215235, -172117, -119585, -116135, -136794, -132754, -118924, -140195, -183254, -192379, -165565, -167195]
5256a67195o0183n6416K1437P8511M2084l7533n3915J5447Q4700P4464N499m4446
5244i7546m3011k3355j7362j6365p104n712k8605n3415m0572J3803P0249Q6324
5232a62671M7293l0270r7433q8830J3567J26741J30034J1675r4904o9271L8892
5221a75177P7857n1q3419o4632K3479P4519M7611j4807o1379o4654j4447N9670
5209a95430Q3590J9309o4969o7364J3968Q1722P1006J5780k3278l4564l8096m0832
5197a79158l4874j2274K7251O0403M5266j9079n9961j8173N0234L8196n0902r9111
5185b52182m7804K2845K9021M101J9032N8082N6906J7051n70K4106M5098K2384
5173a930k6795n1208k1079L2864L8895k7549q8804n6607L1546N5203m017l2853
$$ y = [-167195, -227378, -283794, -262357, -183846, -141762, -179295, -233210, -217763, -133063, -58599, -53100, -97546, -140557, -163912, -181274, -197639, -204743, -210455, -239060, -292475, -333047, -319244, -248995, -162671, -115378, -145648, -243081, -331911, -318344, -191603, -61569, -49894, -144798, -214069, -175177, -97320, -97371, -180790, -245422, -221943, -147424, -99813, -114620, -175999, -240653, -255100, -195430, -111840, -92531, -157500, -224864, -210896, -129174, -58168, -42388, -65666, -100230, -138326, -179158, -214032, -226306, -199055, -138652, -93386, -112465, -172426, -190599, -140365, -102169, -153071, -252182, -299986, -277141, -248120, -244019, -224987, -166905, -109999, -92948, -93518, -69412, -24314, -1930, -28725, -79933, -101012, -68148, -29253, -56802, -145606, -202213, -170667, -115464, -119481, -152334]
5161a52334K3071O5296J2677n6417m0992P161j8937q4583o6966L6086J02509P5941
5149i7488J8497k3079o4678q6592k8612P8584J04291N57j07707q6156L0484R5980
5137a65919M2519n1299o6400K1051J12294R5187j7136r3457n6367J2376N60o2037
5125b28628n9016K4806Q7615O9661J5131k5563m9097m9178j2683K8902L5061L2391
5113a30598N8066N9421k2554j04295n7901O0850P5580j6770l8824M2294L6948
5102c7783j18977j95667k5171J93538J74668k8168j27374l3564P1815N5336j2069
5091h3416k8073J687K9555L2499p251p9097j06387l6026N5214N4050j7060l8797
5079b23102J8511O9145N6680R454l3992n1308j4563N6947O5559l1565j14332n6291
$$ y = [-152334, -129263, -63967, -51290, -107707, -148699, -141538, -160475, -245058, -312024, -275938, -173429, -97488, -78991, -102070, -166748, -253340, -281952, -203368, -99077, -98520, -206227, -292383, -261899, -165919, -123400, -174699, -241099, -220048, -107754, -12567, -29703, -123160, -179527, -167151, -166591, -228628, -287644, -262838, -175223, -105562, -90431, -115994, -165091, -214269, -226952, -198050, -162989, -130598, -72532, -13111, -35665, -139960, -197861, -137011, -61431, -78201, -117025, -74731, -37783, -156760, -352427, -377598, -184060, -9392, -37560, -164934, -198498, -126683, -71347, -83416, -111489, -109802, -80247, -47748, -54999, -134096, -240483, -276509, -221295, -167245, -184305, -223102, -204591, -135446, -78766, -69312, -103304, -154612, -169175, -112228, -46669, -78234, -192566, -248857]
5067b48857O9430R4198J1955l9733j8859j2161m6308n3734k4575j2607L691P9179
5055a98381J35831N0541r6405r8965L3749P5943l2535q7219J0769Q0641j156p4787
5043b01974K500R0179K8036o3773j0740Q3974K5647j02392o8552R8143J42121
5032B3169p568j46790j24201r998Q3866J29145J02367j2470j14151p1429N4826
5021i3234P0481m5116r9980o538P8163K2119o7678l4335P5535J00189J2446o3525
5009e1473m6419O849M382m9728n9417K8567J19705P0211r1663j56598k7599J08379
4997a44804N2705q3671n4250J08180J31963m4587j65748p1964O3306M4082m9323
4986b14111m7358K6206N4535N0357P9091Q7240M980q1831n3519L2964L9391k2760
$$ y = [-248857, -179427, -85229, -73274, -113007, -131866, -144027, -190335, -244069, -268644, -281251, -277560, -198381, -62550, -12009, -108414, -207379, -173630, -97687, -130222, -217441, -206672, -126031, -127187, -201974, -199474, -109295, -81259, -145032, -155772, -71798, -46151, -148543, -217095, -118952, 23169, 15601, -131189, -255390, -265388, -181522, -52377, 49990, 37520, -76631, -148060, -93234, -22753, -67869, -167849, -174387, -96224, -74105, -141783, -176118, -100583, -394, 12052, -51473, -97892, -91043, -86661, -136389, -195806, -167239, -47534, 22677, -68986, -225584, -253183, -144804, -92099, -175770, -230020, -121840, 10123, -34464, -200212, -272176, -208870, -164788, -214111, -261469, -235263, -180728, -130371, -51280, 35960, 40940, -40891, -94410, -61446, -22055, -44815]
4974d4815m1602j8386l6615o5765n55J19760J30597k866j24569j13309k0618M8864
4962a69879O0674K2994m1446o6855k71R3125R1695k667o5336m1616n244j923J8365
4949a08384O5039N1463m6215j06946m1158N9711O1984q115k3940L5702O6402P883
4937A3426p3440q6100k5241M0865N6476L0429J1889J8788P686n4075j06801n8665
4925b24763O5829J22046L0605j07084j37738m3396O6027J02254O9026J2322k7488
4914g2360k4202J4260L8431J4493k3252k2486K736k963l4823k2988N2298J06672
4902B5816O0042m3206q5445l5138J4590j1582n6793k3913O0137P0187k4340j01113
4890a50758o6125J0350K2748J003K9452O8049J6641p6084n5986O8821J02034l0091
$$ y = [-44815, -86417, -104803, -141418, -207183, -207738, -87978, 42619, 39753, -84816, -198125, -218743, -169879, -109205, -86211, -127657, -194512, -194783, -101658, -9963, -12630, -77966, -119582, -124826, -126749, -108384, -43345, 8118, -38097, -145043, -186201, -126490, -64506, -72621, -96561, -60859, 5543, 13426, -60014, -146114, -171355, -130490, -74014, -43585, -31696, -12908, -5222, -59297, -166098, -224763, -158934, -36888, -6283, -113367, -251105, -294501, -228474, -126220, -57194, -44872, -72360, -96562, -82302, -43871, -29378, -52630, -75116, -72380, -75343, -110166, -133154, -80856, 25816, 85858, 42652, -42793, -77931, -63341, -74923, -131716, -155629, -95492, -25305, -49645, -150758, -216883, -206533, -183785, -182782, -153330, -85281, -68640, -144724, -200710, -131889, -29855, -59946]
4878e9946j34195m0892J23973J30048j3300r9403m4959L2400L7935J0924o223
4867f3638l8280p2600l5676O3463R9316J5519p0254l6077O3935Q8302Q412p9266
4855e6844r6650n0242J6648O0558M8669k723k4923J1156L6706j2627p6659m5643
4843a92574O5196J20824N4688m7628q3650o2452m5754l5579N300O3039P8885L5395
4831d4310k0192l9718k1377O867J8166P61l0555l6797N124O3823Q0568L9099j4071
$$ y = [-59946, -194141, -235033, -111060, 18988, 5688, -93715, -138674, -106274, -68339, -57415, -63638, -101918, -174518, -210194, -146731, -47415, -31896, -102150, -138227, -74292, 14010, 22422, -56844, -153494, -203736, -187088, -126530, -77861, -80584, -105507, -94351, -57645, -70272, -146931, -192574, -127378, -6554, 48134, 506, -83144, -145596, -191350, -226929, -221629, -158590, -79705, -44310, -64502, -104220, -125597, -118730, -100564, -99803, -130358, -167155, -162031, -98208, -17640, 21459, 7388]
$$ [...]
##END NTUPLES=NMR SPECTRUM
##END=
