##TITLE=1H ikalashn
5238-N
20.9.2024
##JCAMPDX= 6.0         $$ Bruker NMR JCAMP-DX V2.0
##DATA TYPE= NMR FID
##DATA CLASS= NTUPLES
##ORIGIN= UXNMR, Bruker Analytische Messtechnik GmbH
##OWNER= root
$$ TOPSPIN		Version 1.3
$$ 2024-09-20 13:50:17.062 +0400  Irina@DPX200
$$ Compression mode = diff/dup
##.OBSERVE FREQUENCY= 200.131392401
##.OBSERVE NUCLEUS= ^1H
##.DELAY= (6, 6)
##.ACQUISITION MODE= SIMULTANEOUS
##.ACQUISITION SCHEME= undefined
##.AVERAGES= 17
##.DIGITISER RES= 18
##SPECTROMETER/DATA SYSTEM= spect
##.PULSE SEQUENCE= zg
##.SOLVENT NAME= CDCl3
##.SHIFT REFERENCE= INTERNAL, CDCl3, 1, 17.95386
##AUDIT TRAIL= $$ (NUMBER, WHEN, WHO, WHERE, WHAT)
$$ ##TITLE= Audit trail, TOPSPIN		Version 1.3
$$ ##JCAMPDX= 5.01
$$ ##ORIGIN= Bruker BioSpin GmbH
$$ ##OWNER= Irina
$$ $$ F:/spectra/data/iren/nmr/1H/4/audita.txt
$$ ##AUDIT TRAIL=  $$ (NUMBER, WHEN, WHO, WHERE, VERSION, WHAT)
(   1,<2024-09-20 13:50:00.781 +0400>,<Irina>,<DPX200>,<TOPSPIN 1.3>,
      <acquisition in progress>)
(   2,<2024-09-20 13:50:17.062 +0400>,<Irina>,<DPX200>,<TOPSPIN 1.3>,
      <data hash MD5: 16K
       E9 EB 49 DB 93 FC F6 83 EE C8 E5 93 20 FD 54 AC>)
$$ ##END=
$$ 
$$ $$ hash MD5
$$ $$ 36 EA F8 CC CB 65 E5 D9 F7 F1 2B 32 4C 80 DB 81
##$RELAX= 
##$RELAX= 
##$RELAX= 
##$RELAX= 
##$RELAX= 
##$RELAX= 
##$RELAX= 
##$RELAX= 
##$RELAX= 
$$ Bruker specific parameters
$$ --------------------------
##$DU= <F:/spectra>
##$EXPNO= 4
##$NAME= <1H>
##$PROCNO= 1
##$TYPE= <nmr>
##$USER= <iren>
##$AMP= (0..31)
100 100 100 100 100 100 100 100 100 100 100 100 100 100 100 100 100 100 
100 100 100 100 100 100 100 100 100 100 100 100 100 100 
##$ANAVPT= -1
##$AQSEQ= 0
##$AQ_mod= 1
##$AUNM= <au_zg>
##$AUTOPOS= <>
##$BF1= 200.13
##$BF2= 200.13
##$BF3= 200.13
##$BF4= 200.13
##$BF5= 200.13
##$BF6= 200.13
##$BF7= 200.13
##$BF8= 200.13
##$BYTORDA= 1
##$CFDGTYP= 0
##$CFRGTYP= 5
##$CHEMSTR= <none>
##$CNST= (0..63)
1 1 145 1 1 1 1 1 1 1 1 1 1 1 1 1 1 1 1 1 1 1 1 1 1 1 1 1 1 1 1 1 1 1 
1 1 1 1 1 1 1 1 1 1 1 1 1 1 1 1 1 1 1 1 1 1 1 1 1 1 1 1 1 1 
##$CPDPRG= <>
##$CPDPRG1= <>
##$CPDPRG2= <>
##$CPDPRG3= <>
##$CPDPRG4= <mlev>
##$CPDPRG5= <mlev>
##$CPDPRG6= <mlev>
##$CPDPRG7= <mlev>
##$CPDPRG8= <mlev>
##$CPDPRGB= <>
##$CPDPRGT= <>
##$D= (0..63)
0 2 0 0 0 0 0 0 0 0.06 0 0.03 0 0 0 0 0.0002 0 0 0 0 0 0 0 0 0 0 0 0 0 
0 0 0 0 0 0 0 0 0 0 0 0 0 0 0 0 0 0 0 0 0 0 0 0 0 0 0 0 0 0 0 0 0 0 
##$DATE= 1726825758
##$DBL= (0..7)
120 120 120 120 120 120 120 120 
##$DBP= (0..7)
150 150 150 150 150 150 150 150 
##$DBP07= 0
##$DBPNAM0= <>
##$DBPNAM1= <>
##$DBPNAM2= <>
##$DBPNAM3= <>
##$DBPNAM4= <>
##$DBPNAM5= <>
##$DBPNAM6= <>
##$DBPNAM7= <>
##$DBPOAL= (0..7)
0.5 0.5 0.5 0.5 0.5 0.5 0.5 0.5 
##$DBPOFFS= (0..7)
0 0 0 0 0 0 0 0 
##$DE= 6
##$DECBNUC= <off>
##$DECIM= 32
##$DECNUC= <off>
##$DECSTAT= 4
##$DIGMOD= 1
##$DIGTYP= 9
##$DL= (0..7)
0 120 120 120 120 120 120 120 
##$DP= (0..7)
150 150 150 150 150 150 150 150 
##$DP07= 0
##$DPNAME0= <>
##$DPNAME1= <>
##$DPNAME2= <>
##$DPNAME3= <>
##$DPNAME4= <>
##$DPNAME5= <>
$$ [...]
##$SW= 21.9925939549014
##$SWIBOX= (0..15)
0 0 2 0 0 0 0 0 0 0 0 0 0 0 0 0 
##$SW_h= 4401.40845070422
##$TD= 16384
##$TD0= 1
##$TE= 300
##$TE2= 300
##$TE3= 300
##$TEG= 300
##$TL= (0..7)
0 120 120 120 120 120 120 120 
##$TP= (0..7)
150 150 150 150 150 150 150 150 
##$TP07= 0
##$TPNAME0= <>
##$TPNAME1= <>
##$TPNAME2= <>
##$TPNAME3= <>
##$TPNAME4= <>
##$TPNAME5= <>
##$TPNAME6= <>
##$TPNAME7= <>
##$TPOAL= (0..7)
0.5 0.5 0.5 0.5 0.5 0.5 0.5 0.5 
##$TPOFFS= (0..7)
0 0 0 0 0 0 0 0 
##$TUNHIN= 0
##$TUNHOUT= 0
##$TUNXOUT= 0
##$USERA1= <user>
##$USERA2= <user>
##$USERA3= <user>
##$USERA4= <user>
##$USERA5= <user>
##$V9= 5
##$VALIST= <valist>
##$VCLIST= <CCCCCCCCCCCCCCC>
##$VD= 0
##$VDLIST= <DDDDDDDDDDDDDDD>
##$VPLIST= <PPPPPPPPPPPPPPP>
##$VTLIST= <TTTTTTTTTTTTTTT>
##$WBST= 1024
##$WBSW= 25
##$XGAIN= (0..3)
0 0 0 0 
##$XL= 0
##$YL= 0
##$YMAX_a= 592542
##$YMIN_a= -295760
##$ZGOPTNS= <>
##$ZL1= 120
##$ZL2= 120
##$ZL3= 120
##$ZL4= 120
##$ABSF1= 10
##$ABSF2= 0
##$ABSG= 5
##$ABSL= 3
##$ALPHA= 0
##$AQORDER= 0
##$ASSFAC= 0
##$ASSFACI= 0
##$ASSFACX= 0
##$ASSWID= 0
##$AUNMP= <proc_1d>
##$AXLEFT= 0
##$AXRIGHT= 0
##$AXTYPE= 0
##$AXUNIT= <>
##$AZFE= 0.1
##$AZFW= 0.1
##$BCFW= 1
##$BC_mod= 2
##$BYTORDP= 1
##$COROFFS= 0
##$CY= 7568.61572265625
##$DATMOD= 1
##$DC= 2
##$DFILT= <>
##$DTYPP= 0
##$F1P= 17.9538593292236
##$F2P= -4.03888763876832
##$FCOR= 0.5
##$FTSIZE= 32768
##$FT_mod= 4
##$GAMMA= 1
##$GB= 1
##$INTBC= 1
##$INTSCL= 1
##$ISEN= 128
##$LB= 0.02
##$LEV0= 0
##$LPBIN= 0
##$MAXI= 945.577
##$MC2= 0
##$MEAN= 0
##$ME_mod= 0
##$MI= -402.1523
##$NCOEF= 0
##$NC_proc= 0
##$NLEV= 6
##$NOISF1= 8.587773
##$NOISF2= 6.764455
##$NSP= 1
##$NTH_PI= 0
##$NZP= 0
##$OFFSET= 17.95386
##$PC= 1
##$PHC0= 102.3572
##$PHC1= 8.44471
##$PH_mod= 0
##$PKNL= yes
##$PPARMOD= 0
##$PPDIAG= 0
##$PPIPTYP= 0
##$PPMPNUM= 100
##$PPRESOL= 1
##$PSCAL= 0
##$PSIGN= 0
##$REVERSE= no
##$SF= 200.13
##$SI= 32768
##$SIGF1= 18.5376
##$SIGF2= -6.396296
##$SINO= 400
##$SIOLD= 32768
##$SREGLST= <1H.CDCl3>
##$SSB= 3
##$STSI= 0
##$STSR= 0
##$SW_p= 4401.40845070423
##$SYMM= 0
##$S_DEV= 0
##$TDeff= 0
##$TDoff= 0
##$TI= <>
##$TILT= no
##$TM1= 0
##$TM2= 0
##$TOPLEV= 0
##$USERP1= <user>
##$USERP2= <user>
##$USERP3= <user>
##$USERP4= <user>
##$USERP5= <user>
##$WDW= 1
##$XDIM= 8192
##$YMAX_p= 0
##$YMIN_p= 0
$$ End of Bruker specific parameters
$$ ---------------------------------
##NTUPLES= NMR FID
##VAR_NAME=  TIME,          FID/REAL,        FID/IMAG
##SYMBOL=    X,             R,               I
##VAR_TYPE=  INDEPENDENT,   DEPENDENT,       DEPENDENT
##VAR_FORM=  AFFN,          ASDF,            ASDF
##VAR_DIM=   8192,          8192,            8192
##UNITS=     SECONDS,       ARBITRARY UNITS, ARBITRARY UNITS
##FACTOR=    0.0002272,     1,               1
##FIRST=     0,             0,               0
##LAST=      1.8609952,     297,             -265
##MIN=       0,             -295760,         -295760
##MAX=       1.8609952,     592542,          592542
$$ Real data points
##PAGE= N=1
##DATA TABLE= (X++(R..R)), XYDATA
0 0 0 0 0 0 0 0 0 0 0 0 0 0 0 0 0 -1 16 -16 16 -16 16 -32 32 -32 48 -48 64 -64 80 -96 102 -117 134 -154 175 -194
36 -194 220 -246 276 -309 343 -383 424 -471 522 -575 638 -703 773 -850 939 -1035 1139 -1258
54 -1258 1388 -1535 1701 -1891 2109 -2366 2670 -3038 3491 -4073 4844 -5920 7532 -10258 15954
69 15954 -59728 219880 276044 -94661 -205203 -155364 -187586 -216786 -54697 -16154 -203942
80 -203942 -267892 -56597 572 -212288 -295760 -92449 15615 -91125 -140500 -70901 -102857
91 -102857 -150984 -10732 131627 -5081 -191041 -91638 123693 112937 -21304 -25315 29539
102 29539 1306 3976 98139 103431 -12406 -17845 110093 115909 -22490 -38378 101172 148910
114 148910 56276 4756 14991 -17195 -17191 105741 170342 23512 -132113 -66827 81585 91693
126 91693 22966 5085 -10007 -45354 -844 92498 67833 -42587 -38629 70654 85458 -5245
138 -5245 -35651 18120 44120 37527 47343 28737 -39645 -45694 48731 102627 32147 -46291 -35997
151 -35997 6128 20551 25803 17688 -23622 -51488 -20850 10911 -18257 -56489 -41125 -12291
163 -12291 -22940 -53841 -66785 -63842 -40169 -3000 -4406 -62630 -100659 -54380 10946 12004 -28217
176 -28217 -50484 -50774 -36232 2061 29829 2259 -38733 -20941 27171 26591 -4189 2593 31079
189 31079 32008 27187 40861 29424 -7871 5908 75094 90131 19940 -25695 7044 43077 38467
202 38467 36349 37225 3117 -26303 7896 48727 20790 -19135 -641 22337 -9414 -31835 760
215 760 16127 -19728 -27307 9461 842 -53559 -46388 18932 25888 -31313 -48792 -16692 -9410
228 -9410 -16325 9802 20317 -27958 -51342 4164 42406 -1629 -34966 4408 27806 -8980
240 -8980 -21801 17360 21407 -15408 -6016 37525 18671 -38559 -23673 40923 42999 -5081 -13803
253 -13803 4089 -7022 -10287 29562 39751 -17874 -46041 4775 36559 -4322 -30322 6735
265 6735 24819 -9475 -21524 8390 8962 -18826 -4571 31031 10028 -34341 -19468 24165 16644
278 16644 -12674 -4031 9466 -10804 -18067 17138 28341 -11628 -28497 8586 26315 -3576
290 -3576 -15140 12087 16756 -9157 -9523 12763 5809 -13332 2374 23709 2488 -25773 -8444
303 -8444 17487 7133 -7787 4305 8998 -15332 -19841 11535 22272 -5417 -17718 1391 7589
316 7589 -8415 -8005 8321 4570 -11326 -4612 9335 -3182 -18226 -2295 18578 5805 -16498
329 -16498 -10273 5542 3963 -1595 4321 3168 -11200 -10757 7432 12830 -2976 -11025 -495 3709
343 3709 -2208 -1406 4680 851 -6071 865 9101 156 -10359 -418 13788 9465 -5891 -9948 -1240
358 -1240 5697 6278 4318 -617 -5559 -3344 5065 6599 207 -1932 1904 3123 -1638 -3490 2931
373 2931 4840 -453 -2544 2724 3479 -3351 -5573 2049 7187 492 -6521 -4457 1882 3057 1685
388 1685 1055 -1135 -4240 -1501 3868 3079 -2209 -2094 1878 234 -4569 -822 6290 1707 -6333 -1415
404 -1415 7751 2252 -9276 -4572 8446 8419 -1640 -4561 -146 1830 3689 6737 3517 -5715 -4815
419 -4815 7205 8579 -2988 -5229 4776 6058 -2584 -2492 5096 2351 -6385 -1814 7522 2459 -8734
434 -8734 -5882 4685 3501 -5209 -5073 -2293 -5123 -4475 2726 455 -10576 -11094 1415 3688 -7447
449 -7447 -8741 1423 2009 -7446 -7931 1350 2367 -4266 -3552 2849 1883 -3187 -1056 4924 2977 1
465 1 3845 6411 1762 -889 6229 10663 4819 335 4344 8617 5857 3708 6552 6521 2167 2136 7292
482 7292 7783 2114 -1282 2215 5213 2548 -952 -1742 -851 -523 218 233 -2728 -6426 -4190 989 904
499 904 -5235 -9510 -5027 816 -2556 -7965 -7175 -3516 -2627 -3575 -2699 -3667 -7094 -5342 1795 1295 -5545
516 -5545 -5854 364 945 -5551 -3785 3104 -89 -7514 -3109 5480 249 -9006 -4820 4927 1450 -5993
532 -5993 -1259 4062 -3298 -7037 2763 5503 -5030 -6627 6140 7472 -6020 -6022 8698 8784 -4935
547 -4935 -509 14870 9606 -7775 -2332 17371 14957 -594 3051 15819 11220 1871 11096 16804
561 16804 4608 160 16887 21580 601 -6106 12777 18823 372 -3894 11726 11111 -7216
574 -7216 -6586 9754 4022 -14419 -8829 7870 376 -18412 -14876 -3032 -9291 -16074 -6902 -5141
588 -5141 -22513 -24753 -4848 -713 -21099 -25732 -4390 136 -17731 -20605 -3508 -3476 -16056 -9190
602 -9190 5762 -1150 -15509 -6048 9059 2387 -7118 3749 12181 1467 -2643 13754 16192 -1133
616 -1133 -3019 17969 22973 4678 -321 13527 14980 2191 5257 17999 12179 -1984 3669 15403
630 15403 6691 -5442 2568 13051 5002 -3709 2623 5456 -4472 -5517 7362 8589 -6401 -10084
644 -10084 3827 6586 -4222 -6474 1077 1409 -2705 1324 3942 -4481 -8527 2799 10777 2795
658 2795 -6882 -3029 3205 2299 2159 2731 -2197 -7349 -736 6759 1545 -7446 -5341 156 -1861 -3083
674 -3083 -766 -2564 -9077 -6934 1765 82 -9245 -9536 -1953 -1100 -6575 -6876 -4358 -6238 -5433 335
690 335 264 -7322 -7072 1253 2965 -2813 -2270 4225 2023 -3830 -361 7118 4568 61 4206 7484
706 7484 2676 -821 4548 7663 4147 5075 7499 2152 -4309 3043 13768 7401 -5349 -3310 6532
721 6532 3742 -2716 1392 3764 -5106 -8335 1908 6367 -5629 -10461 -1773 2501 -4030 -3753 1182
736 1182 -3404 -10324 65 11060 -55 -14274 -4336 11073 4859 -6813 -1576 6370 749 -2953
750 -2953 7042 10080 -1274 -4090 7837 9387 -1438 -1181 10219 7733 -2912 -254 8444 2723
764 2723 -4603 4289 11014 -1156 -11923 -956 9501 1025 -7816 -1214 2116 -4918 -4938 2821 -610
779 -610 -10870 -6678 5112 437 -12049 -8152 2289 -1061 -7479 -987 2524 -7921 -11451 2488
793 2488 10309 -1786 -10488 -857 4806 -908 -619 6604 1920 -7864 -1304 11846 6580 -6260 -2470
808 -2470 8352 3800 -3425 1657 7376 918 -2882 5374 6947 -3644 -5388 7333 9211 -3027
822 -3027 -6140 2528 3390 -2222 553 5469 -1312 -8389 -370 7459 -253 -8407 -1277 5850 806
837 806 -4126 -1020 -449 -3802 406 7183 364 -10911 -6137 7035 6258 -3605 -3836 1184 -1001 -2532
853 -2532 3812 5977 -3158 -6359 2514 6840 -685 -3763 1769 3122 -1429 435 4968 306 -5701
868 -5701 330 8116 2357 -6576 -1929 6876 4067 -2655 -199 3040 -1104 -2236 3194 3894 -2104
883 -2104 -2989 2833 2885 -2833 -1162 3641 599 -2895 556 3849 -1692 -5995 1025 7259 1026 -5449
899 -5449 -3129 924 1001 -77 1306 -1801 -5210 -775 4243 877 -5022 -2234 1725 538 -1808 9
915 9 684 -2997 -2752 3854 4243 -2471 -5069 -113 4094 1496 -1241 -1079 -1897 -239 3231 3252 -2266 -3696
933 -3696 1744 5485 1421 -2854 -696 2183 788 273 1327 -76 -1676 240 3655 1409 -2034
948 -2034 -1051 1504 1136 290 1489 -205 -2717 -827 3624 1917 -2749 -3375 1557 1864 -1446 -1315 103
965 103 -1460 -1462 1107 1728 -3609 -4213 1115 3268 -593 -2674 81 -333 -2672 217 3670 435 -4521
982 -4521 -1636 3784 2262 -2358 -1145 2071 158 -514 2725 2238 -2362 -2171 5083 5672 -1168 -3448
998 -3448 1731 4426 975 380 1752 120 -1529 1689 4919 153 -4162 -498 3904 1417 -1701
1013 -1701 -33 1508 -1781 -1786 2854 2075 -3784 -3906 2413 3295 -2887 -4949 -672 1673 -970 -1115 -230
1030 -230 -2242 -3475 77 2561 -1582 -4749 -1180 2536 -1382 -3830 -584 1290 -1421 -3052 972
1045 972 2101 -2724 -4023 741 3063 -78 -2218 223 1019 218 1227 2607 492 -1627 1568 4889
1061 4889 2168 -1107 1009 3815 2680 341 2588 4590 1726 83 3433 5396 2619 -416 1517
1076 1517 4356 4125 1966 796 769 428 2099 3042 -41 -3154 -1784 2183 1634 -3288 -3838 -955 -765
1093 -765 -3030 -3942 -1939 -3117 -5029 -3919 -1378 -2573 -6264 -5306 -1645 -1684 -4379 -4980 -3496 -2848 -1773
1110 -1773 -702 -1255 -4238 -4098 1005 3502 -175 -2446 427 3774 1615 423 1917 3885 2337
1125 2337 2126 4629 4590 1471 1446 5146 5233 3205 2265 3478 3698 2415 3709 5132 1864 -491 1794
1142 1794 4515 2330 -515 -136 1562 342 -848 773 286 -2089 -1940 1225 775 -2200 -2594 10
1158 10 722 -1811 -2486 -842 -1156 -2787 -566 1282 -1009 -4238 -2300 940 -31 -2128 -1311 -645 -1567
1175 -1567 -1019 510 -357 -2888 -1192 1701 730 -3494 -3994 -495 1184 -852 -1959 -1522 -1043 -1232 -605
1192 -605 570 -460 -1727 -131 712 138 -455 41 483 417 985 1727 1000 -81 371 2221 2709 1015
1210 1015 380 1196 3586 4122 1543 403 1729 3256 2714 1071 962 2311 1676 863 471 1598 2174
1227 2174 90 141 158 173 -501 -451 -691 -1195 -885 45 -1568 -3143 -1808 306 -170 -3189 -3096 -406 -257
1246 -257 -2669 -2308 -411 -539 -1588 -806 468 -965 -1434 -59 1201 320 -2 1298 684 -258 1595
1263 1595 3443 1469 -1602 1283 4560 2481 -1236 -245 2961 2279 439 1493 1896 -554 -785 2063
1279 2063 2349 -1829 -2013 1724 1849 -1891 -1212 858 -571 -2871 -1009 2427 -1019 -4514 -1949 2127
1295 2127 -296 -3973 -1639 762 -1175 -2327 272 778 -2069 -2214 1738 1367 -2548 -2352 2303 2071
1311 2071 -1263 -401 2502 393 -1080 864 3795 667 -1663 1450 3453 549 -691 1882 2856
1326 2856 -751 -608 3290 2564 -2139 -1208 3552 2249 -1110 -517 1867 819 -1827 1088 2603 -1812
1342 -1812 -2874 1571 2960 -1493 -3076 991 1950 -2167 -1983 1646 996 -3090 -1648 2343 1061 -3309
1358 -3309 -1711 2180 1125 -2459 -565 938 -1180 -1787 1531 1942 -2199 -2577 2285 3187 -1286 -2663
1374 -2663 1906 2305 -891 -1120 1562 1388 -1347 -233 2410 1199 -857 57 1808 41 -645 1318
1390 1318 1718 -1059 -510 2290 2323 -1651 -1574 2067 2314 -1165 -1683 1487 960 -985 -574 954 8 -1434
1408 -1434 -182 805 -552 -1117 656 526 -1491 -1384 1308 791 -2302 -1827 1869 1187 -2116 -1812 214
1425 214 390 -468 -937 -121 -716 -851 603 1266 -107 -946 118 577 328 471 1047 556 -479 708
1443 708 1741 623 10 -346 1006 1058 806 -277 41 828 1714 1368 -119 -900 677 1383 -164 -356
1461 -356 1058 608 274 355 521 -130 -1141 301 1618 23 -1204 40 1320 -123 -1671 190 603
1478 603 -833 -1196 864 836 -1776 -2243 55 355 -1432 -862 693 -837 -2258 -847 974 59 -2193
1495 -2193 -166 1799 -460 -2143 130 1544 -1083 -1247 1783 2194 -750 -1707 1399 1299 -474 -76
1511 -76 1980 281 -1492 1459 3564 494 -2102 1287 4103 523 -1532 1505 2671 -30 -1352
1526 -1352 1648 2389 -1099 -1266 2055 1529 -1552 -881 1596 801 -2146 -397 2141 -48 -3579 -331
1542 -331 2265 -996 -4266 -535 2240 -815 -3041 -531 1534 -1429 -2159 223 709 -2017 -1875 844
1558 844 334 -2247 -954 1750 315 -1758 318 3187 382 -2831 -252 3272 1495 -1636 438
1573 438 3099 905 -415 1587 2278 150 -318 2661 2658 -93 106 2259 1899 -336 1278 2548 693
1590 693 -1467 414 3056 262 -2577 -169 1791 962 -1308 -1085 42 -355 -855 -48 -95 -1883 -1679
1607 -1679 -213 -141 -2539 -2314 -304 96 -1350 -1609 -298 -1319 -2489 -1224 579 -475 -1312 -1157 140
1624 140 -129 -976 -928 117 181 221 376 510 310 198 1335 1903 896 59 806 1789 1551 1026 1200 1364
1644 1364 1251 1067 1328 2020 1264 678 698 1682 1608 759 508 1346 1019 56 694 715 -272 -247 791 1291 24
1665 24 -1333 -515 493 -93 -856 -1582 -735 -543 -951 -215 -6 -1838 -1601 164 101 -1252 -1579 -121 -110
1684 -110 -1436 -741 395 -247 -1386 -158 1606 219 -2081 -550 1430 736 -1069 -275 420 -7 -237
1701 -237 1097 849 -794 -981 1369 1439 -937 -908 1292 1533 -459 -230 1955 904 -1374 219 2293
1718 2293 1323 -805 -619 962 1524 25 407 892 329 18 1309 1101 -821 -934 1434 1713 -369
1735 -369 -238 1441 1793 -561 -674 959 569 -836 -668 1470 311 -842 -1263 438 153 -440 2
1752 2 330 -1272 -1747 789 855 -1413 -1701 562 1551 -690 -1501 574 953 -197 -1047 239 226 -794
1770 -794 -540 990 957 -413 -330 921 1182 -71 452 1053 22 -686 961 1876 323 -532 282 1569
1788 1569 379 -564 93 1323 542 -1003 -78 207 -516 -469 257 108 -1175 -1490 -229 62 -1251 -527
1806 -527 -184 -864 -1062 -1422 384 -116 -930 -535 28 56 -1178 -522 1061 367 -490 237 1047 71 -527
1825 -527 1212 1521 680 -50 979 1547 974 72 1841 1761 201 176 1481 1603 -67 288 1459 1152
1843 1152 76 201 1544 232 -1073 409 1936 -110 -1424 139 1569 -203 -1748 -451 523
1858 523 -180 -1279 -617 -302 -1466 -1027 3 -153 -1192 -1352 212 542 -1500 -985 255 -136 -962 -175
1876 -175 675 -232 -1838 -51 1687 112 -1070 -396 696 415 -116 307 675 19 706 1099 783 -242
1894 -242 581 1889 1281 -43 212 1538 1118 -250 375 1690 846 -432 406 1756 840 -677 162
1911 162 545 186 -44 244 113 -749 -374 190 134 -1380 -927 248 353 -970 -993 294 -209 -1191 -239
1930 -239 456 -190 -1229 -1158 123 585 -111 -227 -140 179 166 127 230 -429 -377 413 834 -369 -195 358 1184
1951 1184 681 -14 415 565 206 239 97 894 13 209 871 1469 697 -190 155 617 607 284 676 624 140
1972 140 -98 482 543 -258 139 1215 780 -229 -148 423 122 -100 25 273 55 -463 -764 799 182 -1078
1992 -1078 -599 232 206 -1017 -590 242 -305 -1148 72 897 -1064 -1665 -196 273 -810 -1001 -413 60
2010 60 -1230 -236 588 255 -1153 -365 1716 1039 -1318 -862 1274 565 -1112 280 1896 1046 -856
2027 -856 715 1953 475 -346 1601 2417 771 -270 1243 1669 373 655 2229 1351 -1126 -295 2080
2044 2080 1323 -1380 -845 1581 811 -1085 -1190 987 -350 -1266 -633 884 -535 -2258 -502 379 -1200
2061 -1200 -1712 -610 -101 -1831 -1317 445 -338 -2086 -1840 1561 1010 -930 -741 1263 416 -1079 -541
2078 -541 1356 672 -122 666 868 264 -633 1212 1844 215 94 1040 1322 -448 222 2056 1489 -719
2096 -719 -574 1748 1275 -684 -856 1229 697 -794 -237 902 -111 -1223 -184 682 -432 -1288 -7
2113 -7 311 -448 -1110 317 413 -359 -1307 -89 332 -777 -735 297 344 -743 -701 -56 438 -243 -555 -50
2133 -50 20 -407 -139 283 -462 -386 50 589 366 -334 -355 376 528 536 568 -258 144 353 553 868 422 49
2155 49 217 671 551 492 403 838 324 131 894 634 760 -63 269 844 455 4 -278 814 205 128 -203
2176 -203 27 162 -168 235 640 -136 -651 56 550 -497 -466 693 180 -1295 -1423 607 -48 -984 -775
2195 -775 134 57 -1286 -749 75 349 -737 -92 -15 -231 -488 -139 777 -524 -756 838 923 -462 -514 1185
2215 1185 1053 -29 -606 867 1431 -227 -29 1082 1229 229 53 1150 654 -25 444 597 341 -516
2233 -516 833 1278 -165 -492 445 1194 -100 -380 837 1416 -123 -542 857 708 -449 -36 833 294
2251 294 -731 -232 887 591 -747 40 605 -541 -729 188 671 -88 -1101 503 849 0 -971 243
2269 243 615 -605 -905 528 619 100 -370 368 747 -617 -395 507 119 -371 242 648 379 -784 313
2288 313 1109 157 -216 153 698 407 -190 557 772 -348 -256 238 300 -379 -749 281 386 -893 -382 395
2308 395 363 -500 88 672 47 -196 -262 465 250 -472 46 246 -183 -728 -392 628 73 -693 -99 636
2328 636 -80 -345 -154 119 -183 162 860 -1 -260 339 593 523 94 770 702 414 355 152 561 506 398
2349 398 465 320 574 -147 -234 449 350 51 -286 503 112 119 -122 14 -74 -15 -237 7 -43 256 -175 -23 -633
2372 -633 -551 -213 -257 -463 -593 -20 252 -471 -985 121 -230 -245 -302 58 193 300 -495 390 468 -47 257
2393 257 308 32 534 106 740 -13 -237 543 790 146 -364 547 780 69 203 471 791 418 -45 429
2413 429 588 -79 131 171 593 341 -65 10 526 32 319 332 -21 -654 -181 589 -154 -592 -398 456 -25
2434 -25 -231 -710 -142 -783 -379 -376 172 -533 -288 -162 251 -305 -145 322 118 -30 239 624 207 -607 264
2455 264 670 162 -333 210 893 710 185 454 599 35 96 671 1031 268 170 631 798 380 454 365 915
2476 915 257 73 236 420 12 638 755 331 -457 -267 682 24 -732 -2 137 163 -541 -38 215 -424
2496 -424 -1023 -331 -243 -288 -667 -585 37 -522 -550 12 -69 -639 -347 -163 -11 -567 -475 86 582 -986 -479 928
2518 928 -75 -791 -248 577 505 -449 -249 560 493 98 -282 604 351 124 861 584 550 630 553 1001 483
2539 483 515 783 919 -53 389 722 1135 196 666 1270 1050 200 11 720 735 110 -259 444 175 -126 -46
2560 -46 -323 -204 -308 -17 582 -538 -908 -255 332 -577 -514 43 43 -1303 -1326 -85 119 -839 -938 -204 -671
2581 -671 -443 -665 -42 -145 -333 484 710 250 -408 -104 592 165 -95 623 714 411 -395 727 684 575
2601 575 579 611 1234 774 375 96 758 171 493 822 882 -375 205 598 43 213 -16 392 339 -500 -414 465
2623 465 77 -416 45 283 -109 -356 -118 109 -266 -658 -85 39 -232 -150 130 112 -22 -242 367 301 -551
2644 -551 97 113 -246 -294 173 150 219 175 451 751 248 -349 -10 579 344 114 136 631 538 -84 308 624
2666 624 270 101 155 31 433 -9 386 754 210 234 318 385 -126 27 519 372 64 110 298 717 -202 77
2688 77 549 185 251 -213 290 -40 -34 -221 207 -194 -303 -234 -251 155 -106 -530 -198 -296 -616 -124 -8 -344
2710 -344 -788 41 84 -245 -623 -190 330 58 -194 -171 488 65 -152 226 601 406 457 63 813 400 107
2731 107 574 340 68 92 705 229 189 487 872 695 60 668 686 40 -41 81 442 6 -346 -87 -84 -250
2753 -250 -18 508 323 21 114 559 59 -583 -758 552 -204 -433 -258 313 -125 -422 -198 470 93 -381
2773 -381 504 606 -466 185 245 673 -277 535 314 359 -266 149 437 -102 102 75 442 244 -170 509 568
2794 568 486 361 921 450 174 -453 542 500 -99 94 592 126 335 -39 149 278 -580 -89 365 -123 87
2815 87 109 406 -667 -85 59 374 -661 -490 -38 574 -394 -559 -91 246 -458 -672 150 -177 -169 -49 385
2836 385 110 -228 -84 298 -160 -82 436 312 0 109 327 313 -26 -192 167 224 -184 39 304 -24 347
2857 347 525 535 -239 236 378 464 153 169 251 -97 -31 -223 -145 394 16 238 524 103 289 -487 -272 144
2879 144 546 32 -144 -239 -266 111 -458 87 -475 -142 -458 -554 62 -112 -30 -425 -507 58 -58 281 -636 -233
2901 -233 277 -176 -121 -235 -1 138 306 24 3 351 850 327 95 -8 147 -153 209 318 455 653 538
2922 538 242 345 240 572 351 -186 -264 527 498 -3 264 648 36 -317 -152 -70 -522 85 -309 116 -415
2943 -415 -302 -217 268 -372 -204 -123 -52 -482 -183 -7 -261 -467 -431 374 0 -326 -336 437 81 90 317 299 183
2966 183 -145 6 453 -357 260 54 605 289 -300 558 618 251 252 612 475 366 -249 585 368 169 121
2987 121 301 132 -292 63 491 49 -125 128 308 -76 -12 -7 66 81 -114 176 419 -447 -221 53 48 -588
3009 -588 93 58 -231 -293 -213 286 -394 -129 -666 53 -732 -252 356 160 -39 -238 -344 215 41 -96 686
3030 686 377 -134 -51 646 551 -4 -296 1 388 -140 533 957 428 266 278 794 792 16 15 804 540 354
3052 354 257 585 308 239 395 558 154 -87 950 852 -39 42 141 145 114 109 -172 450 -333 -780 -766 37 -569
3075 -569 -605 292 -186 72 -385 257 -370 -467 -438 162 -201 -141 -211 83 -441 -577 33 -4 -62 -175 -107 317 -78
3098 -78 -314 421 248 451 129 104 275 213 8 -222 284 330 -31 419 57 477 324 698 276 -152 64
3119 64 848 141 -113 397 676 396 63 98 556 407 -401 371 -2 281 162 -92 78 -572 -125 515 -150
3140 -150 -135 40 401 -105 8 -632 -124 -100 -231 -148 492 41 -61 -43 227 -189 -315 -306 536 -201 -667 -109
3162 -109 172 274 -264 150 412 508 -101 153 391 -6 -219 240 288 123 202 376 436 332 367 496 158 -390
3184 -390 -437 312 443 -170 -129 477 571 -162 47 132 -102 -261 359 61 77 -326 -150 -19 -81 32 80 249
3206 249 -111 -130 552 -150 -402 -183 549 507 -411 -456 -28 185 52 -243 -91 93 322 309 10 169 107 247
3228 247 359 157 3 556 303 53 -192 256 318 358 -83 -71 541 145 -312 733 622 355 22 -367 702
3249 702 456 532 332 71 194 -76 729 238 -250 -293 440 213 -43 -50 -191 -146 -45 -88 15 -185 178 -368
3271 -368 -388 24 -279 395 93 383 -464 -113 140 -45 13 201 455 -365 211 131 -125 -109 333 490 248
3292 248 -73 56 164 240 239 -37 308 161 -95 168 763 540 -42 506 347 450 59 59 204 272 58 547
3314 547 546 85 387 614 143 -284 372 560 268 -28 215 389 -121 -400 38 115 -252 -479 -185 -64 167
3335 167 -137 512 -46 -204 -238 194 67 -384 58 3 36 -105 5 170 574 -131 47 682 279 -170 214
3356 214 544 410 -220 207 -59 59 -110 150 353 230 164 300 283 -50 586 280 213 9 434 430 442 429
3378 429 -74 475 55 425 207 -44 318 514 4 480 -171 -89 90 438 98 -104 109 189 17 -305 304
3399 304 26 115 -47 85 -163 -74 -250 119 -20 -418 -253 532 18 -248 188 51 -172 -9 107 -138 315
3420 315 -226 -149 -30 -36 348 194 375 95 96 -254 411 603 328 387 251 266 -354 77 467 61 173 92 -111
3443 -111 87 342 -28 304 265 -115 117 373 299 -63 -37 -45 -649 95 -116 88 4 22 4 -93 280 -41 311
3466 311 -69 -69 306 6 -422 505 337 40 -44 388 -101 -202 273 192 430 89 146 186 600 294 203 -109
3488 -109 346 372 -74 125 313 843 348 486 365 259 -50 191 -110 107 -82 538 474 -46 -267 139 504
3509 504 73 -340 246 -32 -315 -489 -46 43 -171 -289 348 -97 -261 -46 359 89 -166 73 148 349 -178
3530 -178 372 375 -35 47 373 527 -20 -3 49 403 135 159 477 542 -169 -155 -60 490 -90 342 703 70 37
3553 37 276 637 310 97 301 733 114 176 305 302 92 -26 891 405 -222 -47 715 252 -270 64 395
3574 395 198 14 196 190 -466 -19 -50 -477 -278 -79 -342 303 -106 -536 -229 115 -360 -284 -145 13 162
3595 162 -207 -290 -2 458 -265 -158 716 -73 249 266 380 283 101 277 401 517 331 358 492 359 464
3616 464 684 261 488 372 671 338 72 380 501 413 344 256 121 117 614 267 648 357 -263 196 177 306
3638 306 -252 -245 331 -259 -14 308 -391 272 -299 343 -402 -480 -200 -159 34 -380 -290 -47 144 -211 -214 387
3660 387 -3 -143 -50 315 -42 129 -381 234 -79 -330 91 126 390 -492 156 779 389 -37 222 -49 -20
3681 -20 193 554 490 317 -306 179 852 187 24 573 319 145 350 502 103 402 286 377 155 -323 -6
3702 -6 254 118 -304 261 218 -437 -123 -24 -106 -141 -217 78 62 -422 8 104 -161 -307 -536 238 -98 -180 -83 355
3726 355 -305 240 13 118 28 -359 178 381 205 -29 161 615 399 106 365 300 372 195 146 475 229
3747 229 -122 317 331 547 -37 431 54 -217 200 269 0 4 394 539 529 20 252 373 335 -281 -122 449
3769 449 22 -51 -20 228 -122 -247 -215 -218 -74 -258 203 306 100 70 76 -76 -160 -267 94 190 -300 173 80 -389
3793 -389 5 -292 379 214 -117 168 134 233 101 -211 369 472 151 133 72 196 217 550 315 173 73 -14
3815 -14 424 115 -163 320 108 182 334 166 -74 185 -30 592 200 -113 12 381 -86 -424 135 267 16
3836 16 -231 -152 78 -107 -184 105 103 -369 -130 309 176 -55 -327 335 -66 -359 -134 329 50 194 -277 -215
3858 -215 409 -93 -275 464 72 211 200 316 -45 192 -392 -20 -75 195 393 548 328 66 362 625 -11
3879 -11 104 371 359 305 109 418 284 532 246 481 352 18 176 234 -84 16 231 48 -178 -511 -62
3900 -62 168 49 -318 29 70 194 -158 109 -290 -47 -87 -147 -200 -345 244 -332 -519 59 -214 124 353 59
3922 59 -151 -370 -356 -98 134 206 493 309 -126 -122 142 -66 161 591 14 106 543 695 152 57 239 147 320
3945 320 -275 483 527 -169 89 20 295 -112 74 106 220 297 -182 285 242 144 366 -179 348 153 166 504
3967 504 18 278 -66 -346 -35 -58 142 32 198 63 7 -351 96 -154 315 109 -184 -55 93 366 174
3988 174 315 241 70 -12 304 686 13 -147 -25 -162 49 67 24 292 -421 154 -211 279 150 -90 -83 186
4010 186 73 -41 495 470 -76 -158 335 211 -221 -142 -133 114 -229 -536 271 197 86 -599 169 -186 -65 -115
4032 -115 -146 216 -362 -49 191 10 201 25 171 175 -449 21 -35 -85 -324 194 355 216 93 461 571 365
4054 365 -324 197 450 400 2 -166 625 185 210 450 201 19 237 160 91 570 717 1047 604 109 541
4075 541 773 317 -241 499 109 -20 -4 211 418 -7 71 -63 118 -214 179 -114 368 -474 56 -270 -354
4096 -354 -446 328 -277 0 10 -227 18 -33 121 -132 230 -173 -277 -99 80 316 -165 -82 -100 -289 -43 484
4118 484 364 -303 244 133 222 257 -125 424 183 506 -51 277 387 181 299 271 296 -330 -75 772 81
4139 81 758 60 331 91 260 -198 420 72 -96 -88 -76 18 355 -76 -30 -598 -449 354 -182 -145 -239 -323 196
4162 196 -364 -130 -355 60 -35 176 -144 24 -66 -273 41 8 300 314 -257 35 -362 166 171 20 -7 58 439
4185 439 281 382 82 252 103 133 69 457 -50 93 247 710 441 259 437 158 221 229 405 528 6 -236
4207 -236 181 -148 248 78 283 53 -168 -57 -58 56 -294 104 239 100 87 -538 -99 -236 -4 82 152 -242
4229 -242 -281 246 360 -141 -12 169 85 -117 -262 92 293 9 374 58 319 225 290 290 417 13 121 751
4251 751 339 129 281 240 130 290 270 239 170 144 226 373 3 1 193 244 -83 341 290 263 429 183 310 14
4275 14 -304 394 22 407 -104 -73 77 -26 -605 -74 73 -76 -545 -51 -242 -55 -3 -242 372 -47 -400
4296 -400 289 16 -181 -133 -253 -316 -547 -18 9 514 -351 499 329 -19 -53 150 566 -38 -132 283 299 241
4318 241 267 87 547 -286 -242 409 189 216 106 428 325 133 -177 157 458 82 -212 -144 188 -53 290
4339 290 338 -94 392 -69 25 97 -158 524 -452 -88 -100 395 62 -374 116 334 -139 -220 42 -199 53 -38
4361 -38 -274 -2 215 -31 -32 200 23 -330 61 267 518 -122 -166 359 -34 257 455 492 182 142 260 511
4383 511 -231 456 45 463 657 140 389 169 401 -39 288 489 -59 297 312 399 7 45 133 -148 -94 147
4405 147 277 130 -112 -606 159 276 119 76 74 613 -350 34 381 364 -85 38 -43 -33 50 -37 -15 -130 31
4428 31 -40 289 -204 -387 136 149 164 -93 308 263 212 532 169 419 239 -95 -113 186 84 18 196 214 299
4451 299 403 667 232 96 257 -65 -7 166 41 273 -170 -411 492 384 169 349 -351 343 93 -74
4471 -74 52 11 420 143 284 706 56 -267 27 -303 -395 -158 -94 38 -181 -150 -224 62 45 -144 183 -116
4493 -116 -9 287 236 -276 60 -181 -80 148 217 160 492 235 -4 -100 419 109 -77 253 -11 217 83
4514 83 434 -59 69 89 57 138 -233 65 238 130 -123 304 -225 82 -202 -245 46 145 305 240 250 -164 142
4537 142 224 176 -391 -85 264 365 238 56 -22 242 -52 14 270 -123 21 71 -150 -68 99 -158 3 83
4559 83 188 269 36 49 -88 417 313 -130 -35 111 472 382 353 613 718 -26 124 192 415 -103 -74 600 444
4582 444 506 64 42 -9 -224 470 159 71 513 288 -226 196 223 28 -67 -198 -128 278 505 -107 -41 -127 -326
4605 -326 -114 137 124 -319 -134 100 -367 186 -282 368 314 287 -256 407 -210 113 -137 -65 421 97 39 192
4627 192 180 183 143 65 379 272 93 433 -50 158 172 377 280 505 393 165 517 279 481 590 179 413
4649 413 -15 17 -136 -28 -17 -301 165 -53 195 79 -62 -86 -231 387 9 -379 -18 253 -248 544 17
4670 17 464 -471 -156 82 -137 26 359 192 -415 193 254 -83 74 -75 191 -274 457 -285 213 398 382
4691 382 17 -250 -31 126 -7 -109 129 306 25 91 561 53 -164 296 39 344 139 163 376 -182 373
4712 373 831 290 -172 -120 324 347 -139 -235 -100 -177 320 -55 225 -188 200 294 -140 207 173 129 -185 -246 -444
4735 -444 327 -42 -215 -47 43 141 -147 -120 476 334 39 -246 298 -42 95 467 284 -181 224 -155 -146 109
4757 109 -308 -172 196 496 -148 314 153 269 -257 728 496 345 16 224 177 -169 90 88 -1 -3 135 254
4779 254 -84 -481 221 -63 378 -184 245 119 -231 38 -326 278 -84 -173 -425 -337 -182 -130 294 581 -17
4800 -17 199 -3 -415 -113 -24 -108 90 -38 104 249 194 -141 205 562 296 -185 133 78 54 -43 610 341
4822 341 239 268 347 -63 458 321 223 410 -10 -77 100 -226 539 275 526 458 16 520 -97 354 409 437
4844 437 116 -161 72 87 157 40 261 -32 209 -471 128 -102 244 82 -455 402 231 449 327 -78 242
4865 242 -393 59 136 -17 -179 169 48 -632 -178 -122 134 210 -98 416 -162 351 312 172 314 4 -213
4886 -213 295 394 88 224 -144 93 605 442 324 240 253 241 -116 121 79 -60 87 -131 108 -454 233 63
4908 63 371 247 178 220 145 -138 207 227 226 -10 11 -19 153 -66 205 -87 -13 75 -176 -27 143 206 332 18
4932 18 13 -53 -223 208 94 161 353 -273 -34 -31 181 -290 344 167 370 338 45 77 294 6 193 5 149
4955 149 188 336 265 160 273 238 250 208 285 186 -76 -80 136 92 -128 607 184 -271 441 -36 356 -488 -219
4978 -219 92 192 162 342 30 490 765 213 94 282 18 -103 -362 13 248 -437 -1 -116 72 89 -254
4999 -254 330 13 -75 -27 281 -391 -131 -308 -243 -48 -256 238 195 -32 111 -41 476 113 563 -53 106
5020 106 219 -257 72 438 -168 -355 167 58 275 -548 57 763 265 269 242 34 238 346 554 228 -234
5041 -234 43 238 -139 -173 -26 -214 38 -19 157 -246 180 202 5 58 158 -21 -52 -240 170 84 272 -568
5063 -568 88 -39 207 83 352 361 -144 144 -63 251 578 -83 46 318 -329 85 -313 92 214 514 143
5084 143 429 -108 15 -127 584 456 322 250 112 -56 373 187 184 757 304 320 74 72 167 137 241 164 339
5107 339 170 -160 -168 -260 -150 -116 -215 99 183 -70 -46 -82 77 -342 -166 -432 190 346 -141 191 191 -115 -156 133
5131 133 137 338 181 -145 -33 389 -141 12 357 298 53 343 145 230 133 186 14 135 81 325 334 435 39
5154 39 -110 587 461 480 81 298 235 88 189 506 -57 -127 364 297 -99 343 -116 96 5 -178 241 347
5176 347 139 -319 -23 15 -328 -101 -51 8 -488 123 -22 -390 94 -14 70 29 -218 -156 312 124 -191 -139
5198 -139 649 -68 219 374 295 225 131 170 223 122 -94 104 291 246 193 203 -120 340 20 141 232 -81 -276
5221 -276 209 408 -9 -192 15 -44 226 270 442 132 71 188 199 -47 343 187 112 61 -168 47 214 -548
5243 -548 -195 106 -167 122 -264 -349 -152 -77 -175 294 -14 -213 254 -88 129 191 83 194 124 -340 205 199
5265 199 127 47 83 -193 120 42 173 408 391 -110 552 -20 33 272 374 362 198 218 341 305 330 266 248 377
5289 377 -423 331 -18 375 191 619 80 -235 -145 -76 388 -230 233 18 -139 153 -104 429 -266 56 -12
5310 -12 212 -168 96 -50 30 -38 230 -402 -308 218 6 -197 309 141 -173 648 136 -60 -184 164 94 191
5332 191 -74 744 134 85 660 169 212 473 28 3 30 4 311 246 -37 295 188 229 488 56 -3 39 28
5355 28 474 301 24 8 50 570 -30 -239 -228 -294 640 -332 -117 -183 -47 -54 -215 267 -132 113 -136 170 -91
5378 -91 -360 -142 202 23 229 123 205 58 -248 139 468 73 -178 -260 178 -21 164 91 -2 89 117 321
5400 321 316 171 222 190 263 -170 71 -59 -279 463 288 25 -55 357 83 368 297 38 -198 -343 259 -68
5422 -68 -113 106 150 115 124 -318 135 192 -350 61 -100 260 -309 92 -212 -254 486 564 -299 -78 -296 -229 26
5445 26 -70 422 -6 -14 69 91 50 152 -13 64 241 98 -89 -215 153 -101 282 142 -11 -82 -128 -202 329 363
5469 363 355 -130 338 354 350 376 493 -41 -88 132 68 -117 577 33 141 344 7 314 75 -128 -319 -178 326
5492 326 61 202 -310 81 120 -422 -451 -335 169 -282 66 -68 329 3 -163 -71 283 -136 -194 -94 -49 46
5514 46 564 307 -68 366 117 214 237 64 22 33 -6 172 307 148 477 405 306 333 336 -23 576 300 126 -21
5538 -21 40 131 331 236 324 829 -184 -110 9 48 -137 -245 113 133 16 240 46 -5 186 166 -114 -50 -321
5561 -321 73 -43 -194 -227 96 41 85 -1 -587 -97 428 -153 27 292 -36 8 33 118 137 -109 266 277 602
5584 602 -95 235 241 218 -101 352 400 -265 -42 184 188 415 243 -87 154 283 -140 447 -66 486 305 407
5606 407 197 0 230 233 -55 -44 -102 590 285 404 348 230 349 55 355 -160 639 88 283 -145 -41 75
5628 75 -13 78 292 142 -323 94 -330 -210 52 167 241 175 7 30 -153 -279 590 -36 223 313 133 673
5650 673 209 87 -72 104 361 -92 296 124 26 -148 378 608 254 340 82 -293 268 36 260 285 200
5671 200 265 87 361 142 -83 264 146 188 275 178 -156 -379 -70 301 -3 361 208 180 106 -196 479 -152
5693 -152 -4 -127 58 -182 -36 -215 568 198 102 558 -91 54 85 -83 213 37 -149 182 489 51 204
5714 204 295 264 446 246 271 -236 317 550 -251 406 -12 46 -3 191 -142 444 617 228 165 93 -133 480
5736 480 329 150 94 516 79 333 -3 52 -403 -112 340 285 137 166 482 269 165 217 339 -121 97 -174
5758 -174 -200 85 43 349 61 86 578 -91 -175 -135 -217 129 -26 -48 -191 -40 -204 -232 -30 33 -65 311 482
5781 482 -263 235 199 -78 406 213 -325 134 -168 22 49 56 86 -51 434 117 283 -55 -23 512 -17 -26 -77
5804 -77 72 114 381 -124 202 -169 438 453 -33 155 342 132 -62 -184 -9 146 195 -315 -283 154 185 -90
5826 -90 -93 -51 -227 150 262 99 -254 -10 -51 225 -252 31 -56 248 -102 133 111 285 138 578 548 332 -247
5849 -247 415 327 127 456 249 379 87 -94 160 505 111 91 1 -188 252 229 219 -53 39 14 384 340 -96
5872 -96 78 123 72 -54 461 -33 -152 -93 -165 124 -165 243 450 257 39 181 129 -166 238 -30 466 -245
5894 -245 -3 308 -46 308 272 344 398 -152 -123 -93 512 76 -47 -118 83 213 176 125 563 373 473 469 346
5917 346 315 101 134 -217 350 -291 79 301 78 304 251 737 -130 -65 367 -193 198 126 22 67 -4 -348
5939 -348 -203 -72 -39 149 -270 148 -379 273 351 -328 225 -102 -310 478 22 52 120 -131 -351 -176 183
5960 183 -198 339 -113 -111 265 224 258 420 257 22 -140 -150 -394 326 320 151 -102 35 267 715 279 -4
5982 -4 280 60 -107 212 96 255 474 77 -14 46 -38 116 221 -11 -69 206 79 84 156 -131 195 -88 -223
6005 -223 -201 169 420 160 653 -5 -105 116 -124 -339 -50 15 -47 -390 60 383 -21 254 145 -155 -435
6026 -435 137 418 114 136 346 -120 11 224 481 45 -91 279 14 499 401 350 207 -53 139 -50 419
6047 419 260 -121 184 32 -31 474 442 97 226 41 -88 268 23 -199 -42 317 86 302 -159 79 -154
6068 -154 237 -71 -12 -126 196 368 355 222 -64 11 -270 -17 296 -91 -248 432 -7 -166 -232 80 -356
6089 -356 -93 118 -108 -171 422 210 -35 -224 392 71 99 296 175 372 -78 62 7 416 308 176 358
6110 358 339 343 161 25 -140 27 218 312 143 271 551 130 -48 -75 171 26 242 -89 -89 -158 -292 112 122
6133 122 -361 176 43 192 22 39 102 -131 30 111 102 209 -172 487 -95 -100 206 62 -119 -474 201 -14
6155 -14 -137 73 656 -4 90 50 479 -49 238 -14 110 308 568 120 366 353 105 138 -301 20 -327 302
6177 302 334 47 139 610 198 78 304 278 7 255 76 -257 -231 -120 -150 189 177 85 13 -14 86 144 129 298
6201 298 -137 -197 52 170 -98 -109 302 306 -255 5 -117 -75 -190 -332 212 134 383 141 -9 -214 156 38
6223 38 252 -54 7 -40 307 196 -167 401 292 250 71 432 -41 141 -116 -190 -154 272 127 378 82 146
6245 146 53 19 260 237 131 339 223 296 27 379 284 -158 332 -149 165 -142 -346 -337 -102 -266 209 -211
6267 -211 50 28 -245 286 185 -99 103 -331 -3 149 -123 -231 -181 90 -90 382 377 430 -111 134 -36 24
6289 24 49 358 -313 161 345 129 295 -111 285 338 234 203 546 102 7 -300 211 -251 240 -35 534 433
6311 433 132 278 40 19 -84 213 -98 397 217 526 196 -424 -223 125 -79 257 164 -200 18 15 71 -10
6333 -10 -356 -75 203 -31 -71 -523 -336 10 -47 496 177 -48 116 167 250 -66 -44 -67 286 -79 -104 75 461
6356 461 34 195 108 -113 -194 434 103 294 46 210 303 189 501 87 314 -201 -48 516 -53 100 -47
6377 -47 336 229 126 197 189 341 -230 -45 129 663 265 -310 24 -173 -180 557 -448 70 -9 107 187 319
6399 319 145 -179 -289 338 -143 -239 -150 49 -119 187 82 -164 82 111 165 -263 36 46 245 107 190 194 90
6422 90 337 38 -17 -50 -56 24 385 -208 154 519 -58 111 1 66 158 30 138 -30 -146 106 -304 259 -124
6445 -124 284 -55 -253 -67 -320 -177 -293 -398 -241 25 20 451 72 -56 162 -326 129 272 529 -223 5
6466 5 63 -159 93 188 33 -116 94 24 379 54 387 242 556 96 -138 286 116 259 -221 585 163 38
6488 38 482 129 288 153 -151 -234 424 -114 436 -209 236 6 -351 464 -46 128 332 294 275 131 85 168
6510 168 -424 169 49 -213 586 -123 225 205 -126 85 76 -90 141 -151 -44 197 -26 483 -286 -214 12
6531 12 -66 179 113 24 -381 -277 258 -431 98 19 10 13 162 569 490 207 219 469 -119 116 48 622 183 497
6555 497 494 -62 87 106 167 299 291 241 141 67 189 171 -1 50 682 40 -58 197 322 338 -198 0 -14 142
6579 142 126 -320 461 174 -66 119 142 -16 31 -119 -421 61 63 230 98 -60 -115 389 232 250 152 117 56
6602 56 330 119 554 173 -149 0 313 279 223 -110 237 109 12 -49 321 295 475 178 478 314 439 84
6624 84 375 -120 400 371 265 277 63 136 320 250 -212 -244 265 187 25 -79 -86 -169 99 -61 -436 48 -221
6647 -221 19 -31 -226 -363 53 279 -72 125 -141 439 -65 211 127 66 62 246 -110 11 63 -195 183 102
6669 102 -36 295 79 140 254 248 340 -158 240 214 327 479 632 479 585 418 330 -100 -147 198 175 -175 84
6692 84 69 236 241 293 -143 219 389 -420 376 -56 288 -143 -122 27 -23 247 417 -44 -202 33 -245 401
6714 401 -51 -49 181 -359 234 132 438 229 342 -127 108 -67 11 217 57 262 344 123 233 -356 -5
6735 -5 -71 547 116 322 187 137 278 126 422 -96 208 377 215 213 193 16 239 163 444 -82 106 294 -136
6758 -136 499 144 445 438 362 327 244 -78 470 349 -95 -49 168 51 -24 147 497 -118 138 707 89 -194
6780 -194 425 117 -46 243 211 87 227 392 -109 226 245 -168 170 212 48 119 244 44 386 245 -173
6801 -173 317 387 432 351 241 489 81 -87 -289 128 -118 -270 193 367 146 -176 120 -259 119 286 42
6822 42 295 -86 -128 458 8 295 -47 -103 388 242 -177 -166 -66 -5 461 -248 500 217 -69 452 148 -371
6844 -371 115 16 -100 41 414 -138 -316 -547 -156 444 -241 -139 -40 133 -51 168 238 71 -12 72 127 221
6866 221 -427 148 -46 161 170 310 464 -175 -15 256 328 -243 112 292 39 95 271 12 5 433 -233 237
6888 237 458 351 61 164 84 -104 73 33 200 -46 203 -212 157 -333 -184 576 408 -42 -185 20 25
6909 25 74 585 -455 93 117 179 115 248 150 33 126 -241 -5 -182 63 182 351 -99 284 -7 5 236
6931 236 358 -137 236 155 -82 114 431 320 178 -23 275 234 302 52 87 19 106 273 -60 11 100 -527 180
6954 180 382 90 160 212 233 -538 338 142 115 196 228 52 114 189 -289 -146 98 -97 112 89 187 121 484 37
6978 37 -81 -61 132 211 297 -55 -24 72 126 260 168 135 -114 8 -273 -121 396 440 -22 151 -379 125 301
7001 301 135 54 -120 -10 522 -135 338 -356 70 152 73 138 363 -20 373 -300 -52 353 -310 68 -211
7022 -211 174 199 -469 -154 -52 -108 -40 43 88 162 28 93 3 212 -186 86 562 253 352 17 -16 370 335 -132
7046 -132 -17 216 173 235 302 179 113 476 480 237 147 237 -392 246 55 264 213 -51 101 566 234 303 -185
7069 -185 53 512 156 33 -273 131 136 19 -5 -35 269 20 -128 227 -324 290 -184 199 274 233 36 67
7091 67 189 -297 129 -142 -317 63 544 -2 -21 -454 -73 2 -245 279 187 749 27 248 77 -224 263
7112 263 347 143 -133 49 217 213 687 161 194 -101 -33 101 274 339 29 89 118 546 -124 470 -54 418 126
7135 126 -5 36 259 55 11 -152 116 -253 204 -69 247 79 98 188 -37 334 -34 179 107 2 249 81
7157 81 239 208 209 63 117 -88 65 339 10 -252 279 149 -42 17 68 320 -16 476 5 428 519 106 83
7180 83 -40 243 89 651 132 -215 285 944 18 193 52 122 -27 155 186 -72 225 551 -135 136 256
7201 256 125 420 -283 68 396 160 314 219 -14 10 517 124 162 -109 166 -204 -46 -410 152 -195 133
7222 133 155 50 64 -59 -8 -314 19 -134 96 37 605 -272 465 39 362 -167 -107 -103 143 -343 -225 25
7244 25 275 46 502 -64 -472 -140 -71 20 142 76 107 319 -104 183 -139 442 354 143 -178 102 360 -168
7266 -168 46 109 118 262 27 256 -91 282 154 -226 153 48 20 309 492 -10 4 193 366 -173 455 174
7288 174 -28 80 4 236 -202 357 -92 439 -11 304 15 301 416 80 51 328 -49 -382 -181 49 353
7309 353 -254 13 61 256 -5 298 69 292 -60 126 251 78 229 155 -232 276 131 -107 0 4 -47 346
7331 346 208 -369 169 319 361 247 65 260 -129 -479 -146 -257 -326 -251 300 82 102 63 -373 258 167 117
7353 117 -33 147 133 -85 107 -311 2 39 76 249 -35 -91 471 -51 8 231 356 469 25 290 255 -323
7375 -323 372 180 92 170 492 375 -108 -95 108 6 316 -9 154 -219 156 24 111 212 92 -272 -177 185
7397 185 -151 -154 265 -19 190 134 245 -62 -112 374 -285 296 -455 467 -62 261 -63 -75 226 -187 -263 -123
7419 -123 262 -308 244 95 124 -127 -101 -79 -100 134 195 324 520 134 98 -99 -15 219 624 50 219 561
7441 561 3 -88 386 204 -65 -51 332 387 -32 43 -343 51 401 -1 306 290 552 59 -122 53 -94 93
7463 93 179 157 -120 -439 112 -50 400 -170 248 417 -23 -121 -134 -120 353 92 -228 -45 363 159 190 -7
7485 -7 52 -273 278 177 -49 -62 98 526 156 104 380 2 -109 -319 96 479 -1 282 50 316 58 95
7507 95 80 129 517 -355 204 -10 137 261 217 -310 105 250 -143 138 0 -134 -85 -36 627 -120 -138 -57 -95
7530 -95 -202 -196 49 -118 6 204 -130 474 -218 164 178 302 -134 220 128 343 -150 230 -172 333 276 -295
7552 -295 -172 264 111 393 -112 -22 283 277 160 -73 115 -255 -348 -211 162 39 167 208 754 -44 11 140
7574 140 195 -192 211 -164 208 165 -74 322 326 112 210 435 201 290 313 147 186 186 78 201 216 -141 410 116
7598 116 384 38 674 -94 -248 271 207 86 -104 97 125 -19 -75 220 -198 -172 221 93 51 -409 60 -206
7620 -206 511 248 -135 81 14 -139 248 84 -121 -80 -213 234 224 58 260 229 71 -21 34 250 176 298
7642 298 227 201 294 225 89 -20 467 342 63 -297 212 -156 276 27 -334 -93 185 -193 151 -249 -85
7663 -85 72 8 203 -58 135 89 287 -9 -106 21 162 -246 -252 289 -158 -365 457 348 210 -70 168 348
7685 348 -406 -203 243 134 -126 -254 328 5 -94 24 87 -41 175 279 459 112 346 -425 208 175 331
7706 331 -295 -244 -194 178 286 118 163 220 65 697 307 120 208 246 33 403 -29 223 176 -29 -71 149 446
7729 446 166 -184 263 141 270 57 232 -338 407 329 -134 -3 5 263 -195 -209 -74 -477 232 -90 -431
7750 -431 518 323 318 -82 608 74 54 -6 90 60 391 3 179 25 103 404 -108 -463 -157 451 418 541 437
7773 437 -232 -11 227 267 264 88 -55 -384 224 -283 -169 -143 -59 131 -464 353 -37 -39 648 -169 -23 295
7795 295 -145 -16 -55 -148 -257 -335 197 73 69 -393 -327 -182 239 24 344 -25 403 -63 -256 567 187 136
7817 136 -133 37 275 -27 219 65 -77 205 171 -79 16 210 310 274 256 249 82 105 4 417 353 231 -71
7840 -71 57 48 -268 168 322 143 316 226 -149 -155 64 33 -124 -268 -446 -130 -110 23 13 -160 -511 18 212
7863 212 24 -68 -11 -129 267 389 313 -87 171 198 -64 230 241 93 438 -210 -162 -7 -151 -168 156 633
7885 633 63 80 -251 373 265 121 484 152 83 439 87 140 130 62 -51 48 468 -197 83 229 -248 -49
7907 -49 288 363 -458 205 135 -68 -169 -160 463 297 602 -31 71 12 102 545 -43 278 181 124 171 -37 143
7930 143 246 123 182 -59 142 -64 397 333 -101 168 -168 614 106 -88 56 199 -179 43 -3 299 -269
7951 -269 9 279 -209 8 379 546 -60 -116 145 105 66 -198 451 187 -54 497 20 -20 -396 111 -17
7972 -17 -70 -71 -119 211 43 -191 -73 121 679 -94 -380 252 182 422 464 44 -193 361 -50 197 -396 470
7994 470 631 -324 -302 148 395 185 -124 -101 66 -302 278 535 296 -13 -395 234 203 227 357 18 396
8015 396 313 -140 -144 -487 140 385 57 249 29 -156 546 19 324 158 -25 577 121 -26 50 450 72
8036 72 219 -63 124 135 295 -48 -89 59 43 614 703 65 146 187 50 71 -103 195 -239 -20 242 605 574
8059 574 131 331 -399 15 305 -71 -51 -214 -117 221 83 100 202 -207 81 406 481 555 152 150 -236 232
8081 232 245 542 551 115 24 251 2 222 -185 243 239 138 238 214 450 -73 -14 381 512 589 759 219 57
8104 57 -51 198 116 90 284 333 -102 -42 326 -172 168 439 443 -182 262 429 -54 217 179 386 -7 177 28
8127 28 -59 163 -43 96 91 399 -141 664 303 153 230 97 264 442 -96 -75 -168 230 -111 3 126 220 351
8150 351 516 536 67 448 506 205 14 145 -151 -114 141 55 171 -41 282 352 208 -174 184 72 -391 129
8172 129 291 241 -71 -163 565 -158 -23 208 438 -4 422 -204 -388 442 -247 677 541 321 297
8191B97
$$ Imaginary data points
##PAGE= N=2
##DATA TABLE= (X++(I..I)), XYDATA
0 0 0 0 0 0 0 0 0 0 0 0 -1 16 -16 16 -16 32 -32 33 -48 63 -65 81 -97 113 -142 160 -191 217 -251 286 -324 370
32 370 -422 478 -539 607 -681 763 -854 952 -1058 1178 -1307 1445 -1598 1765 -1948 2145
48 2145 -2367 2605 -2872 3166 -3489 3851 -4253 4714 -5233 5832 -6532 7354 -8345 9565
62 9565 -11108 13131 -15916 20003 -26607 39111 -71229 337437 592542 -15784 -92164 38926
74 38926 130051 77406 192780 169786 -29038 -121603 85219 132019 -77838 -176379 19906
85 19906 89408 -70333 -160619 -66662 -63461 -121262 -51373 33213 -116759 -272278 -141001 73582
97 73582 11480 -176098 -184286 -78066 -70118 -74204 -7314 -8784 -119671 -118693 14497 34584 -88787
110 -88787 -92160 49955 81176 -37904 -87777 -31076 -8821 -1838 77519 100336 -46944 -159681
122 -159681 -42128 124172 101682 -13773 -40152 -18982 -22461 16106 84677 46073 -61125
133 -61125 -50499 58961 63846 -36113 -56474 21156 54102 24173 12118 3641 -29798 -10699
145 -10699 83060 115367 25657 -47026 -4797 68061 81151 65439 47804 15063 839 39816
157 39816 75143 47448 10008 24254 49322 29601 -2117 -1537 17535 32870 39565 12728 -45511
170 -45511 -64294 -6935 46197 14943 -53535 -76726 -58448 -32847 -7024 -1534 -42983 -85911
182 -85911 -64382 -14805 -15745 -50081 -46316 -17535 -21112 -35981 -26040 -22192 -40528 -22637 32006
195 32006 30906 -38742 -65481 -4890 45402 30436 9528 9582 -5096 -13354 28872 66003 33721
208 33721 -10981 11007 44156 21100 -57 30577 45004 7550 -5503 29955 27653 -18968
220 -18968 -12819 44013 41097 -23878 -37854 7437 19430 -792 4805 9827 -29265 -45564 8227
233 8227 38946 -13046 -51004 -9697 20550 -15064 -33126 5611 14914 -21634 -18393 23022 8598
246 8598 -41178 -21675 42321 37106 -21638 -29639 3783 5327 -2720 23236 27759 -23644 -43441
259 -43441 11962 44502 -1538 -31539 7039 28962 -6930 -22671 8554 14941 -12529 -5752
271 -5752 23859 4867 -36129 -17535 28298 18046 -20036 -14257 6995 -5929 -15121 14111 22780
284 22780 -16841 -31078 9015 27585 -5330 -20568 7910 15458 -11196 -12646 11956 8976 -10585
297 -10585 877 20846 1536 -23619 -2924 26024 13088 -9330 722 9350 -8341 -11424
309 -11424 17836 25295 -5480 -19293 3240 13842 -3184 -5752 10426 7322 -9711 -4536 10121
322 10121 391 -13049 1618 19416 3379 -18666 -9858 10999 7746 -4028 -1045 -136 -9834
335 -9834 -8474 8879 11226 -7245 -13770 -912 5306 -2062 -3873 2109 -364 -7024 -1692 5700
349 5700 -2019 -10706 -1275 11131 3518 -12361 -12489 616 7664 3958 -1440 -4620 -6151 -1943 5892
364 5892 5888 -1624 -4462 827 2874 -1662 -2332 3234 4491 -1172 -2547 2051 3296 -2706 -3482 3562
380 3562 7258 -425 -6976 -2439 5390 4634 535 -919 -1449 -2571 -29 4563 3473 -2697 -2546 1692
396 1692 1273 -3150 -246 4938 382 -7090 -2240 6100 779 -8678 -3576 8196 6542 -6021 -7481
411 -7481 -113 2840 2562 2402 -439 -7245 -3939 7258 7754 -4461 -5954 5207 7767 -1577 -1827
426 -1827 5833 4342 -3179 783 10347 4828 -5941 -1407 9043 6839 -2801 -2248 3013 1500 671
441 671 5122 3364 -6130 -5428 6066 6558 -5432 -7989 2195 3748 -7068 -8764 392 904 -7779
456 -7779 -7121 -583 -1723 -8818 -6996 -1545 -2640 -7065 -3449 -1611 -6170 -8309 -542 2956 -2609
471 -2609 -6957 -1590 3152 510 -1695 1826 3541 265 491 5544 6610 1838 826 5543 8373
486 8373 5531 1958 2847 6338 7208 7072 5989 2977 1000 4307 8558 7431 854 -2926 2114 6446
502 6446 3212 -2483 -1238 2991 2221 -1050 -1130 -1044 -2786 -1802 2952 1277 -5773 -6158 1161 1120 -4954
519 -4954 -3721 2297 -877 -7884 -3311 5068 31 -10300 -5029 4689 405 -8303 -4092 2074 -3607
534 -3607 -8682 -891 1835 -8404 -9973 930 2330 -12139 -13022 952 1329 -12432 -9657 4248
548 4248 -1135 -18359 -11980 8113 5048 -12488 -8761 4570 1258 -8345 -287 9065 -515 -5482
562 -5482 9141 13316 -4187 -7207 15568 23586 3742 -1428 15692 19081 4064 5866 22882
575 22882 19257 447 6051 24748 18630 43 3777 17739 11407 1800 8953 12878 -1827 -5877
589 -5877 9707 12288 -9598 -13623 6853 9561 -12937 -19366 -3551 -2009 -15415 -12602 49
602 49 -9772 -25768 -17693 -1622 -7773 -20259 -12432 -3951 -15495 -19697 -4367 359 -15076 -17616
616 -17616 2258 5816 -12356 -15036 2359 6805 -6370 -5159 8793 5291 -6859 -424 13385
629 13385 6619 -6159 2443 15380 8010 -1645 4619 9852 1580 -559 11127 12491 -2583 -5962
643 -5962 7245 10779 -1418 -4255 4590 5920 109 1216 3977 -1889 -4963 5432 11690 1512
657 1512 -8253 -1328 6468 4953 1654 2918 561 -2551 3953 10521 4626 -4546 -84 8092 7055
672 7055 2505 3400 2578 -1775 944 8299 5986 -4327 -5134 3695 4178 -2635 -4060 -1011 -2844 -4193
688 -4193 134 -1154 -7973 -8484 -544 -975 -8425 -8295 -1756 -2991 -9486 -6956 -336 -2640 -7764 -3769
704 -3769 741 -3633 -7337 -1721 2802 -438 -529 2444 -400 -4986 2542 12062 4933 -6270 -2475
719 -2475 9115 6621 -789 2781 7157 712 -2549 6117 9813 -1660 -6669 3852 8051 -692
733 -692 -3775 1739 -471 -6280 355 8009 -3481 -16119 -5015 9674 1668 -13115 -8688 2161
747 2161 -2183 -7050 1042 4330 -6723 -9455 3239 6050 -4576 -4823 6627 5444 -5947 -2508
761 -2508 7872 5228 -2297 4082 10989 257 -7523 5587 16744 5430 -4899 2489 8489 2646
775 2646 477 7847 4511 -5684 -1462 9320 4732 -8013 -4424 7048 2727 -6213 -1663 3392
789 3392 -5502 -8866 3405 8660 -5908 -13522 -2588 5251 -2479 -5844 223 -2074 -10090 -4130
803 -4130 7884 2429 -11317 -6809 5353 2207 -6351 -1539 5231 -1009 -5269 2941 6115 -3829
817 -3829 -5265 7123 8483 -4102 -6853 3739 6469 -819 271 4749 174 -5672 1426 9527
831 9527 767 -7406 233 7809 1647 -5147 -1194 1607 -1690 791 5716 -689 -10601 -4104 8682
846 8682 6380 -5758 -5561 1823 901 -2124 1706 3711 -4000 -6763 2156 5766 -1974 -5870 605
861 605 2672 -2432 -1784 2462 -546 -5396 -367 7350 731 -7789 -1733 6892 3255 -4370 -1304 2748
877 2748 -76 -2510 2524 3609 -1608 -2380 2995 3729 -2489 -1008 3926 1568 -2197 252 4350 -586
893 -586 -4429 2589 7720 910 -5537 -2569 3467 2587 -142 359 -1555 -3241 816 5111 1252 -4519
909 -4519 -1469 3529 2062 -2103 -607 1038 -2166 -1678 3294 3053 -4290 -5839 658 4051 141 -3201
925 -3201 -2548 -1470 -175 2168 1618 -2874 -4025 1757 4421 -485 -4356 -1033 2052 585 -1321 3
941 3 -75 -1540 903 3287 985 -2716 -1149 2342 2293 719 878 59 -1601 96 4337 2627 -2696
958 -2696 -2501 2712 2668 -829 -1044 1118 717 -133 1453 1773 -2703 -2687 2156 3819 -1153 -3625 -145
975 -145 467 -1995 -581 2584 -724 -5799 -2768 3345 654 -4015 -2686 658 143 -1931 177 564
991 564 -3441 -2388 3382 3686 -3338 -4975 1368 3684 -602 -1802 765 855 -1027 1660 3823 -228
1007 -228 -3992 354 6097 2514 -1429 -36 2633 85 44 3833 2785 -2439 -2186 4070 4613 -1970
1023 -1970 -3659 1840 4156 468 -937 428 -416 -877 1880 3453 -1549 -4105 -85 3621 -98
1038 -98 -3871 -781 1233 -1853 -3247 521 1468 -3140 -4448 -117 2084 -2053 -3824 -1143 1 -1796
1054 -1796 -1444 -830 -2333 -3421 -729 997 -1795 -4820 -1779 1446 -51 -2416 -774 1246 -1235
1069 -1235 -2408 1188 3689 499 -2288 341 3792 3603 1016 1235 2416 2864 3046 4236 2293 330
1085 330 3012 6466 5348 793 1012 4285 5387 2215 1039 2321 2106 902 1613 3538 1857 -2366
1101 -2366 -2140 1330 937 -2078 -3533 -2623 -1359 -2101 -2311 -2473 -5078 -5164 -1646 -532 -4903 -7432 -3652
1118 -3652 -1168 -3571 -5861 -4244 -2061 -3604 -3596 -710 -1177 -3814 -3523 304 1770 -695 -1676 427
1134 427 1451 149 1869 3688 1761 -676 2166 4541 2496 246 2169 4438 3464 2036 2717 2981
1150 2981 965 1679 4082 3783 537 -553 2570 3328 837 -225 1687 1144 -208 896 1907 102
1166 102 -2243 -268 2447 1294 -1528 -540 597 307 49 759 -504 -2075 -707 2153 1555 -2707
1182 -2707 -2849 909 1947 -695 -2507 -715 -176 -958 -814 -926 -1844 -2504 -935 -460 -1340 -2905 -2001
1199 -2001 -1150 -1943 -1699 -1301 -1687 -3116 -2230 15 206 -1910 -2119 -931 745 393 -1433 -1812 94
1216 94 1686 1303 -525 227 1858 2167 663 727 2029 2346 1039 1275 1973 1728 1137 1588 1976 1692 2272
1235 2272 2313 856 -684 670 2489 1797 -1249 -927 1062 849 -2011 -1454 711 63 -2053 -1692 -908
1252 -908 -1150 -2188 -1288 -179 -1708 -2219 -671 -1303 -1614 -646 1273 -1189 -3737 -683 2941 1016 -2964
1269 -2964 -825 2310 1661 -327 820 1987 274 224 2453 2916 -801 -465 3462 3758 -78 -481 2622
1286 2622 1870 -273 1084 3624 957 -3413 -208 3788 764 -3049 -906 2158 -88 -2639 -355
1301 -355 473 -2598 -2806 922 933 -3317 -3579 1446 1103 -3141 -2639 982 -638 -2821 -942 1784 -1067
1318 -1067 -3421 -348 1784 -835 -2625 796 1357 -1169 -1057 2618 1850 -2396 -1772 2937 3001 -1470
1334 -1470 -518 2175 1430 -1057 962 2391 -961 -1911 1836 3329 -1312 -2077 2050 3113 -1292 -1873
1350 -1873 2056 1516 -2073 -1362 3089 1344 -2377 -1886 2816 1463 -2038 -564 1136 -316 -1739 1139
1366 1139 1428 -2248 -2560 2268 2688 -2653 -2917 1136 1619 -1740 -2027 932 962 -1737 -1102 1477 702
1383 702 -1676 -494 1753 39 -593 622 1390 -1024 -444 2374 1921 -1847 -1667 2463 2322 -1155 -1597
1400 -1597 1953 1419 -822 -844 1686 786 -1115 354 1334 -167 -1280 731 1009 -896 -289 1735 505
1417 505 -2055 -1379 2278 1645 -1982 -2259 774 1088 -446 -910 -89 -390 -1135 -234 -127 -1561 -1595 -277
1435 -277 539 -449 -745 -368 -816 -1426 -247 391 -285 -1518 -519 894 45 -179 -600 160 31 788 684
1454 684 -738 -661 758 1017 40 -704 779 1098 847 111 1044 574 -263 569 1994 982 -750 863
1472 863 1700 -138 -1124 1363 1137 11 -523 1506 1231 -1098 -993 1180 1835 -463 -559 947 -112
1489 -112 -1589 -191 1932 -26 -2529 33 1400 -436 -2345 -64 697 -1607 -2077 251 720 -2236
1505 -2236 -2698 659 488 -1154 -878 956 -456 -2242 163 2509 -526 -2981 359 3130 -328 -2491
1521 -2491 364 2747 92 -1760 1507 2497 -848 -1055 2514 2333 -1404 -342 2381 1506 -1362 446
1537 446 2853 479 -1995 1349 4037 197 -2476 609 3409 354 -2112 335 2224 -584 -2234
1552 -2234 -16 878 -1395 -1613 1083 365 -2845 -1928 734 -241 -2783 -1021 1554 -1282 -4271 -1271
1568 -1271 2599 -271 -3631 -1344 1397 -591 -2355 -457 1010 -793 -1213 660 912 -1683 -1125 1715
1584 1715 1234 -706 -38 2011 905 -958 1135 2829 1520 -1715 563 3454 2065 -621 355 2186
1600 2186 1348 428 1315 1268 -7 34 1516 1108 -599 -859 1517 1401 -733 -381 160 350 -952 -827
1618 -827 364 -692 -2168 -1604 140 -443 -1722 -1524 -754 -1165 -1799 -952 -1094 -1774 -1475 -621 -760 -868
1636 -868 -1521 -1374 -505 -209 -949 -1119 -414 -112 -146 -11 55 -373 -102 248 1186 1230 83 566 1217 1313 859
1657 859 941 1530 956 220 1426 2240 702 -511 615 2378 1288 -647 235 1529 468 253 1060
1674 1060 561 -663 -63 1342 1304 -844 -1286 187 389 -1095 -15 681 -513 -1659 -398 1366 -560
1691 -560 -2170 -1019 1333 37 -1779 -1058 59 -146 -825 262 -21 -1383 -1069 605 663 -1593 -1139
1708 -1139 579 472 -996 -785 781 146 -1729 -383 1684 436 -1556 -823 628 531 -588 10 501
1725 501 6 -102 621 951 -1143 -685 1760 1591 -570 -467 1402 1262 -411 -396 1774 1072 -197 -273
1743 -273 1761 988 -482 -312 953 1447 196 385 482 -180 -753 979 1002 -592 -1515 524 1013 -923
1761 -923 -1496 -43 1008 -470 -1579 -69 -195 -723 -1233 563 305 -1471 -1435 265 552 -610 -653 105
1779 105 -506 -300 853 1144 118 -938 -93 1789 60 -983 457 1563 864 -148 353 1193 427
1796 427 262 1290 1207 18 -190 797 666 -127 -404 270 257 -510 -924 610 -112 -1184 -854 262 -421
1815 -421 -1773 -1088 192 -551 -1566 -700 -27 -1001 -1716 -492 507 -1204 -1859 -64 771 -374 -842 180
1833 180 540 -928 -710 905 1079 -663 -227 1343 943 183 326 1374 881 39 994 1835 308 -521
1851 -521 1217 2423 570 -910 433 1861 1209 -167 208 637 -245 -117 799 840 -797 -732 939 1043
1869 1043 -1457 -867 634 -178 -1314 -170 394 -976 -2117 -629 1159 -587 -2255 -1150 144 151
1885 151 -896 -485 -718 -948 -794 230 -460 -1033 -834 646 630 -1114 -7 1274 666 -562 400 1643
1903 1643 679 -659 150 1522 638 -399 -106 677 1000 357 587 1059 78 24 1276 883 -613 -362
1921 -362 1327 933 -726 -540 400 482 -614 -236 569 -394 -871 -586 753 744 -677 -783 -611 167 -302
1940 -302 -297 -411 -1094 -147 462 -24 -668 -1129 -706 488 77 -1039 -100 488 -253 -484 -47 55 -246 156
1960 156 288 1003 23 -896 -90 60 557 154 -474 334 163 -123 488 354 -38 139 771 389 -76 -797
1980 -797 188 335 322 -206 360 162 -418 390 1398 461 -614 157 870 497 -472 138 785 275 -431 560
2000 560 1125 5 -861 30 1086 -145 -921 -45 217 -729 -1348 402 -404 -1714 -429 376 -586 -1929
2018 -1929 -1506 168 -467 -2037 -1026 1071 -700 -1617 -817 651 -804 -1729 204 1076 -137 -1490
2034 -1490 -160 1186 -61 -186 1810 962 -1256 50 2425 1818 -932 -9 2282 2216 -54 38 1684
2051 1684 797 -87 880 2029 860 -569 478 1678 38 -604 759 878 -991 -1472 438 78 -1697
2068 -1697 -1329 956 97 -2207 -1398 332 -277 -1898 -1145 76 -394 -1646 -654 176 -918 -1302 -9
2085 -9 1068 -622 -1360 447 805 -778 -800 1011 704 -1359 -221 1381 1228 -713 -589 1388 1520 -106
2103 -106 -1 1118 547 158 288 1472 308 -579 260 1215 -26 -194 479 1500 -92 -665 324 1073
2121 1073 -754 -799 516 357 -497 -1201 786 22 -474 -284 45 -210 -697 -327 52 -335 -763 -813 103
2140 103 -227 -309 -510 -255 -529 -795 -279 -125 -432 -371 56 -34 -492 -693 -146 447 -99 -417 -56 465 -51
2161 -51 -113 218 575 114 -142 210 886 317 -41 219 1185 369 130 172 1206 613 625 873 601 313 200
2182 200 837 1151 -392 -417 1201 856 -466 -530 644 1052 -474 -810 299 547 -1171 -374 664 -46
2200 -46 -253 -578 50 -190 -1251 -497 64 -381 -1052 84 341 -967 -1510 14 499 -985 -1851 124
2218 124 733 -862 -866 74 404 -501 -661 509 -165 -480 -230 837 291 -491 254 727 -236 -1311 218
2237 218 814 -343 -616 873 1413 40 -645 705 1047 -317 -627 906 925 -271 252 1419 235
2254 235 -386 249 1094 -192 -857 489 629 125 -969 657 913 -420 -1240 25 672 -550 -630 219
2272 219 781 -491 -215 385 136 -823 -482 438 395 -1021 -633 502 -48 -301 182 765 255 -97 -84 620
2292 620 19 -767 384 751 -219 -485 -231 559 44 149 622 155 -68 -322 384 99 -432 252 845 171
2312 171 -229 224 538 -200 -209 168 489 -298 -811 -206 632 -726 -1166 -292 228 -575 -534 93 18 -861 -658
2333 -658 -446 -124 -829 -356 -599 -289 -389 -319 55 -63 2 179 271 -215 -436 597 554 12 149 -209 386
2354 386 442 -12 205 866 351 53 506 452 506 429 -70 324 257 307 97 136 283 428 158 38 -187 -233 15
2377 15 187 -18 -1057 35 302 -73 -488 12 -22 -327 -702 -27 -540 -221 -705 -389 -401 -460 -156 -372 -74
2398 -74 -632 -458 -36 -516 -569 272 294 -490 -519 520 378 291 -505 11 488 -26 -549 661 503 -208 96
2419 96 322 394 -84 340 471 194 41 282 603 310 -219 151 893 256 -7 -363 254 76 -590 -97 271
2440 271 -500 -719 3 396 -208 -588 -277 -185 -525 -726 24 -246 -868 311 270 -292 -1102 -479 223 -44
2460 -44 -470 -863 -149 235 -837 282 -23 3 -238 262 734 -72 -319 591 664 -13 118 922 185 126 -15
2481 -15 941 275 130 408 807 309 -292 557 703 65 -326 381 766 63 163 -20 972 452 -554 -313
2501 -313 194 -58 -298 113 169 -268 -402 -26 72 -634 -308 116 437 -498 -728 -34 -400 -672 -536 -203 -288
2522 -288 -473 -680 -407 -267 -755 -582 254 -436 -701 -366 -190 -593 -675 109 532 -300 -374 403 56 -512 -36
2543 -36 179 706 24 303 251 298 -596 303 1164 918 602 254 940 586 363 536 1089 648 455 1063 585
2564 585 1029 -102 463 923 87 -49 893 755 -347 -590 493 709 -665 -910 93 219 -1016 -716
2582 -716 -307 -421 -332 -656 393 -631 -1214 -840 113 -376 -1299 -169 -237 -967 -1126 -234 386 -324 -883 -379
2602 -379 536 -360 -703 -2 637 60 295 484 598 -104 354 969 582 -112 64 601 375 195 510 639
2622 639 56 274 732 699 -239 73 403 434 46 -210 89 245 -89 -680 181 27 -43 -206 41 -193 -193 -398
2644 -398 49 -71 -430 74 -246 141 -27 -395 246 -549 -476 54 210 -135 -210 176 142 -82 -418 -324 306
2665 306 145 -251 101 450 274 -103 -316 222 -478 -86 216 34 83 87 292 180 -8 183 330 302 -285
2686 -285 184 227 162 -245 212 221 268 -140 -234 -269 181 141 -146 260 190 -250 5 194 37 62 51 236 -350 -288
2710 -288 41 -183 -506 -590 286 153 50 -809 -221 -91 -279 -372 -392 95 -287 -657 17 158 -526 -103 96
2731 96 -253 60 -132 -309 52 -609 -244 542 55 -521 257 209 381 -436 157 941 886 -16 71 842 63
2752 63 -187 183 662 -7 101 662 203 -580 259 323 292 -114 -38 379 -535 -201 -48 242 -166 -672 -314
2773 -314 514 -466 -668 -164 176 -360 -401 -7 190 -593 -622 -128 3 -130 415 427 -249 -663 153 524 401
2794 401 -259 -314 117 29 -234 -47 553 369 -33 419 153 -283 87 584 285 -249 204 273 203 -94 308
2815 308 394 -117 47 420 227 5 -304 169 -105 104 -433 -371 -65 -256 -114 -165 -237 11 -240 -136 63
2836 63 -469 -263 29 567 -333 -286 -245 -191 -756 -120 86 4 -413 -122 213 -267 -194 -36 -91 -538 -107 -393
2858 -393 144 289 -267 304 14 174 225 354 280 260 448 356 258 155 177 578 363 34 216 544 119 3
2880 3 508 326 240 69 738 571 247 408 171 47 154 -27 306 -319 -121 -147 115 -939 -615 -397 -247
2901 -247 58 -665 -260 -402 -244 -306 -312 -345 -324 160 -348 -410 -244 -115 -479 -692 115 -508 -483 90 -340 147
2923 147 -7 420 150 -188 74 207 85 30 -376 321 203 -580 213 262 -118 -58 631 345 271 181 -394 67
2945 67 215 -12 -161 410 -140 153 244 200 -458 2 426 76 112 -209 104 -442 -96 54 -210 -568 -414
2966 -414 -695 205 -36 -810 14 -84 -38 -123 -206 248 -259 125 346 213 72 51 282 218 -484 69 407 250
2988 250 144 490 744 35 135 957 531 151 17 82 459 26 -417 322 583 13 164 370 102 209
3008 209 -141 475 361 -945 47 7 -84 -264 -6 202 -76 -295 -291 380 -256 -810 -504 5 -39 -407 -284
3029 -284 -249 -247 -363 -559 69 -286 104 148 204 -445 -38 129 -271 -187 -315 317 -32 -317 -603 477 303 -294
3051 -294 -46 215 472 -69 40 270 154 15 126 404 531 -151 287 325 125 -395 906 804 310 -14
3071 -14 1091 705 12 -76 604 467 298 153 23 -321 235 36 329 43 -185 -516 63 -389 -367 -107 -74
3092 -74 -323 -685 -298 155 -289 -553 -181 -430 -862 -567 -163 -263 -582 -634 -653 -195 -111 -245 510 29 -27 -168
3114 -168 82 161 -290 74 263 199 -88 215 214 571 -300 89 706 109 -288 502 628 -32 323 245 788 106
3136 106 32 60 690 61 -1 -92 246 38 -600 180 251 -67 -36 7 -169 -399 -157 298 407 -220 24 383
3158 383 -24 -490 -108 195 -527 -117 -164 154 -197 -293 -260 527 222 -245 116 513 -400 -246 321 110 197
3179 197 -211 -49 7 0 -435 386 -140 -250 -204 -18 300 337 -25 100 288 -305 362 590 138 404 314 580
3201 580 228 -297 25 475 -260 -415 275 -376 201 -3 216 -10 -69 -678 202 289 48 -300 29 -299 107
3222 107 -281 -40 -95 -75 -82 -283 -396 -482 -184 205 -263 -542 232 118 -84 -131 -152 215 -2 36 247 726 -19
3245 -19 -538 340 385 318 -28 384 63 175 379 570 -235 -192 -74 607 386 222 65 839 -21 -393 121
3266 121 810 121 -409 -165 361 6 -251 -54 237 -125 -427 -25 23 112 -435 -76 -203 -274 42 260 -379
3287 -379 -328 198 490 -81 -421 -13 196 -551 -362 -241 490 1 -236 34 328 275 194 -211 207 242 -362
3308 -362 334 620 255 5 255 223 201 357 420 443 -384 -290 105 625 -181 -391 358 61 -270 -238 566 546
3330 546 243 46 122 50 -196 125 -23 -110 -187 11 145 -550 -79 4 -265 -281 -330 328 -530 -311 -23 230
3352 230 -326 -65 -243 317 99 -147 -128 -110 349 19 63 -83 -32 -139 151 140 -96 -195 -237 -174 7 -351 484
3375 484 -278 -141 265 79 406 26 -128 -200 216 16 337 284 -65 -118 75 656 -131 670 494 70 129
3396 129 110 156 299 -107 217 49 466 -443 -203 334 44 -143 -141 151 -75 -172 -334 -75 14 -397 -431 -272
3418 -272 -352 93 200 301 -220 -1 -446 90 296 -65 -497 429 -508 -507 -44 484 237 50 301 -157 164
3439 164 -399 169 12 277 82 -70 -156 305 105 98 395 -50 -45 390 704 -217 -641 -235 -93 156 -90 -93
3461 -93 -305 -484 26 -198 -281 -538 -171 -19 -94 40 -32 330 -225 -256 -192 -104 176 26 -33 -161 -31 81 80
3484 80 160 149 344 -40 90 -539 -99 189 -38 -100 -38 -148 194 41 5 453 176 -98 430 323 306 216 370
3507 370 198 -505 -388 619 238 -252 -108 223 38 -302 -262 200 -213 -42 -176 244 211 -686 -32 306
3527 306 310 -254 -307 64 -421 -481 -53 15 -574 -576 97 153 -346 -306 171 170 -394 -166 -290 316 3 -192 151 -316
3551 -316 -585 203 153 419 -50 -237 677 -54 -51 577 807 471 475 285 -65 -293 247 39 230 56 -390 518
3573 518 510 -253 203 162 -46 25 161 272 394 32 97 368 102 -143 -450 374 -160 -67 96 11 296 -417
3595 -417 80 -302 -146 -448 -40 -122 104 -631 97 -521 -362 -461 73 -253 -305 -286 -129 -176 -150 180 -221 8
3617 8 -581 -340 107 -104 -183 -160 69 229 -299 389 248 434 509 184 279 214 238 175 531 106 318 367 349 105
3641 105 90 110 359 301 132 213 -147 29 569 593 216 -162 -448 -78 568 -423 -388 106 -42 108 -274 -147
3663 -147 -32 -30 -632 97 -185 -231 -122 8 -419 -155 40 329 -293 -235 20 317 -282 -482 -101 105 134 -230
3685 -230 26 -160 -384 -261 234 55 -35 -82 23 528 -192 62 571 301 -53 509 272 -265 84 2 -54
3706 -54 515 -151 87 519 -146 33 0 312 -42 -173 234 326 -286 -12 -279 345 -172 165 -247 -510 -272
3727 -272 -253 -2 -16 -289 -442 125 -576 -375 -203 -77 -125 -110 -67 -398 -480 68 -474 154 -238 -23 178 359
3749 359 140 128 -91 -352 -104 -277 447 235 22 95 286 542 -174 -48 737 354 167 143 322 354 156
3770 156 245 116 10 -66 161 -56 -108 168 207 -231 -343 385 -215 -194 -293 -267 50 144 -211 42 39 139 -581
3793 -581 -790 31 -159 -74 -306 -233 394 -538 -701 -77 95 -597 -467 -127 25 -157 -176 -235 51 402 -14
3814 -14 275 294 -58 433 330 62 527 83 167 366 114 528 642 516 283 -224 441 131 266 96 264
3835 264 214 -118 233 307 168 114 174 -43 162 -98 255 -216 -222 -298 179 -326 -244 78 -349 46 -507 -41 -53
3858 -53 -255 -525 -297 7 -222 40 -45 57 -157 -135 130 -377 -476 8 160 -450 -269 112 136 -18 -183 -17
3880 -17 664 -726 282 230 -34 21 116 316 -149 415 -252 -17 -153 161 59 70 507 515 -134 134 -93 212
3902 212 103 236 -10 -167 -214 338 240 338 -134 -24 138 -98 273 197 347 321 -317 60 -171 24 -382 1
3924 1 207 -265 -298 17 -262 -322 -32 -73 235 -151 122 -439 -56 5 194 -162 -540 214 537 382 29 503
3946 503 113 100 141 -228 -140 -48 183 107 -256 -138 -53 395 549 87 -11 242 204 -415 -132 -190 447 -288 227
3969 227 183 119 -82 -302 -68 -100 -247 49 46 -303 10 199 116 -257 -282 34 -274 -417 -304 -265 250 -222 -126
3992 -126 20 -205 37 -632 -489 363 -133 -209 303 22 -92 -33 -93 -365 -109 395 377 -224 67 61 395 148
4014 148 189 481 6 -9 -230 410 541 -151 42 195 381 410 -64 7 641 251 -111 443 -25 -162 -230 52
4036 52 61 -213 478 -129 -428 -50 -2 -203 -16 -275 -16 137 -162 -428 22 -288 -212 -523 -133 163 -103 -97
4058 -97 136 -349 -400 90 39 112 -400 72 122 -481 -252 -505 -30 -221 439 -218 327 -198 -333 439 206 627
4080 627 -68 224 3 256 -323 226 151 150 280 445 39 165 122 -232 -94 259 -162 29 206 -259 -238 165
4102 165 -126 -442 381 97 -312 -129 3 -314 -89 -35 -140 -259 63 -554 54 386 -204 -261 83 -500 -356
4123 -356 -147 -92 -322 -83 89 159 -80 38 337 -63 233 -92 518 7 501 -365 183 89 111 -156 -33
4144 -33 678 33 295 483 396 -290 -206 478 472 -24 94 -19 236 -179 -280 324 17 -285 -37 41 193 334
4166 334 -9 -70 -473 100 -95 330 -98 -377 79 -49 -193 -927 -142 -177 -452 242 -62 390 -401 406 -50
4187 -50 11 -363 -146 -195 227 -69 0 -239 -85 54 201 137 288 8 3 148 -102 -128 244 51 -137 11 -129
4210 -129 80 292 43 -72 -47 168 -193 -147 315 103 -202 7 284 39 -178 153 26 -163 58 -311 80
4231 80 63 -489 372 -125 -361 -4 142 496 62 216 37 -132 -391 -449 358 -66 -309 -3 68 -83 -7 -46
4253 -46 250 -175 -542 240 -204 -185 129 98 184 -364 -297 255 425 -73 -63 366 336 -24 195 -37 315 -38
4275 -38 -202 133 41 609 472 404 -112 -155 202 -23 96 -144 385 278 126 -21 -84 -33 -214 -555 280 335
4297 335 241 -94 107 164 -609 -148 -155 -68 -67 112 7 -191 -449 -385 -155 -321 -782 -84 -246 25 -15 108 402
4320 402 -474 -5 208 -19 74 43 431 329 225 349 191 118 140 318 202 207 522 310 454 579 327 -59
4342 -59 409 -119 -147 185 77 -22 162 477 277 466 -406 133 674 107 -499 -267 167 -25 -694 -61 -407
4363 -407 212 -108 -235 -142 -4 51 520 14 -541 -200 -128 -583 -293 -488 -144 112 257 -153 108 196 -7
4384 -7 97 163 282 176 -72 74 257 27 -84 39 -127 147 291 -194 213 56 -91 340 -226 87 276
4405 276 137 39 216 111 162 338 157 212 -251 36 -33 -52 -63 -182 182 203 338 -188 -1 72 -333 -126 -434
4428 -434 354 -18 -120 -346 -51 -593 -412 146 205 -26 -566 83 126 -107 -150 -38 -271 -407 -418 -91 141
4449 141 37 -180 55 321 243 6 181 -181 512 -109 64 -1 162 113 201 202 -389 -157 107 358 0 594
4471 594 38 188 290 -95 239 -66 305 440 228 -272 419 138 -64 -386 -391 25 -218 101 210 -158 -222
4492 -222 -462 -238 -9 -108 -320 -164 97 -99 -156 129 -75 181 467 112 -161 -17 255 -107 212 -77 100
4513 100 42 141 -454 -325 60 25 -150 -294 340 202 199 79 340 375 -146 -76 198 8 -142 269 254 55 245
4536 245 113 -103 -97 111 139 -311 338 -256 136 88 158 161 339 -165 45 150 -1 426 37 -55 22 -43 34 -42
4560 -42 -153 -271 -162 604 -452 -101 265 298 -274 -161 168 -419 179 288 -220 158 -230 86 45 -198 -5
4581 -5 95 283 360 136 -296 44 -15 41 266 346 597 219 189 167 133 -196 -171 244 -59 115 231 322 559 -102
4605 -102 -391 -63 125 -222 122 343 -134 -274 -280 224 95 -567 231 -291 58 246 -332 124 -144 162 87
4626 87 -69 -3 118 111 27 -414 50 240 35 -358 29 -275 258 33 -183 134 -12 121 173 118 14 -246
4648 -246 218 -110 62 225 63 212 350 -108 -16 265 202 -5 149 -2 260 472 -102 544 -115 29 87
4669 87 40 192 -72 61 82 115 248 497 -221 -170 86 -229 286 -157 23 -155 207 161 241 -31 -144 195
4691 195 13 -148 -199 -178 -665 174 66 24 -60 -265 227 -387 -248 60 -101 369 140 116 214 153 51 -46 -258
4714 -258 88 54 -248 25 181 69 150 -362 130 294 -534 137 262 144 77 137 134 -173 -352 262 95 278
4736 278 -162 299 5 238 -419 -210 -107 -202 -201 -156 201 -181 -141 -233 302 -290 47 -120 113 135 -257 103
4758 103 99 -91 99 -138 -35 -93 -442 51 -24 -231 -9 127 -171 -34 -378 37 -17 -136 74 493 159 -28
4780 -28 229 25 260 -20 606 308 161 132 172 -67 -285 327 -118 -94 -49 -135 184 -32 -287 -187 20 -65
4802 -65 -182 241 401 83 -346 203 -339 -302 -109 -778 -140 -46 -251 -129 153 6 -713 -218 -33 87 -412
4823 -412 -162 -68 -97 74 351 95 -219 -159 -17 -157 185 -388 310 224 -23 -127 -162 151 81 357 -97 130
4845 130 -129 138 -377 58 -116 -136 136 -264 -357 315 43 105 -229 275 101 17 72 -102 161 264 165 342
4867 342 -14 261 27 -160 -422 -31 -148 -348 -349 -234 3 -418 -153 -227 469 178 -426 -308 50 -377 -85
4888 -85 -1 -174 105 -85 -48 173 278 230 135 -180 -74 79 -160 -84 -68 137 -53 89 -135 115 150 109 369
4911 369 257 172 308 326 -369 447 -99 405 448 323 -402 195 240 369 -99 274 80 -254 200 -342 -277 -108
4933 -108 23 -256 -27 137 18 -284 -345 -168 -186 -1 294 -160 136 -305 56 20 311 -412 -138 257 -331
4954 -331 116 114 431 -409 -639 83 -131 326 82 83 509 -109 -198 463 -77 119 -28 590 150 242 150 71 -115
4977 -115 313 -62 -95 58 215 92 -178 -146 -83 384 193 21 -309 267 548 299 -299 -358 -366 126 -83 456
4999 456 -471 -131 -251 -78 333 -357 231 221 -242 4 -250 -227 255 -213 56 -338 -183 -166 -248 -41 -443
5020 -443 -265 -142 113 174 150 62 123 232 270 132 -351 396 593 184 -73 6 50 303 -183 -40 128 4
5042 4 538 130 101 465 33 229 204 -166 141 -175 362 55 -79 -319 -15 -318 145 57 -121 -102 66 -255
5064 -255 25 -112 84 -73 8 24 82 -298 42 -20 -255 -186 -18 240 -448 -126 -73 463 219 44 267 -258
5086 -258 184 185 -154 29 -133 -28 115 40 257 -34 237 -95 -206 478 -111 30 -124 260 195 -400 663
5107 663 239 462 446 -6 157 -60 139 64 9 -24 53 -358 -16 -222 -17 -54 -97 -56 -328 -197 -2 13 165
5130 165 82 298 3 -379 349 -193 -40 20 11 -131 -138 -117 -225 -250 -219 154 -244 86 -248 36 -194 60 80
5153 80 130 -162 -64 -213 125 -76 -222 192 -168 -109 -66 334 -151 147 1 271 340 140 175 112 -18 228 157
5176 157 -286 168 102 -127 -280 -134 313 -142 -399 442 -200 20 167 -146 48 65 -217 217 315 -101 163
5197 163 50 -327 -100 98 -186 -180 -137 -202 -29 -50 -74 250 -25 -103 -137 -97 -92 -196 -296 -27 -223 84 -29 35
5221 35 129 212 368 58 584 -172 340 -257 211 357 254 37 191 -35 180 248 55 -63 112 0 200
5242 200 -141 -142 -264 79 -83 314 -154 10 -46 65 283 12 317 -170 371 -51 221 43 51 -179 -108 -122
5264 -122 -360 252 -251 4 -298 -156 437 -152 -158 -29 -83 -10 97 25 -240 210 -200 -31 -51 130 173 146 -351
5287 -351 311 435 -98 148 74 -227 222 -336 139 185 300 263 -87 46 101 111 186 -30 328 -160 -79 161
5309 161 -142 12 443 -320 -15 163 -144 109 154 -283 -61 -337 174 133 -329 -288 -188 -107 -397 86 51 311
5331 311 -264 -123 -167 330 115 173 -188 -347 123 311 188 -312 113 -4 280 -4 227 -409 298 221 -102
5352 -102 234 -53 558 226 699 -54 -201 260 201 453 147 -130 258 214 -327 -157 146 148 287 -154 301
5373 301 28 48 315 -194 7 -374 -134 84 52 -200 -357 31 -6 -102 75 -283 -12 22 82 -25 -221 -132
5395 -132 -126 228 -492 -355 -392 96 -158 64 -68 141 -39 -223 -150 -142 -6 -120 72 163 51 423 325 -130 128
5418 128 288 334 338 96 124 196 181 182 157 190 353 20 -250 1 -48 -242 353 -255 160 16 573 -163 157 -437
5442 -437 -501 123 -190 70 221 -130 -421 -52 -50 6 -138 -270 182 -150 -205 -117 -161 -606 154 -243 69 -530
5464 -530 -375 -163 -120 -85 -172 -335 80 -190 187 -106 107 -100 193 21 250 436 -194 153 308 178 222
5485 222 477 400 152 444 509 -165 -56 34 -271 -207 245 -22 344 300 -248 180 133 -396 -102 137 63 -150
5507 -150 -20 -298 117 136 35 324 -443 -162 140 -302 78 -66 31 113 -60 106 -154 -422 294 357 33
5528 33 64 -476 145 -290 60 -212 123 58 -251 -2 -236 -124 136 -184 81 -373 -155 -18 -39 181 290
5549 290 210 78 107 -76 215 99 381 310 -190 -186 184 -119 361 138 -270 153 -152 14 20 -71 196 340 126
5572 126 6 -248 -141 154 -65 -158 -376 -50 181 237 -26 -93 -160 -68 -17 -12 -244 -23 4 -87 -268 242 -175
5595 -175 -450 55 411 12 -84 271 -87 1 -126 463 148 24 511 -366 -386 -85 91 -235 333 145 -427
5616 -427 243 124 180 -65 417 182 579 -72 -18 1 224 61 236 -23 -271 -34 133 -411 -172 -43 -359
5637 -359 100 331 -216 38 -135 -326 -263 -217 -205 169 -45 -223 -3 -395 -440 207 27 -259 185 34 8 288
5659 288 -62 200 199 -267 228 315 -3 86 97 276 -100 429 -327 -278 24 84 409 -50 -75 166 72 -268 -257
5682 -257 445 254 -249 -18 89 -147 173 288 -31 185 -166 64 434 -268 446 74 -167 -351 41 -148
5702 -148 -170 85 -230 214 -130 -3 -275 -247 377 -269 -236 197 147 -340 -264 135 180 264 503 204 -158 -203 -145
5725 -145 -58 147 -48 161 -65 -176 29 545 -217 52 104 -15 58 -47 280 -30 71 -21 100 187 20 357
5747 357 46 -299 302 162 -21 71 -76 199 119 304 -454 138 204 403 470 133 -30 127 -132 249 81
5768 81 -214 -299 -218 -96 -157 -110 -157 111 25 -146 129 -330 92 296 -97 -550 -223 263 -25 348 -336 276
5790 276 74 157 149 137 266 -111 230 -39 185 -304 -317 253 288 390 48 221 -75 404 263 -268 -101 -218
5812 -218 99 -159 420 -276 215 -12 42 317 -70 137 -290 247 91 147 226 157 -171 -175 107 197 -181 125
5834 125 -191 316 -35 -71 338 -236 -172 -501 293 307 149 -49 -141 475 147 356 -65 396 128 23 173
5855 173 86 -222 1 134 333 365 -111 196 178 495 126 289 82 -152 -208 -128 461 -312 197 -139 -196 -72
5877 -72 -315 -1 245 18 121 235 -16 -32 343 26 139 263 -787 18 51 -58 126 58 -550 -268 -349
5898 -349 186 79 -211 -118 137 269 -538 -239 -62 -357 191 258 12 -91 170 -53 -45 -45 -277 -71 -68 211 -59
5921 -59 244 409 -188 -79 204 367 317 -11 377 106 465 -141 28 49 -179 449 21 -96 369 295 363 250
5943 250 -27 148 -238 358 121 -114 43 -29 -193 -169 -57 -17 29 15 240 199 34 -90 94 -137 210 132
5965 132 -235 -53 22 -121 122 -111 64 -87 257 -197 -664 -98 92 -46 -378 172 194 130 150 -244 297
5986 297 -123 -325 447 82 244 -36 -89 535 -48 -24 176 -322 151 250 -326 169 -23 -230 143 -58 359
6007 359 -257 -173 -55 103 -249 320 339 -650 -110 -22 -441 -208 -407 -292 -282 -214 154 -430 -436 -208 181 -190
6029 -190 -116 156 205 192 153 115 -130 -221 -154 58 122 -82 48 180 -132 -49 -57 -445 -218 -67 -28 208 133 458
6053 458 85 -53 2 224 435 73 3 -200 248 -365 -30 -161 77 303 217 69 -36 168 -262 27 451
6074 451 -277 -91 -294 155 38 -12 -180 -79 197 -416 244 -240 23 66 -134 2 -257 -138 -209 107 -149
6095 -149 126 -102 173 -122 -160 -218 -270 387 72 257 -81 403 115 -343 78 103 107 252 -138 341 279 410
6117 410 -81 198 383 84 299 171 90 274 -349 73 -2 389 -28 30 6 -493 133 -199 -100 -384 -153 -341
6139 -341 65 -119 -261 -386 -406 -479 -128 -378 -159 711 -475 -146 235 48 -32 79 77 -205 -27 -3 53 -172
6161 -172 -382 -26 187 -169 -209 64 -80 294 97 -31 212 42 256 146 97 183 165 71 133 26 29 397 22
6184 22 239 -107 101 28 -93 10 49 15 -9 262 216 80 490 222 113 -126 -121 111 143 -51 385 -654 -78
6207 -78 219 -275 -192 169 132 -136 -394 -225 -108 -86 130 341 -28 36 -314 -245 208 -167 364 -104 -487 264
6229 264 339 -295 -59 -150 -78 -60 -133 -649 205 205 459 100 120 -141 -5 -299 287 -220 -6 253 -141 448 107
6252 107 -45 -194 167 38 -134 -15 330 177 561 489 102 -312 253 -36 -5 274 -336 53 120 -124 8
6273 8 -148 -262 364 170 -312 -281 -607 243 87 240 -226 -255 -34 -87 -197 187 633 -111 225 211 37 152
6295 152 134 176 -380 -123 -264 264 -143 130 454 -81 258 -394 183 175 217 151 62 364 353 6 57 345 279
6318 279 45 -198 -166 171 119 30 3 -21 -41 -26 331 -423 196 359 -214 330 -48 270 275 8 307 -125 -41
6341 -41 -133 -277 -445 112 -54 -55 -223 2 -302 -290 55 -54 348 196 482 -87 25 -196 -303 -11 325 -178
6363 -178 -93 160 -65 -282 40 -139 213 157 -14 86 132 168 28 137 22 270 71 -86 148 -246 -64
6384 -64 -128 -177 239 -7 -190 106 117 -114 -119 16 159 -85 50 52 -155 -95 369 -296 102 187 -92 246 65
6407 65 165 -111 -124 -181 342 -308 38 23 -69 -115 -195 173 0 -475 194 405 84 598 -1 139 55 131 38
6430 38 -232 80 172 -183 257 -171 -288 -231 -15 111 121 39 261 288 -109 53 90 231 -298 -75 -78 111 76
6453 76 -142 -9 60 14 -149 -60 354 290 -152 55 141 75 -252 -349 -392 -222 133 94 -88 -161 46 -212 193 237
6477 237 -432 -619 -91 -201 151 -285 9 162 -106 -308 -352 117 -30 269 377 -241 131 143 -107 174 53
6498 53 -171 -291 142 58 -101 188 169 -75 284 266 -281 -119 -26 -111 -225 -110 65 141 146 -50 -203 -112 121
6521 121 251 -112 -95 111 278 47 346 229 -342 -189 -306 442 -205 93 -148 -30 22 72 -124 98 100 -307
6543 -307 22 -128 -228 294 -89 142 589 -88 -85 -2 -29 -53 132 -94 53 -257 -15 228 53 350 -66 -97
6565 -97 258 302 -35 92 -147 -67 160 25 274 38 212 397 77 -384 -57 190 414 -152 183 62 312
6586 312 214 -463 -446 400 -165 22 -451 39 107 61 157 199 -297 -164 -4 -391 -23 -552 -266 -189 -203 -77 -244
6609 -244 -122 153 -194 279 82 -340 344 385 393 314 -153 -145 380 -48 114 -265 30 415 -282 320 -63 332
6631 332 304 495 -173 -107 320 -166 -260 460 309 762 530 91 1 -291 424 -12 286 -30 -72 -30 49 -215
6653 -215 -382 116 275 -285 689 -341 -110 135 159 -558 -191 -423 -135 -233 185 310 194 -580 271 -102
6673 -102 303 -142 220 -164 -313 516 -134 -207 146 -96 -72 -233 502 -94 -356 142 -149 342 18 -537 104
6694 104 404 130 382 -157 205 38 -230 -3 -83 -202 300 -250 359 155 227 -56 -471 109 -85 -6 -37
6715 -37 139 -539 57 -176 -225 -432 410 100 -6 326 -82 73 -397 -104 -207 -286 -320 -368 -78 -270 140 156
6737 156 -39 -189 231 -593 -146 80 46 -196 -42 129 111 135 350 220 475 46 33 215 323 291 -573 -211
6759 -211 166 -172 -121 160 -142 -245 -136 -15 129 -45 333 -72 -39 -219 -176 -584 188 259 -40 116 23 8
6781 8 130 -236 40 252 -217 -244 4 417 -100 17 173 -230 -42 -7 48 55 -40 -551 53 12 -18 121 -213
6804 -213 -335 -35 -232 192 32 -276 -62 -33 -60 195 -35 -19 -168 -95 451 202 411 -156 -66 120 -32 -206
6826 -206 38 22 207 -88 463 -36 -153 350 -275 -202 -278 114 -295 222 14 213 -25 313 -313 0 419
6847 419 -80 -197 63 -59 -271 113 -99 254 -119 -18 -238 151 -179 68 -131 -216 713 -36 -176 108
6867 108 86 -219 573 384 71 -238 -59 6 134 189 -204 -295 -113 -120 -373 -322 480 536 -217 517 230 317 62
6890 62 -139 516 31 -227 -1 99 251 -145 -70 229 74 165 -288 261 -402 -309 -96 -166 -274 100 -230 -338
6912 -338 -235 -165 -375 51 166 -346 -564 114 311 -301 -241 -51 -298 366 -25 -16 155 -69 -156 -79 -193 -21
6934 -21 45 -354 -331 -152 86 274 161 118 -59 235 -338 -195 119 208 526 265 193 -59 -249 -182 123 271
6956 271 -60 -92 -87 37 -6 86 291 -67 393 -243 -76 202 -101 163 148 336 -182 -133 580 247 -138 -64 -170
6979 -170 -396 234 152 317 139 87 -140 -251 -233 -216 43 24 45 -42 355 -59 -121 -28 -146 -249 -104 23 -166
7002 -166 36 306 314 543 -53 -63 218 323 104 495 -164 41 -208 -166 255 170 -86 154 267 326 171 -107
7024 -107 244 -206 110 233 -293 242 -113 -306 310 6 -253 -81 72 228 263 127 136 -61 28 138 -81
7045 -81 -30 610 77 385 47 19 -69 47 25 337 87 -410 94 186 -631 197 -67 -159 -454 -33 18 177 -78
7068 -78 132 75 254 -455 -134 36 -24 -223 121 -225 -79 -364 16 -87 76 17 -49 30 216 222 -92 -254 -301
7091 -301 116 -203 -31 295 319 -187 -341 -64 134 195 256 -165 167 49 -64 -310 -180 233 111 43 -82
7112 -82 173 -25 -226 -242 -408 -189 304 -411 -98 -96 114 -79 -281 240 445 230 73 -1 337 -188 -5 75
7134 75 -78 236 -75 120 356 252 -384 62 164 390 48 -306 -62 208 169 -38 178 388 -361 195 -115
7155 -115 -250 -215 -322 -110 35 -225 -199 -301 -175 40 256 274 274 -151 30 162 -249 -352 -186 139 -328 162
7177 162 -380 -228 -97 9 -118 184 395 -358 137 -12 113 -90 -114 -330 5 -10 87 459 311 -49 -151
7198 -151 296 337 -218 0 82 304 -406 -162 -12 -303 -142 62 723 -129 75 82 -13 87 -248 37 -223 -60
7220 -60 -37 55 45 -59 -114 336 -628 308 -154 11 -246 -28 -153 -124 184 182 92 -588 -189 -201 -310 166 -347
7243 -347 -89 92 222 -19 203 -323 -209 603 482 75 88 147 122 41 332 25 -180 266 -126 7 -145
7264 -145 -40 38 305 -334 48 24 101 228 -87 11 207 230 -104 139 243 116 -7 111 22 505 212 -186
7286 -186 -33 217 21 -379 278 368 -17 22 108 -60 21 172 -244 162 -50 112 -344 -139 323 134 320
7307 320 -60 -231 -68 -169 118 -394 8 -29 -90 9 191 422 139 100 -201 7 -317 -66 -146 117 -90 35
7329 35 468 297 -178 -203 423 -500 281 261 204 -115 -109 363 -61 240 -149 81 -182 -331 181 155 -28 537
7351 537 -145 107 -95 406 -20 206 6 -216 101 26 -95 77 2 233 498 -337 -421 -233 99 341 274
7372 274 116 -67 130 78 -1 57 -55 153 73 258 222 219 -57 -74 -83 -61 -56 84 -398 126 -394 104 464 110
7396 110 -86 399 74 -60 -387 -369 150 209 67 326 375 -86 -208 -127 -60 -148 30 98 -183 384 1 -256
7418 -256 -144 -217 -600 -361 -328 -250 2 -208 183 95 -78 -288 -18 179 -244 -179 -161 108 525 20 -108 273
7440 273 325 259 -108 -140 143 -130 45 168 -240 22 51 -97 -66 49 69 -347 300 59 186 152 225 34 -228
7463 -228 85 143 -645 -118 -473 84 -24 -139 -9 -62 -126 -47 207 -272 90 24 93 229 110 -101 86 -246
7485 -246 138 390 -241 234 20 -15 -263 -77 -355 -374 -195 108 146 -152 -424 -459 -20 166 -170 -84 -534 -29
7507 -29 288 -117 154 -317 166 79 577 54 -378 -351 -65 331 -336 -188 677 365 -50 -4 3 85 163 -97 -151
7530 -151 295 168 423 409 -296 -493 236 444 72 -103 -348 171 -326 -8 343 -4 174 -223 231 -50
7550 -50 121 -78 -53 60 224 -369 -247 -29 133 2 52 279 -253 -128 41 -189 46 -54 -297 -313 68
7571 68 156 292 -8 -212 -134 101 -138 353 264 -119 123 -13 296 -279 -131 -220 127 -6 61 474 13 9 -112
7594 -112 -89 -200 315 -146 245 47 26 280 -88 -178 12 213 416 263 -6 243 132 35 -317 -126 -125 38
7616 38 50 70 -148 -149 21 137 -194 -380 85 -411 -246 292 -193 -57 5 107 474 -173 -258 279 45 -217
7638 -217 88 63 126 -132 -120 181 -271 28 355 151 294 11 192 -117 145 -235 403 -159 158 152 188 -303
7660 -303 -84 311 35 -72 168 316 155 -46 -69 84 -69 -88 311 56 -42 121 276 -271 -353 95 -170
7681 -170 111 21 -165 -305 -6 -229 145 -239 -219 -54 -253 -22 391 -118 -23 202 -36 -80 278 -214 -354
7702 -354 -184 -153 28 26 -101 -233 387 -45 -273 123 220 220 226 -187 144 401 567 170 130 -181 -124 -52 166 329
7726 329 -235 -416 198 -294 -322 -38 580 -234 234 -117 -80 317 -54 -187 -417 284 -74 -145 -575 176 -304
7747 -304 -15 -43 323 166 64 -39 -69 136 -214 124 294 94 309 104 218 -51 165 -178 200 -438 460
7768 460 338 -183 65 -94 -107 -89 -5 -54 404 1 468 229 -270 281 27 311 147 83 -165 -482 -17 44
7790 44 -106 31 186 -507 -485 306 -134 47 -69 -281 -35 44 364 -251 -172 -162 -97 -109 -356 -312 -200 -168 -397
7813 -397 233 -6 -38 -266 -241 -210 -126 173 49 -35 37 -28 77 159 -166 -190 326 6 584 227 24 91 -235
7836 -235 164 177 57 517 117 -174 -346 -124 -10 -347 -37 204 -31 -249 297 91 -237 -70 34 324
7856 324 -84 -81 211 57 -240 -81 457 37 -48 -257 -79 -201 -385 133 104 -75 111 -67 0 -411 -91 73
7878 73 -46 -126 491 -46 408 58 339 149 -30 -180 -93 -293 -421 212 -218 164 317 -20 43 -533 169
7899 169 4 7 24 116 -284 148 64 105 245 231 -50 139 15 287 56 -5 -249 -199 -39 12 -337 217 -218
7922 -218 34 -177 -15 73 -183 358 151 -86 -18 -31 96 -122 94 -82 0 124 -251 -157 286 -263 7 13
7944 13 -94 -35 78 -10 192 -222 28 -343 -189 250 -339 54 -116 166 -9 45 215 -45 103 174 -340 116
7966 116 250 -100 -322 -416 471 -189 398 -13 -201 318 22 346 -542 30 -15 -352 6 -10 22 96 261 79
7988 79 -226 -365 -76 -276 -111 -91 -335 -24 162 201 -49 209 44 310 -11 18 -33 -206 85 -9 203 204 -217
8011 -217 -102 328 310 89 118 25 -289 111 -259 367 123 -115 -89 32 182 154 -12 -273 297 299 125 223 500
8034 500 254 94 548 -51 140 -266 159 203 299 18 103 -31 262 371 -65 -87 61 94 183 -24 61 451
8056 451 -112 -94 -296 234 -234 248 20 -471 -489 378 117 17 -93 62 -11 -3 169 5 287 -43 165 240
8078 240 24 29 271 -153 -237 116 -31 288 -190 -111 302 -246 -307 125 -209 -34 154 -115 267 80 206 3
8100 3 151 -144 50 193 -86 -465 -181 -142 45 77 -43 -26 -212 70 133 24 -154 354 -218 94 -69 -34
8122 -34 166 339 180 143 -42 21 -126 -191 -123 -67 35 152 19 10 -291 -280 83 71 498 268 233 -187 348 73
8146 73 -306 123 -209 55 -63 223 3 32 -130 157 310 -158 111 222 27 -46 123 -6 10 -63 142 166
8168 166 197 131 263 -227 370 336 248 204 -203 -325 278 -261 288 220 379 -89 -51 109 111 148 310 173 -265
8191b65
##END NTUPLES=NMR FID
##END=
