##TITLE=1H ikalashn
5237-H
16.9.2024
##JCAMPDX= 6.0         $$ Bruker NMR JCAMP-DX V2.0
##DATA TYPE= NMR SPECTRUM
##DATA CLASS= NTUPLES
##ORIGIN= UXNMR, Bruker Analytische Messtechnik GmbH
##OWNER= root
$$ TOPSPIN		Version 1.3
$$ 2024-09-16 13:59:58.203 +0400  Irina@DPX200
$$ Compression mode = diff/dup
##.OBSERVE FREQUENCY= 200.131392401
##.OBSERVE NUCLEUS= ^1H
##.ACQUISITION MODE= SIMULTANEOUS
##.ACQUISITION SCHEME= undefined
##.AVERAGES= 64
##.DIGITISER RES= 18
##SPECTROMETER/DATA SYSTEM= spect
##.PULSE SEQUENCE= zg
##.SOLVENT NAME= DMSO
##.SHIFT REFERENCE= INTERNAL, DMSO, 1, 17.95386
##AUDIT TRAIL= $$ (NUMBER, WHEN, WHO, WHERE, WHAT)
$$ ##TITLE= Audit trail, TOPSPIN		Version 1.3
$$ ##JCAMPDX= 5.01
$$ ##ORIGIN= Bruker BioSpin GmbH
$$ ##OWNER= Irina
$$ $$ F:/spectra/data/iren/nmr/1H/4/pdata/1/auditp.txt
$$ ##AUDIT TRAIL=  $$ (NUMBER, WHEN, WHO, WHERE, VERSION, WHAT)
(   1,<2024-09-16 13:58:45.093 +0400>,<Irina>,<DPX200>,<TOPSPIN 1.3>,
      <created by zg
	started at 2024-09-16 13:54:31.906 +0400,
	POWCHK disabled, PULCHK disabled
       configuration hash MD5:
       BE 6D 3F 07 2A EA 11 49 91 17 2B D3 AF B3 58 0D
       data hash MD5: 16K
       27 3C 31 33 92 39 82 AD C3 BB 42 18 94 7A B2 0E>)
(   2,<2024-09-16 13:59:22.421 +0400>,<Irina>,<DPX200>,<TOPSPIN 1.3>,
      <Start of raw data processing
       efp BC_mod = 2 LB = 0.02 FT_mod = 6 PKNL = 1 PHC0 = 305.3314 PHC1 = 4.916258 SI = 32K 
       data hash MD5: 32K
       DE F6 16 5C 9E BC 2C 58 4D BC BC 76 40 A6 83 A1>)
(   3,<2024-09-16 13:59:24.453 +0400>,<Irina>,<DPX200>,<TOPSPIN 1.3>,
      <apk 
       data hash MD5: 32K
       95 DD 1B 7C 99 AE 83 8D 70 DE DA 95 72 91 E4 37>)
(   4,<2024-09-16 13:59:47.031 +0400>,<Irina>,<DPX200>,<TOPSPIN 1.3>,
      <pk fgphup PHC0 = 23.08115 PHC1 = -54.4 
       data hash MD5: 32K
       3A 23 8B 51 FD B1 AF 5D 1E 92 CF 68 E1 F9 22 93>)
$$ ##END=
$$ 
$$ $$ hash MD5
$$ $$ 96 57 A5 69 04 BD 4F 4A 80 E0 5C 07 BF 8B 91 4B
##$RELAX= 
##$RELAX= 
##$RELAX= 
##$RELAX= 
##$RELAX= 
##$RELAX= 
##$RELAX= 
##$RELAX= 
##$RELAX= 
$$ Bruker specific parameters
$$ --------------------------
##$DU= <F:/spectra>
##$EXPNO= 4
##$NAME= <1H>
##$PROCNO= 1
##$TYPE= <nmr>
##$USER= <iren>
##$AMP= (0..31)
100 100 100 100 100 100 100 100 100 100 100 100 100 100 100 100 100 100 
100 100 100 100 100 100 100 100 100 100 100 100 100 100 
##$ANAVPT= -1
##$AQSEQ= 0
##$AQ_mod= 1
##$AUNM= <au_zg>
##$AUTOPOS= <>
##$BF1= 200.13
##$BF2= 200.13
##$BF3= 200.13
##$BF4= 200.13
##$BF5= 200.13
##$BF6= 200.13
##$BF7= 200.13
##$BF8= 200.13
##$BYTORDA= 1
##$CFDGTYP= 0
##$CFRGTYP= 5
##$CHEMSTR= <none>
##$CNST= (0..63)
1 1 145 1 1 1 1 1 1 1 1 1 1 1 1 1 1 1 1 1 1 1 1 1 1 1 1 1 1 1 1 1 1 1 
1 1 1 1 1 1 1 1 1 1 1 1 1 1 1 1 1 1 1 1 1 1 1 1 1 1 1 1 1 1 
##$CPDPRG= <>
##$CPDPRG1= <>
##$CPDPRG2= <>
##$CPDPRG3= <>
##$CPDPRG4= <mlev>
##$CPDPRG5= <mlev>
##$CPDPRG6= <mlev>
##$CPDPRG7= <mlev>
##$CPDPRG8= <mlev>
##$CPDPRGB= <>
##$CPDPRGT= <>
##$D= (0..63)
$$ [...]
##$SW_h= 4401.40845070422
##$TD= 16384
##$TD0= 1
##$TE= 300
##$TE2= 300
##$TE3= 300
##$TEG= 300
##$TL= (0..7)
0 120 120 120 120 120 120 120 
##$TP= (0..7)
150 150 150 150 150 150 150 150 
##$TP07= 0
##$TPNAME0= <>
##$TPNAME1= <>
##$TPNAME2= <>
##$TPNAME3= <>
##$TPNAME4= <>
##$TPNAME5= <>
##$TPNAME6= <>
##$TPNAME7= <>
##$TPOAL= (0..7)
0.5 0.5 0.5 0.5 0.5 0.5 0.5 0.5 
##$TPOFFS= (0..7)
0 0 0 0 0 0 0 0 
##$TUNHIN= 0
##$TUNHOUT= 0
##$TUNXOUT= 0
##$USERA1= <user>
##$USERA2= <user>
##$USERA3= <user>
##$USERA4= <user>
##$USERA5= <user>
##$V9= 5
##$VALIST= <valist>
##$VCLIST= <CCCCCCCCCCCCCCC>
##$VD= 0
##$VDLIST= <DDDDDDDDDDDDDDD>
##$VPLIST= <PPPPPPPPPPPPPPP>
##$VTLIST= <TTTTTTTTTTTTTTT>
##$WBST= 1024
##$WBSW= 25
##$XGAIN= (0..3)
0 0 0 0 
##$XL= 0
##$YL= 0
##$YMAX_a= 2455515
##$YMIN_a= -1094753
##$ZGOPTNS= <>
##$ZL1= 120
##$ZL2= 120
##$ZL3= 120
##$ZL4= 120
##$ABSF1= 0
##$ABSF2= 0
##$ABSG= 0
##$ABSL= 0
##$ALPHA= 0
##$AQORDER= 0
##$ASSFAC= 0
##$ASSFACI= 0
##$ASSFACX= 0
##$ASSWID= 0
##$AUNMP= <proc_1d>
##$AXLEFT= 0
##$AXRIGHT= 0
##$AXTYPE= 0
##$AXUNIT= <>
##$AZFE= 0.1
##$AZFW= 0.1
##$BCFW= 0
##$BC_mod= 2
##$BYTORDP= 0
##$COROFFS= 0
##$CY= 7568.61572265625
##$DATMOD= 1
##$DC= 0
##$DFILT= <>
##$DTYPP= 0
##$F1P= 17.9538593292236
##$F2P= -4.03888763876832
##$FCOR= 0.5
##$FTSIZE= 32768
##$FT_mod= 6
##$GAMMA= 0
##$GB= 0
##$INTBC= 0
##$INTSCL= 1.483618e-010
##$ISEN= 128
##$LB= 0.02
##$LEV0= 0
##$LPBIN= 0
##$MAXI= 945.577
##$MC2= 0
##$MEAN= 0
##$ME_mod= 0
##$MI= -402.1523
##$NCOEF= 0
##$NC_proc= -5
##$NLEV= 6
##$NOISF1= 8.587773
##$NOISF2= 6.764455
##$NSP= 0
##$NTH_PI= 0
##$NZP= 0
##$OFFSET= 17.95386
##$PC= 1
##$PHC0= 106.5699
##$PHC1= 0.9436302
##$PH_mod= 1
##$PKNL= yes
##$PPARMOD= 0
##$PPDIAG= 0
##$PPIPTYP= 0
##$PPMPNUM= 100
##$PPRESOL= 1
##$PSCAL= 0
##$PSIGN= 0
##$REVERSE= no
##$SF= 200.13
##$SI= 32768
##$SIGF1= 16.12182
##$SIGF2= -4.496377
##$SINO= 3.521527
##$SIOLD= 32768
##$SREGLST= <1H.CDCl3>
##$SSB= 0
##$STSI= 32768
##$STSR= 0
##$SW_p= 4401.40845070423
##$SYMM= 0
##$S_DEV= 0
##$TDeff= 16384
##$TDoff= 0
##$TI= <>
##$TILT= no
##$TM1= 0
##$TM2= 0
##$TOPLEV= 0
##$USERP1= <user>
##$USERP2= <user>
##$USERP3= <user>
##$USERP4= <user>
##$USERP5= <user>
##$WDW= 1
##$XDIM= 32768
##$YMAX_p= 399680469
##$YMIN_p= -2314433
$$ End of Bruker specific parameters
$$ ---------------------------------
##NTUPLES= NMR SPECTRUM
##VAR_NAME=  FREQUENCY,     SPECTRUM/REAL,   SPECTRUM/IMAG
##SYMBOL=    X,             R,               I
##VAR_TYPE=  INDEPENDENT,   DEPENDENT,       DEPENDENT
##VAR_FORM=  AFFN,          ASDF,            ASDF
##VAR_DIM=   32768,         32768,           32768
##UNITS=     HZ,            ARBITRARY UNITS, ARBITRARY UNITS
##FACTOR=    0.134324425510551, 1,           1
##FIRST=     4401.40845070423, -1476993,     -2538293
##LAST=      0,             -1207697,        -2737778
##MIN=       0,             -2314433,        0
##MAX=       4401.40845070423, 399680469,    0
$$ Real data points
##PAGE= N=1
##DATA TABLE= (X++(R..R)), XYDATA
$$ [...]
10346F3471240j176581n05244k85256o99560r79480p05996l84947m49531n42168
$$ 63471240 62294659 61789415 61504159 60804599 59825119 59119123 58734176 58284645 57742477
10337E7742477k48803J41263J61101n7458q5076J06146K64435L76018N57466O67550
$$ 57742477 57493674 57634937 57796038 57738580 57653504 57759650 58024085 58400103 58957569 59625119
10327E9625119N18124L03718L62088O35190P97011P94881Q23572Q70282P74316
$$ 59625119 60143243 60446961 60809049 61444239 62241250 63036131 63859703 64729985 65504301
10318F5504301O90310R58737J458856J628722J304898J041111J306047J806643
$$ 65504301 66194611 67153348 68612204 70240926 71545824 72586935 73892982 75699625
10310G5699625K006329J967073K166008K660890L001361K985865K986290L334987
$$ 75699625 77705954 79673027 81839035 84499925 87501286 90487151 93473441 96808428
10302I6808428L806757M008298L983067M048565M185691M002934L319070K421773
$$ 96808428 100615185 104623483 108606550 112655115 116840806 120843740 124162810 126584583
10294A26584583J629820Q90109J388r75402j775041k287708k628831k884567k985865
$$ 126584583 128214403 129104512 129105900 128130498 126355457 124067749 121438918 118554351 115568486
10285A15568486k851878k518517k106047j752207j556504j492101j410814j237027
$$ 115568486 112716608 110198091 108092044 106339837 104783333 103291232 101880418 100643391
10277A00643391j084174j042607r59905o62727l23355k80480m64073l72525J90697
$$ 100643391 99559217 98516610 97556705 96893978 96570623 96290143 95826070 95453545 95644242
10268I5644242O98119N67764N4613K0267P86042J640033J727492J155390Q34826
$$ 95644242 96342361 96910125 96964738 96985005 97771047 99411080 101138572 102293962 103128788
10259A03128788J288218K026820K291669K081549K054797K533249L074909L140611
$$ 103128788 104417006 106443826 108735495 110817044 112871841 115405090 118479999 121620610
10251A21620610K761159K284726J803296J191116M80701j88747q40681j509985
$$ 121620610 124381769 126666495 128469791 129660907 130141608 129952861 129112180 127602195
10243A27602195j997386k192470k439819l036185l526381l206194k295521j787546
$$ 127602195 125604809 123412339 120972520 117936335 114409954 111203760 108908239 107120693
10235A07120693j976688k026784j378370o83444o99306j046303r27357m76975
$$ 107120693 105144005 103117221 101738851 101055407 100356101 99309798 98382441 97905466
10227I7905466l95142o38355n49760j08160L6485k21388k46871J46564L18226
$$ 97905466 97510324 96871969 96322209 96214049 96250534 96029146 95782275 95928839 96247065
10218I6247065n9169l95436j81164J99585J90690o8108j57838r3155m4554J49496
$$ 96247065 96187896 95792460 95611296 95810881 96001571 95933463 95775625 95682470 95637916 95787412
10208I5787412O00587R29763Q02938N46017O57709J044138J298686J409756J600174
$$ 95787412 96387999 97317762 98120700 98666717 99324426 100368564 101667250 103077006 104677180
10199A04677180J778785J786100J909522K481156L184375L456283L405444L602593
$$ 104677180 106455965 108242065 110151587 112632743 115817118 119273401 122678845 126281438
10191A26281438M077091M287197M059804L785877L609157L160298K254742J197104
$$ 126281438 130358529 134645726 138705530 142491407 146100564 149260862 151515604 152712708
10183A52712708K25404p39791j657210k295253k725971l244654l686655l551662
$$ 152712708 152938112 152198321 150541111 148245858 145519887 142275233 138588578 135036916
10175A35036916k955418k628864k723888k531841j778131j215800j332184j440246
$$ 135036916 132081498 129452634 126728746 124196905 122418774 121202974 119870790 118430544
10167A18430544q86427k64891l69954o89318k21500P07568Q75132K23548K5518
$$ 118430544 117544117 117279226 116909272 116219954 115998454 116706022 117581154 117804702 117830220
10158A17830220Q35271J655501J599203J183392J300840J865989K268030K453203
$$ 117830220 118665491 120320992 121920195 123103587 124404427 126270416 128538446 130991649
10150A30991649K743735L079740L212923L323235L754623M366249M748182M895832
$$ 130991649 133735384 136815124 140028047 143351282 147105905 151472154 156220336 161116168
10142A61116168N110530N371249N338218M912432M336260L786620L252648K743799
$$ 161116168 166226698 171597947 176936165 181848597 186184857 189971477 193224125 195967924
10134A95967924K259162J643301Q27123J02324k08359k35449l39920n47616o38258
$$ 195967924 198227086 199870387 200697510 200799834 200591475 200356026 200016106 199468490 198830232
10125A98830232o63944q61718j107820j020095o45091m87827p36745r95711r76848
$$ 198830232 198166288 197304570 196196750 195176655 194531564 194043737 193306992 192311281 191334433
10116A91334433r40833j172798j484493j577964j518048j478998j349006r71856
$$ 191334433 190393600 189220802 187736309 186158345 184640297 183161299 181812293 180840437
10108A80840437n16159k14004O1013N78570J278522J865527K246013K562527K930551
$$ 180840437 180324278 180110274 180171287 180749857 182028379 183893906 186139919 188702446 191632997
10099A91632997L410665M042103M612060M658737M082406L469310L339561L364886
$$ 191632997 195043662 199085765 203697825 208356562 212438968 215908278 219247839 222612725
10091B22612725K920719K136792J643606J462975J076577N80755P06852J449368
$$ 222612725 225533444 227670236 229313842 230776817 231853394 232434149 233141001 234590369
10083B34590369J779865J239786P48542J060856J422614Q09982l40543r48994
$$ 234590369 236370234 237610020 238358562 239419418 240842032 241652014 241311471 240362477
10075B40362477j224762k246493l887486m828034m752728m869022n762893o344334
$$ 240362477 239137715 236891222 233003736 228175702 223422974 218553952 212791059 206446725
10067B06446725n762954m916550m878388n033815m236321k932348k481398k844173
$$ 206446725 200683771 195767221 190888833 185855018 181618697 178686349 176204951 173360778
10059A73360778k656111j512716n43925m77851o35129l48879n5630k56959n01051
$$ 173360778 170704667 169191951 168648026 168170175 167535046 167186167 167130537 166873578 166372527
10050A66372527k54544O6742j72147p14855q98701p46260p39520q91673q35121
$$ 166372527 166117983 166184725 166012578 165297723 164399022 163652762 162913242 162021569 161186448
10041A61186448n43537k57860K2799L08239K17675m46526j072474j047017r01276
$$ 161186448 160642911 160385051 160407850 160716089 160933764 160487238 159414764 158367747 157466471
10032A57466471j638270l049295l831135l511665l136706l641279m532128m801810
$$ 157466471 155828201 152778906 148947771 145436106 142299400 138658121 134125993 129324183
10024A29324183m379207l957571l897411l970936l874274l471367k798911k207301
$$ 129324183 124944976 120987405 117089994 113119058 109244784 105773417 102974506 100767205
10016A00767205k149150k493197k512250j943477j487480j702102k011335j602340
$$ 100767205 98618055 96124858 93612608 91669131 90181651 88479549 86468214 84865874
10008H4865874q01430n72447r58828j130150q84503r12269j379857j449010p16311
$$ 84865874 84064444 83491997 82533169 81403019 80518516 79606247 78226390 76777380 76061069
9999G6061069p4551l69091j024513r48884k35468P5674l46633p48483n78964k21847
$$ 76061069 75986518 75617427 74592914 73644030 73408562 73484236 73137603 72389120 71810156 71588309
9989G1588309k03076m18907n25715n44295o52119p46261o27166m02644l64385
$$ 71588309 71385233 70966326 70440611 69896316 69244197 68497936 67870770 67468126 67103741
9980F7103741n72509q03369q31159o11437k86749j11097k29808m53331m29850
$$ 67103741 66531232 65727863 64896704 64285267 63998518 63887421 63657613 63204282 62774432
9971F2774432j23554J07730K3153j80008k23438j47457j22495j28071j08897k09075
$$ 62774432 62650878 62758608 62781761 62601753 62378315 62230858 62108363 61980292 61871395 61662320
9961F1662320n09370p40022o41078m31474m82869o72212n78432k62083k56244
$$ 61662320 61152950 60412928 59771850 59340376 58857507 58185295 57606863 57344780 57088536
9952E7088536o92092j017443q16169l97844k56242l72764m35334m06417m57066
$$ 57088536 56396444 55379001 54562832 54164988 53908746 53535982 53100648 52694231 52237165
9943E2237165n67749n85188n24221m92497m60360l81409l65677m57956m47879
$$ 52237165 51669416 51084228 50560007 50067510 49607150 49225741 48860064 48402108 47954229
9934D7954229k01571L2263k3208k32066l12379k99516l33809k51591R6396L47560
$$ 47954229 47752658 47784921 47761713 47529647 47217268 46917752 46583943 46332352 46428748 46776308
9924D6776308O6703m56840n26051r9186J80745N6237j5493K22103L56880Q9716
$$ 46776308 46843011 46386171 45860120 45760934 45941679 45997916 45982423 46204526 46561406 46651122
9914D6651122k10785j60003L9643R4070J40072K82027J80093l09512o11104k39674
$$ 46651122 46440337 46280334 46319977 46414047 46554119 46836146 47016239 46706727 46095623 45855949
9904D5855949L06660K38467k80477m29830o7259J39629j10122l37823k12758q9676
$$ 45855949 46162609 46401076 46120599 45690769 45623510 45763139 45653017 45315194 45102436 45012760
9894D5012760l04346n78331n13526k14542o0005j84758m52321o60209o05598k47176
$$ 45012760 44708414 44130083 43616557 43402015 43342010 43157252 42704931 42044722 41439124 41191948
9884D1191948R3613M1754k56475l02700n5994r348k89504l42479J16648M85995
$$ 41191948 41285561 41327315 41070840 40768140 40712146 40702798 40413294 40070815 40187463 40673458
9874D0673458J75653m00926m42388q517J41902j95921m07149j17327K39249J83145
$$ 40673458 40849111 40448185 40005797 39997280 40139182 39943261 39536112 39418785 39658034 39841179
9864C9841179r1769j61955q0521j55222k99693j40845K90486M75450J49280k56612
$$ 39841179 39749410 39587455 39506934 39351712 39052019 38911174 39201660 39677110 39826390 39569778
9854C9569778j95066K04774L03864j20153n09099k75274L75054P04585M12645
$$ 39569778 39374712 39579486 39883350 39763197 39254098 38978824 39353878 40058463 40471108
9845D0471108l2452p3932K47400M61494L14780K5287m8502J65780L96842L69838
$$ 40471108 40438656 40364724 40612124 41073618 41388398 41413685 41365183 41530963 41927805 42297643
9835D2297643J62146J13679L40306N30458M10198K10205L35254O91099P81795
$$ 42297643 42459789 42573468 42913774 43444232 43854430 44064635 44399889 45090988 45872783
9826D5872783M89642K87171N21477R18117J051391R54763R44191J086113J181830
$$ 45872783 46362425 46649596 47171073 48089190 49140581 50095344 51039535 52125648 53307478
9817E3307478J150415J134578J253427J424103J438364J194910Q97108R02847
$$ 53307478 54457893 55592471 56845898 58270001 59708365 60903275 61800383 62703230
9809F2703230J210304J305327Q78628M64205P82042J588429J948908J655135J445125
$$ 62703230 63913534 65218861 66097489 66561694 67343736 68932165 70881073 72536208 73981333
9800G3981333J624429J536620Q86692M87545Q78967J206752N66864l52195k64702
$$ 73981333 75605762 77142382 78029074 78516619 79395586 80602338 81169202 80817007 80552305
9791H0552305O68003J213461J113938J210343J626397J453795N01095j75754j8398
$$ 80552305 81220308 82433769 83547707 84758050 86384447 87838242 88339337 88163583 88145185
9782H8145185J15951n24067j340636j488698j194039j060442r29486m17955Q7660
$$ 88145185 88261136 87737069 86396433 84907735 83713696 82653254 81723768 81305813 81393473
9773H1393473k0167n07870p07064n98322o42951q82104j035445j199594j618422
$$ 81393473 81373306 80865436 80158372 79560050 78917099 78034995 76999550 75799956 74181534
9764G4181534j985715j790719j209965q95847r89344j061540r42257q94327j005015
$$ 74181534 72195819 70405100 69195135 68299288 67309944 66248404 65306147 64411820 63406805
9755F3406805j074473j102031j270574j460304j361510j051937r03033r51170
$$ 63406805 62332332 61230301 59959727 58499423 57137913 56085976 55182943 54231773
9747E4231773r16739p81699p63081p79087n61469k51920k41026m40166l90740
$$ 54231773 53315034 52533335 51770254 50991167 50429698 50177778 49936752 49496586 49105846
9738D9105846j00076m7004k94365l50914o4777J00561q1716k01813J3610K00473
$$ 49105846 49005770 48958766 48664401 48313487 48248710 48349271 48267555 48065742 48079352 48279825
9728D8279825K4384k33832j89500L2969J17602Q1111R5415J38448J59298K67212
$$ 48279825 48304209 48070377 47880877 47913846 48031448 48112559 48207974 48346422 48505720 48772932
9718D8772932M67695N31225L74876K49133L33678M92046N99928P25817Q31815
$$ 48772932 49240627 49771852 50146728 50395861 50729539 51221585 51821513 52547330 53379145
9709E3379145P44954N83301P00949J037408J104192Q30418P53927J070125J222178
$$ 53379145 54124099 54707400 55408349 56445757 57549949 58380367 59134294 60204419 61426597
9700F1426597Q72366N40825P01509R35231O70695J51699r5717k11351n91391j009566
$$ 61426597 62298963 62839788 63541297 64476528 65147223 65298922 65203205 64991854 64400463 63390897
9690F3390897j030484r07403j149620j519255j420459j035806j059165j448744
$$ 63390897 62360413 61453010 60303390 58784135 57363676 56327870 55268705 53819961
9682E3819961j497697j107231r22839j125312j150348q09770o51664q89451r70489
$$ 53819961 52322264 51215033 50292194 49166882 48016534 47206764 46555100 45665649 44695160
9673D4695160o33881m50250p72168j023230o88101k51314l99170q84709r71512
$$ 44695160 44061279 43611029 42838861 41815631 41127530 40876216 40477046 39592337 38620825
9664C8620825n76982k27889j87882l08575n02618p32221p27392l20109Q9337k8944
$$ 38620825 38043843 37815954 37628072 37319497 36816879 36084658 35357266 35037157 35126494 35097550
9654C5097550n27284p39317l94044R7329K45010k3119m35914o21141l55178J31950
$$ 35097550 34570266 33830949 33436905 33534234 33779244 33756125 33320211 32699070 32343892 32475842
9644C2475842K55230k01169o77056n53788m1357J63918p5895k49792r1303Q4659
$$ 32475842 32731072 32529903 31852847 31299059 31257702 31421620 31345725 31095933 31004630 31089289
9634C1089289K9517n1297L5354J12061k938j61847j75054j19168j30813j61020
$$ 31089289 31118806 31067509 31102863 31214924 31211986 31050139 30875085 30755917 30625104 30464084
9624C0464084j26164n5763N3790K53458L81149J34240m04187o78798l82752O9341
$$ 30464084 30337920 30282157 30335947 30589405 30970554 31104794 30700607 30021809 29639057 29708398
9614B9708398J32837j02175j59797L4429J09804r7045l30813l79356l20377k34735
$$ 29708398 29841235 29739060 29579263 29613692 29723496 29626451 29295638 28916282 28595905 28361170
9604B8361170o3860J31620J32061o7274j71695n4145J8583j48129l04890j58084
$$ 28361170 28297310 28428930 28560991 28493717 28322022 28267877 28286460 28138331 27833441 27675357
9594B7675357J28067J93920M6824l5848k0146j00953k52483k41262p4548P323
$$ 27675357 27803424 27997344 28044168 28008320 27988174 27887221 27634738 27393476 27318928 27326251
9584B7326251k819J02177K18673j0396m65599n02799M9318M52420J05878m94712
$$ 27326251 27323432 27425609 27644282 27633886 27168287 26665488 26714806 27167226 27273104 26778392
9574B6778392m75762J22675M85765K38901j87250l33092k03545J8401J85470J07060
$$ 26778392 26302630 26425305 26911070 27149971 26962721 26629629 26426084 26444485 26629955 26737015
9564B6737015k28724m01028o4675L81706K70058k79560n20603k72224r4255j92503
$$ 26737015 26508291 26107263 26042588 26424294 26694352 26414792 25894189 25621965 25527710 25335207
9554B5335207j05330K72491L50362n1076k36126J44606L69913j04780n85136k69849
$$ 25335207 25229877 25502368 25852730 25801654 25565528 25710134 26080047 25975267 25390131 25120282
9544B5120282L36387K52779l31147m53068l1169J38809j40043k35575N0799J57384
$$ 25120282 25456669 25709448 25378301 24925233 24894064 25032873 24892830 24657255 24708054 24865438
9534B4865438j37998l46940k40630k24379m53858m85301j52913M5662j74481l96225
$$ 24865438 24727440 24380500 24139870 23915491 23461633 22976332 22823419 22869081 22694600 22298375
9524B2298375k84772j32387k05333k45836p1961j4904k80949m82581k90870J061
$$ 22298375 22013603 21881216 21675883 21430047 21358086 21343182 21062233 20579652 20288782 20289843
9514B0289843L2437n1101l3503q1559k85054l07593j0989J34645j74969m52603
$$ 20289843 20322280 20271179 20237676 20156117 19871063 19563470 19552481 19687126 19512157 19059554
9504A9059554j94060K47903K54948n8273j69604p0609j02763k08723j14442K0825
$$ 19059554 18865494 19113397 19368345 19310072 19140468 19069859 18967096 18758373 18643931 18664756
9494A8664756j04628k53976m0901K43683L7823m35742m27054Q4719L17012m8009
$$ 18664756 18560128 18306152 18265251 18508934 18546757 18111015 17683961 17768680 18085692 18037683
9484A8037683m03987k50710R6480J43352o9281k23491k14702j05878L8725J06323
$$ 18037683 17633696 17382986 17479466 17622818 17553537 17330046 17115344 17009466 17048191 17154514
9474A7154514M1413K3219J81589K41000o9757m11383k77291R1566K6419l83444
$$ 17154514 17195927 17219146 17400735 17641735 17571978 17160595 16883304 16974870 17001289 16617845
9464A6617845l55664K19051M85285K6518m28911k31479J59259N0615l37110l82816
$$ 16617845 16262181 16481232 16966517 16993035 16564124 16332645 16491904 16542519 16205409 15822593
9454A5822593j27122j6524m5704N4812J45405l4378k18208l0324K21056r160m60992
$$ 15822593 15695471 15678947 15633243 15688055 15833460 15799082 15580874 15550550 15771606 15762446 15301454
9443A5301454l74320K10110L94294j56024o17272k51483M60685N32814j00148
$$ 15301454 14927134 15137244 15531538 15375514 14758242 14506759 14967444 15500258 15400110
9434A5400110n33778j84763M48590N24185o27l69274j26205K49997J14123l14509
$$ 15400110 14866332 14681569 15130159 15654344 15653717 15284443 15158238 15408235 15522358 15207849
9424A5207849k87220K36605M55190k008m54983k65157J68263J49364j71743k00075
$$ 15207849 14920629 15157234 15612424 15610416 15155433 14890276 15058539 15207903 15036160 14836085
9414A4836085O891m3650k51442r9310K60761J34433m32829n46915Q5399N90785
$$ 14836085 14842976 14799326 14547884 14448574 14709335 14843768 14410939 13864024 13949423 14540208
9404A4540208K83267k95817l16492R0394K56675R4378k940j527j70763l89567
$$ 14540208 14823475 14527658 14211166 14301560 14558235 14652613 14649673 14648146 14477383 14087816
9394A4087816k65364J21756K73572Q0445n4867L6357M0535j72327k28677R4328
$$ 14087816 13822452 13944208 14217780 14298225 14243358 14279715 14320250 14147923 13919246 14013574
9384A4013574L90205K17242j85818k58419K3880J70124r088j41082K7691J77620
$$ 14013574 14403779 14621021 14435203 14176784 14200664 14370788 14361700 14220618 14248309 14425929
9374A4425929m4905l92920l65974k088J80527O574j20650N2318J82567o1996l77470
$$ 14425929 14381024 13988104 13622130 13620042 13800569 13807143 13686493 13738811 13921378 13859382 13481912
9363A3481912k76894J15359K63424P0962l8630J13752J89282l7942k81238k21915
$$ 13481912 13205018 13320377 13583801 13654763 13616133 13729885 13919167 13881225 13599987 13378072
9353A3378072O490J01495N2267K4327K4427k7813p0684j1300O7916M8095J50N2808
$$ 13378072 13384562 13486057 13538324 13562651 13587078 13559265 13488581 13477281 13545197 13593292 13593442 13646250
9341A3646250J39144R0636q4934k06331j55655K1612J95046K28347P1335j31295
$$ 13646250 13785394 13876030 13791096 13584765 13429110 13450722 13645768 13874115 13945450 13814155
9331A3814155j35351R6956L05838K50516p282k31530k84095j71651K7282J75721
$$ 13814155 13678804 13775760 14081598 14332114 14324832 14093302 13809207 13637556 13664838 13840559
9321A3840559J64110O8206O1091J21301O2887q6555n9178J72664K56799K0565
$$ 13840559 14004669 14072875 14133966 14255267 14318154 14231599 14172421 14345085 14601884 14622449
9311A4622449k09064j45503j7449j02287j59151J32103M57712K59416k97684m56511
$$ 14622449 14413385 14267882 14250433 14148146 13988995 14121098 14578810 14838226 14540542 14084031
9301A4084031j643M25075L15584l4716j45744p8292j22529j97866o2216J49254
$$ 14084031 14082388 14507463 14823047 14788331 14642587 14564295 14441766 14243900 14181684 14330938
9291A4330938R3101j96085l26500j32016J28700J87828Q7925J3269K2542M2148
$$ 14330938 14424039 14227954 13901454 13769438 13898138 14085966 14173891 14187160 14209702 14251850
9281A4251850m514j15519j81486o3435J94941L02098N0904l21792l59828j8726
$$ 14251850 14247336 14131817 13950331 13886896 14081837 14383935 14434839 14113047 13753219 13734493
9271A3734493K11767j4101l59314k61102K22372M48093J06547l34923l24759J6618
$$ 13734493 13946260 13932159 13572845 13311743 13534115 13982208 14088755 13753832 13429073 13445691
9261A3445691J97769J26712R2205J30285j0090k53509j63715K81237M62451K8229
$$ 13445691 13643460 13770172 13862377 13992662 13982572 13729063 13565348 13846585 14309036 14337265
9251A4337265m74266l62586J78999M35576K22212k8198q1252j18637j49222R4669
$$ 14337265 13862999 13500413 13679412 14114988 14337200 14309002 14227750 14109113 13959891 14054560
9241A4054560N10906N34132Q725l98203r7008N29508O54801J75869k14131n7502
$$ 14054560 14565466 15099598 15108323 14710120 14613112 15142620 15797421 15973290 15759159 15701657
9231A5701657L03923L37161P2749m4605J55329L70395L08225Q4446R828J64924
$$ 15701657 16005580 16342741 16415490 16370885 16526214 16896609 17204834 17289280 17299108 17464032
9221A7464032L79102N18102N59281M52706J95582K5626K02331N62748O82341N48444
$$ 17464032 17843134 18361236 18920517 19373223 19568805 19594431 19796762 20359510 21041851 21590295
9211B1590295N89034Q75281R02381N05995L36424Q46167J422571J311955Q85044
$$ 21590295 22179329 23054610 23956991 24462986 24799410 25645577 27068148 28380103 29265147
9202B9265147J012195J569609J715939J450095J586840K124511K027588J005636
$$ 29265147 30277342 31846951 33562890 35012985 36599825 38724336 40751924 41757560
9194D1757560J58521K05943L19636m07178j430190j765207j617467j783298k113619
$$ 41757560 41916081 42122024 42441660 42034482 40604292 38839085 37221618 35438320 33324701
9185C3324701j885834j269875j105437j427312j458864j013159p22539q21647
$$ 33324701 31438867 30168992 29063555 27636243 26177379 25164220 24441681 23620034
9177B3620034q20760n41676m25527n83600n39433k03299j43424n28666p23394
$$ 23620034 22799274 22257598 21832071 21248471 20709038 20505739 20362315 19833649 19110255
9168A9110255l74397k9362j55886l62704k03303q172k12383m85815l10858O0736
$$ 19110255 18735858 18706496 18550610 18187906 17984603 17976431 17764048 17278233 16967375 17028111
9158A7028111L5533k82237k92749M7660J66653j48144m13827k33315J28935J86672
$$ 17028111 17063644 16781407 16488658 16536318 16702971 16554827 16141000 15907685 16036620 16223292
9148A6223292r4694l12482j77021J28702J78143j30592l72878j44463L19134M30044
$$ 16223292 16128598 15816116 15639095 15767797 15945940 15815348 15442470 15298007 15617141 16047185
9138A6047185J09277j30528m4903j9379l09156n00756j92039K57099K26194k14042
$$ 16047185 16156462 16025934 15981031 15961652 15652496 15151740 14959701 15216800 15442994 15228952
9128A5228952m32755j63159K29942L44700J69110p1013j63806l7510J44700J22931
$$ 15228952 14796197 14633038 14862980 15207680 15376790 15305777 15141971 15104461 15249161 15372092
9118A5372092o9150r8003R3738Q0217l46148o67008l21612M08577P46009M41549
$$ 15372092 15302942 15204939 15298677 15378894 15032746 14365738 14044126 14452703 15198712 15640261
9108A5640261o9172l54783l19769j9779L31670L33666j08072m51044k24326J89067
$$ 15640261 15571089 15216306 14896537 14876758 15208428 15542094 15434022 14982978 14758652 14947719
9098A4947719J40106j82641q0906L77093L99527j52985m58674p7428L56497K21694
$$ 14947719 15087825 14905184 14824278 15201371 15600898 15447913 14989239 14911811 15268308 15490002
9088A5490002j64362k50481j38109j45411j22144J30863K81019q344l87434l30355
$$ 15490002 15325640 15075159 14937050 14791639 14669495 14800358 15081377 15073033 14685599 14355244
9078A4355244J4909J45619N5268Q2601J80571O2129j11724N6308L87678K89531
$$ 14355244 14370153 14515772 14571040 14653641 14834212 14896341 14784617 14840925 15228603 15518134
9068A5518134k42296n17349j91605K57137L21865J28446M919p3614k25050k71233
$$ 15518134 15275838 14758489 14566884 14824021 15145886 15274332 15279251 15205637 14980587 14709354
9058A4709354m1075K28599K11569J6453M775K12048L23734J81836k4121r5438
$$ 14709354 14668279 14896878 15108447 15124900 15129675 15341723 15665457 15847293 15823172 15727734
9048A5727734o4743k7328K4443Q5754O2004l5128K2227L66432O98257N51666n3529
$$ 15727734 15662991 15635663 15660106 15745860 15807864 15772736 15794963 16161395 16859652 17411318 17357789
9037A7357789n04557l24639K06158M32334J86132q6497m1994J19991P6333j00008
$$ 17357789 16853232 16528593 16734751 17167085 17353217 17266720 17224726 17344717 17421050 17321042
9027A7321042j06897J05480K98672K99015J67160O3641R8397K59390L85905L04106
$$ 17321042 17214145 17319625 17618297 17917312 18084472 18148113 18246510 18505900 18891805 19195911
9017A9195911P2247n1481K8657J22702J18545J91263M19537M89637J56468k23767
$$ 19195911 19268158 19216677 19245334 19368036 19486581 19677844 20097381 20587018 20743486 20519719
9007B0519719j04981L98427O03140K50591j21606r672L32608L70835J46913J61296
$$ 20519719 20414738 20813165 21416305 21666896 21545290 21535618 21868226 22239061 22385974 22547270
8997B2547270N20623P19746L99424p6392r0949L92386Q21683Q36801O86085P31477
$$ 22547270 23067893 23787639 24187063 24110671 24019722 24412108 25233791 26070592 26756677 27488154
8987B7488154Q73732P87457N33122N19910Q73977J237117J294227J164265J113657
$$ 27488154 28361886 29149343 29682465 30202375 31076352 32313469 33607696 34771961 35885618
8978C5885618J178022J258109J334041J379176J290719J117188J141680J512546
$$ 35885618 37063640 38321749 39655790 41034966 42325685 43442873 44584553 46097099
8970D6097099J962749K102433J861867J522978J467074J919771K691156L198637
$$ 46097099 48059848 50162281 52024148 53547126 55014200 56933971 59625127 62823764
8962F2823764L138437L056550L654436M621994N096651N319480O475703Q475954
$$ 62823764 65962201 69018751 72673187 77295181 82391832 87711312 94187015 102662969
8954A02662969R669080R858882J1517412J5659697J8202168J4132848N126424
$$ 102662969 112332049 122190931 133708343 149368040 167570208 181703056 186829480
8947A86829480j087433m39048J964306j254977r976021j7284938j8495723j5510010
$$ 186829480 185742047 185302999 187267305 186012328 176036307 158751369 140255646 124745636
8939A24745636j2319434j0107788q184320o722035o248034o019818n008790l681236
$$ 124745636 112426202 102318414 94134094 87412059 81164025 75144207 70135417 66454181
8931F6454181l168188l303928l014240k213986j813603k004568j970776j419892
$$ 66454181 63285993 59982065 56967825 54753839 52940236 50935668 48964892 47545000
8923D7545000j108724j480788j869886j606525j069122r88156j315240j458745
$$ 47545000 46436276 44955488 43085602 41479077 40409955 39421799 38106559 36647814
8915C6647814j241467r68775p78699n39886l06793l24652n54281o54568n22860
$$ 36647814 35406347 34437572 33658873 33118987 32812194 32487542 31933261 31278693 30755833
8906C0755833m49720o07268p55582o55047m51935m00742m58880m44871l93008
$$ 30755833 30306113 29698845 28943263 28288216 27836281 27435539 26976659 26531788 26138780
8897B6138780m26590m37747k61823p0072j75149m66779m87200j44104J06465l4307
$$ 26138780 25712190 25274443 25012620 24942548 24767399 24300620 23813420 23669316 23775781 23741474
8887B3741474k60257k00448r710l2542j91952j78313m0376q0722k53336j85887
$$ 23741474 23481217 23280769 23271059 23238517 23046565 22868252 22827876 22747154 22493818 22307931
8877B2307931J60974L43758J00532k37303k33008M7895J93643M6070j22359r871
$$ 22307931 22468905 22812663 22913195 22675892 22442884 22490779 22684422 22730492 22608133 22598262
8867B2598262L07987M43228J53456l18422m78093j82011J81460K36875J14822
$$ 22598262 22906249 23349477 23502933 23184511 22706418 22524407 22705867 22942742 23057564
8858B3057564J47653K93615K62866J02207J74225N20851P20150N32887K81224
$$ 23057564 23205217 23498832 23761698 23863905 24038130 24558981 25279131 25812018 26093242
8849B6093242L53928O69981R00533R59317R91188J067741J164389J303599J481083
$$ 26093242 26447170 27117151 28017684 28977001 29968189 31035930 32200319 33503918 34985001
8840C4985001J543401J332376Q80726L44152j45230m66823n45430n38780p79083
$$ 34985001 36528402 37860778 38741504 39085656 38940426 38473603 37928173 37389393 36610310
8831C6610310j329908j795670j801412j479342j216321j101684r67001q38344
$$ 36610310 35280402 33484732 31683320 30203978 28987657 27885973 26918972 26080628
8823B6080628r12178j078532r27200l99959m2976k96752q05573q47569l42827
$$ 26080628 25168450 24089918 23162718 22762759 22719783 22423031 21617458 20769889 20427062
8814B0427062L5349j61624n32313m80527j30295q3612m31751o20611l72652j23576
$$ 20427062 20462411 20300787 19768474 19287947 19157652 19074040 18642289 18021678 17649026 17525450
8804A7525450k52671m34248k24687J43076J43616j59116k63441r2454l2062j75326
$$ 17525450 17272779 16838531 16613844 16756920 16900536 16741420 16477979 16385525 16353463 16178137
8794A6178137k14992j16371k08378m87364n04604j41839J40427O1229r6212j05968
$$ 16178137 15963145 15846774 15638396 15151032 14646428 14504589 14645016 14706245 14610033 14504065
8784A4504065j56593k93690j90183J56826K04649k07068m32307p7853K55249j1832
$$ 14504065 14347472 14053782 13863599 14020425 14225074 14018006 13585699 13507846 13763095 13751263
8774A3751263l94802j86062K86789K41836k01561l25963j21991j56958l65333
$$ 13751263 13356461 13170399 13457188 13699024 13497463 13171500 13049509 12892551 12527218
8765A2527218j60668L22690L16225j81729l07651J48859L43447j20730m67248
$$ 12527218 12366550 12689240 13005465 12823736 12516085 12664944 13008391 12887661 12420413
8756A2420413r9654L82635K43453k19694l54906k35808k33125j72288J99275M48359
$$ 12420413 12320759 12703394 12946847 12727153 12372247 12136439 11903314 11731026 11930301 12378660
8746A2378660Q2420m64163l94021J79796M30862J22554j80498j57808j15280k19801
$$ 12378660 12461080 11996917 11602896 11782692 12213554 12336108 12155610 11997802 11882522 11662721
8736A1662721j60970J67183L27035M3065k79857j75076J17740J775n09307o86737
$$ 11662721 11501751 11668934 11995969 12039034 11759177 11584101 11701841 11703616 11194309 10507572
8726A0507572r4870O69285O44489j83448p63701l97343K63982K03202l91192m33782
$$ 10507572 10412702 11081987 11726476 11543028 10779327 10381984 10645966 10849168 10457976 10024194
8716A0024194K91076P44376K79963l79252l90878p5521j27963l26371n2850M35094
$$ 10024194 10315270 11059646 11339609 10960357 10569479 10493958 10365995 10039624 9986774 10421868
8706A0421868L70566j68276l63708k2591K01771o191j95880p5301K3926j27032
$$ 10421868 10792434 10624158 10260450 10237859 10439630 10433439 10237559 10162258 10186184 10059152
8696A0059152k32142q2066O7625K2978k5631L3905K531j63977j94602k4548O4055
$$ 10059152 9827010 9744944 9812569 9835547 9809916 9843821 9846352 9682375 9487773 9463225 9527280
8685I527280J2196J02313K98598J34810m27126o99814k65684L32718L99861N8218
$$ 9527280 9539476 9641789 9940387 10075197 9648071 8948257 8682573 9015291 9415152 9473370
8675I473370j34104q0632o3632j08412l5567P2575N171j25464m5303J78064K19986
$$ 9473370 9339266 9258634 9195002 9086590 9051023 9123598 9128769 9003305 8958002 9136066 9356052
8664I356052J3601j81099j73465l0124P2362q560k64874m29504j97835K99765
$$ 9356052 9369653 9188554 9015089 8984965 9057327 9048767 8783893 8354389 8156554 8456319
8654H456319N34438K69106j18151k19257j28602j03658q4996O7192J92595R5973
$$ 8456319 8990757 9259863 9141712 8922455 8793853 8690195 8605199 8672391 8864986 8960959
8644H960959p8699j13167q1534j02179m0353J63551K15831n2721k85520j52228
$$ 8960959 8882260 8769093 8687559 8585380 8545027 8708578 8924409 8871688 8586168 8433940
8634H433940N9940n2487k69054j29841K34731L29745J24381k2667o6873k05473
$$ 8433940 8493880 8441393 8172339 8042498 8277229 8606974 8731355 8708688 8641815 8436342
8624H436342k78670P868L87806L34258l4071j43772J8585l5971k60626r3640L78178
$$ 8436342 8157672 8165540 8553346 8887604 8853533 8709761 8728346 8692375 8431749 8338109 8716287
8613H716287L52205l00461o50325j85950L51070K38340q5538M5000L07667R1803
$$ 8716287 9068492 8768031 8117706 7931756 8282826 8521166 8435628 8480628 8788295 8880098
8603H880098k69292p1656M14055L34476k44055m00518P6399L30282j13205n66892
$$ 8880098 8610806 8539150 8953205 9287681 9043626 8643108 8719507 9049789 8936584 8369692
8593H369692l22264K57835M00440Q4357j31840p4272o2173j95990j71684J20636
$$ 8369692 8047428 8305263 8705703 8790060 8658220 8583948 8521775 8325785 8154101 8274737
8583H274737L16923J24746j87541j59261J70790K95975j8739l71723k98808M6216
$$ 8274737 8591660 8716406 8528865 8369604 8540394 8836369 8817630 8445907 8147099 8193315
8573H193315J37617j06006j96976J35933M67364K75168k67703m92495j25013L85791
$$ 8193315 8330932 8224926 8027950 8163883 8631247 8906415 8638712 8146217 8021204 8406995
8563H406995M68651R2308k86438k89904o313J73382L6173k13923k47525m9394
$$ 8406995 8875646 8967954 8681516 8391612 8385299 8558681 8594854 8380931 8133406 8084012
8553H084012R7783L7120p4920n1730O4920J26904R1826J9756r238O7898K01620
$$ 8084012 8181795 8218915 8143995 8092265 8157185 8284089 8375915 8395671 8386433 8454331 8655951
8542H655951J97011j6149j54853M9731L24735J66639l04497l99458N8966L71937
$$ 8655951 8852962 8836813 8681960 8731691 9056426 9223065 8918568 8519110 8578076 8950013
8532H950013M9716l87846k61634J72102K07293j30365k17534O0827J95654J7042
$$ 8950013 8999729 8611883 8350249 8522351 8729644 8599279 8381745 8442572 8638226 8655268
8522H655268m9953J71758K56089o6644m03786k99823J06916L59276K83810M0901
$$ 8655268 8605315 8777073 9033162 8966518 8562732 8262909 8369825 8729101 9012911 9053812
8512I053812j67731k16827q5465Q3294J24374R7553J68506K56519J18175j95810
$$ 9053812 8886081 8669254 8583789 8667083 8791457 8889010 9057516 9314035 9432210 9236400
8502I236400l19455q5408K47790L49312J34555k56458n16440l09231K81938O08117
$$ 9236400 8916945 8831537 9079327 9428639 9563194 9306736 8790296 8481065 8763003 9371120
8492I371120K45562k69517j64360L02006K12707l96711m53705L32834Q00907J57320
$$ 9371120 9616682 9347165 9182805 9484811 9697518 9300807 8847102 9179936 9980843 10138163
8482A0138163o60624m48851L53407M64644j52484m02848K5185K81107m7035k80008
$$ 10138163 9477539 9028688 9382095 9846739 9694255 9291407 9316592 9597699 9550664 9270656
8472I270656N5960M16546K54183p5671m1806J63288J11692m6304N9631K67150
$$ 9270656 9326616 9743162 9997345 9921674 9879868 10043156 10154848 10108544 10168175 10435325
8462A0435325J66195j35797j78348O7390J67948n1424k65301j86325N1767J46495
$$ 10435325 10601520 10465723 10287375 10354765 10522713 10471289 10205988 10019663 10071430 10217925
8452A0217925j2144k93644m36035k17103K62213N17750J93628l86456n27627q3691
$$ 10217925 10205781 9912137 9476102 9258999 9521212 10038962 10232590 9846134 9318507 9234816
8442I234816L20060J73253j97339j62839K31763L60476J5958k78333j24853J35167
$$ 9234816 9554876 9728129 9530790 9367951 9599714 9960190 9976148 9697815 9572962 9708129
8432I708129M5457j82583o6339K67595K76675l9814j18353J64677K38624j43019
$$ 9708129 9753586 9571003 9504664 9772259 10048934 10009120 9890767 10055444 10294068 10151049
8422A0151049l81821j0359M62081L23121k18708m15117j44862O2341l0848j48722
$$ 10151049 9769228 9758869 10220950 10544071 10325363 9910246 9765384 9827725 9796877 9648155
8412I648155j30685q4904K7039K92272M07568M6492m06500k85377K22259K76535
$$ 9648155 9517470 9432566 9459605 9751877 10159445 10205937 9799437 9514060 9736319 10012854
8402A0012854k08037l80558P6393L85136M9801k84120l8367K41141n9154l96565
$$ 10012854 9804817 9424259 9500652 9885788 9935589 9651469 9613102 9854243 9795089 9398524
8392I398524r887O15508M65439k81283n43183r4849K62186J96218J99883L70705
$$ 9398524 9388637 10004145 10469584 10188301 9645118 9550269 9812455 10008673 10208556 10579261
8382A0579261J64394l59219l45331L35918O30200R382n56096j99651L72470J32734
$$ 10579261 10743655 10384436 10039105 10375023 11005223 11014605 10458509 10258858 10631328 10764062
8372A0764062m65872k98209M35749N22321j99512n84639j02462L82690J48918
$$ 10764062 10298190 9999981 10435730 10958051 10758539 10173900 10071438 10454128 10603046
8363A0603046k82518j98436J49066J79123J436O244L2777k33460m80162k23306
$$ 10603046 10320528 10122092 10271158 10450281 10451717 10457961 10490738 10257278 9777116 9553810
8353I553810K59722K86037j20289k91967k3182K07694J58192J43827K70433J48711
$$ 9553810 9813532 10099569 9979280 9687313 9664131 9871825 10030017 10173844 10444277 10592988
8343A0592988l00461m92056q6305L77728L02950m1034l1556K92910M08412J95069
$$ 10592988 10292527 9800471 9714166 10091894 10394844 10353810 10322254 10615164 11023576 11218645
8333A1218645l6254j99305m25718n43221k65049J68346K41466K1446K3243K34742
$$ 11218645 11182391 10983086 10557368 10014147 9749098 9917444 10158910 10180356 10203599 10438341
8323A0438341J34685k31210j78404L34631M15366k43378o25789J359P34318M14347
$$ 10438341 10573026 10341816 10163412 10498043 10913409 10670031 10044242 10045601 10779919 11194266
8313A1194266m29859m27074L40524M95389k65874o35166J01295Q65456N51158
$$ 11194266 10764407 10337333 10677857 11173246 10907372 10272206 10373501 11238957 11790115
8304A1790115k99072n69067l00270k03054k03747K33401P75141N36546l67654
$$ 11790115 11491043 10921976 10621706 10418652 10214905 10448306 11223447 11759993 11392339
8295A1392339q05771l08825L03515K79972l9145l4462J58048O8748j96006j56690
$$ 11392339 10586568 10277743 10581258 10861230 10822085 10787623 10945671 11014419 10818413 10661723
8285A0661723K08397M42023L11615N3332o7840o6118o4590q8218r6677o9536j6258
$$ 10661723 10870120 11312143 11623758 11677090 11609250 11543132 11478542 11390324 11293647 11224111 11207853
8274A1207853K7100K4507k459l394M434k4384l1718O9332J79779R9775j20389
$$ 11207853 11234953 11259460 11257001 11253607 11258041 11233657 11201939 11271271 11451050 11550825 11430436
8263A1430436j72784N7529K95700K78100R1815o0505j64549k46588j97496j1861
$$ 11430436 11257652 11315181 11610881 11888981 11980796 11920291 11755742 11509154 11311658 11299797
8253A1299797O4663o5345q7559K01706L97590L7956n47758n84358r036L94999
$$ 11299797 11364460 11299115 11211556 11413262 11810852 11848808 11301050 10716692 10707656 11102655
8243A1102655J59026k28551j44124K60842M07035J55795j41651k36368j93986
$$ 11102655 11261681 11033130 10889006 11149848 11556883 11712678 11571027 11334659 11140673
8234A1140673j23054l0719Q6739K12225L04624K43883l7031l05539k28924P1779
$$ 11140673 11017619 10986900 11073639 11285864 11590488 11834371 11797340 11491801 11262877 11334656
8224A1334656R0484k42146l29215J38099N59474L24767j75263j87167J55696J31269
$$ 11334656 11425140 11182994 10853779 10991878 11551352 11876119 11700856 11513689 11669385 11800654
8214A1800654k56288k87893J54838L47640Q583k03765J17106L91454R4877l03008
$$ 11800654 11544366 11256473 11411311 11758951 11767534 11563769 11680875 12072329 12167206 11864198
8204A1864198j67726K07271J46672k61731l87902r6363J93553K51636J75607N611
$$ 11864198 11696472 11903743 12050415 11788684 11400782 11304419 11497972 11749608 11925215 11930826
8194A1930826j92898j19067K83111M47506l4649n93837m30919K13111M36982J02646
$$ 11930826 11737928 11618861 11901972 12349478 12314829 11720992 11290073 11503184 11940166 12042812
8184A2042812j26558n1852j37684l99845k48376L21540N03204K4901l44744j16547
$$ 12042812 11916254 11864402 11726718 11326873 11078497 11400037 11903241 11928142 11583398 11466851
8174A1466851J48318j3146r6971L08146N74402J11996m49777k54748K96290K56565
$$ 11466851 11615169 11602023 11505052 11813198 12387600 12499596 12049819 11795071 12091361 12347926
8164A2347926k02254j53669L65273L87343k59335o05899j60791L40231K33378
$$ 12347926 12145672 11992003 12357276 12744619 12485284 11879385 11718594 12058825 12292203
8155A2292203p3523K0560K87761K07303r5576j32212J21480K74401J55736o2881
$$ 12292203 12218680 12239240 12527001 12734304 12638728 12506516 12627996 12902397 13058133 12995252
8145A2995252k07458k17299p5034J23665J86789Q4504Q43J8496J2274m3802J1817
$$ 12995252 12787794 12570495 12495461 12619126 12805915 12890419 12891262 12909758 12922032 12878230 12890047
8134A2890047J76624J99347K1254o1038J10705K59706J35059o2418k2006J83458
$$ 12890047 13066671 13266018 13287272 13226234 13336939 13596645 13731704 13669286 13647280 13830738
8124A3830738K64546J65859N4170J8891L8282J07053J90293J80322N7921m2492
$$ 13830738 14095284 14261143 14315313 14334204 14372486 14479539 14669832 14850154 14908075 14865583
8114A4865583l6634Q862L9772N9300j0035k09270k86067K7861M40543L34792k72905
$$ 14865583 14828949 14837811 14877583 14936883 14926848 14717578 14431511 14459372 14899915 15234707 14961802
8103A4961802o11560k69805K01736K13475K2679J19353L11601J66477r1013L3256
$$ 14961802 14350242 14080437 14282173 14495648 14518327 14637680 14949281 15115758 15024745 15058001
8093A5058001L23788J74984k73393k78123K20512M24889n41l62149r3685L36907
$$ 15058001 15381789 15556773 15283380 15005257 15225769 15650658 15650117 15287968 15194283 15531190
8083A5531190K57371j15902j21543K31201L49709Q3136o6851J87806M61820L39007
$$ 15531190 15788561 15672659 15551116 15782317 16132026 16215162 16148311 16336117 16797937 17136944
8073A7136944K2085j8481K16894K95209O9537q1518J06887K95502O6431l10849
$$ 17136944 17159029 17140548 17357442 17652651 17722188 17640670 17747557 18043059 18109490 17798641
8063A7798641j88315M16389P09090K66660k91882j98200L78488O83336M68976
$$ 17798641 17610326 18026715 18735805 19002465 18710583 18512383 18890871 19574207 20043183
8054B0043183J24992n9635j25863o7974J24240J12909m15538j012155q37024P2772
$$ 20043183 20168175 20108540 19982677 19914703 20038943 20151852 19736314 18724159 17887135 17959907
8044A7959907O42642J96202o01352p02337o6552M63605L53541j17764m12719l31903
$$ 17959907 18602549 18798751 18197399 17495062 17428510 17892115 18245656 18127892 17715173 17383270
8034A7383270m5677J71244J80005P0810J1275Q634m5750j26903j03375o654P316
$$ 17383270 17337593 17508837 17688842 17759652 17770927 17779561 17733811 17606908 17503533 17496879 17504195
8023A7504195l1102M3038J65492J20900J840J17224L72288K94868j46936l52217
$$ 17504195 17473093 17516131 17681623 17802523 17804363 17921587 18293875 18588743 18441807 18089590
8013A8089590j2425L60932K57455k7632M4532L35617L12981k6897j64697J20042
$$ 18089590 18077165 18438097 18695552 18667920 18712452 19048069 19361050 19334153 19169456 19289498
8003A9289498M75206N05449J82332k36140m10068j55171K86845M11714J01758
$$ 19289498 19764704 20270153 20452485 20216345 19806277 19651106 19937951 20349665 20451423
7994B0451423j92344j57002o4800j62186j34571K65171N54182K16588l24536k74322
$$ 20451423 20259079 20102077 20037277 19875091 19740520 20005691 20559873 20776461 20451925 20177603
7984B0177603K48735M03943o241l05015j25018R9717K8589m7335J12828K09718
$$ 20177603 20426338 20830281 20824040 20519025 20394007 20493724 20522313 20474978 20587806 20797524
7974B0797524j0601k64310k00627J01049L89460N51490M63927M2221l74695k61077
$$ 20797524 20786923 20522613 20321986 20423035 20812495 21363985 21827912 21870133 21495438 21234361
7964B1234361K56202M27498K5286k45250J11329N49786L87436r0173j60617J61349
$$ 21234361 21490563 21918061 21943347 21698097 21809426 22359212 22746648 22656475 22495858 22657207
7954B2657207K77498N4190o7619J00262K60291K30948J85977K21251J73653j8710
$$ 22657207 22934705 22988895 22921276 23021538 23281829 23512777 23698754 23920005 24093658 24074948
7944B4074948j54700p9991J06242K20597J92491R5876J00557K91763M51903K51610
$$ 24074948 23920248 23840257 23946499 24167096 24359587 24455463 24556020 24847783 25299686 25551296
7934B5551296k08403l78031j4214M16749M29739K26069K52341M08964K82632o7078
$$ 25551296 25342893 24964862 24950648 25367397 25797136 26023205 26275546 26684510 26967142 26900064
7924B6900064j86749R563J59327J06336P9821J95266K82373K62288K54254K77789
$$ 26900064 26713315 26722878 26882205 26988541 27068362 27263628 27546001 27808289 28062543 28340332
7914B8340332K52553K63387M02571M38809J45769j45743O1922N47092N87711J12471
$$ 28340332 28592885 28856272 29258843 29697652 29843421 29697678 29759600 30306692 30894403 31006874
7904C1006874j48746J55899M82985L87843K36148M23092O09542L89924J22859
$$ 31006874 30858128 31014027 31497012 31884855 32121003 32544095 33153637 33543561 33666420
7895C3666420L35221P40465O71097K13756P7462M34924O91524M56726M3737j37818
$$ 33666420 34001641 34742106 35413203 35626959 35704421 36139345 36830869 37287595 37331332 37193514
7885C7193514q7659N7288K68798M11296K66407k1617J2429M42649P44760N76327
$$ 37193514 37105855 37163143 37431941 37843237 38109644 38088027 38100456 38543105 39287865 39864192
7875C9864192L00918L70847O20518O41487N01744N33167O56218N42400L22202
$$ 39864192 40165110 40535957 41156475 41797962 42299706 42832873 43489091 44031491 44353693
7866D4353693M61990R17621J086163P66181N18676P70333J154602J175049J001021
$$ 44353693 44815683 45733304 46819467 47585648 48104324 48874657 50029259 51204308 52205329
7857E2205329J058574J256383J256855J204968J490943J994911K293605K466664
$$ 52205329 53263903 54520286 55777141 56982109 58473052 60467963 62761568 65228232
7849F5228232K897094L378547L395638L329189M175383N651596N863280L799461
$$ 65228232 68125326 71503873 74899511 78228700 82404083 88055679 93918959 97718420
7841I7718420J144482K85593J085031J103804j040542l933629n316750m647591
$$ 97718420 98862902 99148495 100233526 101337330 100296788 96363159 91046409 86398818
7833H6398818l124971j994847j584304j580743j553527j236304o70147j15578
$$ 86398818 83273847 81279000 79694696 78113953 76560426 75324122 74653975 74538397
7825G4538397K40478L95056L96808L36395M19791P56702J118726J224661J194400
$$ 74538397 74778875 75173931 75570739 75907134 76326925 77083627 78202353 79427014 80621414
7816H0621414J350490J650141J742111J533372J262267J069584R34510R22431
$$ 80621414 81971904 83622045 85364156 86897528 88159795 89229379 90163889 91086320
7808I1086320J020982R14610M77995K37354O59114J293220J465915J449178J868270
$$ 91086320 92107302 93021912 93499907 93737261 94396375 95689595 97155510 98604688 100472958
7799A00472958K373903K333771K454852L801001N375528N211173M222490N779920
$$ 100472958 102846861 105180632 107635484 111436485 116812013 122023186 126245676 132025596
7791A32025596R934959J1434719O571065n30451k659473O00855K357146j906138
$$ 132025596 141960555 153395274 159966339 159435888 156776415 157377270 159734416 157828278
7783A57828278q554983j1435156r599153o691369n184881m517119l796371l246762
$$ 157828278 149273295 137838139 128238986 121547617 116362736 111845617 108049246 104802484
7775A04802484k918171k207824j119068n14199p20725r79646o18618N4921L31022
$$ 104802484 101884313 99676489 98557421 98043222 97322497 96342851 95724233 95779154 96110176
7766I6110176j3678o17167r59350q22325n30009n98584j017571j232880j010447
$$ 96110176 96096498 95479331 94519981 93697656 93167647 92569063 91551492 90318612 89308165
7757H9308165p71986p85811o82877k22231J47062O8965k3648L46823Q67449J022860
$$ 89308165 88536179 87750368 87067491 86845260 86992322 87061287 87037639 87384462 88251911 89274771
7747H9274771R23070Q79884Q29968Q62914J483451K530183K875052K310553K508637
$$ 89274771 90197841 91077725 91907693 92770607 94254058 96784241 99659293 101969846 104478483
7738A04478483M425303N898643M223215N40747j165619L01048J601959k09463
$$ 104478483 108903786 114802429 119025644 119566391 118400772 118701820 120303779 120094316
7730A20094316l610145n217425m434497l266736k837158k501442j883912j559072
$$ 120094316 116484171 111266746 106832249 103565513 100728355 98226913 96343001 94783929
7722I4783929j635011j423430q11307n66681r48436j199594q08847k65780j36094
$$ 94783929 93148918 91725488 90914181 90347500 89399064 88199470 87390623 87124843 86988749
7713H6988749k32971j55891L2196J03392J16635K09190L41717M85053O77390P73448
$$ 86988749 86755778 86599887 86632083 86735475 86852110 87061300 87403017 87888070 88565460 89338908
7703H9338908N86191L66648O07423J234145J575314J345058J057719J176273J454670
$$ 89338908 89925099 90291747 90899170 92133315 93708629 95053687 96111406 97287679 98742349
7694I8742349J528388J579100J868229K089944J855388J507411J726510K445600
$$ 98742349 100270737 101849837 103718066 105808010 107663398 109170809 110897319 113342919
7686A13342919K873730K662728K388729K635215L153801L336939L146167L074237
$$ 113342919 116216649 118879377 121268106 123903321 127057122 130394061 133540228 136614465
7678A36614465L347317L669171L798861L935275M311726M748075M959763N121490
$$ 136614465 139961782 143630953 147429814 151365089 155676815 160424890 165384653 170506143
7670A70506143N678148O604098P329827P603343P989918R108600J0656698J1750246
$$ 170506143 176184291 182788389 190118216 197721559 205711477 214820077 225476775 237227021
7662B37227021J2187082J2782072J4226318J6083646J7332846J7626555J7458837
$$ 237227021 249414103 262196175 276422493 292506139 309838985 327465540 344924377
7655C44924377J7057288J5660507J2338949P376137K323211j555569m587326q031262
$$ 344924377 361981665 377642172 389981121 397357258 399680469 398124900 393537574 385506312
7647C85506312j2203258j5785507j7246863j6543549j4973822j3593849j2370570
$$ 385506312 373303054 357517547 340270684 323727135 308753313 295159464 282788894
7640B82788894j0912136r375449q220876p406984o386142m938756l602709l019123
$$ 282788894 271876758 262501309 254280433 246873449 240487307 235548551 231945842 228926719
7632B28926719l035917k806989j850128o90838j54473k02661L7526J030587K172545
$$ 228926719 225890802 223083813 221233685 220542847 220388374 220185713 220223239 221253826 223426371
7623B23426371K702308K802872L252095M273729N388073O299612P262610Q500333
$$ 223426371 226128679 228931551 232183646 236457375 241845448 248145060 255407670 263908003
7615B63908003R857486J1155511J2359520J3305481J3845506J4294918J4910310
$$ 263908003 273765489 284921000 297280520 310586001 324431507 338726425 353636735
7608C53636735J4748821J2164446P114902J936206j299421l465013p032626j2413031
$$ 353636735 368385556 380550002 387664904 389601110 388301689 384836676 377804050 365391019
7600C65391019j7212219j9278711j8993242j7988202j6953457j5683285j4308427
$$ 365391019 348178800 328900089 309906847 291918645 274965188 259281903 244973476
7593B44973476j3244895j2348142j1170332r865227q967583q419978p666000o668247
$$ 244973476 231728581 219380439 208210107 198344880 189377297 180957319 173291319 166623072
7585A66623072o011231n905582n843136n431077m909964m598761m403301m150959
$$ 166623072 160611841 154706259 148863123 143432046 138522082 133923321 129520020 125369061
7577A25369061l906413l681445l307242k864063k743716k973518k993508k505121
$$ 125369061 121462648 117781203 114473961 111609898 108866182 105892664 102899156 100394035
7569A00394035k033175k128589k466067k366690j868463j559266j570412j520340
$$ 100394035 98360860 96232271 93766204 91399514 89531051 87971785 86401373 84881033
7561H4881033j381153j565151k023348k063407j398499p04856o82124j091635
$$ 84881033 83499880 81934729 79911381 77847974 76449475 75744619 75062495 73970860
7553G3970860j247891j047508r15959r97123j025699r23358r37294j120331j170160
$$ 73970860 72722969 71675461 70759502 69762379 68736680 67813322 66876028 65755697 64585537
7544F4585537r52420p84318r59078j279867j346341j117906q91964q11523p21869
$$ 64585537 63633117 62848799 61889721 60609854 59263513 58145607 57253643 56442120 55720251
7535E5720251n61997n74580q98634j171537r14362k89223m3922n19962j112679
$$ 55720251 55158254 54583674 53685040 52513503 51599141 51309918 51265996 50746034 49633355
7526D9633355j084539o00670m16880p00499q36387m84397j39707l13401p27044
$$ 49633355 48548816 47948146 47531266 46830767 45994380 45509983 45370276 45056875 44329831
7517D4329831q04368n51990m05164m67010m63731l17236k32947k68177k84622
$$ 44329831 43525463 42973473 42568309 42101299 41637568 41320332 41087385 40819208 40534586
7508D0534586l09047m91083o98315o08356k64415j05685l29513o09074n86983
$$ 40534586 40225539 39734456 39036141 38427785 38163370 38057685 37728172 37119098 36532115
7499C6532115l10885l3782J08475P1579j58913m45037n49260m34979k97167k26052
$$ 36532115 36221230 36187448 36295923 36367502 36208589 35763552 35214292 34779313 34482146 34256094
7489C4256094j09713N2434N1787j78218l95040l83773k22503r2591o0304j31944
$$ 34256094 34146381 34198815 34250602 34072384 33677344 33293571 33071068 32978477 32918173 32786229
7479C2786229k66071k73753j3574K71229J86307j87734l58262k05612j53023l56254
$$ 32786229 32520158 32246405 32232831 32504060 32690367 32502633 32144371 31938759 31785736 31429482
7469C1429482l57408P7675L96833Q7569m49415n07526j56209j705j59559k30382
$$ 31429482 31072074 31149749 31546582 31634151 31184736 30677210 30521001 30519296 30359737 30129355
7459C0129355j34429j92230m10891m31883k37818k08840l77168l25780j795P1636
$$ 30129355 29994926 29802696 29391805 28959922 28722104 28513264 28136096 27810316 27808521 27880157
7449B7880157l17912o28115m00101K2554Q3663j38907k04887q5343r8688k70405
$$ 27880157 27562245 26934130 26534029 26556583 26640246 26501339 26296452 26211109 26112421 25842016
7439B5842016l04040j34772l8507j50210k57308j70684m617M9049J3372K8004
$$ 25842016 25537976 25403204 25364697 25214487 24957179 24786495 24781878 24830927 24844299 24872303
7429B4872303P8955J2523j81288k65454o4818K07478J58897k13114m37141k23129
$$ 24872303 24951258 24963781 24782493 24517039 24452221 24659699 24818596 24605482 24168341 23945212
7419B3945212P8131j7592l87662n03744k53855n9950j65697l20553k97092k40492
$$ 23945212 24023343 24005751 23618089 23114345 22860490 22800540 22634843 22314290 22017198 21776706
7409B1776706k95410l16563k06772j57538k72752l17086j52801p1291l07361n38166
$$ 21776706 21481296 21164733 20957961 20800423 20527671 20210585 20057784 19986493 19679132 19140966
7399A9140966l30355J28237K47394j02556m30958l58544q3140J2719j13546k30370
$$ 19140966 18810611 18938848 19186242 19083686 18652728 18294184 18211044 18223763 18110217 17879847
7389A7879847k16311j57083j25307n4165J04134J99259K4049l41519n19005l07253
$$ 17879847 17663536 17506453 17381146 17326981 17431115 17630374 17654423 17312904 16793899 16486646
7379A6486646O162L7929j46296j92397l4584P6689M4574j1171j07824l22325l97983
$$ 16486646 16492808 16530737 16384441 16192044 16157460 16234149 16278723 16267552 16159728 15837403 15439420
7368A5439420k5910M56344L51681k78370n70828k05304P1862k70479o23034k93825
$$ 15439420 15413510 15869854 16221535 15943165 15372337 15167033 15238895 14968416 14345382 14051557
7358A4051557K89049L16319p6520j99484n6599j63364m29727k95053J67974L08465
$$ 14051557 14340606 14656925 14580405 14380921 14324322 14160958 13731231 13436178 13604152 13912617
7348A3912617J6960j67179o9255o6080k18615j47294J28445J30131j70949k66782
$$ 13912617 13929577 13762398 13693143 13627063 13408448 13261154 13389599 13519730 13348781 13081999
7338A3081999o4506k3914k02716j18276K45403K89198q7460k52306k8771k9955
$$ 13081999 13017493 12993579 12790863 12672587 12917990 13207188 13119728 12867422 12838651 12808696
7328A2808696m07475m30082J38899M36930k283l34088J03885N23124M4232o71562
$$ 12808696 12401221 11971139 12110038 12546968 12544685 12210597 12314482 12837606 12881838 12210276
7318A2210276m74877L49493O06080J01771l29596l38170k78080j93838J38884
$$ 12210276 11735399 12084892 12690972 12792743 12463147 12124977 11846897 11653059 11791943
7309A1791943L67473l216n12634l25855K62349K29180l87712n38067j4964K48368
$$ 11791943 12159416 12156200 11643566 11317711 11580060 11809240 11421528 10883461 10868497 11116865
7299A1116865o4583j47587K77219L45410k84223o20278m1321N25097J49295n33821
$$ 11116865 11052282 10904695 11181914 11527324 11243101 10622823 10581502 11106599 11255894 10722073
7289A0722073m64789R0169J79874j69337k09796J06213J87531k3346o0627Q2126
$$ 10722073 10257284 10347453 10527327 10357990 10148194 10254407 10441938 10418592 10357965 10440091
7279A0440091N030k04672r8291K09311J72754j63010j87189J87458L40156o377
$$ 10440091 10445121 10240449 10142158 10351469 10524223 10361213 10174024 10361482 10701638 10695261
7269A0695261l56540k97499p9981n1344r9209L820J46631R8759j05414k40522
$$ 10695261 10338721 10041222 9961241 9909897 9810688 9814508 9961139 10059898 9954484 9713962
7259I713962j70344M7772J96639P2231k14900k70348J7847K00689q0889m52251
$$ 9713962 9543618 9591390 9788029 9860260 9645360 9375012 9392859 9593548 9512659 9060408
7249I060408l18811K08449N00236L64142J57668L5073k03168m83648m07936K4750
$$ 9060408 8741597 8950046 9450282 9814424 9972092 10007165 9803997 9320349 8912413 8937163
7239H937163K97073J67484j7275K136J4577j30840j99428n9862M5627k59L3104
$$ 8937163 9234236 9401720 9384445 9386581 9401158 9270318 9070890 9011028 9056655 9056396 9089500
7228I089500J67387L3015m02399n49174j09963L17831J38908k74263k09130K24548
$$ 9089500 9256887 9289902 8887503 8338329 8228366 8546197 8685105 8410842 8201712 8426260
7218H426260L58157J13874L2427K35558K19271j87133m29159j10532L41629L23795
$$ 8426260 8784417 8898291 8930718 9166276 9385547 9198414 8769255 8658723 9000352 9324147
7208I324147n5700k12712K5277K45183J16535j75202k78130j69729q5755j00195
$$ 9324147 9268447 9055735 9081012 9326195 9442730 9267528 8989398 8819669 8733914 8633719
7198H633719m7981J29507K28012J00735p7661o9955O5898J18137P1661L2082n3255
$$ 8633719 8585738 8715245 8943257 9043992 8966331 8896376 8962274 9080411 9152072 9184154 9130899
7187I130899k40238k83228O5224N19299N40975J52448j02912o2767j46870m88189
$$ 9130899 8890661 8607433 8672657 9191956 9732931 9885379 9782467 9719700 9572830 9084641
7177I084641n90397j96339J95081J42019n7393l0310k6931k95419l93502N2805
$$ 9084641 8494244 8297905 8492986 8635005 8577612 8547302 8520371 8224952 7831450 7884255
7167G884255M53968R4753n53932m63646K59804N10347k6286m45050j85688J64871
$$ 7884255 8338223 8432976 7879044 7415398 7675202 8185549 8159263 7714213 7528525 7693396
7157G693396M7934j73942p7150K3021j75502k36536J98957N66449K21075m06208
$$ 7693396 7741330 7567388 7490238 7513259 7337757 7101221 7300178 7866627 8087702 7681494
7147G681494m17093J54075M75225K42219m0494m9164m2776j71661j53491J26958
$$ 7681494 7264401 7418476 7893701 8135920 8095426 8046262 8003486 7831825 7678334 7805292
7137G805292L12291J45344j32238k13878j57181j36752j27543q0944j01680k02536
$$ 7805292 8117583 8262927 8130689 7916811 7759630 7622878 7495335 7414391 7312711 7110175
7127G110175j71002N6433J57107j20921m74427l96944Q1381L97621K20837j58154
$$ 7110175 6939173 6995606 7152713 7031792 6557365 6160421 6241802 6639423 6860260 6702106
7117F702106l27464k92385k51703j32776K18320N21932K86659l72650o94488l20379
$$ 6702106 6374642 6082257 5830554 5697778 5916098 6438030 6724689 6352039 5657551 5337172
7107E337172J43650O0639k39357o2950M18505M19974j19363m18046j65166L4048
$$ 5337172 5480822 5541461 5302104 5239154 5657659 6077633 5958270 5540224 5375058 5409106
7097E409106j82496l11644j3968J82416j05430k79575J82362O19707K17627m84081
$$ 5409106 5226610 4914966 4900998 5083414 4977984 4698409 4880771 5500478 5718105 5234024
7087E234024l72031L54400M63698k68261p20661k87420K81426K87784R5053J64917
$$ 5234024 4861993 5216393 5680091 5411830 4691169 4403749 4685175 4972959 5068012 5232929
7077E232929J86814j35516l68478j64204L0756j62929k71502J32478M91435J69922
$$ 5232929 5419743 5284227 4915749 4751545 4782301 4619372 4347870 4480348 4971783 5141705
7067E141705l45493k08853L29203L61683j28598l47423j30461r2773l37989k34031
$$ 5141705 4796212 4587359 4916562 5278245 5149647 4802224 4671763 4578990 4241001 4006970
7057D006970L09886M93021l9668n25991l00299J84859J90318j64273k83753q5669
$$ 4006970 4316856 4809877 4770209 4244218 3943919 4128778 4319096 4154823 3871070 3785401
7047C785401R3009J76991K75651K30445j19625m41305k93102J35749K60341q296
$$ 3785401 3878410 4055401 4331052 4561497 4441872 4000567 3707465 3843214 4103555 4095259
7037D095259j87511m0773R9920l8276k12339q6267K28483L44706J36126j41101
$$ 4095259 3907748 3866975 3966895 3928619 3716280 3630013 3858496 4203202 4339328 4198227
7027D198227k01699l8954J25991J15204k8204j29241j01871j4702L6753J2145
$$ 4198227 3996528 3957574 4083565 4198769 4170565 4041324 3939453 3924751 3961504 3973649
7017C973649j05515k66488k77572J1338L87725M02537m7345n03785m94639q2984
$$ 3973649 3868134 3601646 3324074 3335412 3723137 4125674 4078329 3574544 3079905 2996921
7007B996921L10300M01703J70189k34235m59365j52832M62914N78826j42647q44649
$$ 2996921 3307221 3708924 3879113 3644878 3185513 3032681 3495595 4074421 3931774 3087125
6997C087125n14292M77364P76667K0235o10529j88767N78672N17136k21794n41877
$$ 3087125 2572833 3050197 3826864 3847099 3236570 3047803 3626475 4143611 3921817 3379940
6987C379940j61607J32526o8224k06468J10004L71399J01678k50962p9420K92296
$$ 3379940 3218333 3350859 3282635 3076167 3186171 3557570 3659248 3408286 3328866 3621162
6977C621162J31379m18282m96547P9160M87306J77988l28061l26066M6347K24224
$$ 3621162 3752541 3334259 2837712 2916872 3404178 3582166 3254105 2928039 2974386 3198610
6967C198610J57955J80770K53089N5784k91254l12497n577Q5672k22588m15427
$$ 3198610 3356565 3537335 3790424 3846208 3554954 3242457 3236880 3322552 3099964 2684537
6957B684537j30389K33034J71380j28269j61893O7085J59095M4131J9624J42066
$$ 2684537 2554148 2787182 2958562 2830293 2668400 2735485 2894580 2938711 2958335 3100401
6947C100401J33499o8755j62787J226J69950J04245r5636k29627k53048j53942
$$ 3100401 3233900 3165145 3002358 3003584 3173534 3277779 3182143 2952516 2699468 2545526
6937B545526J10849L89523L50159o4481m51543m33721j06797J95982L40191L55670
$$ 2545526 2656375 3045898 3396057 3331576 2880033 2446312 2339515 2535497 2875688 3231358
6927C231358K12032p0595k68328k15468p8884q8414j52243n7939J03932R9250
$$ 3231358 3443390 3372795 3104467 2888999 2810115 2721701 2569458 2511519 2615451 2714701
6917B714701R909R2317K41182R9545k60825l15142Q4103L79728J25730l20555
$$ 2714701 2724610 2816927 3058109 3157654 2896829 2581687 2665790 3045518 3171248 2850693
6907B850693l41054M7453L12575J96256q9700l10092l78226j87016K37744M73307
$$ 2850693 2509639 2557092 2869667 3065923 2976223 2666131 2287905 2100889 2338633 2811940
6897B811940J29762m37161m30927K36700P15145M06987k09380l76071j31248j469
$$ 2811940 2941702 2504541 2073614 2310314 3025459 3432446 3223066 2846995 2715747 2714278
6887B714278m4986P1025K72223J38086k67117l64910J2736L29535J85253j40157
$$ 2714278 2669292 2740317 3012540 3150626 2883509 2518599 2531335 2860870 3046123 2905966
6877B905966k44861j66702q2018N2944K18115J63567j05298j55235J53751K90933
$$ 2905966 2661105 2494403 2412385 2465329 2683444 2847011 2741713 2586478 2740229 3031162
6867C031162q4895m18372j02534M25162L01754l29963m96973M4274M31383Q2163
$$ 3031162 2946267 2527895 2425361 2850523 3152277 2822314 2325341 2369615 2800998 2883161
6857B883161m56923m46629j030K87503K16356k026j61550j25121J53163L76221
$$ 2883161 2426238 1979609 1978579 2266082 2482438 2480412 2318862 2193741 2346904 2723125
6847B723125J18570m32441n01759J36657O54893L26342l90838n90779k43276J1294
$$ 2723125 2841695 2409254 1907495 2044152 2699045 3025387 2634549 2043770 1800494 1811788
6837A811788J5042J39250L64411K47339j71332k96077K3464K07744o9565l27737
$$ 1811788 1826830 1966080 2330491 2577830 2406498 2110421 2133885 2341629 2272064 1944327
6827A944327r6595L04073K87800j04749l30283j33174K09846L33944J68315q9805
$$ 1944327 1847732 2151805 2439605 2334856 2004573 1871399 2081245 2415189 2583504 2493699
6817B493699j99160r6380L9558J2363j16111j23069L1934J65604J58290O0515
$$ 2493699 2294539 2198159 2237717 2250080 2133969 2010900 2042834 2208438 2366728 2427243
6807B427243p2627k17674k72632j53619K6133J03238J07050J12285K4419j55942
$$ 2427243 2354616 2136942 1864310 1710691 1736824 1840062 1947112 2059397 2083816 1927874
6797A927874j01762L23403N73746J11519n97129o06299M6699L68458J7363j96327
$$ 1927874 1826112 2149515 2723261 2834780 2237651 1631352 1678051 2046509 2063872 1867545
6787A867545K07340N01258L4304n85848m93522K6069J42452r5715k7360L30235
$$ 1867545 2074885 2576143 2610447 2024599 1531077 1557146 1699598 1603883 1576523 1906758
6777A906758L63675K2618j56231q0951j52032l16918r3533L96771M30492r7684
$$ 1906758 2270433 2293051 2136820 2055869 1903837 1586919 1493386 1890157 2320649 2222965
6767B222965m20236j43070J74408N9628j28322J7032K06774Q2662p7091Q5286
$$ 2222965 1802729 1659659 1834067 1893695 1765373 1782405 1989179 2071841 1994750 2080036
6757B080036K84791R5642k34433j49197K88522M56800O3263n02734o75780k76907
$$ 2080036 2364827 2460469 2226036 2076839 2365361 2822161 2885424 2382690 1706910 1430003
6747A430003L52682O15364K35515l33666l97242J9219J93255j49965l77156o896
$$ 1430003 1782685 2398049 2633564 2299898 1902656 1921875 2115130 1965165 1588009 1581113
6737A581113M56342L53015n5514j02054J48339J36873j15750j02892J36879L7978
$$ 1581113 2037455 2390470 2334956 2232902 2381241 2518114 2402364 2299472 2436351 2474329
6727B474329l96903m57726P8335M67924J30531m44486m50795P8327M34279K54885
$$ 2474329 2077426 1619700 1698035 2165959 2296490 1852004 1401209 1479536 1913815 2168700
6717B168700j40741l12502j81599L9933J43599J08004O7453Q7598M3261j28311
$$ 2168700 2027959 1715457 1533858 1573791 1717390 1825394 1892847 1980445 2023706 1895395
6707A895395j82500R7377M02012K04903l82642o05653j22575M60649M59246L7249
$$ 1895395 1712895 1810272 2212284 2417187 2034545 1428892 1306317 1766966 2226212 2263461
6697B263461j96454j26717r6267j87662j60953n349L7477j2060J02374K97139
$$ 2263461 2067007 1940290 1844023 1656361 1495408 1490059 1527536 1515476 1617850 1914989
6687A914989J90224j62077k04142J81149L24664j73806o37072k59489N50408O66206
$$ 1914989 2105213 1943136 1738994 1920143 2244807 2071001 1433929 1174440 1724848 2391054
6677B391054n5265n42744j58780L68875J67873m16768m54918Q3409L74672P2286
$$ 2391054 2335789 1793045 1634265 2003140 2171013 1754245 1299327 1382736 1757408 1829694
6667A829694k85914k36985J6122J53735K12642K47620R3583k24410l32988p9203
$$ 1829694 1543780 1306795 1322917 1476652 1689294 1936914 2030497 1806087 1473099 1393896
6657A393896J78326J41369p217m9057j05423k15912p6800L41980M58971n2411
$$ 1393896 1572222 1713591 1706374 1657317 1551894 1335982 1259182 1601162 2060133 2007722
6647B007722n57623l33326K73285L84283j7408j69571J33584K73170n2470l50491
$$ 2007722 1450099 1116773 1390058 1774341 1756933 1587362 1720946 1994116 1941646 1591155
6637A591155k38650j0989K1112L5318J83594K09373k9495k10799j00277N5475
$$ 1591155 1352505 1341516 1362628 1397946 1581540 1790913 1761418 1550619 1450342 1505817
6627A505817M0592N4781K16792K19667q4258k69024o852L08340J64215k33555
$$ 1505817 1546409 1601190 1817982 2037649 1953391 1684367 1677515 1985855 2150070 1916515
6617A916515l18767n5395J28170Q1984L0393N1818k907j23834j23363J3745J12323
$$ 1916515 1597748 1542353 1670523 1752507 1782900 1834718 1831811 1707977 1584614 1598359 1710682
6606A710682R9036L7731l5396q0619j2996R8199J8212k42623l10223j1178K89046
$$ 1710682 1809718 1847449 1812053 1731434 1718438 1816637 1834849 1592226 1282003 1270825 1559871
6595A559871K38005J6727o2027p1341j51674j09400J44395J98089j93736m80650
$$ 1559871 1797876 1814603 1752576 1681235 1529561 1420161 1564556 1762645 1568909 1088259
6585A088259r9114M92369M27445j85333m42926q3350K43559J59558L6411J27300
$$ 1088259 989145 1481514 1908959 1723626 1280700 1197350 1440909 1600467 1636878 1764178
6575A764178J31606r6044k02991j9054J21129K5699m3947L1853o530j83726j27763
$$ 1764178 1895784 1799740 1596749 1577695 1698824 1724523 1680576 1712429 1705899 1522173 1394410
6564A394410J91030K60579j05205l91115k30423N1124J09483J03644J52981O433
$$ 1394410 1585440 1846019 1740814 1349699 1119276 1170400 1279883 1383527 1536508 1542941
6554A542941l03425k40119K86241N32855R3706l45285j42264K08244q06m07291
$$ 1542941 1239516 999397 1285638 1818493 1912199 1566914 1424650 1632894 1632088 1224797
6544A224797k66243J73683J34986k59143k23221K50520L90260K7776j66560P7312
$$ 1224797 958554 1132237 1267223 1008080 784859 1035379 1425639 1453415 1286855 1364167
6534A364167K27797J422j54343O7531L08713K22688j7019j69175k64656k76284
$$ 1364167 1591964 1593386 1439043 1506574 1815287 2037975 2020956 1851781 1587125 1310841
6524A310841n4988K31716K09528l1679m0025J35749k9188m92153n15583R9572
$$ 1310841 1255853 1487569 1697097 1665418 1625393 1761142 1731954 1239801 724218 823790
6514H23790N54179K98298j17304m9178J64591q9892n45091m76808R5150M66834
$$ 823790 1377969 1676267 1558963 1509785 1674376 1584484 1039393 562585 657735 1124569
6504A124569L18502R229j02651m6063J1409m0794k29918l56993r7319M46343O39014
$$ 1124569 1443071 1452300 1349649 1303586 1314995 1274201 1044283 687290 589971 1036314 1675328
6493A675328J75138l50094k68398J48701J78786j64433k44384N0025J48462j47929
$$ 1675328 1850466 1500372 1231974 1380675 1559461 1395028 1150644 1200669 1349131 1201202
6483A201202l00057K7109L75123K32105j86686l33232j15604J27537J84099J22897
$$ 1201202 901145 928254 1303377 1535482 1348796 1015564 899960 1027497 1211596 1334493
6473A334493M0690l8769q1266n8444l113M5426O9101J8425j16326j75410P06K38387
$$ 1334493 1375183 1336414 1255148 1196704 1193591 1239017 1308118 1326543 1210217 1034807 1035513 1273900
6461A273900J63114k22076m10776p1993M17589M39328l6792m40730l65195L917
$$ 1273900 1437014 1214938 804162 732169 1149758 1589086 1552294 1111564 746369 750286
6451G50286K58866K55344R3202j26666l07413k85938j5613K55461K44233M4200
$$ 750286 1009152 1264496 1357698 1231032 923619 637681 622068 877529 1121762 1165962
6441A165962J525J64585J94271n9116k63259j46017K5263r2591k67868m7834M02710
$$ 1165962 1167487 1332072 1526343 1467227 1203968 1057951 1083214 990623 722755 674921 1077631
6430A077631M51348j0725l70233k25299R4905J81837J33479J54178J02276j49009
$$ 1077631 1528979 1518254 1148021 922722 1017627 1199464 1332943 1487121 1589397 1440388
6420A440388l46289k72210j22039o7291J07941M83511N98804J38641m08595m12171
$$ 1440388 1094099 821889 699850 632559 740500 1224011 1822815 1961456 1552861 1140690
6410A140690m0781J20169K3307l01m818k09710l13878O5000N02226L02034k53991
$$ 1140690 1099909 1220078 1243385 1243084 1238266 1028556 714678 779678 1281904 1583938 1329947
6399A329947k80306J82985K29407k65440l81747J73968M94431Q5031k71284J5046
$$ 1329947 1049641 1232626 1462033 1196593 814846 988814 1483245 1568276 1296992 1312038
6389A312038K69518j19206m73853o0320M80290K26860l47160k20761L24108K44862
$$ 1312038 1581556 1462350 988497 928177 1408467 1635327 1288167 1067406 1391514 1636376
6379A636376l26076l23584K79111M07844j54836l89196R3687L73845p2120m46757
$$ 1636376 1310300 986716 1265827 1673671 1518835 1129639 1223326 1597171 1525051 1078294
6369A078294j25006K42300r568l41960n6711M03398K76031j68004j95790P2291
$$ 1078294 953288 1195588 1186020 844060 787349 1190747 1466778 1298774 1102984 1175275
6359A175275K4206k38910j62867J40694J20101j20055k4058K80205J50810l18824
$$ 1175275 1199481 960571 797704 938398 1058499 938444 914386 1194591 1345401 1026577
6349A026577l41681J78080M09619k799l57162j19673K29156J21093j51769o1274
$$ 1026577 684896 862976 1272595 1269796 912634 792961 1022117 1143210 991441 930167
6339I30167K33546K54989J4926j55881j95607j92578n0144K29506K99632l876
$$ 930167 1163713 1418702 1433628 1277747 1082140 889562 839418 1068924 1368556 1364680
6329A364680k76279j75477l453j04138j63416J94266N57820L20661k17313k78496
$$ 1364680 1088401 912924 909471 805333 641917 836183 1394003 1714664 1497351 1218855
6319A218855P7138Q8440l26166m20317K1747K83220J586j95704J43049M51116
$$ 1218855 1295993 1384433 1058267 637950 659697 942917 944503 748799 891848 1342964
6309A342964J44816l43445l17111M5225J25608o2476o9933J01546J14868J2659
$$ 1342964 1487780 1144335 827224 872449 998057 935581 865648 967194 1082062 1094721
6299A094721O3572J46753J0374j19019P2047K60076k9742m61658l29085K07104
$$ 1094721 1158293 1305046 1315420 1196401 1268448 1528524 1498782 1037124 708039 915143
6289I15143L15460j13826l17687J777K44914O5756p0914J34997K45102l0953k46249
$$ 915143 1230603 1116777 799090 800867 1045781 1111537 1040623 1175620 1420722 1389769 1143520
6278A143520n6369J47788J4982j20679K7337P4241k46501l99513O0935N68277
$$ 1143520 1087151 1234939 1249921 1129242 1156579 1230820 984319 584806 645741 1214018
6268A214018L81579j99646l68067j04490J301j25158o4008J73171J64676q6503
$$ 1214018 1595597 1395951 1027884 923394 924695 799537 735529 908700 1073376 986873
6258I86873j64925n55J20041J58487K34345J52808k23986m17491j759M70468K06418
$$ 986873 821948 821393 941434 1099921 1334266 1487074 1263088 845597 843838 1314306 1520724
6247A520724m27114l95487K64223M81494l7953l90236j00072J68137m5119k07697
$$ 1520724 1093610 698123 962346 1443840 1405887 1015651 915579 1083716 1038597 830900
6237H30900O7578K63813N620k01989J4812J64667r1246j99439J90102L94825r9717
$$ 830900 898478 1162291 1167911 965922 980734 1145401 1054155 854716 1044818 1439643 1339926
6226A339926n78901k94331J91871M2513l16261l5841M88493K93675l19080k32553
$$ 1339926 761025 466694 658565 701078 384817 348976 837469 1131144 812064 579511
6216E79511M77108O21284l5322m13417m0521K22843j68315m96903j52333K81069
$$ 579511 1056619 1677903 1642581 1229164 1188643 1411486 1243171 746268 593935 875004
6206H75004J12103k71694j68857K50439L71032J73559O6174R7494K6250j36538
$$ 875004 987107 715413 546556 796995 1168027 1341586 1407760 1505254 1531504 1394966
6196A394966k20434k56615k96255j71265J63815L79299K36828l1641j50302k04422
$$ 1394966 1174532 917917 621662 450397 614212 993511 1230339 1198698 1048396 843974
6186H43974k65733q9601L55619N32718Q7155m45757l46246J76138L03184j15156
$$ 843974 578241 488640 844259 1376977 1464132 1018375 672129 848267 1151451 1036295
6176A036295l76595o8749L22905K14726k10017l36736j9932K75369J75607j04795
$$ 1036295 659700 590951 913856 1128582 918565 581829 561897 837266 1012873 908078
6166I08078j19362J46226K55751k994k54639r9807K24924J82393k03171l55218
$$ 908078 788716 934942 1190693 1187699 933060 833253 1058177 1240570 1037399 682181
6156F82181m7317K57245J48415j52676k37826j08623j952M0581R8692J31308Q8250
$$ 682181 634864 892109 1040524 887848 650022 541399 539447 580028 678720 810028 898278
6145H98278L8014j0633j42014k40610l4144L84153N04266J24172l09567l74637
$$ 898278 936292 925659 783645 543035 508891 893044 1397310 1521482 1211915 837278
6135H37278k27292j50705m3735K11948L40249J17705j73089k13991j56450j78328
$$ 837278 609986 459281 415546 627494 967743 1085448 912359 698368 541918 363590
6125C63590l4365L71285N00104J156m78892j88527M35761L89926k52225m53743
$$ 363590 329225 700510 1200614 1201770 722878 534351 970112 1360038 1107813 654070
6115F54070P5159M57883J45414k69849j53123J91273J88769p3439j61773k7470
$$ 654070 729229 1187112 1332526 1062677 909554 1100827 1289596 1216157 1054384 1026914
6105A026914Q5326Q3296m044j57412k17953R858L17871K31787k15399m03228p6812
$$ 1026914 1112240 1195536 1191492 1034080 816127 825985 1143856 1375643 1160244 757016 680204
6094F80204K24742N6165k20752r5087K51922L26583J22507l7619j18801k52067
$$ 680204 904946 961111 740359 645272 897194 1223777 1346284 1308665 1189864 937797
6084I37797k78331j2773K42039O1536l33508k89834K82064O93470M14661k20869
$$ 937797 659466 646693 888732 950268 616760 326926 608990 1302460 1717121 1496252
6074A496252m97671k15299J83162K64154R9559J7246N1459o2651l32753l45263
$$ 1496252 998581 783282 966444 1230598 1330157 1347403 1398862 1336211 1003458 658195
6064F58195P2947M04911J47439l19094k35112L12006M80344K8475l23524j40854
$$ 658195 731142 1136053 1283492 964398 729286 1041292 1521636 1550111 1226587 1085733
6054A085733L9495k45101n03712j58007L98644M24032J4929j60541K6662J33329
$$ 1085733 1125228 880127 376415 218408 617052 1041084 1056013 895472 922134 1055463
6044A055463n646j44334j87327k12702r4183K56529M58206J48537k79964j70797
$$ 1055463 1049817 905483 718156 505454 411271 667800 1126006 1274543 994579 823782
6034H23782L06631L62274j49763m98021k18000K71344M08350J94643q4236k88075
$$ 823782 1130413 1492687 1342924 844903 626903 898247 1306597 1501240 1417004 1128929
6024A128929l26158j03784K11757K62796j085k42746k27347l6992K03560M09570
$$ 1128929 802771 698987 910744 1173540 1172455 929709 702362 665370 868930 1278500
6014A278500L78063O900l62155l06190K4529J32810l4253j13495m3147o3401q2414
$$ 1278500 1656563 1663463 1301308 995118 1019647 1152457 1118204 1004709 961562 898161 815747
6003H15747J68382L86030J3700o36614n96717K09019O95221K79941k57900j48665
$$ 815747 984129 1370159 1383859 747245 150528 359547 1054768 1334709 1076809 928144
5993I28144J85277Q0506j66847J5143L31166J64339k82143l74818j61957j41686
$$ 928144 1113421 1193927 1027080 1042223 1373389 1537728 1255585 880767 718810 577124
5983E77124k56183o8868K93663L08612K2200l5243J80710J92514p8391j67626
$$ 577124 320941 252073 545736 854348 876548 841305 1022015 1214529 1136138 968512
5973I68512Q1645K54298P9818k00386l05352k39296p3493J38904K22145P3225
$$ 968512 1050157 1304455 1384273 1183887 878535 639239 565746 704650 926795 1000020
5963A000020p7553j6126L7461j48028k54600P8688M63790K73834k47553k92351
$$ 1000020 922467 906341 943802 795774 541174 619862 1083652 1357486 1109933 817582
5953H17582J72534L50995l0499l27723j61345q57j79130k47421J48242N31819
$$ 817582 990116 1341111 1310612 982889 821544 820687 641557 394136 542378 1074197
5943A074197L59610r9623k64284j28386o5086j33749j23400K424J36918K49907
$$ 1074197 1433807 1334184 1069900 941514 876428 742679 619279 621703 758621 1008528
5933A008528K73892Q7106j57321j00345J99114K24328j41227l17772K8532L80506
$$ 1008528 1282420 1369526 1212205 1111860 1310974 1535302 1394075 1076303 1104835 1485341
5923A485341K13357j59440j91862j4456n1530j93867r2202J00350L3116j14733
$$ 1485341 1698698 1539258 1347396 1332940 1281410 1087543 995341 1095691 1128807 1014074
5913A014074J7098J79621r1567n01071l23464L50046O16483J25170m16935l52375
$$ 1014074 1031172 1210793 1119226 618155 294691 644737 1261220 1386390 969455 617080
5903F17080O1058K39896J21203J0967K2216M9719K7838o1796k26736l43514k25006
$$ 617080 678138 918034 1039237 1050204 1072420 1122139 1149977 1088181 861445 517931 292925
5892B92925Q0289K87219K50436J12326L3534J5255J1735j0873j11602k50891k23072
$$ 292925 373214 660433 910869 1023195 1056729 1071984 1083719 1072846 961244 710353 487281
5881D87281L2087K18354J16215J776J79830L44902L2379m61588l83560K54051
$$ 487281 519368 737722 853937 855713 1035543 1380445 1412824 951236 567676 821727
5871H21727N76880J55396l83610l73972k1148J29178J9579j00869j85277k47569
$$ 821727 1398607 1554003 1170393 796421 775273 904451 924030 823161 637884 390315
5861C90315j39725J06232J32450j46952k54589J02856M62234K95542j53208k95359
$$ 390315 250590 356822 489272 342320 87731 190587 652821 948363 795155 499796
5851D99796r2933P6082J28347K14781K05677j02772m36746l39440Q7456L24170
$$ 499796 406863 482945 611292 826073 1031750 928978 492232 152792 240248 564418
5841E64418K15728M9121l8516j41366j76780l142J45228k6741k26031M6589N31409
$$ 564418 780146 829267 790751 649385 472605 469463 614691 587950 361919 408508 939917
5830I39917M58519j76674m86612p8477L27489Q9665l64521l27426P8750K58401
$$ 939917 1398436 1221762 735150 656673 984162 1073827 709306 381880 460630 719031
5820G19031J13423k2871n9773j13582p8881J61048L28455J27790j85797j76230
$$ 719031 832454 809583 749810 636228 557347 718395 1046850 1174640 988843 812613
5810H12613M8961P4753o3524j6310J32015k2451l78222l70754P7348L81251K40856
$$ 812613 861574 936327 872803 856493 988508 966057 587835 217081 294429 675680 916536
5799I16536M5602P9335M4656k38384l52867k6493K58688L2217l07068j42339K60124
$$ 916536 962138 1041473 1086129 847745 494878 468385 727073 759290 452222 309883 570007
5788E70007J68637l27249m04579J15237M40476J11064k62436l8814M10339L49580
$$ 570007 738644 411395 6816 122053 562529 673593 411157 372343 782682 1132262
5778A132262j44516l86861j69675P5517Q3026M3028O4460l4205k51322k49314
$$ 1132262 987746 600885 431210 506727 589753 632781 697241 663036 411714 162400
5768A62400Q4158L41955J57117k45423l59200o7231K65788K70945m6492l44937
$$ 162400 246558 588513 745630 500207 141007 73776 339564 610509 564017 219080
5758B19080k69640J71071N31883M04361l3449k13345L4255K54444Q3829k13276
$$ 219080 -50560 120511 652394 1056755 1023306 809961 844216 1098660 1182489 969213
5748I69213k21668k4528L7163k1087N8697K14768J37891j42912k47576n8666J07609
$$ 969213 747545 723017 760180 739093 797790 1012558 1150449 1007537 759961 701295 808904
5737H08904L6111r6517r2824k1361Q453J5890l1406k10039l32061o4552M52974
$$ 808904 845015 748498 655674 634313 642766 658656 627250 417211 85150 20598 473572
5726D73572N76434N7541m65909l22636K14205L56623k5672k97515q0708K38519
$$ 473572 1050006 1107547 641638 319002 533207 889830 864158 566643 485935 724454
5716G24454J80808j46044l10110j66780P8848K18984J99062M3958j54730k25118
$$ 724454 905262 759218 449108 282328 361176 580160 779222 823180 668450 443332
5706D43332n7815K24983L39740J24418k59253m38220k06417J98722L12378N201
$$ 443332 385517 610500 950240 1074658 815405 377185 170768 369490 681868 687069
5696F87069l13964k09282K00826M07636J91563j36133j96757K052J71251J14507
$$ 687069 373105 163823 364649 772285 963848 827715 630958 633010 804261 918768
5686I18768j14049l10474l01609j03591P8190Q5956P242J5288R5221J29652J70203
$$ 918768 804719 494245 192636 89045 167235 253191 260433 275721 370942 500594 670797
5675F70797L25684M17095J33828l88522n67794j65272L04489K66485j29308l06541
$$ 670797 996481 1413576 1547404 1158882 591088 425816 730305 996790 867482 560941
5665E60941j09254J06109J00470p11p7157j80095k57665j26137J52743K39944
$$ 560941 451687 557796 658266 657555 580398 400303 142638 16501 169244 409188
5655D09188L8595j06766M7941K45294J63581n1688p6760J3243p2616k28178p7885
$$ 409188 447783 341017 388958 634252 797833 746145 669385 682628 610012 381834 303949
5644C03949K78679K58007k62085n64343q5453O53731P02077K5942m65024k30050
$$ 303949 582628 840635 578550 14207 -71246 582485 1284562 1310504 845480 615430
5634F15430K26542K05469k20131m69119l01192L1140K50129K67284P4761k10984
$$ 615430 841972 1047441 827310 358191 56999 88139 338268 605552 680313 469329
5624D69329l02410o9852J95564J77399L4483R6503K23182J8588l78538l76151
$$ 469329 166919 97067 292631 470030 504513 601016 824198 842786 464248 88097
5614H8097R5452L71999R0628k24196m5936K81431J59507k37975k74654R0381L01550
$$ 88097 183549 555548 646176 421980 376044 657475 816982 579007 304353 394734 696284
5603F96284J47844j6658N816J702r3256k7231K00699K12821p5457k31475m1773
$$ 696284 844128 827470 833286 834988 741732 714501 915200 1128021 1052564 821089 779316
5592G79316R0656j37742l48525j04641L18079L46816r588k69196k42689j23747
$$ 779316 869972 732230 383705 279064 597143 943959 934371 665175 422486 298739
5582B98739J6915K34253L07722l0523m66556l52903K92991O71775L25365k20327
$$ 298739 315654 549907 857629 827106 360550 7647 300638 972413 1297778 1077451
5572A077451l04822q4326j04269l21277k20285K42316M83419J75516k60902k88041
$$ 1077451 772629 688303 584034 262757 42472 284788 768207 943723 682821 394780
5562C94780K0567K00054R5653j6935O3725J72381P6179j49474k18276m4066J15580
$$ 394780 415347 615401 711054 694119 757844 930225 1006404 856930 638654 594588 710168
5551G10168K009k50185k30990J80870N44255L56294k38239n40549j98556K96840
$$ 710168 712177 461992 231002 411872 956127 1312421 1074182 533633 335077 631917
5541F31917K84885j44793l41139r5416J09533k8292j18228J74869M08459L8287
$$ 631917 916802 772009 430870 335454 444987 416695 298467 473336 881795 920082
5531I20082n24555l70245M50353Q23542J84393o05453n13635K05320N24921J63573
$$ 920082 395527 25282 475635 1299177 1483570 878117 364482 569802 1094723 1258296
5521A258296k34470k26799o3183l4872n1805j6682l7159r2797O871J83565J14186
$$ 1258296 1023826 797027 733844 698972 647167 630485 593326 500529 507400 690965 805151
5510H05151j52134j48028K18497L96779N3095l49688k75144O4719J39614m3149
$$ 805151 653017 504989 723486 1120265 1173360 823672 548528 613247 752861 709712
5500G09712j07591l3937p3778j37429O2865L43949K14545k50353l73652R6646
$$ 709712 602121 568184 494406 356977 419842 763791 978336 727983 354331 450977
5490D50977N30816L06108l26698o52259m28592j6353K18697K48119K01733J46845
$$ 450977 981793 1287901 961203 308944 -119648 -136001 82696 330815 532548 679393
5480F79393O7143q0287k69089l22527o8114L42341M61105P1623m58616n71804
$$ 679393 746536 666249 397160 74633 6519 348860 809965 881588 422972 -148832
5470a48832j87040K47058L38472J58405L442l7871r6656j88287j13174K04656
$$ -148832 -335872 -88814 249658 408063 411505 373634 276978 88691 -24483 180173
5460A80173M63832L09663j38883l68668j42722J93416K28122K4321j04503j06834
$$ 180173 644005 953668 814785 446117 303395 496811 724933 749254 644751 537917
5450E37917j39789j80694q2841P5906Q9151Q942M4866J25304j751k38177j96351
$$ 537917 398128 217434 134593 210499 299650 308592 353458 478762 477011 238834 42483
5439D2483J38424L09441J02248j34475r1900N4577P4967R4911K32523K45087n3238
$$ 42483 180907 490348 592596 458121 366221 420798 495765 590676 823199 1068286 1015048
5428A015048l61119k99684J7480K14587J98087R6838o7502k50158k03586J28914
$$ 1015048 653929 354245 371725 586312 784399 881237 813735 563577 359991 488905
5418D88905L12178P880l88987k73550K02066L29794o2606l85877k18771J48716
$$ 488905 801083 808963 419976 146426 348492 678286 615680 229803 11032 159748
5408A59748K73415J47781n4r8876j81411k01542r6548J12758L38533M26031K34326
$$ 159748 433163 580944 580890 482014 300603 99061 2513 115271 453804 879835 1114161
5397A114161j03840k01018L6488J53425j66573m77086k04332L63069M43526k7112
$$ 1114161 1010321 809303 845791 999216 832643 355557 151225 514294 957820 930708
5387I30708l56475k35914p3520j03776l3686K14482K50387m304q9409J18693J27322
$$ 930708 574233 338319 264799 161023 127337 341819 592206 587902 498493 617186 744508
5376G44508k06504k96917J11204L85165R4627k13549l2210J73130j11264l99332
$$ 744508 538004 241087 352291 737456 832083 618534 586324 759454 648190 248858
5366B48858o9691M25789L12420j34692j37254J50754P630m10221l12053K28087
$$ 248858 179167 604956 917376 782684 645430 796184 803814 393593 81540 309627
5356C09627L55628l0556j62676J16445J12130k86254k92806K80977N37430K5969
$$ 309627 665255 634699 472023 588468 700598 414344 121538 402515 939945 965914
5346I65914m61726k68555R5741K9043j17392J05152K97513K3252k72686q1853
$$ 965914 504188 235633 331374 360417 243025 348177 645690 668942 396256 314403
5336C14403J83778k3664l11931o0830L94809L37404q2886k16731r6749j86512
$$ 314403 498181 474517 162586 101756 496565 833969 751083 534352 437603 251091
5326B51091l28399m8629L73682K66644j99701k55838J21523K35994k4708p6434
$$ 251091 -77308 -125937 247745 514389 314688 58850 180373 416367 391659 315225
5316C15225J45827N4395l63263l76212J57170M45279J28316j34484Q6460K54247
$$ 315225 461052 515447 152184 -224028 -66858 378421 506737 372253 458713 712960
5306G12960k9138k30843P3930L31709J4873l58810j39320K63928J22385k80384
$$ 712960 683822 452979 526909 858618 873491 514681 375361 639289 761674 481290
5296D81290j54560L75684M79245K8043k73724j18517L2549j18468k76717k16090
$$ 481290 326730 702414 1181659 1209702 935978 817461 850010 731542 454825 238735
5286B38735j26185j16812j4267J82937K14383N5363k7077K686q2199k22909r9515
$$ 238735 112550 -4262 -18529 164408 378791 434154 407077 409763 327564 104655 5140
5275E140K10965K46885l3182j36785Q0715J50040j06937j76937J95095M15891
$$ 5140 216105 462990 429808 293023 373738 523778 416841 239904 434999 850890
5265H50890L1829l70604o2350N48842M90957k10762n65875j80378K14974K2226
$$ 850890 882719 512115 449765 998607 1489564 1278802 712927 532549 747523 769749
5255G69749l32130k12219K15265L63288J54979k9480o2963j51788l17830l11283
$$ 769749 437619 225400 440665 803953 958932 929452 866489 714701 396871 85588
5245H5588o0382J84078K18559J10122J458n6593m0062M6998P9359m3809j45671
$$ 85588 25206 209284 427843 537965 539423 482830 442768 489766 569125 525316 379645
5234C79645M7470M19165M99063J34772k25706j85478m564j57011n19121n20684
$$ 379645 427115 846280 1345343 1480115 1254409 1068931 1064367 907356 388235 -132449
5224a32449m5153L72958L59581J85806J85868J72953j34473m64019l39324Q5180
$$ -132449 -177602 195356 554937 740743 926611 1099564 965091 501072 161748 246928
5214B46928J64453k23249m19366J1878N59399M80341j25151m89091k51058J87161
$$ 246928 411381 188132 -231234 -219356 340043 820384 695233 206142 -44916 142245
5204A42245L54756K29307k8313l41207n10988k30769L69928O24899K03621k96670
$$ 142245 497001 726308 697995 356788 -154200 -384969 -15041 609858 813479 516809
5194E16809j69947L13025L34252j50857l67076k1097K57704M9272j75651m335
$$ 516809 346862 659887 994139 843282 476206 455109 712813 762085 586434 582099
5184E82099J17760k42672n46458j17063N86843N95089M72k40501M8887O6073m07566
$$ 582099 699859 457187 -89271 -206334 380509 975598 976070 735569 784456 850529 442963
5173D42963n34277N8975M96216R2544m62025k59512L26481L44957j33976k47546
$$ 442963 -91314 -32339 463877 556421 94396 -165116 161365 506322 372346 124800
5163A24800J76520M57108K55449m4132j46432j82568j97921p3462J2504k11599
$$ 124800 301320 758428 1013877 969745 823313 640745 442824 369362 381866 170267
5153A70267m38474j09251N41988O35292l787n17581l26195Q9909J27967j6100
$$ 170267 -268207 -377458 164530 799822 796035 278454 -47741 42168 170135 154035
5143A54035Q6668K81189K03828k4970q2882k9070o8300q7023O6772J70992r161
$$ 154035 240703 521892 725720 700750 617868 588798 520498 433475 500247 671239 662078
5132F62078k49693k24956l7388N5266J12353K42825K23954q2031k80512j4319
$$ 662078 412385 187429 150041 205307 317660 560485 784439 702408 421896 407577
5122D07577L33976J77813k92040l93484m9885J73774O4722j787J28791J28160
$$ 407577 741553 919366 627326 233842 183957 357731 422453 420666 549457 677617
5112F77617r4893j41882J31657K70728k4986l57344k54458J01517K08189j3249
$$ 677617 582724 440842 572499 843227 818241 460897 206439 307956 516145 502896
5102E02896k23812k08842n6820Q3378J56344J76926J94531K00905O0952k73427
$$ 502896 279084 70242 13422 96800 253144 430070 624601 825506 886458 613031
5092F13031n10549l04714J80535L93098J70973m5671M2509J29926r4931l42267
$$ 613031 102482 -202232 -21697 371401 542374 496703 539212 669138 574207 231940
5082B31940j82932K00191K58739p5459l06000j19744K20975L17909J34810p7328
$$ 231940 49008 249199 507938 432479 126479 6735 227710 545619 680429 603101
5072F03101j34972o5640j380j8979o9805o8101l5914o9330j47787j21182N6650
$$ 603101 468129 402489 401109 382130 312325 244224 208310 138980 -8807 -129989 -73339
5061g3339K34921K80403K25943J31237j4408j51944j27648N1664J42947R245j59448
$$ -73339 161582 441985 667928 799165 784757 632813 505165 556829 699776 709021 549573
5050E49573j46425l0025N317o680P1923J84194J51540l1548j91439k09509j03391
$$ 549573 403148 373123 378440 371760 443683 627877 779417 747869 556430 346921 243530
5039B43530M9712J42130R4436m804L5672J99852K20615j8556k72630l01577j96882
$$ 243530 293242 435372 529808 525004 560676 760528 981143 962587 689957 388380 191498
5028A91498j29826m4698J25450J98417K7092j70620j08249J21619K24789J55421
$$ 191498 61672 16974 142424 340841 367933 197313 89064 210683 435472 590893
5018E90893O6204p746r4710j16412p9084j72311l54705k13035L31258O21431J83700
$$ 590893 657097 649351 554641 438229 359145 186834 -167871 -380906 -49648 571783 755483
5007G55483l94301k99326J80954J66412k47464j49400M78850N73196j79079o76581
$$ 755483 361182 61856 242810 409222 161758 12358 491208 1064404 885325 208744
4997B08744k05948L63548J01675l92327j14354N12805L54679m20803n63184J79095
$$ 208744 2796 366344 468019 75692 -38662 474143 828822 408019 -155165 23930
4987B3930O68211K45592l38035k95046L6709L3468j23027M6629L59727L01783
$$ 23930 692141 937733 599698 304652 341361 374829 251802 298431 658158 959941
4977I59941o8227k42232p5993J05991Q6590m8841j98741l08545k30356R3122L70113
$$ 959941 891714 649482 573489 679480 766070 717229 518488 209943 -20413 72709 442822
4966D42822K63160q2720j89829O2551K75704J49362r2495q9449J07108J42761
$$ 442822 705982 623262 433433 495984 771688 921050 828555 739106 846214 988975
4956I88975j09411l88987m09673j81280P4530J80972J05477p5582k02875j16845
$$ 988975 879564 490577 80904 -100376 -25846 155126 260603 185021 -17854 -134699
4946a34699J44259K92759J17721j70369j60923J55058L00082j3941m18379l95262
$$ -134699 9560 302319 420040 249671 88748 243806 543888 529947 111568 -283694
4936b83694k9568J58684L2387o655K46052M06396J25809k85316k83389P9036K38437
$$ -283694 -313262 -154578 -122191 -128846 117206 523602 649411 364095 80706 159742 398179
4925C98179m056j92806L3473L37908J91861k79963m40163p9511K75814J56195
$$ 398179 394123 201317 234790 572698 764559 484596 44433 -35078 240736 396931
4915C96931j87186k32104L4217K22518K11872J96238J64815q2642l78897k71553
$$ 396931 209745 -22359 11858 234376 446248 642486 807301 724659 345762 74209
4905G4209J81157L36722k8404l02629n6065K02655p3941m31172j37702M94026
$$ 74209 255366 592088 563684 261055 204990 407645 333704 -97468 -235170 258856
4895B58856N39268j3072k72024K7418J57533k11303l90048O6521M93017K04847
$$ 258856 798124 785052 513028 540446 697979 486676 96628 163149 656166 861013
4885H61013l70256m45560j00810Q3965Q7863K53882M25424J89598k54698l42821
$$ 861013 490757 45197 -55613 28352 116215 370097 795521 985119 730421 387600
4875C87600j09656p0031k33922j09353L06012M13724M2533k29461l8050K10383
$$ 387600 277944 207913 -26009 -135362 170650 584374 626907 397446 359396 569779
4865E69779Q1221k11260k46181j8741K22785L41924K43192j35604n13539m06749
$$ 569779 651000 439740 193559 174818 397603 739527 982719 847115 333576 -73173
4855g3173J54931N15143K76188j79101l46247k59925j41160O0590L14565K44798
$$ -73173 81758 596901 873089 693988 347741 87816 -53344 7246 321811 566609
4845E66609k17236m28553M4923N65409K86962m68003o28325o153M82893K83648
$$ 566609 349373 -79180 -34257 531152 818114 350111 -278214 -284367 198526 482174
4835D82174r4244j05802p542j88686l83906j54428L25484N36773L47651J157l30693
$$ 482174 387930 282128 274586 85900 -298006 -452434 -126950 409823 757474 758631 427938
4824D27938n25854l43001K18871O22562L90909j51942k83699O8411K73411J847
$$ 427938 -97916 -440917 -222046 400516 791425 639483 355784 424195 697606 699453
4814F99453l28095k81019k9703M9993k8460m2325n171l6808k1689J92686M05176
$$ 699453 371358 90339 60636 110629 82169 39844 34673 -2135 -23824 168862 574038
4803E74038K80826j08181l52123k89408j35904k6066J41738L15278K10915j55122
$$ 574038 854864 746683 394560 105152 -30752 -56818 84920 400198 611113 455991
4793D55991k94705N3032M20191K50077k39731l66197n367K69509Q1020k73489
$$ 455991 161286 214318 634509 884586 644855 278658 273291 542800 623820 350331
4783C50331l63935j66140J23869L78374M28675R2793m21969n47864j04046L62511
$$ 350331 -13604 -179744 -55875 322499 751174 843967 421998 -125866 -229912 132599
4773A32599L33887L5341l2946R8969P7715o0254j3115J33404L7420k08379j92189
$$ 132599 466486 501827 468881 567850 645565 585311 572196 705600 743020 534641 342452
$$ [...]
##END NTUPLES=NMR SPECTRUM
##END=
