##TITLE=1H ikalashn
2066-EA
16.9.2024
##JCAMPDX= 6.0         $$ Bruker NMR JCAMP-DX V2.0
##DATA TYPE= NMR FID
##DATA CLASS= NTUPLES
##ORIGIN= UXNMR, Bruker Analytische Messtechnik GmbH
##OWNER= root
$$ TOPSPIN		Version 1.3
$$ 2024-09-16 15:29:09.906 +0400  Irina@DPX200
$$ Compression mode = diff/dup
##.OBSERVE FREQUENCY= 200.131392401
##.OBSERVE NUCLEUS= ^1H
##.DELAY= (6, 6)
##.ACQUISITION MODE= SIMULTANEOUS
##.ACQUISITION SCHEME= undefined
##.AVERAGES= 32
##.DIGITISER RES= 18
##SPECTROMETER/DATA SYSTEM= spect
##.PULSE SEQUENCE= zg
##.SOLVENT NAME= DMSO
##.SHIFT REFERENCE= INTERNAL, DMSO, 1, 17.95386
##AUDIT TRAIL= $$ (NUMBER, WHEN, WHO, WHERE, WHAT)
$$ ##TITLE= Audit trail, TOPSPIN		Version 1.3
$$ ##JCAMPDX= 5.01
$$ ##ORIGIN= Bruker BioSpin GmbH
$$ ##OWNER= Irina
$$ $$ F:/spectra/data/iren/nmr/1H/4/audita.txt
$$ ##AUDIT TRAIL=  $$ (NUMBER, WHEN, WHO, WHERE, VERSION, WHAT)
(   1,<2024-09-16 15:28:38.140 +0400>,<Irina>,<DPX200>,<TOPSPIN 1.3>,
      <created by zg
	started at 2024-09-16 15:26:30.250 +0400,
	POWCHK disabled, PULCHK disabled
       configuration hash MD5:
       BE 6D 3F 07 2A EA 11 49 91 17 2B D3 AF B3 58 0D
       data hash MD5: 16K
       E2 EC 10 41 63 08 43 39 46 AB 6B DC 20 DC 44 88>)
$$ ##END=
$$ 
$$ $$ hash MD5
$$ $$ 8E 13 E0 87 9D B9 78 D3 EF A6 FC 29 C7 A6 F7 A8
##$RELAX= 
##$RELAX= 
##$RELAX= 
##$RELAX= 
##$RELAX= 
##$RELAX= 
##$RELAX= 
##$RELAX= 
##$RELAX= 
$$ Bruker specific parameters
$$ --------------------------
##$DU= <F:/spectra>
##$EXPNO= 4
##$NAME= <1H>
##$PROCNO= 1
##$TYPE= <nmr>
##$USER= <iren>
##$AMP= (0..31)
100 100 100 100 100 100 100 100 100 100 100 100 100 100 100 100 100 100 
100 100 100 100 100 100 100 100 100 100 100 100 100 100 
##$ANAVPT= -1
##$AQSEQ= 0
##$AQ_mod= 1
##$AUNM= <au_zg>
##$AUTOPOS= <>
##$BF1= 200.13
##$BF2= 200.13
##$BF3= 200.13
##$BF4= 200.13
##$BF5= 200.13
##$BF6= 200.13
##$BF7= 200.13
##$BF8= 200.13
##$BYTORDA= 1
##$CFDGTYP= 0
##$CFRGTYP= 5
##$CHEMSTR= <none>
##$CNST= (0..63)
1 1 145 1 1 1 1 1 1 1 1 1 1 1 1 1 1 1 1 1 1 1 1 1 1 1 1 1 1 1 1 1 1 1 
1 1 1 1 1 1 1 1 1 1 1 1 1 1 1 1 1 1 1 1 1 1 1 1 1 1 1 1 1 1 
##$CPDPRG= <>
##$CPDPRG1= <>
##$CPDPRG2= <>
##$CPDPRG3= <>
##$CPDPRG4= <mlev>
##$CPDPRG5= <mlev>
##$CPDPRG6= <mlev>
##$CPDPRG7= <mlev>
##$CPDPRG8= <mlev>
##$CPDPRGB= <>
##$CPDPRGT= <>
##$D= (0..63)
0 2 0 0 0 0 0 0 0 0.06 0 0.03 0 0 0 0 0.0002 0 0 0 0 0 0 0 0 0 0 0 0 0 
0 0 0 0 0 0 0 0 0 0 0 0 0 0 0 0 0 0 0 0 0 0 0 0 0 0 0 0 0 0 0 0 0 0 
##$DATE= 1726486117
##$DBL= (0..7)
120 120 120 120 120 120 120 120 
##$DBP= (0..7)
150 150 150 150 150 150 150 150 
##$DBP07= 0
##$DBPNAM0= <>
##$DBPNAM1= <>
##$DBPNAM2= <>
##$DBPNAM3= <>
##$DBPNAM4= <>
##$DBPNAM5= <>
##$DBPNAM6= <>
##$DBPNAM7= <>
##$DBPOAL= (0..7)
0.5 0.5 0.5 0.5 0.5 0.5 0.5 0.5 
##$DBPOFFS= (0..7)
0 0 0 0 0 0 0 0 
##$DE= 6
##$DECBNUC= <off>
##$DECIM= 32
##$DECNUC= <off>
##$DECSTAT= 4
##$DIGMOD= 1
##$DIGTYP= 9
##$DL= (0..7)
0 120 120 120 120 120 120 120 
##$DP= (0..7)
150 150 150 150 150 150 150 150 
##$DP07= 0
##$DPNAME0= <>
$$ [...]
##$SW= 21.9925939549014
##$SWIBOX= (0..15)
0 0 2 0 0 0 0 0 0 0 0 0 0 0 0 0 
##$SW_h= 4401.40845070422
##$TD= 16384
##$TD0= 1
##$TE= 300
##$TE2= 300
##$TE3= 300
##$TEG= 300
##$TL= (0..7)
0 120 120 120 120 120 120 120 
##$TP= (0..7)
150 150 150 150 150 150 150 150 
##$TP07= 0
##$TPNAME0= <>
##$TPNAME1= <>
##$TPNAME2= <>
##$TPNAME3= <>
##$TPNAME4= <>
##$TPNAME5= <>
##$TPNAME6= <>
##$TPNAME7= <>
##$TPOAL= (0..7)
0.5 0.5 0.5 0.5 0.5 0.5 0.5 0.5 
##$TPOFFS= (0..7)
0 0 0 0 0 0 0 0 
##$TUNHIN= 0
##$TUNHOUT= 0
##$TUNXOUT= 0
##$USERA1= <user>
##$USERA2= <user>
##$USERA3= <user>
##$USERA4= <user>
##$USERA5= <user>
##$V9= 5
##$VALIST= <valist>
##$VCLIST= <CCCCCCCCCCCCCCC>
##$VD= 0
##$VDLIST= <DDDDDDDDDDDDDDD>
##$VPLIST= <PPPPPPPPPPPPPPP>
##$VTLIST= <TTTTTTTTTTTTTTT>
##$WBST= 1024
##$WBSW= 25
##$XGAIN= (0..3)
0 0 0 0 
##$XL= 0
##$YL= 0
##$YMAX_a= 326833
##$YMIN_a= -637849
##$ZGOPTNS= <>
##$ZL1= 120
##$ZL2= 120
##$ZL3= 120
##$ZL4= 120
##$ABSF1= 10
##$ABSF2= 0
##$ABSG= 5
##$ABSL= 3
##$ALPHA= 0
##$AQORDER= 0
##$ASSFAC= 0
##$ASSFACI= 0
##$ASSFACX= 0
##$ASSWID= 0
##$AUNMP= <proc_1d>
##$AXLEFT= 0
##$AXRIGHT= 0
##$AXTYPE= 0
##$AXUNIT= <>
##$AZFE= 0.1
##$AZFW= 0.1
##$BCFW= 1
##$BC_mod= 2
##$BYTORDP= 1
##$COROFFS= 0
##$CY= 7568.61572265625
##$DATMOD= 1
##$DC= 2
##$DFILT= <>
##$DTYPP= 0
##$F1P= 17.9538593292236
##$F2P= -4.03888763876832
##$FCOR= 0.5
##$FTSIZE= 32768
##$FT_mod= 4
##$GAMMA= 1
##$GB= 1
##$INTBC= 1
##$INTSCL= 1
##$ISEN= 128
##$LB= 0.02
##$LEV0= 0
##$LPBIN= 0
##$MAXI= 945.577
##$MC2= 0
##$MEAN= 0
##$ME_mod= 0
##$MI= -402.1523
##$NCOEF= 0
##$NC_proc= 0
##$NLEV= 6
##$NOISF1= 8.587773
##$NOISF2= 6.764455
##$NSP= 1
##$NTH_PI= 0
##$NZP= 0
##$OFFSET= 17.95386
##$PC= 1
##$PHC0= 299.3538
##$PHC1= 16.29654
##$PH_mod= 0
##$PKNL= yes
##$PPARMOD= 0
##$PPDIAG= 0
##$PPIPTYP= 0
##$PPMPNUM= 100
##$PPRESOL= 1
##$PSCAL= 0
##$PSIGN= 0
##$REVERSE= no
##$SF= 200.13
##$SI= 32768
##$SIGF1= 18.5376
##$SIGF2= -6.396296
##$SINO= 400
##$SIOLD= 32768
##$SREGLST= <1H.CDCl3>
##$SSB= 3
##$STSI= 0
##$STSR= 0
##$SW_p= 4401.40845070423
##$SYMM= 0
##$S_DEV= 0
##$TDeff= 0
##$TDoff= 0
##$TI= <>
##$TILT= no
##$TM1= 0
##$TM2= 0
##$TOPLEV= 0
##$USERP1= <user>
##$USERP2= <user>
##$USERP3= <user>
##$USERP4= <user>
##$USERP5= <user>
##$WDW= 1
##$XDIM= 8192
##$YMAX_p= 0
##$YMIN_p= 0
$$ End of Bruker specific parameters
$$ ---------------------------------
##NTUPLES= NMR FID
##VAR_NAME=  TIME,          FID/REAL,        FID/IMAG
##SYMBOL=    X,             R,               I
##VAR_TYPE=  INDEPENDENT,   DEPENDENT,       DEPENDENT
##VAR_FORM=  AFFN,          ASDF,            ASDF
##VAR_DIM=   8192,          8192,            8192
##UNITS=     SECONDS,       ARBITRARY UNITS, ARBITRARY UNITS
##FACTOR=    0.0002272,     1,               1
##FIRST=     0,             0,               0
##LAST=      1.8609952,     -10,             -124
##MIN=       0,             -637849,         -637849
##MAX=       1.8609952,     326833,          326833
$$ Real data points
##PAGE= N=1
##DATA TABLE= (X++(R..R)), XYDATA
0@%%%%%%%%%%%%%%%L2o4O4o4O4o4R6j28J28j60J92k24K57k89L52m08M55n10N89
34C18o70P37q32R41j039J155j297J454j614J783j975K181k406K657k926L221l557
51a869L927m318M758n258N813o446P169p999Q971j0123J1522j3267J5505j8489
65a0104K2695k9153M0409o5666K28817m0864l02605K06528K04517N3241r5390
76B12425J1659j5293q6118p7197J26245J55112m3404k44538j13205J36259J87391
87B49336k5325j45798n7244N6566j2701r0955k4482P5989r388j46758r1963J12244
99a10479J47651k0306j13761J2847J15035N481j42274p7703R0205R1088o4377
110f6593j04065L6425J23341K6497o1399J9495J12700J6501j38435q9455J11038
$$ plain form
0 0 0 0 0 0 0 0 0 0 0 0 0 0 0 0 0 32 -32 32 -32 32 -32 64 -64 64 -96 96 -128 129 -160 192 -216 239 -271 318
34 318 -352 385 -447 494 -545 610 -687 767 -847 936 -1039 1142 -1264 1393 -1533 1688 -1869
51 -1869 2058 -2260 2498 -2760 3053 -3393 3776 -4223 4748 -5375 6147 -7120 8385 -10104
65 -10104 12591 -16562 23847 -41819 186998 146134 -156471 50057 254574 307815 212425
76 212425 224084 208791 122673 45476 171721 326833 283429 38891 -74314 61945 249336
87 249336 224011 78213 20969 77535 64834 -26121 -50603 25386 15998 -130760 -222723 -110479
99 -110479 37172 16866 -96895 -84048 30987 36468 -105806 -183509 -93304 -2216 -66593
110 -66593 -170658 -134233 -10892 15605 -45794 -26299 86401 102902 -35533 -124988 -13950
121a3950J59346j3966j41083n1398Q2649O5122k4333j5024M4597l97j01730o5050
133g5217J06758J70094R045j62416j12460O1136J01336j2116p2998j6032P401
144D531n2879m0314R7504J55548K493j63261j03486Q1194J18614j6929j01289
155a8274l7147L4093R203j7617M0359Q6862R037j00551p1202O3676J02761j1121
167I0079r7331k8358P1489M2181n1666m2988M3479M4309n1375p7554J8358Q0889
179D1512J0062o6370j4804P4286L8127p5936q3577K8216P7303j2983r0947l1485
191a06596O5271N2600j8681j3609M4458K5506o0652o6806L3077Q6307N644q5034
203c8515m9053N3463P4538P866k6396P033J8529l0604m6139K6751Q5127K1792
$$ plain form
121 -13950 145396 131430 -9653 -61051 21598 86720 62387 47363 91960 91563 -10167 -75217
133 -75217 31541 201635 210680 48264 -64196 -3060 98276 86160 13162 -2870 4531
144 4531 -48348 -88662 8842 164390 166883 3622 -99864 -18670 99944 83015 -18274
155 -18274 -55421 -21328 -12125 -29742 10617 97479 106516 5965 -65237 -1561 101200 90079
167 90079 -7252 -35610 35879 78060 26394 -16594 26885 71194 19819 -57735 -39377 41512
179 41512 51574 -14796 -29600 44686 82813 6877 -76700 -48484 28819 15836 -75111 -106596
191 -106596 -41325 11275 -7406 -21015 23443 48949 -11703 -78509 -45432 40875 46519 -38515
203 -38515 -87568 -34105 40433 48299 21903 28936 47465 16861 -29278 -2527 82600 104392
215A04392q0433o2954M9787Q5545j514o5685k0505K9463o884m5477R213P6113
227G1061L2239o6981o5920L3270P4550l483p8091m5395K5891K4502k3532j6804
239c8693L8410M0639k5627n4557L938N3142P367o0329l9440L4578M1016j9945
251a9501l4746K5875N4246l457n4378j5632M4336K5515l4002k6236L6641M4086
263D2747k0467m5981J5235O0697P756o3365l9933L7513M8102j0273l0358J6288
275A7961L7124j0746m4077k003M5047J1234n5903m9362K4731N6515P070l6977
287F14q892L1018P393l8149k0741L3320K6458l7806n1304J6921O1702J4346m3144
300h264k1681K9202J7507l1074k5642K6961L5010j6943l9463P930M9017J7757
$$ plain form
215 104392 23959 -38995 10792 96337 94823 29138 8633 38096 31212 -14265 -5052 71061
227 71061 103300 36319 -29601 3669 78219 74736 -3355 -48750 -22859 1643 -21889 -38693
239 -38693 -283 40356 14729 -39828 -35890 17252 24619 -35710 -75150 -40572 444 -19501
251 -19501 -54247 -28372 25874 22417 -31961 -47593 -3257 22258 -11744 -37980 -1339 42747
263 42747 22280 -23701 -8466 52231 59987 -3378 -43311 -5798 42304 32031 1673 17961
275 17961 55085 44339 262 -1741 43306 54540 -1363 -50725 -25994 30521 37591 614
287 614 -8278 22740 30133 -8016 -28757 4563 31021 -6785 -58089 -41168 20534 34880 -8264
300 -8264 -29945 -743 16764 -14310 -39952 -12991 22019 5076 -34387 -26457 22560 40317
312D0317l6443l0024J6713K3752j6300k7385J4541L9725L777l3456p893L6899
324B4223K1536l2676l7654J2824L2628r380l4841O005M6651J5819l7645k7376
336a9886K5423K9409k2423m0998M607L6825L387l3104o445L8653K2281l2818l8727
349c3816J1151L4134l636l3969n886L1738J7509k0236j6049K0581K2148j9240
361D429l5969R22L3194J0120k5539j0977K8770K4267j7369k5521J1885K6213j1472
374A2953l6995l452L5828J7990k3474j7313K3621K5796j5984l2344K871K7733
386A7230Q0l2075j1493L0123K6581j4855k6588O417K4764m102l1157j0712K3558
399b229J4780j9744j7628J8724K8008p325k9990m060K3150M222k7277j4081K3508
$$ plain form
312 40317 3874 -26150 -9437 14315 -1985 -29370 -14829 24896 28673 -4783 -12676 24223
324 24223 45759 13083 -24571 -11747 20881 11501 -23340 -17335 29316 45135 7490 -19886
336 -19886 5537 34946 12523 -28475 -23868 12957 16344 -16760 -23205 15448 37729 4911 -33816
349 -33816 -22665 11469 7833 -26136 -32022 -284 17225 -3011 -19060 1521 23669 4429
361 4429 -31540 -30618 2576 12696 -12843 -23820 4950 29217 11848 -13673 -1788 24425 12953
374 12953 -24042 -27494 8334 26324 2850 -14463 9158 34954 18970 -13374 -10503 17230
386 17230 17310 -14765 -26258 3865 30446 15591 -10997 -4580 20184 16082 -15075 -25787 -2229
399 -2229 12551 -7193 -24821 -6097 21911 14586 -15404 -19464 3686 7908 -19369 -33450 -9942
412i942K3468j2347k0892J1853K7151l443k9046p663K2807J0807k0178j3849K1020
425b54K6252o693k3506K106K3321L306k5501j4854J8220J9212j0064j8905Q903
438A543K4900k50k6139j0909J8589J0107k1063k0484J4021K5650m323k4043j409
451a3810K2874N217k5334j7589J4773J7247j1152j8842Q596K4865K885k0882p531
464a8683J6763R743j6680j6649J0747K1154m27j5872J602K0928P843j7162j3457
477a0150J1692J4473r324j7337P337K3600L949j8572o262J8521J0332j8642j9816
490a0199R288J9798m105j9611R03K2101P343j8847j4307J0501J2075j2403k0090
503a7553K997J9877M660j5975p025J4994J1858j2752j8253K608J4772j765j5988
$$ plain form
412 -9942 13526 1179 -19713 -7860 19291 15848 -13198 -20861 1946 12753 -7425 -21274 -254
425 -254 25998 19305 -4201 -2095 21226 24532 -969 -15823 2397 21609 11545 -7360 1543
438 1543 26443 26193 54 -10855 7734 17841 -3222 -23706 -9685 15965 11642 -12401 -13810
451 -13810 9064 14281 -11053 -28642 -13869 3378 -7774 -26616 -18020 6845 9730 -11152 -18683
464 -18683 -1920 7823 -8857 -25506 -14759 6395 5968 -9904 -8302 12626 20469 3307 -10150
477 -10150 1542 16015 6691 -10646 -3309 20291 24240 5668 -594 17927 28259 9617 -10199
490 -10199 -911 18887 14782 -4829 -3926 18175 25518 6671 -7636 2865 14940 2537 -17553
503 -17553 -14556 5321 9981 -5994 -13019 1975 13833 1081 -17172 -14564 208 -1557 -17545
516a7545r33J8581J0834j2020j0940R985J3583q028j7595J571J7304M009j3952
529e146l681J7480J2395j1963j6204N752J4633m118j7506j320J7468Q126j2221
542C695r075J1947J2742r235j9476j417J4895M078j3912p359J3699J4410o681
555H311j4370L167J4474j340j8227o414J4942J0774r513r557J0598J5108m800
568A3153j5775j88J4320K619j3964p062J2099J1820n058r842L889J0572l182j5066
582a665m369J2521P190j0702j0975P795J4693j789j3825l523Q901J0j4208o937
596a6883J1481J1393p985j3482M319J6107K290j4528p893Q332O061r081p728J0034
610g563J4532l162j3988L13J5607O689j1515r481P391J0733k446o665N657J2386
$$ plain form
516 -17545 -18478 103 10937 -1083 -12023 -2038 11545 3517 -14078 -12507 4797 8806 -5146
529 -5146 -8827 8653 21048 9085 -7119 -1367 13266 9148 -8358 -9678 7790 15916 3695
542 3695 -5380 6567 19309 10074 -9402 -10819 4076 8154 -5758 -13117 582 14992 8311
555 8311 -6059 -2892 11582 10242 -7985 -14399 543 11317 1804 -7753 2845 17953 13153
568 13153 -2622 -2810 11510 14129 165 -6897 5202 17022 11964 2122 6011 16583 13401 -1665
582 -1665 -6034 6487 13677 2975 -8000 -205 14488 12699 -1126 -4649 4252 4262 -9946 -16883
596 -16883 -5402 5991 -1994 -15476 -11157 4950 7240 -7288 -15181 -6849 -788 -9869 -17597 -7563
610 -7563 6969 3807 -10181 -9868 5739 12428 913 -8568 -1177 9556 7110 445 6102 18488
624A8488J90j1910n026J0149P649p518j0787L917J2060R41r353q50J0371K389
638B0710j2986j0657N967Q371o325j1200L226J1802M3j1924l493J0336N379j1306
652b057j3069K530J0772J379q053j223Q363L019q677n379Q417R318o118j3292
666a4070N57J4454Q126o272n975M334M629n339n905N896R219l264j1556j60J4367
681I041R523o261r745J212N626l231p205K434Q252j223j0143j727J1767Q379o770
696I929j0943j49O823n82p234j079P365L191o973n531N805Q446l483j0779j393
711f587Q901L389p631l893Q532Q297n283r853M78P814L05p188j711O666K944n616
727d36k736P946Q181m452j1640l974O958N249l802m579K177K936k677k350N990
$$ plain form
624 18488 18678 6768 1742 11891 19540 12022 1235 5152 17212 18153 8800 7950 18321 20710
638 20710 7724 -2933 3034 11405 5080 -6120 -2894 8908 8951 -2973 -6466 3870 9249 -2057
652 -2057 -15126 -12596 -1824 -445 -8498 -9721 -1358 1661 -7016 -12395 -3978 5340 -778 -14070
666 -14070 -13513 941 9067 2795 -3180 1154 5783 444 -5461 435 9654 6390 -5166 -5326 9041
681 9041 18564 12303 2558 3770 9396 6165 -1040 1394 9646 8423 -1720 -3447 8320 16699 9929
696 9929 -1014 -1163 5660 5078 -2156 -3235 4130 7321 348 -5183 622 9068 5585 -5194 -6587
711 -6587 2314 5703 -1928 -5821 2711 11008 5725 -4128 -3650 4164 4469 -2719 -4430 2236 5180 -436
727 -436 -3172 4774 12955 8503 -3137 -7111 -153 5096 1294 -3285 -1108 1828 -849 -3199 2791
742B791P252m182j2855l908R229Q586l182p251l29M795K8k923K491N708k101j0102
758e953l360R808J0532k483r185j314O127J928m916j682M264R41o165l279O934
773B197Q539j141p556k417M882K320n050m556K619M449j773n261J395O574J468
788F689n715l414M022K164n583m685M679P301j534p775j854N737L423l806l349
803c700J648J539l208k139N551P478q22r211m640N608O810j548o221j587L458
818i84J107r08L228O022m78q735n247N462P926j005p869l194M234M037n97n84
834B415K735P6n785m508L904O866n78o884k846M807L929k294l109J309J545k774
850a192l745J804N120J283l876j947L434K859k832m630R84M325k3n265j606N300
$$ plain form
742 2791 10043 5861 -6994 -10902 -1673 6913 3731 -3520 -3849 946 974 -1949 542 6250 4149 -5953
758 -5953 -9313 495 11027 8544 -641 -1955 4172 6100 1184 -498 3766 4707 -1458 -4737 2197
773 2197 10736 9595 2039 -378 4504 6824 1774 -2782 -163 4286 2513 -2748 -1353 5221 6689
788 6689 974 -2440 1582 3746 -1837 -6522 -1843 5458 3924 -3851 -5705 32 3455 -351 -3700
803 -3700 -2052 -513 -3721 -5860 -309 7169 6347 -2864 -7504 -1896 4914 3366 -2855 -4442 -984
818 -984 123 -785 2443 8465 7987 -748 -5995 -533 7393 6388 -1481 -4675 -441 3596 2999 2415
834 2415 5150 5226 -559 -5067 -1163 5703 5125 -1759 -4605 202 4131 1837 -1272 37 1582 -1192
850 -1192 -4937 -3133 1987 3270 -606 -2553 881 3740 908 -3722 -2738 1587 1564 -3701 -5307 -7
866gM396j928l184J267K672k670m392J395N733M53n611l311M206N911r6m064j624
883h54J437m21k001J213M221J096m933m238L080O325O11n444l710J451K071m13
899e09J31K911J050m001l890K450N704J32n942l966K436L942m6j488J489K097
915B500j831l690N86M532R29m554l211K599M230j65k738K79K654L62l421j832
931b771K676K673j475k539Q41L242l5l153n57K998J184l760l192J994M293M90
947B909k764n26J983o0k344l53K546O77l658l172K180M646J233k982j950J163
963d72J057j305j040J627J441k321l357J594M881J823l413l223J188K288m90j657
979a379Q36J952m13k620K65L640J986k947l740N19K913M46k153M4K390N93k084
$$ plain form
866 -7 4389 2461 -723 544 3216 546 -3846 -2451 3282 3735 -1876 -5187 -981 4930 4834 770 -854
883 -854 583 162 -1839 -626 3595 4691 -242 -4480 -1400 4925 5536 92 -3618 -2167 -96 -509
899 -509 -378 2533 3583 -418 -4308 -1858 3846 3978 -1964 -5930 -3494 448 402 -1086 403 2500
915 2500 669 -3021 -2435 2097 3026 -1528 -4739 -2140 2090 1925 -813 -534 2120 2482 -939 -2771
931 -2771 -95 2578 1103 -1436 -595 2647 2612 -541 -1098 1900 3084 -676 -3868 -1874 2419 2909
947 2909 145 -381 1602 1542 -802 -1155 1391 2068 -1590 -4762 -2582 2064 3297 315 -1635 -472
963 -472 585 -720 -1760 -133 1308 -1013 -4370 -2776 2105 3928 515 -2708 -1520 768 278 -1379
979 -1379 -543 1409 996 -1624 -1359 2281 4267 1320 -2420 -1901 1012 1458 -695 -651 1739 2332 248
996B48j203K027J537j822k932p1K322M80j575m26K209J209j938k142O56K333k29
1013F83k572p61K017J360j503p98K049J804j911l067M84L214Q43k405j214J817
1029D0J655n73j334R92J499j426k654r8K843J825j727j922Q44K079j02j890r9
1046d8J341l10k377m79K298J920j015k284K13J815J88j964p22J369N14j684j035
1063b260J768K182q43k385k60J985L55j755q85J551J338j094j346J103K334k71
1079A517k226q25J413R64j082j159J213J954k92j831j47J942Q47k104j782J158
1095d40J698m70j532P19J790k6k127p43J664R38j358j829P30J896j48j183N7J540
1113A176K70j800j021J050J395q17j480L56J913M41j246n92Q23R07j369j479Q78
$$ plain form
996 248 -955 1072 2609 787 -2145 -2216 106 586 -989 -1415 794 2003 65 -2077 -1421 912 683
1013 683 -1889 -2650 -633 727 -776 -1574 475 2279 368 -2699 -2215 999 1842 -563 -1777 40
1029 40 1695 1122 -212 780 2279 853 -1801 -1899 944 2769 1042 -880 -36 2043 1941 51 -48
1046 -48 1293 983 -1394 -1873 425 2345 1330 -954 -741 1074 1262 -702 -1424 -55 459 -1225 -2260
1063 -2260 -492 1690 847 -1538 -1798 187 542 -1213 -2098 -547 791 -303 -1649 -546 1788 1517
1079 1517 -709 -1534 -121 843 -239 -1398 -185 1769 1477 -354 -501 1441 2288 184 -1598 -440
1095 -440 1258 788 -744 -25 1765 1739 -388 -1131 533 1471 113 -1716 -986 910 762 -421 -364 1176
1113 1176 1446 -354 -1375 -325 1070 253 -1227 -871 1042 1483 237 -355 468 1375 6 -1473 -595
1130e95J551J31j634l46J715R11j325j211P28R99q74j552L96J737N40j495o92
1147a016J253R33q77j478L09J087m8j267r9J465R49j205q85L83J197m78j405P5
1165a107J288O28j185n70J532J071q49j428K68J238l2j228k69J578O34p64r19
1182a14Q85J141o64j468j26J140M49j100o57J153Q39n63j255J36J023j33j331
1199f45o01Q27J122o70j009N34R95k5j474l05R88M81j033n14P67J110l58r02J38
1218e74J084j75r98n32J137M91n35o15O89R95o2j071j20Q70L94j025o32Q44R31
1237A096k64q89K95Q24J69r88p34Q84N33n58q04M25R24J28j058k53Q79K29q21
1256A7q14L53R87l45p16J61Q63K25j014l31M08L56n41n19L34Q30Nm91n7M40N58
$$ plain form
1130 -595 956 1087 -547 -893 822 1733 408 -803 -75 924 50 -1502 -1106 631 1171 -324 -1016
1147 -1016 237 1170 293 -1185 -876 211 163 -1104 -1203 262 1211 6 -879 -496 701 223 -1182 -1107
1165 -1107 181 809 -376 -946 586 1657 808 -620 -352 886 854 -374 -643 935 1569 805 -114
1182 -114 771 1912 1248 -220 -346 794 1243 143 -514 639 1478 915 -340 -204 819 686 -645
1199 -645 -1246 -419 703 33 -976 -442 553 528 -946 -1251 -263 218 -815 -1329 -562 548 190 -712 -574
1218 -574 510 335 -663 -1195 -58 433 -102 -717 -28 967 905 -166 -286 584 978 -47 -679 165 1096
1237 1096 832 -57 238 1062 1231 243 -491 393 926 368 -436 -11 913 1041 -17 -270 609 838 17
1256 17 -797 -444 543 198 -518 -357 506 731 -283 -614 -206 150 -391 -910 -576 254 259 -232 -289 151 709
1277G09q19n67L17O68j20r18L63P92L89r25l63O09O40n42r16K47Q16Q7p04p9P46
1298D30L53p21n86M99N15j41q77J33P55M25o38l75N07M34n70n72Q3P10P9p42p3
1319c72O58M15m62n10K10M25j79o32j12O96M09n65l90N06O08m71p13K58O29j80
1339B28p93L6P55L27l84n95M11M87j83o31q9O14J02l69l95N52N35j76p08o9N09
1360A64J51n26k87M79M51l35m33K71M66M7o44j74M74J57l08k46K86L85j63m13
1380a98L8N57n6m20l27M40K20j22m37K18M44j10l66k36L74K52k92m74L06N32j38
1401B05m06n2N20R4o57k56K70N16j26m07O4N04L2k95j43M03J16l93n00L80M24
1422B93K9m53J2L06J20k78q5J82J59l97k65J83N69J12n32k19L24L64m32j80Q3
$$ plain form
1277 709 -110 -677 -360 308 188 -730 -367 425 814 -111 -474 135 775 233 -683 -436 380 467 -237 -316 430
1298 430 783 62 -524 -25 490 349 -528 -395 360 785 147 -228 279 713 143 -429 -346 364 443 -299 -372
1319 -372 286 701 239 -271 -61 364 185 -447 -559 137 546 -19 -409 97 705 234 -479 -221 408 228
1339 228 -565 -529 226 553 169 -426 -15 472 289 -342 -431 183 285 -84 -479 73 608 432 -276 -345 164
1360 164 315 -211 -498 -19 432 97 -336 -65 401 448 -196 -370 104 261 -47 -293 -7 378 215 -198
1380 -198 -160 397 341 -79 -406 34 254 132 -305 -87 357 247 -119 -355 19 271 -21 -495 -189 343 205
1401 205 -201 -253 267 361 -296 -552 -282 234 108 -299 -235 269 301 6 -137 266 382 -11 -511 -131 293
1422 293 322 -131 -119 187 307 29 -56 126 285 -112 -377 -194 375 487 -45 -264 60 424 -8 -188 -105
1443a05L09k77j92J49M09L10o28l28L40K00j20l50M8K60J17l64n4M10K19l25l00
1464b72k2L40M2m30J7L57J70j34k85K15K71o8l21j67M08J0j15j33L20K39m05j96
1486a59L6L25O9k63k45L05O4k1j02J73M9k36l12K67K78p9k08j76N4L75j2j01r6
1509a5J84j09l14mL99J06k76k23oK76J96j66j39J59p6j63J8J90R7r1j76N2J21
1532D0J21j11m02K69K14j57q8J60P5J88k61j12K45K4k30r2K6K74j33l04J66L20
1554B32M8j14k17k6J03j14o4K46J06j69j00o3K88Q7j16l04R7O9J03q1J21o6M2
1577A08j42o6rL75p6m17K8K2L42l8j11j8N2%n2M2M5L2j96r1K09J84j94O4k02K73
1603A64j87n7J0J60Nk09J03p3J43J13k06j96L46l8j46j02J60J25j6k47N9K1Q3
$$ plain form
1443 -105 204 -73 -265 -116 293 603 -25 -353 -13 187 67 -283 -235 25 142 -222 -276 134 353 28 -272
1464 -272 -294 46 88 -342 -325 32 202 68 -217 -2 269 201 -120 -287 121 131 16 -117 203 442 37 -159
1486 -159 -123 202 271 8 -237 68 132 111 9 182 231 -5 -317 -50 228 149 -59 -235 -181 194 182 81 -15
1509 -15 169 60 -254 -258 141 247 -29 -252 -258 18 214 48 -91 68 -8 -171 -153 37 134 43 -133 -81 40
1532 40 161 50 -352 -83 131 -26 -114 46 121 309 48 -64 181 205 -25 -117 -91 183 50 -254 -88 232
1554 232 280 166 -51 -77 26 -88 -152 94 200 31 -69 -132 156 243 127 -177 -80 -11 92 11 132 66 108
1577 108 -34 -100 -109 266 190 -227 -199 -177 165 127 16 -2 50 50 -2 40 85 117 -79 -170 39 223 29 93 -109 164
1603 164 -23 -80 -70 90 95 -114 -11 -84 59 172 -34 -230 116 78 -68 -170 -10 115 99 -148 -89 -68 15
1626A5P5j08J08j2m4k02R3J88Q7j60j60K34p2Rj65J96j15r9O0K9J46K27k99n3
1650b2n7J33L7j96K67q6j14j29K53P8Q6m0m08N9J86K8k07J76nJ8j6k11K24J30
1674A84k12jj95J24J41qn8nL5O2Oj93J56J58k70L3J9l6J13j50j06K90m5j04r2
1699a54J96K14l65j90K39J75o4qj34K34j27j32r1K98R4o3k97P1J32J22o7j18J25
1722I0q3Q3k14J45J73M7j91p5Q7J34j31J5j19OJ47k21n5K41l8j72j6m1J82ok3
1747c5p1j6k2Np1J90j0J31k19k6K5J39k03O8Q8O3j14L2J02J21r3j91M1J39n2l0
1773iqJ54k1m4j24J71Q3q1j09j20K28Qm9j06kJ24j07j39J26N0J01j76k33J84J15
1798A6P7j96L9R9q1m4l4Q1k1r5k1N6K46k7l31J54Pk6P3j67J57J19j13q8%J99n
$$ plain form
1626 15 90 -18 90 78 34 -168 -75 113 200 40 -120 114 42 51 -114 82 -33 -132 -72 -43 103 330 31 -22
1650 -22 -79 54 91 -105 162 76 -38 -167 86 164 250 210 -198 -139 47 75 -132 44 39 57 41 -170 54 184
1674 184 -28 -29 -224 -100 41 33 -25 -30 5 67 73 -120 36 194 -76 -43 -24 -60 53 -97 -203 87 42 -62 -154
1699 -154 42 256 -109 -299 -60 115 51 43 -91 143 16 -116 -207 91 185 122 -175 -104 28 150 83 -35 90
1722 90 7 90 -124 21 194 241 50 -25 62 196 65 80 -39 -33 114 -107 -162 79 41 -131 -147 -188 -6 -12 -35
1747 -35 -106 -122 -144 -139 -210 -20 -30 101 -118 -144 -119 20 -183 -115 -27 36 -78 -46 56 177 84 -107 -66 73 21 -9
1773 -9 -17 137 116 72 -52 119 202 121 12 -108 120 128 79 -27 -29 95 -12 -151 -25 25 126 -50 -283 -99 16
1798 16 93 -103 -64 35 -46 -90 -124 -43 -64 -159 -180 -124 122 95 -236 -82 -75 -101 -28 -195 -38 81 -32 -120 -120 79 74
1825G4j67o3L18o5j52O6JJ99p9j11lJ66O4k48k0L6J96j07o3k7N0M2j22p9oJ51
1851E1j7p0m9J38K7j85J10r6J58k52k4K29K06k56j13nM3K19k70n8J84K37k87r1
1875a71J28J70m2j78J01L6K2n9N4J1j5k3m8J3O5l4J3j67R8J13O1n8p6J7Q4j33
1901a8p0J44K2O5k04o6J30J7k37J69N3J09j58L2j35K27K5j79q2K68q3j06J4J8
1925d5L1j05Q2q4K88p5j60j47K94Qj37j19K62l9q2k09K36J1o2L6m5Q2k9J9o2O9
1951A8K87j93p6j00P2J97k89jP1J37j21O9k2J44q2j29l4P0Qkj13K2J31J5k07J1
1977a17K09j0j80k23K60K28k28j5j39K84j11L2k7m8J26j99m5j3L11m4j59N0j17
2000a75K15j02r6Q7N1O6j50M5qK51l29LJ50P0j73O4J25K8j01j81K05J64L1j60
$$ plain form
1825 74 -93 -156 162 97 -55 11 12 211 132 21 18 184 248 0 -20 16 212 105 42 15 65 107 -15 -94 -100 51
1851 51 34 -36 -85 53 80 -105 5 -91 67 -185 -209 20 226 -30 -143 -148 -105 114 -156 -214 -30 207 -80 -171
1875 -171 -43 127 85 -93 8 44 66 7 61 72 57 34 -14 -1 64 30 43 -124 -26 87 148 90 14 31 115 -18
1901 -18 -88 56 78 143 -61 -127 3 20 -217 -48 5 114 -44 -12 -147 80 105 -74 -156 112 29 -77 -63 -45
1925 -45 -14 -119 -37 -121 167 92 -68 -215 79 87 -50 -169 93 54 -28 -237 -1 10 -52 -16 -61 21 -8 11 -51 18
1951 18 305 112 36 -64 8 205 -84 -85 -14 123 2 71 49 193 111 -18 -52 18 26 24 -89 -67 64 79 -128 -117
1977 -117 92 82 -98 -321 -61 167 -61 -76 -215 69 -42 -10 -37 -85 41 -158 -203 -216 95 51 -108 -58 -175
2000 -175 40 -62 -158 -71 -20 46 -104 -59 -67 184 -145 -142 8 78 -95 -31 94 122 21 -160 45 209 240 80
2024H0n5O8o7R6p0n0J33j7q7p1J10J23k34l2J96lk08M4q3K43j32O3r5J2p1J17
2050A0k35J67q2J35j13j61J93Q9j33L3j3j2K54l98J88J59Np7o4j2J33j38p5K5
2074a22P2Q2j32J17q3O9J21k18L9M5J17k25l7K35Q5m6j37l7K25j7q0j62J84j6
2098G9p2m6O6R7k3j20J30j31O3j10j1R4Kj03Qo2J78j02Qm5M4Q2n9p7J05l0j5q7
2126a37J7J23K1p1j29J85P5q1m7%Q3J7l8j7RJ3jq5oJ12l0r3J93j89K9P0j77J34
2154b0O0j37P1J7N7J3l02K16O4J31j64m0m3J25O0k10O4j9O6l4k5J94j42L9j25
2179h4Q7P1m2j19O1J18j21ppP3N3q1o1L8K25j90O0p3%Q0m8j01K21j4j12p2n4R6
2207cJ6J9j49K34P2j57k4j29J37J4j14J4JL6o7N8%J57p7q9j37J85O6j18n7L6P7
$$ plain form
2024 80 25 93 26 122 52 2 135 118 31 -40 70 193 -41 -73 123 120 -88 -44 -127 116 -16 47 -48 -36 -107 10
2050 10 -225 -58 -140 -5 -118 -279 -86 3 -130 -97 -110 -122 132 -266 -78 81 86 9 -55 -67 66 -72 -147 -122
2074 -122 -50 32 -100 17 -66 3 124 -94 -55 -10 107 -118 -155 80 165 119 -18 -55 170 153 73 -89 95 79
2098 79 7 -39 27 124 101 -19 111 -20 43 -67 -78 16 18 -85 -77 -139 39 -63 -55 -100 -56 26 -33 -110 -5 -35 -50 -137
2126 -137 -120 3 24 -47 -176 9 84 3 -44 -44 39 56 18 1 10 23 22 -63 -69 43 13 -80 113 -76 -47 23 -154 -20
2154 -20 40 -97 -26 -9 48 61 -241 -25 39 170 6 -34 -77 48 108 -102 -38 -57 9 -25 -50 144 2 41 -84
2179 -84 3 74 32 -87 -26 92 -29 -36 -43 30 83 2 -59 -21 204 14 74 1 1 81 33 -68 153 139 27 -45 -99 -3
2207 -3 13 32 -117 117 189 32 8 -121 16 30 -84 -70 -69 -33 -100 -42 -42 115 38 -51 -188 -3 63 -55 -112 -76 1
2234AM7j41P4j7K0l8j9P6J36j35m6M9K17k28P0j2q1P7k5n4M2N8K4l06J98m7J94
2261A34k15J95j45O0p9j38J26O8q4j5Rr1J94r3Q3q4N3j52J74j4J3j40Q1n0K2J13
2287B5N6j21p1L5O9m5Q4K0N8J0j36nK2J24j03Pj4j12Q6p1J5O8M4m3o8J23r1L9
2315Ek8N6L9k33K3J80k8l8j54P8O8N1%J9j85O6J4L3O8J3k1J0o2oK7n3J34j03k5
2344e2j1jR4m5O9l6j13J26J8Kk1m7J2%P2j83K9J09j02p6K16r7j19l3J03L6Mj8
2372f4p5O9M7q4p5J17k9%J06L5q0J46j36N8k7o0O8Oq0Q6rq0J57l0J3j04O0l6P1
2401G0P6j71N7j91J58NL8q4O4j6j13J4J13k9n0n2N5P0n3R5k02J46kj8p0N1JJ36
2429I8k34J48l6k8k5N2J12j68J61j88J16P3j00N9r6J41l1rnPj04J9N5J23l2o8
$$ plain form
2234 1 48 -93 -19 -36 -16 -54 -73 3 139 4 -42 7 224 -4 66 54 -27 50 25 -29 13 71 95 -211 -13 -60 134
2261 134 -81 114 -31 29 -50 -188 -62 6 -78 -93 -84 -175 19 -74 9 -75 -22 -174 0 -14 -1 -141 -60 -110 -88 25
2287 25 81 -40 -111 -76 -7 -52 32 52 110 120 -16 -21 1 125 22 29 15 -97 -11 -82 -67 1 45 2 -66 57 -34 5
2315 5 -23 33 72 -161 -138 42 14 -24 -178 -100 -32 19 19 38 -147 -81 -67 -34 34 47 26 36 -26 -32 -5 -58 76 -27 -52
2344 -52 -63 -64 30 -15 54 18 -95 31 49 51 30 -17 -5 -5 67 -116 -87 22 -80 -156 60 -37 -156 -189 -86 -50 -46 -64
2372 -64 -139 -70 -23 -107 -182 -65 -94 -94 12 47 -33 113 -23 35 8 -52 16 22 -58 28 19 -61 96 66 79 -25 35 -1 70
2401 70 146 -25 32 -159 -1 4 42 -42 22 6 -107 -93 20 -9 -59 -111 -56 14 -39 56 -146 0 -2 -20 -90 -39 -38 98
2429 98 -136 12 -24 -52 -77 -25 87 -81 80 -108 8 81 -19 40 -56 85 54 45 40 47 -57 -38 17 140 108 40
2455D0j47J1K07o8RP7r6K3n8o7O4RN9n4q7J19k7m0j2K8N4j58NJ0N6j00J61r3N3
2484b2J5M2m7o6K4n6M3J36o0J10j61L0N1j09n6J52r7J00M6Mp3M1N9j1K0j57M6
2511DL2k4p8J27m2q6R8J09j15r%k2J44j98p1J86%j01R5K2j73j9P9r5J61k08K34
2538E0j8q0m5P4O8m5j9j36J64j9L3m7p3J34j92J32q1P8O4q1P9n5M7k7n0P8o2L0
2566Aj6P8p1J07J4j32N1Q2p8K1p5L6MJ2P9j40%n3Q4k1J65j49j54J40q9J81R5k80
2594a08J21K2q7J66m0j87O3N5k8Q9rk01J46N8k1k5pQ2j67o5P3%J38j6j1j3q2J3
2622d1P6k9J26j48n3mP0Nq1J03j69J64r2J10j53J48k5J0R2p4o1k3M9L8p6J03l5
2649C0K5M6P4k01J44k08J13m0L8J09j06R2k17K04q5J8K6J5p5k5j29J75j2p5J7
$$ plain form
2455 40 -107 -96 111 43 52 129 33 56 -2 -69 -5 4 63 9 -78 41 14 -26 -38 -10 44 -114 -109 -99 -43 -143 18 -75 -22
2484 -22 -7 35 -12 -78 -54 -110 -67 69 9 119 -42 -12 39 -70 -126 26 -71 29 75 79 6 47 106 95 115 -42 4
2511 4 36 12 -66 61 19 -67 31 140 25 16 16 -6 138 -60 -131 55 55 -46 49 71 -102 -121 -42 -137 24 -184 50
2538 50 32 -48 -93 -19 49 4 -15 -151 13 -6 27 -20 -93 41 -151 -19 -100 -22 42 -39 40 -15 32 5 -45 33 -29 1
2566 1 -15 63 -8 99 113 -19 32 114 36 57 -18 18 22 34 113 -27 -27 -80 4 -17 148 -1 -155 -15 -104 77 172 -108
2594 -108 13 35 -52 114 74 -113 -50 5 -23 66 57 -144 2 60 39 14 7 89 -78 -143 -70 -70 68 52 41 28 -54 -41
2622 -41 35 6 132 -16 -69 -73 -3 2 -79 24 -145 19 -73 37 -116 32 7 17 109 35 -26 -49 0 38 -38 65 30
2649 30 55 101 175 -26 118 -90 23 -17 21 130 24 116 -101 103 18 36 62 77 2 -23 -152 23 11 -64 -47
2674d7l7R4k4Q3j15K8j7L6M0l0K4j20P9K7L2j47K4o0J13o9N8J28o6j9nO9j13R9
2702F5J4j19Q7o4Q4k1j4k7J79n9j39J06n7J9n4J3J5J5R2r7Jo9l4k2N4j8M5j25
2730a30J48nr2K6K40k30l0M4K6q4L5m8J68j52Q5N0o2q5O3k9J32k9n4J8J05pn0
2757E3O6j45M2p1K4l4J09j6J03j59P4l7R6n1Pp0n2K7LKN2j8j7r2P5J06j06K2M0
2786C3L4L3j80P2j0l4m9O2j7N3QL1N5j12J06o7M7j42J35j26J02K6q4J10p4k7p7
2813i2J34o1K8lj05J20j2N3j09o2m2P7R9p1j3L7k8J49j5j55J6L7M6n3r9%K6l9
2841a37K15p6j11J22l3M6j52j0J29J36m3q0p4N5m4O7N9j33J07j31J61l8p7J12
2865G0q1J5JP8j72O0n9J62k1O7l6p7j71M5MJ32J6o0L0n2J08j1L8p4j02K04r3j09
$$ plain form
2674 -47 -84 10 -14 69 -46 -18 -35 1 41 11 35 -85 -6 21 53 -94 -70 -130 -17 -86 -28 100 34 15 10 79 -34 65
2702 65 79 -40 47 -17 67 46 32 5 184 125 -14 92 35 54 0 13 28 43 135 38 39 -30 -64 -86 -32 -50 -5 -130
2730 -130 18 13 -79 -53 187 -43 -73 -29 -3 -87 -52 -100 68 -84 1 51 -11 -96 -33 -62 70 41 -13 5 110 103 53
2757 53 119 -26 16 -55 -31 -65 44 28 131 -28 46 9 105 54 61 -9 -61 -34 -31 -29 23 5 -12 -104 -29 77 -29 -7 33
2786 33 67 100 -80 -8 -18 -52 -101 -39 -56 -3 5 36 91 -21 85 18 65 -77 58 -68 34 60 -24 86 12 -15 -92
2813 -92 42 -19 9 6 -99 21 9 62 -47 -109 -151 -74 25 -46 -59 -22 -50 99 84 -71 -55 -18 28 -25 -124 -124 -98 -137
2841 -137 78 2 -109 13 -20 26 -126 -136 -7 129 86 6 -68 -13 -57 10 69 -64 43 -88 73 35 -42 70
2865 70 -11 4 5 83 -89 -29 -88 74 53 120 84 7 -164 -119 -115 17 33 -27 3 -49 59 48 86 12 -90 114 21 -88
2893h8J44O9j98J4Q3j14Q3O0l6j42J53m6k5M1q9J93j50m5K32j98O7n8J08n6K9
2918C1n3K8l4K7J80r0n7%J2j66R3Q7J4j02l9J11J10q6r6o1R4N1n4j13O6j0P4j6
2946Al9J12r1l1j7J9K1o7J23m2n2M9N7Kk7r5J92j15O0l9O4j3j37K20j41Mr4J46
2974G0j20J78j54J0J05j51N3N6k8k2J42m5o5M5n0oOn8J28j23ln9Q6j05J22J0J17
3001A39k51J06K2r3R6p8J18q9q6J02k7Q7N6j34J15j35N3M7j50L1J16%rK3l9j3
3027GJ41o0m2L2j17K6J12p0L0j14O7ql2L5J08j75M1m4J3j1J14r9p2oJ86j65n7
3054a60J20M9J9j9O6l3p7L5l6O4R7r7LO3n5n4J20j09K4m5P1k3Nj1p8k8R4R4n3
3083D6q0J6R7j68L2l1P6Qj00P9JL2l5m8n2O8J03j2r9J11Q7j46k2O6pKl9Qo1Q7
$$ plain form
2893 -88 56 125 -73 -59 24 -90 -7 53 17 -125 28 -18 -43 -2 -91 102 -48 -93 139 -59 8 -50 58 2 31
2918 31 -22 6 -28 -1 179 89 32 32 44 -122 -29 58 72 -30 -69 42 152 66 -30 -91 3 54 0 -113 -47 -57 17 1
2946 1 -38 74 -17 -48 -65 -46 -25 -92 31 -11 -63 -14 43 45 18 -77 115 0 60 21 85 72 -65 155 14 18 -76 70
2974 70 -50 128 -26 -16 89 -62 -9 47 19 -3 139 94 29 74 24 18 24 -34 94 -29 -32 -91 -5 -110 12 22 139
3001 139 -112 -6 16 -77 19 -59 59 -30 -116 -14 -41 46 102 -32 83 -52 1 48 -102 -71 45 45 36 59 20 7
3027 7 148 88 46 78 -39 -13 99 29 59 -55 12 4 -28 7 115 -60 -19 -63 -50 -61 53 -46 -118 -124 62 -103 -160
3054 -160 -40 9 28 9 75 42 -35 0 -36 28 125 28 31 94 39 -15 105 -4 20 -25 46 23 28 17 -61 -89 5 99 46
3083 46 -34 -18 79 -89 -57 -88 -12 -4 -104 -25 -24 8 -27 -75 -127 -59 44 32 -67 44 131 -15 -37 29 22 24 -15 -7 -68 19
3113A9o7oK7J17r0Q1L0j36K0QN0n3Qk00L16j97L9N4j3K9o9ok9KJ76r3n2K9q0R1
3143Ej02J55j20J60j17q8J28P1j02o6K0Q9k9j45K15l8K6o9rL2k09K62k4j18M1
3168c2P3R4j27Q6j91o4R3J7k9J24j49L13j93p5J7m7O0m8J63j49R0m6M0J9K3j51
3194h9J03l9l8O7L7j21K6o3J60m0j15J11k0q6J39K0m5M3p5J4p8Q6J1o3J8R2q3
3221b8Q1nJ22j25kj78R2K5j3j9N8pj24J05j7L8L0r2P3L7r3M7R3j57M5m1Q9m9l9
3250e4Q3j43J31J06j10n8M3J13K1n3j36l8Q7J04j01P7n4j13L4m9J40q4K9M2m2
3275b5K8j0R5j02J3L4O7j77O2m2k3J59j05pM8j12J32m0r4J17n5k2J98j54k5J%
3302c9Q3j35J21m1O0p3n4J1J05l1j05J56l9Q1j47k6MJ25j29O3o2J31o4QJ7L5J5
$$ plain form
3113 19 -48 -54 -27 90 0 81 111 -25 -5 3 53 0 8 -192 124 -73 -34 20 7 36 -33 -39 -68 -66 110 17 -35 -6 -86 5
3143 5 -97 58 -62 98 -19 -107 21 92 -10 -76 -56 33 4 -141 74 36 62 -7 -16 16 -193 69 45 -73 -32
3168 -32 41 135 8 94 -97 -161 -68 -51 -80 44 -105 208 15 -60 -43 -90 -30 -78 85 -64 26 -20 20 39 62 -89
3194 -89 14 -25 -63 4 41 -80 -54 -117 43 3 -112 -1 -21 -107 32 52 7 50 -25 -11 -89 -3 8 -55 -37 55 -28
3221 -28 53 48 170 45 43 -135 -43 -18 -31 -50 8 1 -123 -18 -35 3 33 -59 14 51 -42 5 98 -59 -14 -55 34 -15 -54
3250 -54 29 -114 17 123 13 -45 -2 111 132 79 -57 -95 -8 96 -5 72 18 -95 -61 -110 30 -54 -25 17 -25
3275 -25 3 -7 88 -14 -1 33 100 -77 -15 -57 -80 79 -26 -33 15 -97 35 -5 -99 18 -37 -59 139 -15 -40 -39 -39
3302 -39 44 -91 30 -11 49 -24 -78 -67 38 7 -98 58 19 100 -47 -73 -69 56 -73 -10 -72 59 -5 3 20 55 70
3329G0j70K20p7j46J13P9j24l7J63l4j16j4O3K7j05J13j15Q3n0JJ58k51L7L4J22
3354D4l3M2J6r3n7QJ87j28l4P4n6K4oJ8r3J01Jlq1J5J57M8j05j25P0J02m4m6R5
3383I8L0j79P6o7J71l8p4Q2q5P8l07J56K1J8n6P0q7N6N2k6q3J16Lj53K53k03Q1
3410CR0J7k17J82j78J20lQ7q4J42l5o1j9j29P2J18n4j4L3k9J1J7j19L7J16r9N8
3437F2nn2j9R5j10M4k2O4Lj9r1N4r7J74J8j74J48p8O7J5j70M5N0j11J36j58Q1
3464e0N9M1o5p1J6l5K29k07M0L7N0j18J30j8j3R3j12N5j68J24m5P5j9M5j40J00
3490C3j3nMp2N7o9M0n3J1J53j42nJ51m0O6l3o6p8O3j19J17J3j1m6l9L0n4j2R4
3519b5k6M8K7m0Nnr8N2N9K7j4k0J6K0J00j00J12j32j1rJ11l5r4L4q8R5q6L5m2
$$ plain form
3329 70 -100 120 43 -103 10 89 -35 -72 91 57 -59 -73 -10 17 -88 25 -90 -7 -57 -56 102 -149 -112 -78 44
3354 44 11 53 69 -24 -81 -73 114 -14 -48 26 -30 -6 -12 6 -87 14 15 12 -69 -54 103 151 46 -79 -9 93 49 3 98
3383 98 128 -51 25 -42 129 91 17 99 14 92 -215 -59 -38 -20 -76 -6 -93 -37 15 -11 -94 22 25 -128 125 -78 3
3410 3 93 110 -107 75 -103 17 14 101 17 159 124 63 44 -85 -13 105 51 37 70 41 52 69 -50 -13 103 4 62
3437 62 57 5 -14 81 -29 15 -7 57 60 41 -50 4 -93 81 99 -75 73 -5 62 77 -93 -48 2 -109 27 -131 -50
3464 -50 9 50 -15 -86 -70 -105 124 -83 -43 -6 44 -74 56 38 25 118 6 61 -107 17 -28 47 28 73 -67 33
3490 33 20 15 19 -53 4 -65 -25 -78 -67 86 -56 -61 90 50 116 83 17 -61 2 -117 0 13 2 -44 -83 -53 -107 -119 -25
3519 -25 -51 -3 24 -16 -11 -16 -114 -62 -3 24 10 -10 6 26 126 26 138 6 -5 -14 97 62 -32 2 -86 9 -77 -42 -84
3548h4J10o1j76K02m1O0J06k03J88J2n0p8j4j3N7Mm6M1m4j07J29o9J39q6QK3J1
3575A8R9k05J87o8j01O0p2M9k9J95j66K9J79k11M2J62j31lp6N8R8M4k72Q8Or1
3601a11J74K4j72M3j4J02n6l0o4M1J2N6l1NN5j29J55p3p9J38Nn9l2mqJ7J1j9M3
3630@j18K27j15J25k21J03j21K84j78N2Lj41J32l1j3k1QJ02j7K2m3j8q0q7J36
3655a0L7M2j97Q1lR1j53K09j27o7N3Q1r0l8J19j00p1P7m6J36n8OK1nr4R4K1l8
3683b9J8M2j34j8J55j00N8mnJ21k03P0R3L2jj92M4N7j28J97j79O9J46n4k7q3J61
3710A06j28J52j74j2K6r3J16Q0o6q2J17j3O5j47K6m2N5k0N8O7K5j34K4J5j34J67
3736E4q1m2J53k3j65J57J8m5K2l9n3J38j64K24j52o1N9p7p1K73k03K7n8P0j7J3
$$ plain form
3548 -84 26 -35 -211 -9 -50 10 116 -87 101 113 63 -15 -29 -42 15 19 -27 14 -30 -137 -8 -77 62 -24 -16 7 18
3575 18 117 -88 99 31 -70 -10 -82 -33 -62 133 -33 -4 175 -36 6 168 37 34 -42 16 114 158 -114 -26 -20 -111
3601 -111 63 87 -85 -42 -56 46 -10 -40 -104 -63 -51 5 -26 -21 34 -95 60 -13 -92 46 51 -8 -40 -44 -52 -35 -24 -43 0
3630 0 -118 109 -6 119 -102 1 -120 164 -14 38 41 -100 32 1 -12 -33 -25 77 60 82 39 21 -59 -146 -10
3655 -10 27 69 -128 -47 -50 41 -112 97 -30 -97 -44 37 -53 -91 28 -72 -143 -66 -112 24 -34 -28 -7 -12 -106 -12 9 -29
3683 -29 -11 31 -103 -121 34 -66 -8 -12 -17 104 -99 -29 64 96 95 -97 -53 4 -124 73 -106 -37 109 55 28 -55 106
3710 106 -22 130 -44 -56 -30 -123 -7 73 7 -75 42 29 94 -53 -27 -69 -14 -34 24 91 116 -18 6 21 -113 54
3736 54 -27 -69 84 61 -104 53 71 26 48 9 -44 94 -70 154 2 -59 0 -77 -148 125 -78 -51 -109 -39 -56 -43
3762d3pm1J06n3M6n5M8j47K10m2j2l4J2j07J58j69Q4K4Jq5J22K5j33J11l3R2j55
3789g7Q4Q9j50n4J50q5J31kqJ3j17rM8k5K4R8j14l1N2r8K1M5n6L2j18K79l16L43
3817A49k18J09o8m5J88k12K33k62J57r0J11Qr6k1J21k6j20O6K3j9RK2Q9j00q2
3842g4R8k0J9j09R1m8O4Ro3Q6n9n5J00k0p7J84Kj32j39J65j3m9L7j6p6K28k15
3869h2J52r1M4n5j8O2j8K7p9R8q7J0K1J15o0J8q8M3q3L1J10j96J70l1n5K2k3k6
3897f9N9l0J7N6p4M5O1n2L6L9j34j95K00O7q7ol7J15M8k3n3J1l2L8K3m5O5q8o6
3926a11QL1J12j16J2N6LK3j22L8L1J71j74Mm9M0J22m1m7O0J05q4n3j3O1l1q1l9
3954h4JR2k0N2m5J14k13K01j03j25N5J00k1M1q6j9Q2j03O5J21j2j7j19n8L3j1
$$ plain form
3762 -43 -50 -91 15 -38 8 -47 1 -146 64 22 10 -24 -12 -119 39 -130 -46 -22 -21 -106 16 41 -92 19 -14 78 -77
3789 -77 7 96 -54 -108 42 -43 88 86 78 91 -26 -35 13 -12 12 110 -4 -35 17 -81 -60 -15 -71 -39 -157 122 -194 149
3817 149 -69 40 -28 -73 115 -97 136 -126 31 -59 52 60 -36 -57 64 38 -82 -16 7 -12 -3 19 108 8 -74
3842 -74 24 4 23 -86 5 -43 21 30 -33 53 -6 -61 39 19 -58 126 128 -4 -143 22 9 -40 -3 -19 -95 133 -82
3869 -82 70 -21 23 -32 -50 12 -6 21 -58 40 -47 -37 -16 99 39 57 -31 12 -71 -40 70 -126 44 13 -42 -20 -43 -69
3897 -69 -10 -40 -23 33 -41 4 65 13 49 88 -46 -241 -41 26 -61 -67 -104 11 59 36 -17 -6 -38 0 23 -22 43 -45 -111
3926 -111 -103 -72 40 -76 -64 -8 -5 18 -104 -66 -35 136 -38 -34 -83 -43 79 38 -9 51 156 72 19 6 67 36 -45 -84
3954 -84 -83 9 -11 41 -4 110 -103 98 -5 -130 -75 25 4 45 -41 -60 22 -81 -16 105 93 76 -43 -101 -68 -79
3980g9N2J32j98O7j30J44kj7k7N3k4K8o1N9k2J29m8O6j02l4K3n9M2N9q6J07l7
4007C5k38J80j1N9Lp1PJ6L5Mo7M0j79J45M5j23K33r1J1J1l5j29k7Q5J19m2j24
4034a09J16j20J3J3n1J21J03K3j00m2Q6rl6m3n0P1kP7p4J02j74O8K6p6n6K00l9
4061C8q6K7J44J3j79K7p3R3Q8q5j20J57R6k23N9k6k8J54j56J00j31J04j9O3j6
4086B1m2P7n9j19P4N1j24N4O0N8j35M9M4K3j16R6m2J03%J3o6l3P5j18J37K7o1
4113D7l4j2J2j8Q2j47O7L9k6n8n1P5J39j50J87l13J86j00J93j41j2j29R5J73q0
4138B4j72J0J59M6j50QQ6l0j0Q3o3N7P2k00J24o5QP%O2rq1L2RL5m4m6J4Q3j19
4168g0L3M1j3K5M4j49K5J32j12J34k13J39j21K45j75P1j55J59P3k45J28p8J84
$$ plain form
3980 -79 -27 105 -93 -26 -156 -12 -14 -31 -58 -5 -29 -1 -62 -3 -25 104 56 122 20 -14 9 -50 -8 51 -35 72 35
4007 35 -203 -23 -34 25 28 -43 -36 -20 15 19 -48 -8 -187 -42 3 -120 113 22 33 44 9 -120 -147 -62 57 15 -109
4034 -109 7 -113 -100 -87 -138 -17 86 109 9 -33 53 44 8 -35 -85 -14 -16 61 -13 89 -85 -17 9 -67 -123 77 38
4061 38 -48 -21 123 136 -43 -16 -89 4 92 7 -113 44 140 -83 -24 -50 -78 76 -80 20 -111 -7 -26 37 21
4086 21 -21 56 -3 -122 -48 3 -121 -67 -7 51 -84 -35 9 32 -84 12 -30 73 73 86 20 -13 62 -56 81 108 47
4113 47 13 1 13 -5 77 -70 -3 36 10 -48 -99 -24 115 -35 152 -161 25 -75 118 -23 -35 -164 -69 104 24
4138 24 -148 -138 21 67 -83 -75 11 -19 -29 54 -9 48 120 -80 44 -21 -13 -6 -6 56 47 -34 -2 7 42 -2 -48 -34 49 -70
4168 -70 -37 4 -9 16 60 -89 -64 68 -44 90 -123 16 -105 140 -35 36 -119 40 113 -132 -4 -82 102
4191A02j71K8J17o3Pq6mP7N8j8N9p5m2kO3j23M7N0o0P7Pj4r5P9L8j8%m1n5P0Q4
4222I6m8j48J01j07J49j70J72l9q5J34j09N6P7j10J46j85l3K15pj79q1R9M4j9
4246c1N1j1N5K0j65P0Q2q8n6O6M1Pjq2j16J25J14n3m0%J22n8l8p2J01j1J9Nr8
4275d2J48j25RJ51j56jj0O7mp0J0lJ09q4m4j5P7m9RqL1N0k7j1J1M4O7m3l9n8k2
4306b8R7j07k5O7J08q3p7Q4j30J71q4j30J21K5rM2j6o8k9Q1nK1l2m1n6J78j17
4333d2L5Q7j40R6r3N9p7M6j42J82Ol9O8j8l0q1L7J33j78R6K3N5j14L3K9Nl1p2
4361f7J04l8k6J35o5p1J7k6J41m9qo7l3J77p6q7R9j8j02L9NL8j94K58p6mn1q5
4389a30J52O0j32r2R6N8l9k5P8j86K15n5M7q3R6n0l4Q0n8k2Q4o8o1N9O0q7p5J41
$$ plain form
4191 102 -69 -41 76 13 20 -66 -70 7 65 47 106 31 -11 -13 50 -73 -26 24 -36 41 48 34 -61 18 56 38 38 -3 -58 12 96
4222 96 48 -100 1 -106 43 -127 45 6 -79 55 -54 2 79 -31 115 -70 -103 112 105 -74 -155 -56 -12 -31
4246 -31 20 9 64 84 -81 -11 71 -17 -73 -7 34 41 40 -42 -158 -33 81 28 -12 -12 110 52 14 -58 43 32 51 56 -42
4275 -42 106 -19 -10 141 -15 -16 -26 41 37 -33 -23 -26 83 -1 -45 -60 17 -32 -23 -31 0 50 23 12 23 67 134 91 52 -6 -28
4306 -28 69 -38 -63 4 112 29 -48 36 -94 77 -7 -137 -16 9 0 42 26 -42 -71 10 5 26 -6 -47 -103 75 -42
4333 -42 -7 80 -60 36 -57 2 -75 -29 -171 11 17 -22 46 28 -2 -83 -46 87 -91 5 28 83 -31 2 31 36 5 -67
4361 -67 37 -1 -27 108 43 -28 -11 -37 104 55 47 -20 -53 124 48 -39 60 42 -60 -21 -16 22 -172 86 10 6 -45 -130
4389 -130 22 82 -50 -142 -46 12 -27 -52 26 -160 55 0 47 -36 60 10 -24 56 -2 -24 60 -8 -69 -10 50 -37 -112 29
4417B9j47J80j13P9k3K0oL4mj65J75o9P5j97J72j74J92np0j26N6K4Q9r4P1n7O
4444d8N3m3NK7J17r1Jn2p9N3N3q5J53j22J04j28J75m4m8p3J18QJ9q1O1J5Kp9K5
4473A6K3j9Q2j84QM0Q7j37O1K1j0Q0j28J07j05M3o8Q6m1n0QrN7L0K9q0O7m6l0
4502f2M7K8n0K7Qp5J70j03k8K8k0R3L2m8j1o0R9p1P6q4J33j62k4J24K8jm1o2L8
4531B9pK4n7j3Q4j52k7J57j38R5m3O5J1l5nK8k6N9j45J47l5O1o3o5J10k1j13J80
4559A05j00m0J8J15j48K12k45o2J36J35q8j5M5P9n8l0j62K06j6j40J00j04J17
4582F0P0j20k6K2M9m3lN2j63O4j5Q1k3j08Q0M1j15J29j12j08K39k0j35J08L8p6
4608c4M4j04pK1P3j17J73j14J07j94K13k9M0L8r0M8o3L9p6J40q4O2r1J24j95J63
$$ plain form
4417 29 -118 62 -51 28 5 25 19 53 49 -116 59 -10 65 -132 40 -134 58 53 -17 -143 -87 -63 26 -68 3 -54 -48
4444 -48 5 -38 -33 -6 111 20 21 -31 -110 -57 -4 -89 64 -58 46 -82 93 49 1 -72 46 54 73 -8 53 68 70 -9 16
4473 16 39 20 102 -82 -74 -34 53 -84 -23 -2 -12 68 -60 47 -58 -15 -83 3 -38 -88 -80 -89 -32 -2 27 -53 14 -32 -62
4502 -62 -15 13 -37 -10 -2 -77 93 -10 -38 -10 -30 63 95 47 36 -24 75 4 80 -4 129 -33 -57 67 95 94 53 -9 29
4531 29 22 46 -11 -24 60 -92 -119 38 -100 -5 -48 17 28 -7 -12 16 -10 49 -96 51 16 77 14 -51 59 38 -75 105
4559 105 5 -35 -17 98 -50 162 -83 -145 -9 126 38 23 68 147 89 59 -103 103 87 -53 47 -57 60
4582 60 130 10 -16 6 55 12 9 61 -102 -38 -53 28 5 -103 -23 18 -97 32 -80 -188 51 31 -104 4 42 -34
4608 -34 10 -94 -101 -80 -7 -124 49 -65 42 -152 61 32 72 110 20 68 5 44 -32 108 24 86 -5 119 -76 87
4634H7n5J03j88o6J34K9m2kn8J23j2p6P9p6q9K00q9K7Jk5J09n1m4mo9o8J98k6
4662E0q4J47j62J26j19O2p8J15p3Ro0J09J13j18N7l6j1n0M4j33M7O5rO1q0Q8j11
4689c1kP2m2j66M4L8J90Q8k15M7m5j55J70J9l1O2r8oJ52l5j85K37j75j4J16L5
4715G0Nm9k9j08J11Q2j42N0J73k39J18l0N1m2j4l4Q7k4L0n5R7n1j26R2O4jj38
4742e2J00l0j3j6o0O9Q0Rq0J9K9j13P1M2j62J68n9M7Po0p3J20j02M0K7R1m5j34
4770h0M5R5k0N4j22J6m3P2n4J6J16n9l5N9K6L3q3PN2j54J50m0Jo6q0K8k5J01m3
4799c3J25J0j38O4J7q8J35j83k2R0o1J23o0rm6K7l4J54j27m8J05o8O5Q8m6j07
4825f7P4j6P9Lj12P8JO2J2k2J9J4j22Lp9J01q1M5O1l6j1q5J73o6L8j6n5L5j25
$$ plain form
4634 87 32 135 -53 -119 15 44 2 0 -58 65 53 -23 56 -20 -109 91 2 29 30 5 114 63 19 15 -54 -122 76 50
4662 50 -34 113 -49 77 -42 20 -58 57 -16 -7 -67 42 155 37 94 58 47 -3 41 -92 -45 20 11 72 -8 80 -31
4689 -31 -33 39 -3 -169 -125 -87 103 191 -24 23 -22 -177 -7 12 -19 43 -55 -61 91 56 -129 108 -67 -81 35 70
4715 70 75 26 -3 -111 0 82 -60 -10 163 -76 42 12 63 21 7 -27 60 36 66 11 108 57 -69 23 87 86 -52
4742 -52 48 18 5 -11 -71 -2 78 87 7 26 55 -58 13 55 -107 61 2 49 56 -4 -77 43 -59 -19 8 99 54 -80
4770 -80 -35 60 40 94 -28 -12 -55 17 -37 -21 95 36 1 60 86 119 36 43 95 -59 91 51 52 -14 -94 -66 -91 10 -33
4799 -33 92 102 -36 28 45 -43 92 -91 -113 -23 -84 39 -21 -30 -76 -49 -83 71 -56 -104 1 -67 -2 86 40 -67
4825 -67 7 -9 70 73 -39 39 40 102 114 92 111 125 3 6 -73 28 -53 -8 53 17 6 -79 94 28 66 50 -5 30 -95
4854i5R3j3K4p0j4J54%p7n9j0J71j37k5R6o0j0M2O0k2j7n6M1p0L0J57k9j1L4O0
4883A87k14J7j4R2j12J40j69M0R1Q4j04m1q3LN9O6J2Kqj19N0j62K59r9n3J2J0
4910e4Q4No8o1O9O4q8Q0j12M4NJ3M3n7oJ43m0jL7n2N9n4K6j01P6%r2J08m8L0J21
4941A73j95N2j7j7n0r5K24q1R2j59Q8R7j55P0m7j8L1M7n9k6K0P8k7R1l8k4q9N2
4969A8OJ8N2j26P6M3mj09L8p2Q7l1L6P2j7o1M1k8j11P7K3m0O1k2p6J21j03Q1o3
4998a3R8l4q1o1J22j06J44q2j6K0L5k2J9r0j7J15l6Nk25K17k7J30o8n0j0Q2ok00
5026a57J52O3r2O1O1q5Qn5J58r2Q2j43M5J66o1j36jP5P8j43k3K4n9J92l8m4J6
5053E2l7l9N9k2n7O7J6m3m4RP9k6kK2k20J07J10n8j8l0J08jL4j76J19n4p1J65
$$ plain form
4854 -95 -2 -15 9 -61 -75 79 79 2 -57 -67 104 -33 -58 38 -22 -32 10 70 48 31 -25 16 -54 -24 133 104 93 127 187
4883 187 -27 -10 -24 68 -44 96 -73 -33 58 142 38 -3 -86 -83 -24 42 54 56 48 -71 -21 -183 76 -23 -76 -64 -54
4910 -54 30 35 -33 -94 -25 39 -49 31 -81 -37 -32 -19 24 -33 -39 104 64 63 100 48 107 53 79 -22 54 54 -38 70 22 52 173
4941 173 -22 30 13 -4 -54 -149 75 -6 86 -73 15 112 -43 27 -20 -38 -7 40 -19 -45 -25 53 26 117 79 55 -34 18
4969 18 24 42 94 -32 44 87 83 -26 12 -60 27 -4 32 104 87 26 67 39 -72 5 28 -12 49 27 -49 72 -31 50 -13
4998 -13 85 51 -30 -91 31 -75 69 -13 -29 -9 26 4 23 -67 -84 31 -5 0 -225 -8 -35 95 27 -23 -33 49 43 -157
5026 -157 -5 58 -34 27 88 3 11 -44 114 22 104 -39 6 172 111 -25 -26 49 127 -16 -39 -15 -74 118 80 36 52
5053 52 15 -24 35 13 -44 23 39 -4 -48 -39 40 14 12 34 -186 -79 31 -27 -45 -75 33 32 66 -110 9 -45 -116 49
5081D9P8j71M0j10J47J9o0J2O9l6M3m0q3qLL1K1r1P8J6r9J55n1ol5m1R2r6J46
5110G2k0m1m6J19n1Q9o5j17R0q1pK5j8J32k49J35j0M1j11J20J3o0j7J5p6P7J03
5137F2r7N3M1J7j45P8k2M3R6j30j0M1M4J14j00m3j18M2L1m6Q4O3m5p3J2Oq4R3
5165Go7k4k3P4K4k2P2j3o4N5J40j00Ol4k1n6%J21J5k02P7J1M7k7q4K59k14J57
5193A14L4p5l4j09O2K6oo6NQ9P4mk52J78L6l5M1p8m5L4j27J10QP2q9m8O8J19k03
5222a01J44j3k4M7j43J62qK7o9j5q5PQ1l8J3Q9j60K3J25j05J03o4jQ4j47N2N7
5249D1%q0Q2n2j5R2K0p8J3O9j6r8Qq1J27k6N8o7r9J33n6J4k2j31J57N1o3O2p0
5278b7Q1j39J38q4l3J1L7o1J04Kj56K35j82O2L5J01j37mK4q0j8K8P1k7k8l1K09
$$ plain form
5081 49 127 -44 -4 -114 33 52 -8 4 73 37 80 40 -43 -51 -48 -17 4 -87 -9 7 -92 63 12 6 -29 -70 22 -74 72
5110 72 52 11 -35 84 33 122 57 -60 30 -51 -58 -33 -51 81 -168 -33 -43 -2 -113 7 20 -40 -57 -42 -118 -41 62
5137 62 -35 18 59 76 -69 9 -13 30 126 -4 -14 27 71 185 85 42 -76 -34 -3 -49 35 98 53 -20 -8 -2 -86 7
5165 7 -60 -84 -107 -33 -9 -31 41 28 -36 19 159 59 65 31 10 -46 -46 75 90 -112 -35 -24 23 -4 -88 171 -43 114
5193 114 148 73 39 -70 -8 18 12 -54 -49 40 114 110 -142 36 72 37 78 0 -45 -11 -138 -28 -20 52 -37 -85 -17 102 -101
5222 -101 43 30 6 53 -90 72 64 91 22 7 -78 -71 10 -28 -15 74 -86 -63 62 -43 60 -4 -5 79 -68 -16 41
5249 41 41 -39 43 -9 -24 68 88 10 23 92 76 -22 -14 -95 32 6 64 -3 -102 31 -25 -11 -33 -164 -7 44 -19 43 -27
5278 -27 54 -85 53 -31 -64 -53 -16 -77 27 29 -127 108 -74 -12 23 124 -13 -17 7 -73 -91 -63 8 -19 -47 -78 131
5305A31j20R5j85P8Kk7L1j43J66j27J24R3j11L6j9k0M9o1k1l0l2O3J9J6j2o5K27
5332A57j50j05J23k7j26J28k3pJ5L0M4j45J11O1j55k6M2Q0k0M8j69K89k22J6M1
5357A0p3N9N6oj8jJ2nj3k7kr5J3J14j30k9J28P5j90J74o2J23j25L3n8J25p3p7
5385f2KO7m0n0M1N3O1j62P1mrJ8J03m2r9J09l0l3J8R1K7k00k0P0j46K33q9K7O9
5414G4l7Q7j55M8m2l6l0R3N4j70Q6N8j0j45K7J82j80J47M0j66Q7j16J65l0J50
5439A81j46o5m1P8P0j29J05j22R1M6j23R4Q2l9j06N2k3l0L5L8j0Q3p2j1l7L7m6
5466hn4J60l9n3m5J4m3J15k6L5j5m3r4J18j03mJ75m0Rj12K7Q2q6m2kK0J28j84
5494a10J58r0N5j5M8j0N3j07j3R5L2N4j16q6J6j02J36n8L5J01k3J4p4Qm4Q8m6
$$ plain form
5305 131 11 106 -79 -1 1 -26 5 -138 28 -99 25 118 7 43 24 4 53 -8 -29 -59 -91 -28 -9 7 -5 -70 157
5332 157 7 -98 25 -2 -128 0 -23 -30 -15 15 59 -86 25 86 -69 -95 -53 27 7 55 -114 175 -47 -31 10
5357 10 -63 -4 52 46 28 27 39 34 21 -6 -8 -103 -90 24 -106 -135 -7 68 -122 52 -10 113 -12 21 -37 88 15 -62
5385 -62 -60 7 -33 -83 -42 11 72 -90 -19 -23 -32 -14 89 47 -52 57 27 -6 12 103 130 -70 -90 -20 -166 67 -22 5 74
5414 74 37 124 -31 17 -25 -61 -91 2 56 -114 -28 30 20 -125 -98 84 -96 51 91 -75 12 -104 61 31 181
5439 181 35 -30 -71 7 77 -52 53 -69 22 68 -55 39 121 82 -24 28 5 -25 10 48 38 121 49 38 1 38 -8
5466 -8 -62 98 59 6 -39 -25 -68 47 21 56 41 -2 -96 22 -81 -85 90 50 59 -53 -26 56 -30 -72 -74 -54 74 -110
5494 -110 48 -42 13 -2 46 36 89 -18 -31 64 96 150 34 -52 -36 -138 -2 -60 -25 76 53 67 -7 1 -43 45 -1
5521aK7o6R9p6q5K01k8j70J07j15L3J00n4L7O4j17oL1Lqn0O0N7l2KJ0p0J4k3M4
5551a2K8O6r2j7L1p4N1n0N6%o4J41j20J84j2o5j06Q1r2R6n5j1J22o9k2l5rM1p5
5580h3O7K8o6J85k33J42j31L5p2P0j61K21K7Pn8N1J1l9L3Mo0N3p2R2K0nmk15J92
5609C9q1K5n4J07j2lJ57l8k29N1l2J33r9rj9J24j2q3J20j27k0J69j20n6K6J6J13
5636H6L9j87J49r7K0rN5j35n7J07MP1m7PM7k37J90J2kK9q0N3N7p8po9J07L1k4
5665C5j7J6N9j34P3o4n7J16k6l6J44j29mn2O5m0Q4J9j93J34rJ30j70Kk9R6q2%
5693f9O0mm4ln2P8P8p9P5j21j8J15k2J7rN8l1Rl5M1o6L6RRo1J5n8J85j39o5K03
5724A12r8M9J9j33k3M2O2J27j33o7Qk3m9J19K9j47Q2J7j2M2k5j22J57j29J02j19
$$ plain form
5521 -1 26 -40 59 -17 -102 99 71 -99 8 -107 -74 26 -28 9 73 -44 -50 -19 -16 -24 -74 -14 43 11 13 23 -47 -33 -56 -12
5551 -12 16 82 -10 -27 4 -70 -19 -69 -13 -13 -77 64 -56 128 116 51 -55 26 -66 30 -25 -36 86 17 -5 -40 -49 -8 -83
5580 -83 -16 12 -54 131 -102 40 -91 -56 -128 -58 -219 2 29 36 -22 29 40 1 34 38 -22 31 -41 51 71 66 62 -153 39
5609 39 -42 -17 -71 36 24 21 178 140 -89 -38 -70 63 -36 -45 -64 60 48 -35 85 -42 -62 107 -13 -69 -43 -27 86
5636 86 125 -62 87 -10 10 1 56 -79 -136 -29 -25 46 -1 6 53 -184 6 18 16 45 -35 18 75 -3 -10 -79 28 59 35
5665 35 18 34 93 -41 32 -32 -89 27 1 -35 109 -20 -24 -76 -11 -51 33 52 -141 -7 -16 114 -56 -54 -83 13 -69 -69
5693 -69 -9 -13 -57 -60 -112 -34 44 -35 40 -81 -99 16 -6 11 2 60 29 38 3 44 -22 14 23 32 -29 -14 -72 113 -26 -91 112
5724 112 14 63 82 -51 -74 -32 30 157 24 -43 -35 -58 -107 12 41 -106 -24 -7 -19 23 -2 -124 33 -96 6 -113
5750a13O5R1k2N6n8r6O0J31o6N4j04N7On9L5J8K6j11Ol4M3J81j38r2O0n9O4M2
5778D3p6M8k6o8K5K4O5K3k21P6PJ19j10K9N8J7k58J52K00j38K6nN1m5MJ2O4j36
5806d0RJ05n4j04Q6j2q4J42k6o9N5M5q3o1k7J16J03j25J05m7j7j6M2l0K4n7j14
5833a34Q1J14j25P1Ppj47J51K9K1m7n1J12j21J3Q2r6N3j0n6j0J11Kn3L9m7l1J41
5861I2j05j6O8j69J52P3j1l2n4m7N3N3jj02J5p8J58p8J02j62J28j01n9J24m8k0
5887f5kM6N6j37J79r5l9M5r7Q4K3l5N2Pj59J01J06o0j50R1P1N7j40j3N3p1P7n0
5915f5Q9O4L8j6j13K5L2m1LJ3r5N0R6j6j74J68j28j6Q9L3j78J06k6K5o8J96j94
5942a03LQ3O5r4R1J5j20P3r6R7j62P9N9R0l6o2k9N1k0Ro6P5O2l6qJ04q3K1j29
$$ plain form
5750 -113 -48 43 21 77 19 -77 -17 114 48 102 -2 55 61 2 37 55 81 -30 -24 -58 -15 166 28 -64 -4 -63 1 43
5778 43 -33 15 -11 -79 -54 -30 35 58 -163 -87 -80 39 -71 -42 16 33 -225 -73 127 -11 15 10 61 16 20 32 96 -40
5806 -40 -31 74 20 -84 2 -10 -94 48 22 -47 8 53 -30 -91 -118 -2 101 -24 81 34 17 1 43 13 37 -20 -134
5833 -134 -53 61 -64 7 14 7 -140 11 40 61 14 -37 75 -46 -33 49 -47 6 -4 -60 -70 41 43 -10 29 -18 -49 92
5861 92 -13 -29 39 -130 22 95 84 52 -2 -49 4 57 56 -46 -31 -109 49 -29 73 -89 39 -62 -121 3 -45 -65
5887 -65 -67 -21 35 -102 77 -18 -57 -12 -109 -25 -2 -37 15 22 -137 -36 70 10 -140 -49 22 79 -61 -74 -21 -92 -15 -65
5915 -65 24 88 126 110 -3 22 54 13 16 29 -66 -16 80 64 -110 58 -70 -86 3 36 -142 -36 -62 -37 -105 91 -103
5942 -103 -100 -17 48 -46 45 60 -60 13 -83 14 -148 -69 -10 80 44 -18 -47 4 -16 -7 -73 2 64 28 20 124 41 62 -67
5971f7K4N5L2M1n4P4N1j69m0J14lj58J01Q2q9j3j13J60j08P5k1m5M7r2J65m8j50
5998a49J75o4Qj61J92R5j94K13j32j04J70m4l2Q4r7q3J08K5m7j4J42j02L7j06
6022h0PJ16j9nkj9j08j6L2J34p0lL4r8J72m7j4%j57M7J15m0JO7j15J1J19r5P9
6051D6K0j5j15J54j16O2q1rP5j2lQ4r3J56j77j5J6M8N6r5J6k7P9r3Q7O6j8m6L0
6080H0n4k5l9P3p1J5P9M9k09J01J07M7r2J2k53J48PK03j13o6r1J88j13K4o5J2
6106d6J26r5n8Q1k4R1j28M7q6R5j8J1O9j07m3Q5n0j2R8l2L2K4j07Rl9J55J9j10
6134a3N7j21R1J14j71j1L9r0J95j71O1K5l4J29n8j61O3M1K9m6J27j56Q3Pj36J72
6160F5M5j10pKn5R5j08J07j06J24j66K07p6n5R3N2m4n2J24j70J39m8k3J5p4l9
$$ plain form
5971 -67 -43 12 44 85 31 105 156 -13 -53 61 58 -100 1 83 -6 -19 -132 28 -80 -5 -26 -71 -24 -116 49 1 -149
5998 -149 26 -38 -30 -191 1 96 -98 115 -17 -121 49 5 -27 57 -40 -123 -15 10 -37 -51 91 -11 26 -80
6022 -80 -73 43 24 19 17 -2 -110 -126 -94 40 -30 -33 1 -97 75 28 14 14 -143 -96 19 -21 -20 47 -68 -57 62 -33 46
6051 46 66 51 -64 90 -26 36 -45 -54 21 9 6 90 -3 153 -24 -39 -23 25 81 -14 2 -25 54 -39 48 114 96 50 80
6080 80 26 1 -38 35 -36 -21 58 107 -102 -1 106 153 61 73 -180 -32 -25 178 65 -1 -92 96 -17 7 -58 -46
6106 -46 80 -15 -73 8 -16 75 -53 -6 -92 3 -15 -4 65 -42 -85 0 -50 -62 36 4 36 60 -47 -38 -77 78 97 -13
6134 -13 44 -77 14 128 -43 -54 -15 -105 90 -81 -20 5 -29 100 42 -119 -56 -15 14 -32 95 -61 22 29 -107 65
6160 65 110 0 -7 -5 -60 35 -73 34 -72 52 -114 93 17 -38 55 107 63 11 135 -35 104 56 33 48 -26 -65
6186f5J94j08n2M2n9M7J25j37R2j32n7J75j47K9J40m4o9Q1J2k18L21j10pj39M4
6211d2kR6j00J57j33K1km2j5LJ25j25J28O9r8K0l1oRj02P7M1j00J69k7j42MJ05
6239E7J2o8j30J61k6mN4m6J6j42M8L3j1J10n3j55j0R3P4j19J79j19L7m8J3R8m0
6266A4j5j8J8j26R1oJ26M1k07J52q0R5j19nN4k9J12j34J00L5p0j00J18j22J67
6291I2p4r9LK9P9J4q6N0j8p3L2nJJ79j75P4p2L3%m0R0j21R5O7p7J09Rj91Q0K4
6321B9qN6kj16Q9j34m7J22K7O4q6L3J3j9j6K4K3JomN0o4j8K3Q1r3M2j68L9J67
6351A02j12K3j0j06R0J1J7l5m0J05o7q4J36P3o4j03P5J01j91nL7PQ0n7j26J27
6377a6J01m1q0Q2O2m8j07L9m3K02j71pK4L2j5J3k4J2l0r8R1k1J45p9p5q4K04n2
$$ plain form
6186 -65 129 21 -31 11 -48 -1 124 -13 79 -53 -110 65 -82 -53 87 43 -26 55 67 -151 170 60 53 -86 -42
6211 -42 -44 52 -48 109 -24 -3 -5 -47 -62 -59 66 -59 69 138 40 60 29 23 32 -70 7 48 -52 117 90 -52 -48 57
6239 57 69 1 -129 32 6 2 56 10 26 -116 -68 -35 -46 64 11 -144 -154 -61 13 -106 73 -46 -9 -57 -44 54 14
6266 14 -1 -19 -1 -127 -36 -42 84 125 -82 70 -10 85 -34 -39 15 -14 98 -36 64 99 29 -71 47 -75 92
6291 92 18 -81 -78 -49 30 44 -42 8 -10 -83 -51 -56 -55 124 -51 23 -49 -16 -16 -56 34 -87 8 75 -2 107 116 -75 5 29
6321 29 21 77 75 -41 48 -86 -133 -11 16 80 -6 27 40 21 5 29 52 53 47 43 93 29 11 34 115 22 64 -104 -65 102
6351 102 -10 13 3 -103 -13 -2 15 -20 -60 45 -22 -106 30 103 39 -64 11 112 -79 -84 -47 -40 40 -17 -143 -16
6377 -16 85 44 -36 46 108 60 -47 -8 -51 151 -20 -27 -3 29 14 27 3 15 -15 -113 -22 -43 102 23 -52 -136 68 16
6405A6nM4m4JK2m8N5j07K6O7j09P9L5n2J2J23p7j00J24r5JpJ09j63P8j0Q2j81
6433a24Q2kL1Q2n1j34J78o0M7j33K2J45k36J56L2K4j48L6J24j20J0K6L5L6j40
6458h2k3J46r5R5j29J15L4l8j60R6R7j0k5j5j3k3O3l1q8nJ64n5m5j4M0k9k5Q5
6486C0k2lO3m2p9L6jJ0q9J88j09R1j69J12nK6j16J24Mk9m2L4j2n7K8j1J67j98
6514g1O0P8k6pJ9k0j4Q1j02oJ41r1q7M9K5L0j17Q8M4j7M3j37K19o6j06p4P3n2
6542d3J3Q0M2j16j0J55k11R3m3O4J0p3R6L8j44J9J19j24O1N8j19N3k5p5O2pm2
6569f9l0J2K12k00n9J04m3j8J4L6k1J03M8J5p4O9j09J01m4m9L5Q6m4j75K56j92
6595c6J77j92R0r1K4P7j06M7j2k9R7j55J46%J0j8j24J44l1n5J6J42j64L9K3O6
$$ plain form
6405 16 11 55 11 12 34 -14 41 -66 -40 27 -82 -3 32 -20 -8 115 38 -62 62 -33 -32 -39 70 -93 -15 -25 57 -124
6433 -124 -42 -44 -13 69 18 -116 62 2 49 -84 -62 83 -153 3 35 59 -89 -53 71 -49 -39 -13 22 58 -82
6458 -82 -105 41 -54 41 -88 27 61 23 -137 -41 56 46 21 6 -7 -30 33 2 -86 -91 73 18 -27 -41 -1 -30 -55 30
6486 30 8 5 68 26 -53 -17 -18 -8 -97 91 -18 73 -96 16 11 37 -79 45 49 20 -22 12 0 -57 -29 -40 127 -71
6514 -71 -11 67 41 34 53 33 19 100 -2 -8 133 42 -45 4 29 59 -58 30 74 57 100 -37 182 116 10 -64 9 -43
6542 -43 -30 50 92 -24 -34 121 -90 3 -40 24 34 -39 57 95 -49 -30 89 -35 26 84 -35 18 -7 -82 -20 -27 -69
6569 -69 -99 -87 125 -75 -134 -30 -73 -91 -77 -41 -62 41 89 104 30 99 -10 91 47 -2 33 119 75 -100 156 -36
6595 -36 141 -51 39 -52 -28 49 -57 -10 -22 -51 46 -109 37 37 47 29 -95 49 18 -37 -21 121 -43 -4 19 85
6621H5j31P4K9j51O2m8J31r2N5Q7j11J13k34P7J05o0m0J6l9R0m7R2N9r5L6r6p
6648d0Q1k4j3P2q6m1J00r6j05Q7N8k1j6j7R2m4j8K6n8N3o0qO4l2Q8j13N3M1p0
6677d7L5J8m4J26p3l8q%L0K7o5N3K4M0k7l5j5L0p4ro6J46L0J3%m1R9l3n9l8o%
6709gQ6m4m9N3k6j05J5O0J15r7m0M8n3n3Q3K2j10rR4N8j39O7M8R2j59J24j39Q5
6737B0p0Q6P7p9m4k6rJ36o5M1o3L6N5j23J2M0R4o1n3m6J33r2m3j0j9k7K12j48
6765c6o8J81j14ooN5J47k13M4j5J7Pq9J71k5j06J08J0k5J50m3j30P8q8K7k4j4
6792gM6MLj10P9OO0j38Q4m4n3J07j26J06k7kN9o7L0j17K9J02n4N0pL1M7l5m9j41
6822a34L9R1N5o0N2o0m5Q1RpKl9J3k7J30n3nl4QM0n0j23J51N2j10P8n6p4mR1o4
$$ plain form
6621 85 -46 28 57 -94 -32 -80 51 -41 14 101 -10 103 -131 -54 51 -9 -49 -33 -72 18 -29 63 122 27 63 -33 -40
6648 -40 41 17 4 76 -10 -51 49 -47 -152 -65 -7 -28 -44 -61 31 -13 -31 -5 -63 -10 -70 -78 -14 -46 42 -71 -18 23 -47
6677 -47 -12 6 -38 88 15 -23 -31 -31 -1 26 -39 14 38 78 51 16 1 31 -43 -52 -118 28 58 71 71 30 129 96 37 -1 -7 -7
6709 -7 79 35 -14 39 13 -92 -77 -17 98 1 -39 9 -44 -97 -14 8 -102 -111 -17 41 -98 -31 17 109 -50 74 -65 20
6737 20 -50 36 113 34 -10 -36 -45 91 26 67 4 40 95 -28 -16 24 118 57 4 -42 91 -1 -44 -54 -73 -100 112 -36
6765 -36 -104 77 -37 -43 -49 6 153 -60 -16 -31 -14 -7 -96 75 50 -56 52 62 37 187 144 14 92 4 31 7 -7
6792 -7 39 43 46 -64 15 21 81 -57 27 -17 -70 37 -89 17 -10 -12 47 -20 10 -107 -78 24 -30 20 13 44 91 56 7 -134
6822 -134 -95 -4 51 -9 43 -17 -62 19 28 21 23 -16 -3 -30 100 47 42 8 16 56 6 -117 34 86 -24 54 -2 -76 -80 11 -53
6853e3p3L1J05M6n9J19k0k1q1lJ26j65M0L9n1J20j06No4P3M5n2R4j31O9j57M6
6880g8M4Q5r5K4n3p1J17J6rP4j22Nj9P6Q2k6j58J20j10N3R7M0O8r6N2m6lp0j21
6909a24J67j58J00J04q3j08O6J33j91Q9J55r7K3j65kJ3PJ6n5j0J74k7K4j2j69
6934a30J47n1MP5m5k4R3n3J0j07M7J46k7p8m4R7R0j35K6j10J8K5L6R5p4m0L8J10
6962A39r9j14N8J64k16j4Q5J09l0K2j09n2J9n3j3R1R4J2r6j57J15n4R7m4J27n5
6988B6mQ9Jn9o8J7l7M7L4l8L5M0J5j42J6Q6k8k4N6K1j0O9j08r4P7j28J07p5m4
7017a23P4P2r5J20r7N0r1P2MK8m9K3Jj55R2J12j12q6J34o6J72q8Pj8m5J16l0j2
7045A0k6J7m1P4q3M0J35o6J7l1j18J09L8j7j54J55j63J69j03l5J10nJ18j70M9
$$ plain form
6853 -53 -126 -95 10 56 -3 116 96 75 -6 -9 117 -48 -8 31 -20 100 -6 -1 -65 8 53 1 95 -36 33 -124 -78
6880 -78 -34 51 -44 -20 -73 -144 -27 -11 -20 54 -68 -63 -82 -6 76 50 -108 12 -98 -45 52 92 160 64 116 70 67 -3 -124
6909 -124 43 -115 -15 89 6 -102 -36 97 -94 -5 150 53 76 -89 -91 -78 -71 -55 -110 -120 54 27 51 39 -130
6934 -130 17 -34 -30 45 0 -24 69 16 26 -81 -34 112 85 7 -37 60 150 15 41 -69 -51 -26 10 105 31 -9 29 139
6962 139 40 -74 -16 148 -68 -82 3 112 82 104 -5 -57 -38 -91 -104 -13 81 93 -3 -160 -45 -99 -2 -46 81 26
6988 26 22 111 112 53 -15 2 -35 12 46 8 43 83 98 -44 -28 58 30 6 62 83 73 142 34 -60 17 -111 -4 -79 -123
7017 -123 -49 23 -72 48 -49 1 -90 -18 -14 14 -35 -12 -11 -166 -74 38 -74 -160 -26 -92 80 -8 -1 -19 -64 52 22 10
7045 10 -16 1 -40 34 -49 -9 126 60 77 46 -72 37 75 58 -96 59 -104 65 -38 -73 37 32 150 -20 29
7070B9mN7j08j8J56j24K3n1o7K01j33j07N3J25l6l5k7P0l0P8l5q4K6M7M6p9l5
7097f2N8o0K29k09p7J42Q1j58J37j08P1l2O6j4J2Qo5j4J7m0L4P1j01O8Qm5N0o7
7125@jK0j02J8J3N7q1p0O5m5Q0J92j02j12RNJ7J1J16j29J45J0J5j62K6Q9l1j3
7153D0m4q0n4QJ82j4L9p9J68j76K4q7J41M3j06q3J77j94jP9rN5n4P8o8q8L9nL8
7182c1L9k9K6o8J40j72J39q0M7o0Q2k9J3k7j19K04N4j31Pm7J28q9j27K04n1K0
7208D3M6l4j53J62m8P2q1L8K8j10O2J4j26L8J05k37J55n5K4n3J69q1R2j47J15
7233C8j8J10p8j08Qm0J18J7j43Q2j8k5N6M5M1j13j64J17j2R2M4R3q9N8p9p3J5
7260b6Q6l6L2M2n1O8j94L0M0JO9j8J4o0L6o1J0P2q3R4K6j58P6m0n8R3J5J8j8Q
$$ plain form
7070 29 25 82 -26 -44 112 -12 11 -40 -107 94 -39 -146 -93 32 -4 -39 -66 4 -26 52 17 -67 -41 6 52 -27 -62
7097 -62 -4 -64 165 -44 -121 21 102 -56 81 -27 44 12 78 64 76 84 19 5 22 -18 16 87 -14 54 62 17 67 0
7125 0 -1 19 -83 -65 -52 5 -76 -146 -81 -126 -46 146 44 -68 -59 -54 -37 -26 90 -39 106 116 131 -31 -5 84 53 40
7153 40 -4 -84 -138 -130 52 38 77 -2 166 -10 14 -73 68 111 5 -78 99 -95 -96 -17 -26 29 -25 53 -15 -103 -64 -69 -31
7182 -31 8 -21 5 -63 77 -95 44 -36 11 -49 33 4 17 -10 -129 75 129 -2 5 -42 86 -3 -130 74 23 43
7208 43 89 55 -98 64 16 88 7 45 73 -37 25 39 -87 -49 56 -181 -26 -81 -57 -110 59 -22 70 -77 38
7233 38 20 130 52 -56 -48 -88 30 47 -96 -14 -32 -57 -1 44 85 -28 -192 -75 -87 5 49 142 53 111 32 -41 -26
7260 -26 60 24 56 98 47 115 -79 -49 -9 -8 61 43 57 -3 33 -28 -18 54 -29 65 91 -67 9 -31 -89 4 19 37 19 27
7290B7n8j5k4M7jo2P0l3l8J48l5m5M2M0J06j62k2K1J7Rj8q5J47r9l7R5L6m6R2
7319A17j07J8l3P0N1j22l0J15j1m4Rq0J0P%N2R6j37P8l6j0o7P8o0N0m0p5L8N2
7348a1kl3pm3J16j8l9N7k9J2m4J12%J19j99M1M6j23M1o3R6L3n6M3j08L0J2J29
7376A12O3k67J55j71P7O9n5k3J6M2j21J44nj42J06nk1j06J57k8ok5M5J8J7o2N8
7403D2r7J35q8qq4P0J52l3m6l9J5j0K6r5R9J11q8o3N2m7O9n8J1m5N0q3Q3R7j16
7432A2M6o2L6P8j04KM9j12R0j24K0O3KRk4r1J6J29qN2o9j40J30n0K9N5K4K3p5
7461FJ7N3k17K66qk1j26P5Q5j32M5j05J49n1O4p6N8n7j0O9k9J4k00P9%R8K3k03
7489a34J41j32J11L6j4J7p9J18j21J29n6j1R8j62J41j33m6O4J55j22L2R5j97K2
$$ plain form
7290 27 -31 -46 -70 -23 -24 -86 -16 -49 -87 61 26 -19 23 63 169 7 -15 6 23 32 14 -71 76 -23 -60 35 71 25 117
7319 117 10 28 -5 65 116 -6 -36 79 68 24 33 -47 -37 -30 -30 22 118 -19 59 23 13 -54 24 -36 14 -26 -101 -63 -11
7348 -11 -13 -46 -53 -96 20 2 -37 20 -9 3 -41 71 71 190 -9 32 78 -45 -4 -67 29 62 6 49 -59 -29 -17 112
7376 112 175 -92 63 -108 -31 38 -17 -40 -24 18 -103 41 36 -106 0 -5 -26 -132 25 -3 -9 -34 11 29 46 -16 42
7403 42 -55 80 -8 -16 -100 -30 122 89 43 4 19 9 35 -60 39 150 62 -1 51 4 73 15 26 -19 31 -52 31 128 12
7432 12 58 -4 32 110 6 8 57 -55 35 -89 -69 -6 -4 5 -19 -110 -94 35 27 79 10 -130 0 -50 -21 34 58 81 6
7461 6 23 76 -141 125 117 96 -30 45 130 -2 43 -62 87 36 100 24 82 25 15 84 55 69 -131 -52 -52 46 69 -134
7489 -134 7 -125 -14 22 8 25 -54 64 -57 72 16 5 103 -59 82 -51 -97 -33 122 0 32 127 -70 -48
7513d8J26m6Q8j05k0o3J16r5Q2m7k2Q8J4n7K5k5K1K2Oj31K5L8l3Q7k5n3Q8j95
7541a39O0j4P4p2P4N9j7j41K24r2j46J67j9M2j13k9O8Q3n8l4L9j4j03j4J60O5
7567A10j66P3k7O4ojJ00j44O5M1p2N8p4l1P1j46J11j0j5N8K7p1q7J9M3m8n6J29
7595A5l0p5m0P5KpJ20n5k3m0O5o0M3MLJ06m0L3m5nNM3k10R8o7J07QM3k3l8J9N4
7627H5j49J0mP7n8K1Q9j17J3j7nN8n4J16l5L8n9m4J33k30J05r8J27m2p9J52j8
7654A5j01J19Jj08O2q6Q9J77j48q7J54j21j9k8J67m0k2J21n1m6L0n3P9n2r1p1
7680a10L7J21j35J41r9K0o6P4l4J76j47L4J4m3j7M9l4J14j46O7r3M1l7j4R0k3
7706b0N8j71P3n5J1KK09j21L1j15O6J43p1p3J65j50R5r8O4j07J31M1j48K15j35
$$ plain form
7513 -48 78 32 120 15 -5 -68 48 -47 35 -12 -34 54 68 11 36 11 32 54 60 -71 -46 -8 -41 46 21 -32 56 -139
7541 -139 -79 -93 -19 -91 -17 42 25 -116 108 16 -130 37 18 60 -53 -82 -14 69 11 -23 16 2 -101 -115 45 110
7567 110 -56 17 -10 54 48 47 147 3 68 109 37 95 21 -10 61 -85 26 16 1 59 86 15 -72 -53 -10 -58 -114 15
7595 15 -15 -90 -130 -55 -53 -60 60 5 -18 -58 7 -53 -10 -6 -3 103 63 96 51 46 51 94 -116 -18 -85 22 30 73 50 12 31 85
7627 85 -64 -54 -58 19 -39 -18 71 -46 -33 -50 -55 3 -51 65 30 68 9 -35 98 -132 -27 -125 2 -40 -119 33 15
7654 15 -86 33 34 -74 -12 -98 -9 168 20 -67 87 -34 -53 -81 86 46 24 145 94 48 78 25 104 52 -39 -110
7680 -110 -73 48 -87 54 -45 -25 -91 -17 -51 125 -22 12 26 -17 -34 15 -19 95 -51 16 -77 -36 -73 -87 3 -20
7706 -20 38 -133 -60 -115 -104 -102 107 -14 17 -98 -32 111 40 -33 132 -18 77 -21 43 -64 67 108 -40 175 40
7731D0l1l6R1j16j4OJ08K1j22Q7Q3q7j04N5R7K3p2n0k9j7M1k4K3j7J10q0L5q9
7759f8JJ26j08M1lJ43j47Kn3l3J39M5k2n3J09j63J69j37p9J71k05J07oL1L6Q4
7785A27q2lJ07j45n1R2q0Q1q4n5NJ48nqj52J00m6o1J45n7J24o0o2k7J44j32m2
7812g9P3k5m5J2Lr0J16J22N6j29l9J20K4j20qJ22N1j28j3jn1J04l2K0r8J29j94
7839a00P3m9l3J88j45pP4J20r6o0O7K9r8mJ88j95J11k1j77J09j4O0j6j02j7K45
7865A30j52J6j6P0j8N1j69J90N5j90J39r8P6r5R1J0m8o7J56j30J90j75M2j06J97
7890A49j32pM4q7J54j45M8mo7J46m4n3j2mnj4L1j0N4n8L8qK1q6J25J6lL2j93J0
7920f4J52q4J3j3L6O6M2r5j8O6j0Nq8OK0P9p0oM9j6r2O4j02P4J2j29L7J87k6k12
$$ plain form
7731 40 9 -27 64 -52 -66 -60 48 69 -53 34 117 30 -74 -19 78 101 29 -21 -50 -67 -26 -50 -27 -44 66 -14 21 -68
7759 -68 -67 59 -49 -8 -11 132 -15 -13 -66 -99 40 85 63 10 119 -44 125 -12 -91 80 -125 -18 -24 7 43 127
7785 127 45 42 149 4 -47 45 -35 46 -38 -93 -88 60 55 47 -105 -5 -51 -112 33 -24 100 40 -22 -49 95 -37 -79
7812 -79 -6 -31 -76 -64 -61 -151 -35 87 143 14 -25 95 119 -1 -9 113 164 36 23 22 -29 75 43 63 -35 94 -100
7839 -100 -27 -76 -109 79 -66 -73 1 121 25 -35 32 61 -37 -41 147 -48 63 42 -135 -26 -40 20 4 -98 -115 130
7865 130 -22 -6 -22 48 30 81 -88 102 157 -33 106 8 84 -11 80 90 42 -25 131 1 191 16 58 -48 149
7890 149 17 10 54 -33 121 -24 24 20 -47 99 55 2 -10 -14 -19 -33 -2 -12 42 -16 22 14 35 -51 74 90 87 119 -74 -64
7920 -64 88 4 17 4 40 106 148 53 35 101 91 96 8 14 34 113 43 37 86 70 -22 42 -60 14 26 -103 -66 121 95 -117
7950a17J35P3k04Q8j22J48P1j71Q5L1m9m6j7K16j33m9J26r7Q1J24k47N0j04J44
7974A6m0rL6Oj02J59J11k08N5Q0r0j3N0J8p3j01R9R7j05M2j4J34j61o5J82r8J73
8001A79k26N2N3j51K5lj1P7J45j32N0o1R8j30k1k0J51j25J00o5j16J28n0L1N1
8026B9jj41K00p6N4J7n6j1J02l3o6K30l13j6J14Km2Km6R8M1k8j49J41L5n6o1Q
8054b2j9NP9j36J00J40j76j13L4l5J66qr9k6R5K3p7K4J48q3n4k2M7J4j2LN6l5
8082A7O3m5j0R0l6oj32J09m7%K6N3j07o7L4K6N9j05J56j48M4J3K2K4o6Ll6J42
8110G6j01J28p5j3p2m4P8O4j32L5L6N5k1j05R9jl4p3P6J95j65p6pK1J72j37J49
8137A28q8o0n7K85l76K38R5j61j4r6K24j53Q3j46oR2q5J20J11j89O3m8nJ45k05
$$ plain form
7950 -117 18 91 -113 -25 -147 1 72 -99 -14 17 -32 -78 -95 121 -12 -61 65 -32 49 173 -74 -24 -128 16
7974 16 -24 -33 3 9 -93 66 177 -31 24 104 14 1 51 69 -4 -105 -6 91 -14 28 14 148 -13 -78 104 6 179
8001 179 -47 5 58 -93 -68 -71 -82 -5 140 8 58 -3 95 -35 -56 -76 75 -50 50 -15 -131 -3 -53 -22 29
8026 29 28 -113 87 11 65 82 26 15 117 84 18 248 -65 -81 33 35 -7 -5 -51 47 88 60 -89 52 87 31 -30 -22
8054 -22 -41 -36 43 -93 7 147 -29 -142 -108 -143 23 15 -84 -110 -15 8 -69 -45 103 20 -34 -56 -9 5 -7 -4 52 17
8082 17 80 35 25 115 79 73 -59 50 3 3 29 82 -25 -92 -58 -32 27 -78 78 -70 -26 -13 9 33 -33 -30 -66 76
8110 76 -25 103 28 15 -57 -101 -23 41 -91 -56 -20 35 14 -91 8 7 -27 -100 -24 171 6 -70 -77 -56 116 -21 128
8137 128 40 -20 -77 208 -168 70 165 4 -10 -106 118 -35 48 -98 -104 -12 -97 23 134 -55 8 -40 -45 100 -105
8162a05oJ16o7O0N9m0o4mm4K1P6M4l7o9J03k0o4P4j31J00q1J05p7n7Q1k3J06N3
8190A09j19
$$ plain form
8162 -105 -111 5 -62 -2 57 17 -47 -51 -95 -74 2 46 9 -60 43 23 -41 33 -98 2 -79 26 -51 -108 -27 -50 56 109
8190 109 -10
8191a0
$$ Imaginary data points
##PAGE= N=2
##DATA TABLE= (X++(I..I)), XYDATA
0@%%%%%%%%%%%%%%L2o4O4o4O4o5R7j28J29j61J93k25K88l21L53m16M81n46O20
33C31p15Q01q98J026j154J282j437J599j765J961k185K426k681K953l247L583
49A880l949M351m797N287n831O442p126P901q795R830j1046J2498j4266J6479
63H858j9344K3219k8779L7500n3238R0618l45900l50783M89168K76851l100k01683
75g6613q637M2068K1161m160J21035O4918j21758k25256O555K47135K14583o2636
87B18395j64391k6659J16661M1995n2957j6075N4316l9642j44735n8985J32422
98F0345J20386p2010j48313K401J04959l251j27247l8688J12669P4062r6063j17221
110a27971L2883J00041j9033j08297k0687P4073o658j17151l0040J55393J48881
$$ plain form
0 0 0 0 0 0 0 0 0 0 0 0 0 0 0 0 32 -32 32 -32 32 -33 64 -64 65 -96 97 -128 160 -161 192 -224 257 -289 331
33 331 -384 417 -481 545 -609 673 -764 835 -930 1031 -1154 1272 -1409 1544 -1703 1880
49 1880 -2069 2282 -2515 2772 -3059 3383 -3743 4158 -4637 5193 -5853 6645 -7621 8858
63 8858 -10486 12733 -16046 21454 -31784 58834 -287066 -637849 -148681 128170 125070 -76613
75 -76613 -85250 -43182 -22021 -26181 94854 159772 38014 -187242 -180687 66448 281031 218395
87 218395 54004 27345 144006 186001 133044 116969 171285 131643 -13092 -72077 60345
98 60345 180731 108721 -39592 -37191 67768 64517 -62730 -101418 11251 85313 -10750 -127971
110 -127971 -95088 4953 -14080 -122377 -143064 -68991 -75649 -192800 -222840 -67447 81434
121H1434n2331j52317k3187J12215N9547n8441n3900J7116l008o7106q173J37093
133a1058J43515l8157j65600n8135J22312J18944l4855r9621k2255K4292k1778
144d2396j5776Q5541R9170n7250j70123n3275J35210J27583m0481j13229j8538
155f3564O2348K3038k5438J0210L8601l3422j06969m1295R3572J03481k3126q9187
167e1751J271R4774M3148o0130m7385L7518L2009n7658o5948L6455Q6257M603
179E3163o4484l834P6685K8914p6464o3217M9431P5794k9167r5143j8031P3808
191G455M1004m3880l8076K3774J2421n5493m3107N3960Q1963j4204r0644l1818
203i6645O8692O1810k6445o0463j2629J4141j8674k3089M3293P8826N411p7703
$$ plain form
121 81434 29103 -123214 -146401 -34186 25361 -33080 -86980 -69864 -72872 -139978 -148151 -11058
133 -11058 132457 94300 -71300 -129435 -7123 111821 76966 -22655 -44910 -20618 -42396
144 -42396 -58172 27369 126539 69289 -100834 -154109 -18899 108684 68203 -45026 -63564
155 -63564 -1216 21822 -3616 6594 45195 11773 -95196 -136491 -42919 60562 37436 -51751
167 -51751 -50480 44294 87442 27312 -20073 17445 49454 -8204 -74152 -37697 48560 53163
179 53163 -11321 -15155 61530 90444 13980 -49237 194 75988 46821 -48322 -66353 7455
191 7455 48459 4579 -33497 -9723 2698 -52795 -95902 -41942 40021 25817 -64827 -96645
203 -96645 -27953 33857 7412 -53051 -65680 -51539 -70213 -93302 -50009 28817 34228 -43475
215d3475l6955P2870Q0560k6009q2801j8679M2548Q789k8877J9260O9767J6879
227G3877o8533m4232N6972P6211j7848q1247k6340M9529L6316k2449k0331K8121
239D0046K3444l7900n2110J3225N3782J018n8298k4305M8054M0588k8598m1936
251b2990J6383L5734k4540o3112j1255M8729K2956l5021k1226M0105L8668k6800
263b369m4702J7165N1140q431o7110k5804N3953N0458j7506l4366J6715L6194
275B5337j0476l7265P548M6003N782n1883k9787M4030N7597o888m8448j1769L0662
288B0443O362l4437j2482L6850K4070l5785l7736L0095N8293l177n8007k5277
300c0788K9993J6139l1208k1036L0763L1898k0258l5521J4473M5725L410m6977
$$ plain form
215 -43475 -80430 -7560 73000 46991 -35810 -54489 -11941 -3152 -32029 -12769 56998 73877
227 73877 5344 -38888 18084 94295 76447 -4800 -31140 18389 54705 32256 11925 40046
239 40046 63490 25590 -26520 -13295 40487 41505 -16793 -41098 6956 47544 18946 -22990
251 -22990 -6607 29127 4587 -58525 -69780 -21051 1905 -33116 -54342 -14237 24431 -2369
263 -2369 -47071 -29906 21234 12803 -54307 -80111 -26158 24300 6794 -27572 -10857 25337
275 25337 14861 -22404 -14856 31147 36929 -14954 -44741 -711 56886 49998 1550 -10219 20443
288 20443 26805 -7632 -20114 16736 40806 5021 -32715 -2620 55673 52496 -5511 -30788
300 -30788 -795 15344 -15864 -36900 -6137 25761 5503 -30018 -15545 30180 33590 -13387
312a3387k8685K3005K6020j5917k3714J7709L5470m032l5846n031L5640J4364
324B5596l5870l0437K3644L7451q620l0821J0020M1842M175m4144k3691L1179
336C24K8833k3202l3897J5856M1959K184l3412m798L4925J1016m0155l4388K0621
349a4134L6712o371l3062p3L4465J2662k6154j8590J7669J5695k3355l1456R870
362b6122L6020O139k8120r696K7343J7565k3888k6419J3138K4691j2210l0858
374c2417O106L9596J3270k8491j7655K2946K0491k1173k9981R466L0934J78k7944
387a4674k838L4144K0813k2830k8314Q933K4106o532k8539k926K8771J4402j9842
400D674j5156J9701K2269j5244l1680j017K4899L128k5425q728K6554J9328j8202
$$ plain form
312 -13387 -42072 -19067 6953 -8964 -32678 -14969 20501 16469 -19377 -24408 11232 25596
324 25596 -10274 -40711 -17067 20384 11764 -19057 -9037 32805 36980 -7164 -30855 324
336 324 29157 5955 -27942 -12086 29873 32057 -1355 -6153 28772 39788 -367 -34755 -14134
349 -14134 22578 16207 -16855 -16928 17537 30199 4045 -14545 3124 18819 -4536 -35992 -26122
362 -26122 9898 16037 -12083 -21779 5564 23129 -759 -27178 -14040 10651 -1559 -32417
374 -32417 -26311 13285 26555 -1936 -19591 3355 23846 2673 -27308 -17842 13092 13270 -14674
387 -14674 -17512 16632 37445 14615 -13699 -4766 19340 12808 -15731 -18657 10114 24516 4674
400 4674 -10482 9219 31488 16244 -15436 -16453 8446 11574 -13851 -22579 3975 23303 5101
413E101k3266J0762K2195r991l0535l501K6244R977k0399j0849K2209K0967j4245
426D669k5603L459K2961N62k4339p272K4325K0143j1688j7340J0874K2510m842
439A8419k6469n743K2534J1255j8738j3781J9702K4503q541k5601m3K2024J270
452B0791k6087j2774J9563J7358j2691j8225R611K1121m757k5211p852J6749P102
465D698j8021j3349J4076K0008n049j8730O19J7328K019k0516j1477J4315J4775
478F96r199j3382J0276K2496m23k0950n078J8259Q415j8821j4477J5616K2215
491A5643m356j7877M198K2012L399k1062j1893J4241J3015j1375j5626Q610K1170
504B0099J335j8139o961J4252P708j5736j6953O795J6260k184j5281O04J7242
$$ plain form
413 5101 -18165 -7403 14792 4801 -25734 -29235 -2991 6986 -13413 -24262 -2053 18914 4669
426 4669 -20934 -17475 5486 6048 -18291 -25563 -1238 18905 7217 -10123 751 23261 18419
439 18419 -8050 -13793 8741 19996 1258 -12523 7179 31682 23141 -2460 -2503 19521 20791
452 20791 -5296 -18070 1493 18851 6160 -12065 -2454 18667 13910 -11301 -19153 -2404 4698
465 4698 -13323 -26672 -12596 7412 2363 -16367 -15748 1580 3599 -16917 -28394 -14079 696
478 696 -8503 -21885 -11609 10887 10464 -10486 -15564 2695 11110 -7711 -22188 -6572 15643
491 15643 11287 -6590 -2392 19620 23019 1957 -9936 4305 17320 5945 -9681 -1071 20099
504 20099 21434 3295 -3666 10586 18294 2558 -14395 -7600 8660 6476 -8805 -8201 9041
517I041N068j7056j2862R228J0754j0055j5865N286J8775K705j4539k807J6125
530C798P967j5966j5280Q066J5686m321j5120K903J9185O376j4165q222J2041
543B948J0317j1632j6945L703J7595L215j3949n400J3893J0567j0928j5655L578
556h693J3619k939j6655k047J7246R694j1927j0251R438J1498q806j6644J742
569a4725J5190K303j3132l071J4846J1401p379j0824M358R969m262j3095k6J4779
583F332O678j0451q034J0749J3483m216j4438j661J0497J241j1599l505J3246
596H322Q675j0537j3462N122J3875k460j7015o747J0501O673q617o795R433J0259
610G227q446j6086J21J3447J903j4648q234R587J1170l110o862N083J0143k752
$$ plain form
517 9041 14109 -2947 -15809 -6581 4173 -5882 -21747 -16461 2314 5019 -9520 -12327 3798
530 3798 11765 -4201 -19481 -11415 4271 -50 -15170 -12267 6918 13294 -871 -9093 2948
543 2948 13265 1633 -15312 -11609 5986 9201 -4748 -10148 3745 14312 3384 -12271 -8693
556 -8693 4926 1987 -14668 -16715 531 10225 -1702 -11953 -2515 8983 177 -16467 -14725
569 -14725 465 2768 -10364 -13435 1411 12812 5433 -5391 -1033 8936 4674 -8421 -8447 6332
583 6332 13010 2559 -5475 5274 18757 14541 103 -1558 8939 10180 -1419 -4924 8322
596 8322 16997 6460 -7002 -1880 11995 9535 -7480 -14227 -3726 2947 -5670 -12465 -3032 7227
610 7227 -1219 -17305 -17184 -3737 -1834 -16482 -24716 -15129 -3959 -7069 -13931 -8848 1295 -1457
624a457j2493k492J1618P027q015q055P426J3488N97r008L71J1058K133j1394
638H04o094J0722J0240n218r288M887J1291j976j2519k493J0304L506j1472r702
652g008P164J2527l60j0037k589O286j4j0337n799P373O193q301j1380M054J5109
667B881M814j0295q152M078M442n412n224N376P357m701r836K799J4542O195j0267
682a403r991L779Q258j171n325L700P948j633r048p7J1720M759r771j0384L301
697e338R635R87n876M71P647K113p716n111N585N920o013j0409O55J0134L060
712E744p493k889Q681O053p304r724K181Q302m16p670j108O879K531n631k052
727c916P421N525o686j0449O53J0229N365m989n328K249L425k412k818M057M099
$$ plain form
624 -1457 -13950 -16442 -4824 2203 -5812 -13867 -6441 7047 7644 -1364 -993 10065 12198 804
638 804 -5290 5432 15672 10454 1166 6053 17344 15368 2849 356 10660 14166 2694 -7008
652 -7008 156 12683 12323 2286 -303 5983 5969 -4368 -10167 -2794 3399 -4902 -16282 -12228 2881
667 2881 7695 -2600 -10752 -6674 -2232 -7644 -12868 -7492 -135 -4836 -14672 -11873 2669 8864 -1403
682 -1403 -11394 -7615 643 -528 -5853 -2153 5795 4162 -4886 -4963 6757 11516 1745 -8639 -5338
697 -5338 4297 5284 -592 -121 7526 9639 1923 -3188 2397 8317 2304 -8105 -7450 2684 5744
712 5744 -1749 -4638 4043 10096 2792 -6932 -4751 3551 3135 -4535 -5643 1236 3767 -1864 -3916
727 -3916 3505 9030 2344 -8105 -7452 2777 8142 3153 -2175 74 3499 1087 -1731 2326 6425
742F425o274j0388O36J2413P571o037q578P65N419l24m352N21L104l325q120J23
758a0421J1332Q127n864j0033L30P648J914n513j967M113J090n364j401P456O444
773G891l854q455o08O721K833m207l229M226M860k207m848J382N507k85o752k828
789c853M938K948m176k592N865O332l355q264p82O130K151n351m255J921K196
804a47j944q17M905N008l771r022k143P378N959m056p285o36M987J897j499J484
820B98L136k638p509k165Q072P566l043p910j202O402M071k147k520Q63n34m366
836c626j847N696O679j796o792j072O101L424l672m247Q02J683k454k713K832
851a002M900m8m358j625L739K340l302m160J533M247o84m654r20N487L094l699
$$ plain form
742 6425 151 -10237 -9601 2812 10383 4346 -4232 -3467 1952 1628 -2724 -2203 901 -2424 -10544 -10421
758 -10421 911 9038 3174 -6859 -6529 1119 3033 -2480 -4447 -334 756 -4608 -6009 1447 7891
773 7891 4037 -4418 -5026 1695 4528 321 -2908 1318 6178 3971 -877 505 6012 5727 -1025 -3853
789 -3853 1085 4033 -143 -2735 3130 9462 6107 -2157 -2939 3191 5342 -9 -4264 -2343 -147
804 -147 -2091 -2908 1997 7005 3234 -5788 -7931 -553 5406 1350 -5935 -6571 -1584 313 -1186 298
820 298 3434 796 -6713 -8878 -806 6760 3717 -4193 -5395 1007 5078 2931 411 1274 740 -3626
836 -3626 -5473 223 6902 5106 -1686 -2758 3343 6767 3095 -1152 -350 1333 -1121 -3834 -1002
851 -1002 3898 3850 -508 -2133 1606 3946 644 -3516 -1983 2264 1580 -3074 -3994 1493 4587 888
867H88m148J389K839j991l045K541N250m92n939j893N286M563k515n548j409K538
883a686J080p03J458L474M6m813k509M341N362j629o681k718L533L226k02l99
899A180J605J2l333k560L529M823j421o344k473M133M361j031k738K10J361j883
915e69l033J569M164K13m575k168M028L835j376l699k58K441m58k950q74L346
931c64K629j821k375J413K963k47l160o63K675O61l535k094L164M441n76l650
947e39m58K156M54k136j42K337L58l089k020L077M323n12m168k103J853J599j110
964a20r21J472J251k111k249K114M012O2m686l129J956K937m67j900O97J925m46
981C97k022M74L111Q58l695l172J849L454J97k135k7K338K90k177p77K256J181
$$ plain form
867 888 -3260 -1871 968 -1023 -4068 -1527 3723 3231 -2708 -4601 685 5248 2733 -2815 -4224 -1686
883 -1686 -606 -1309 149 3623 3669 -1144 -3653 688 6050 4421 -2260 -4978 -1445 1781 1579 1180
899 1180 2785 2797 -536 -3096 433 5256 3835 -2509 -4982 -849 3512 2481 -257 -47 1314 -569
915 -569 -3602 -2033 2131 2344 -2231 -4399 -371 3464 2088 -1611 -1869 572 114 -2836 -3710 -364
931 -364 2265 444 -1931 -518 2445 2198 -962 -1625 1050 1711 -1824 -3918 -754 3687 3111 -539
947 -539 -997 1159 1613 -523 -665 1672 2030 -1059 -3079 -2 4321 3809 -359 -2462 -609 990 -120
964 -120 -1041 431 1682 -429 -2678 -564 3448 3510 -1176 -4305 -2349 588 121 -1779 -1082 843 397
981 397 -1625 -1151 1960 2818 -877 -4049 -2200 1254 1451 -684 -711 1627 1917 -260 -1037 1219 2400
998B400k160k306J021K877K80j839l26J820N34k347j912J164K389o34k401k51
1014a691K475J084j896j219J537J016k301k678J386L244L40k664r38K168J618
1029A481j308j467O87J246j328k119Q17L179J113k253j863J242K198l91j937M
1045f99J363k4j626O6K432J597j837k288N37J952kj973l40J685O13j549n22J837
1063A222J462j553k532O3J895L55j800o83J680J150j315j345J076J576o57k586
1079a992m14J924J033j082j117J447J609q96j777O3J841N56k196j049J496J993
1095A439p19j312N85J530l96j955m02J664R33j691j113J089J911k32j513j7J077
1112H78j47j727n90J548J076p88j254N79J729nj518o43J029P39j451r37J245J760
$$ plain form
998 2400 240 -2066 -1045 1832 2112 273 -53 1767 2301 -46 -1958 -794 1595 961 -1440 -1691
1014 -1691 784 1868 -28 -1247 290 1306 -995 -3673 -2287 957 1297 -1367 -2305 -137 1481
1029 1481 173 -1294 -607 639 -689 -2808 -1991 1188 2301 48 -1815 -573 1625 1234 -703 -699
1045 -699 664 640 -986 -920 1512 3109 1272 -1016 -479 1473 1471 -502 -842 843 1456 -93 -615 1222
1063 1222 2684 1131 -1401 -1338 557 912 -888 -1571 109 1259 -56 -1401 -325 1251 594 -1992
1079 -1992 -2406 -482 551 -531 -1648 -201 1408 512 -1265 -1202 639 1195 -1001 -2050 -554 1439
1095 1439 720 -592 -7 1523 1127 -828 -1230 434 1367 -324 -1437 -348 1563 1331 -182 -199 878
1112 878 731 -996 -1586 -38 1038 250 -1004 -425 1304 1299 -219 -862 167 906 -545 -1482 -237 1523
1130A523m36j695J21J621N41j586j126Q41J223p70j287P87J787J94j778p06J185
1147D39Q98j170j254M35J309k28r14J28J303J99j328j036N88J078n89j197K11
1164a128J295M80j274m84J303N18j135j275M81J302q4j110K3J467N63j056p51
1181h65Q12J079q06j253L77J478K87q34m97J129P04p28j098L63J022j8j197k06
1199b51J258P44q41j066N63R80m24j352l78J234K94p71p18Q58Q85o98j116K42
1217e57R48l89j015l21J299M47q49n18O19J002m43j147o3Q58K92q61m48J018Q76
1236G48n02q05K38R47j45r64l55R28O68m26p21N32J045j49j108k73R76K91q18
1255A07n67O99R23m58q95K76R30m9j072l74N99L58k80n97M51O86j80r05m8N67
$$ plain form
1130 1523 1087 -608 -487 1134 1675 89 -1037 -196 1027 257 -1030 -243 1544 1738 -40 -746 439
1147 439 1337 167 -1087 -652 657 429 -485 -357 946 1145 -183 -1219 -631 447 -142 -1339 -1128
1164 -1128 167 647 -627 -1111 192 710 -425 -1700 -1219 83 -1 -1111 -1088 379 942 -114 -865
1181 -865 -53 1026 220 -1033 -656 822 1109 275 -222 907 1611 883 -215 148 1170 1152 -45 -251
1199 -251 1007 1751 910 -156 407 1387 963 -389 -767 467 761 -10 -728 130 1015 317 -799 -557
1217 -557 391 2 -1013 -1334 -35 412 -437 -955 -336 666 223 -924 -987 -129 163 -698 -1146 -128 748
1236 748 246 -559 -321 626 481 -483 -838 90 758 332 -389 143 1188 1039 -69 -342 634 925 107
1255 107 -460 239 1162 704 -191 85 1015 966 -106 -480 119 477 197 -400 51 737 557 -348 -396 171
1275A71J61o80m89N41P18l34n85R6R72J02q41m45N20O34n95q43N79R42j17o83
1295a76j01P83Q1p64n68O85N35j88q09K84P79K30o66m13N68L04n02o22L06P10
1315D56%o13j88Q02J97m79n24L13M89k77o36J44Q01K75p08k12M37K98n47n21L63
1336a30N17m1o54K06M45L21n93m02K98M68j97n55j05N67K63o54j07N09M72m01
1356B27o12q1P19M2m71j34M87M06m66l85L13L26k25p49J84N44J75m40j55L91M83
1377E79m28l59R9M06j34n58J07L52L81l05m22M37L65j99n32n2M71J69m63j53M63
1398B24R4l7m58K04K87n5n02j43L56N13m16l05K30K66m4m40P4J54J89n34o7M08
1420bM84k40m39O6K47K28k86l39K60L7k23N2L03K76q3m99j47L00L76m01l26K43
$$ plain form
1275 171 332 -348 -837 -296 422 88 -497 -401 571 673 -168 -613 -93 541 -54 -897 -318 624 507 -176
1295 -176 -277 506 587 -177 -745 -60 475 287 -522 -238 541 771 105 -308 260 564 62 -560 -254 456
1315 456 456 -157 -345 457 654 175 -349 -36 453 176 -460 -316 485 760 52 -160 277 575 28 -493 -130
1336 -130 387 346 -308 -102 343 664 71 -331 -33 435 238 -317 -422 145 408 -246 -353 156 628 227
1356 227 -385 -466 253 295 -176 -310 177 583 117 -268 45 371 146 -603 -419 125 300 -140 -295 96 579
1377 579 151 -208 -109 297 163 -395 -288 64 445 140 -282 155 520 321 -211 -263 208 377 -86 -239 224
1398 224 318 281 -177 27 314 259 -243 -386 -30 483 67 -238 -8 258 214 -226 -152 2 191 -343 -410 -2
1420 -2 482 242 -197 -131 116 344 58 -281 -21 16 -207 -155 148 424 341 -158 -305 -5 371 -30 -356 -113
1442a13L28j47k38K42L20M1m72k36L63L03k37k82K0M43r5j31p0K53k3k77m46K77
1464a77L96j31l03rL79P9k85l64K92R3j15j70l7M35K3k88Q2K14J89m83j89J72
1486a97M19J9l85k55M56J01l5j32J19K8l2k82K52J83J8k05k20J70K42k7k74k3
1508f0N3k8j92L20J03J95m03k15J63L08J42l69p6M3M2l7j40R1J03k4l33J17J20
1531g7J27j86q8P7J58j17k00K66J56r1k05J19J25Q0j33j23KL12o3o5q4J94o1q9
1555C4k13k2L07j3m4j0J93p4k42j37L72O6j00m24J02K81k1M1k40K06M8j57j35
1578a82J19K28k04k63M7K42J51J4j47O3l9J10k23R3J68ll16P8J00J46o7j40q9
1601a14J62L1j23R6J20q3J9k77K32K35j23j85q0J25J6p7n5M9Q6k8j57J8J76ml7
$$ plain form
1442 -113 215 68 -170 72 392 433 -39 -275 88 391 154 -128 -108 335 240 109 39 292 269 -8 -454 -177
1464 -177 219 88 -215 -224 155 234 -51 -415 -123 -30 -145 -315 -352 83 106 -182 -100 114 303 -180 -369 -197
1486 -197 222 241 -144 -399 57 158 123 -9 110 138 106 -176 76 259 277 72 -148 22 264 237 -37 -60
1508 -60 -7 -35 -227 93 196 391 -12 -227 -64 244 386 17 -59 -16 26 -11 -151 -60 43 19 -314 -197 -77
1531 -77 50 -136 -224 -147 11 -106 -306 -40 116 25 -180 -61 64 144 11 -112 -110 202 139 74 -10 184 123 34
1555 34 -179 -201 106 93 49 39 232 158 -84 -221 151 217 117 -307 -205 76 55 96 -144 62 110 -47 -182
1578 -182 -63 165 -39 -302 -255 -13 138 152 5 68 29 139 -84 9 177 174 -142 -64 36 182 115 -25 -114
1601 -114 48 79 -44 52 172 89 108 -169 63 298 175 -10 -90 35 51 -26 -81 -32 54 26 -131 -113 63 59 22
1626B2k49J23R0j39j23K13K81l6l09j30K24J38k2j91l5J40n8j06K65J32j18k22
1648a10j03N5K19Q2o6o3O6j2j40J87k4J03k27j25K7L08j11j23M4O2J09k73J07
1671hO1K1o7k97O8K29J17j47j26K83p4Pj63j0P5l1R9j53O2M5J8o0J34m7k2j47
1697a33j4K39J06k67j32P7J87M0j60J54o1L5j67RJ50J48k16o7l0K20J5j70J1J06
1721H0K9k19j9K81ol3k07o5J78Lq4j35K21m3m5Ok8J79N4l42k5K16J00n0j00K5
1747b9P1j18J44q5J08O7k76j08J95J10p7j80J17J20j40M8l0R8P6j66j88J09R1
1770d3J07p2p5RJ33Lk05J24Q7L4k70o4L07Q5r6p3J07%j38L1m5J54Jj66O7l0K41
1797B13n4l7r0M3K9j72J06mJ09j68NQ8L0n9o1k11J77J74k59l7R5J70j65j27J30
$$ plain form
1626 22 -227 -104 -14 -153 -276 -63 218 182 -127 -257 -33 105 83 -108 -143 -3 -61 -167 98 230 112 -110
1648 -110 -213 -158 61 143 77 14 80 68 -72 115 91 194 -33 -158 -131 177 66 -57 -13 49 158 -115 -8
1671 -8 53 74 7 -290 -222 7 124 -23 -149 134 60 67 -96 -106 -31 -62 37 -116 -54 -9 9 -51 83 36 14 -133
1697 -133 -147 92 198 -69 -201 -124 63 103 -57 97 36 71 -96 -87 63 211 -5 -72 -102 118 133 -37 -26 80
1721 80 109 -110 -129 152 146 113 -94 -159 19 22 -62 -197 24 -19 -64 -58 -86 93 147 -195 -220 -4 96 46 -54 -29
1747 -29 42 -76 68 -17 91 158 -118 -226 -31 79 2 -178 -61 59 -81 -33 -63 35 111 -55 -243 -134 -43
1770 -43 64 -8 -83 -74 59 62 -143 -19 68 102 -168 -232 75 160 64 -9 98 98 -40 -9 -54 100 101 -65 2 -28 213
1797 213 159 122 32 75 104 -68 38 34 143 -25 -20 68 98 39 -22 -233 -56 118 -141 -178 -83 87 -78 -205 -75
1822g5R3k6j11j05J76q1N0K8J30r0J0k58J88J22n8rk63K89R5p1j33J98J29j84
1846D4j30K8J55K1J3j00o8J57k8j93nJ86j13OoQ5L5j13o6J82k9L4o2q9J43k28
1872a41J46j28J60j7n0l8j8J00Kj44J84r4p0R3j67J13J08M9n1j88J26KJq6lJ16
1898ER5j79m0J94Q6k65J26oO0mk78K09Q2P0j18p7LJ30q1j27J01L3On7j65K44N4
1925A01j69M3n1K31k09j13N9J68j36q3J39O3o0kj08j38K75O2j71lJ00j2j05N8
1949f1m7J29l8K4j50J21N0r5K0O7N6j8r4k8J16M1k18J18P0J5k5m0JJ13J30k97
1975d0Q8%k5r6J8J01J30j09j59N1Q7m2j57Q1roJn9K52k5n7k07lJ62L0r2l8K7J02
2004FK1j83N3J54Pk15O4M1R6q6r0J62j08P0%r3J13nl2l1j2J58j57rM0Q5P6k49
$$ plain form
1822 -75 18 -8 -119 -224 -48 -129 -79 -51 79 -11 -1 -259 -71 51 -7 -16 -279 10 105 34 -99 99 228 44
1846 44 -86 -58 97 118 131 31 -37 120 92 -101 -106 80 -33 -27 -33 52 87 -26 -92 90 61 95 33 -56 87 -141
1872 -141 5 -123 37 20 -30 -68 -86 14 16 -128 56 -38 -108 -15 -182 -69 39 88 37 -151 -25 -23 -22 -108 -111 5
1898 5 100 -79 -119 75 161 -104 22 16 76 72 -206 3 85 155 37 -40 -37 93 12 -115 -14 19 25 -32 -197 47 101
1925 101 -68 -25 -76 155 -54 -167 -108 60 -76 -159 -20 43 -17 -19 -127 -265 10 72 -99 -102 -2 -14 -119 -61
1949 -61 -108 21 -17 7 -143 -22 28 -67 -47 20 76 58 -36 -64 52 93 -125 -7 63 78 53 13 14 127 257 -40
1975 -40 48 48 23 -73 -55 46 176 67 -92 -41 46 4 -153 -72 -81 -87 -86 -145 107 82 25 -182 -185 -23 7 -85 -123 -96 6
2004 6 27 -156 -103 51 58 -157 -93 -52 44 -42 -132 30 -78 -8 -8 -101 12 7 -25 -56 -68 90 -67 -76 -36 49 125 -124
2032a24O4J52J6r7j2n9J33J42k19k3P6P2r8j37mK69j11q9O7K2K07l15R6N0oj66
2058i4ok6J94p6p7Q7P8k1q4p9M1J96j61j62J76Q4p1j5j78K34j57N1J8j05N2J10
2084Ij06j1R9L9k10J1J37R7m3j61Q2O1K5K2j48J31j3K8r0n2J3J52K2j37J78J5
2110A50j01M4o3MR5j79N5j22J71m8M0J0M6j26Oj8j0K4PL5j9j6rq8J4N5j4j35J1
2139a81K07o2p1l9J74mj67O2Q7k7k0q5q1K88K1j17O4j38J00o6M6J3L2Q7m9m5J4
2166D3R8%k4j23OO8l1m1p9J32p4J0k6m4J32j5m7k4l6m5MR1JMr5O8KqN1j70J04
2197f8J52k2p0Q9r0KrQ8j92J29p4r0J80J8o3o1J58l5J26k07M4K7o9Q0j75j5J76
2224B9p3J12j56R1J31j41q6J31JJ0k14M0R9K2j8q8K7Q6L7k61J05L3m9Q9k4N8p0
$$ plain form
2032 -124 -60 92 108 11 -1 -60 73 215 -4 -27 49 121 23 -114 -118 151 40 -49 18 40 247 -68 28 78 72 -94
2058 -94 -100 -126 68 -8 -85 2 80 59 -25 -104 -63 133 -28 -190 -14 70 -1 -16 -194 40 -117 -66 -48 -153 -101 9
2084 9 -97 -108 -9 30 -180 -169 -32 65 22 -139 -57 4 29 51 -97 34 21 49 -41 -93 -80 72 94 -43 135 150
2110 150 49 93 30 34 129 -50 5 -117 54 6 46 56 102 -24 -18 -36 -46 -22 -15 20 1 -15 -24 -112 -98 -43 -57 -192 -181
2139 -181 26 -36 -107 -146 28 24 -143 -81 6 -21 -41 -126 -207 81 102 -15 49 -89 11 -55 -9 4 36 123 74 29 43
2166 43 141 141 117 -6 0 68 37 -4 -83 49 -25 -15 -41 -85 47 32 -15 -39 -75 -120 -116 -25 -24 -20 -115 -47 -45 -53 -2 -172 -68
2197 -68 84 62 -8 81 -9 -7 -16 72 -120 9 -65 -155 25 43 -20 -81 77 42 168 -39 5 32 -37 43 -132 -147 29
2224 29 -44 68 -88 3 134 -7 -93 38 39 49 -165 -125 -26 -4 -22 -110 -83 3 40 -221 -116 -83 -132 -43 -67 -9 -79
2251g9P9L1p8l6O2rr3K12j51P8R1o3Q3j16kK6k2K7k02L0J76J5m3l3K1l1J49o0
2279F2q7J51qp8jo6j16K33j76J3J96K5j74M6o0N7NJ07m9j55K00p9j08J21K1n9
2305B1l3J48j27l0N8k7j7J18k47N0Q4J4j2N5qj24K9L3N5j19j0N3n2J25j05K6K1
2332b1j0k4P0o6J03j63K00j01l7N9j5M9o7O3Q2j65LJ26l8Nq0Q6k01P8J3n7N9M5
2360dm1K5j0k2Q1m5j34Q4R7kj27k0MJ33M1l5m1q1k5P8M7j2K4M3lJ2k9n1m6l1J37
2391D7mJ7N8j24m3k1J87j54J03L6j94K8O5L5j3j28LR5j3j26J63m4oJ7j2q0K33
2418A25m5n2j7l7P8j12O0p2J04N9n2j18Q7Nj3L9k5o2J38j10M3L5L8j31J00k7q0
2445d2O8m8L7j09l4N4R3j32O4j4OM8J5N6j05k6R5pr5L8j3Q1n0k7k5N6l4J3m0N8
$$ plain form
2251 -79 0 31 -47 -83 -21 -30 -123 89 -62 16 107 44 127 11 9 35 13 40 -162 -132 44 59 16 -17 4 -27 122 62
2279 62 -25 126 118 40 39 -27 -143 90 -86 -73 123 148 -26 20 -40 17 22 129 80 -75 125 46 -62 59 80 21
2305 21 -12 136 9 -21 37 10 -7 111 -136 -86 -2 12 0 55 47 -77 -48 -15 40 -79 -89 -36 -88 37 -68 -42 -21
2332 -21 -31 -55 15 -51 52 -111 89 -12 -49 10 -5 44 -23 40 122 -43 -40 86 48 53 -27 59 -142 -64 -51 -108 -49 -4
2360 -4 -45 -20 -30 -52 29 -16 -150 -66 31 29 -98 -118 -114 19 60 25 -16 -97 -122 -44 3 -9 15 58 55 67 38 -13 -59 -90 47
2391 47 43 60 118 -6 -49 -70 117 -37 66 102 -92 -64 1 36 23 -105 -102 -7 -20 -146 17 -27 -33 -16 -28 -108 125
2418 125 80 28 11 -26 52 -60 0 -72 32 91 39 -79 8 13 0 39 14 -48 90 -20 23 58 96 -35 65 38 -42
2445 -42 26 -22 15 -94 -128 -74 19 -113 -49 -63 -57 -9 6 62 -43 -69 26 19 -76 -38 -51 30 -20 -47 -72 -16 -50 -37 -77 -19
2475a9J06p9m5J29j58R5n2L3L1K3p6M2mk5j33K5P6J07j52P2rN1n5L9j3p7R2Rr4
2504f1j00J08j5M9j28J49pl7J0m1OO5j53J69J6NK2K7j23J11j53kR0L4J32j92m
2531b3Q9l7K3j46J96o9m4L8O2l2N4j97O3rO3k3PJ53k10QM9j62J64L8j59J69j73
2558a08P2J6j94K86m1q4OM2o3j3P4P6op0oOM8M4l7o6J77l9o9k10L55j28r8p7J20
2587A3J2J0R8q2q3K05j09l0Mj25J90j39O7J0q4o6J70k04J88k42K4K11k1j47J28
2612bO0j83N4r5J3J48k9J57r3j15J6K00j17K0O0j48J8J3J06j14r3J21rM3Ql4m9
2639d4N9k6o7J08n6J0N8l8p0P2o6k0K8l9J06l3l9J4j16J05M5o6J2R4Pn0RN8j73
2668a18J28l6M2N7o6Q3p2k5J8l5l0rJ17j07m4l6J42L1L2j32J07n2Q2l7r6k2M4
$$ plain form
2475 -19 87 8 -37 92 -66 29 -23 10 41 64 -12 30 26 1 -132 -107 -31 76 -76 -4 -13 38 -17 22 9 -68 24 33 -61
2504 -61 -161 -53 -68 -19 -147 2 -5 -42 -32 -73 -67 -2 -155 14 30 35 57 84 -39 72 -81 -83 7 41 173 -19 -23
2531 -23 66 29 52 -94 102 33 -11 27 89 57 111 -86 -23 -32 31 8 15 168 -42 -34 15 -147 17 55 -104 65 -108
2558 -108 -36 -20 -214 72 31 -53 -47 -5 -68 -81 -7 69 63 -7 -13 -7 41 85 48 -18 159 120 51 -159 196 68 -30 -107 13
2587 13 25 35 133 51 -32 173 64 34 38 -87 103 -36 31 41 -43 -109 61 -143 45 -197 -173 38 17 -130 -2
2612 -2 58 -125 -71 -166 -153 -5 -34 123 30 -85 -69 131 14 34 94 -54 -36 -23 83 -31 -124 -3 -12 31 39 5 -44
2639 -44 15 -11 -78 30 -26 -16 42 4 -66 6 -60 -80 -52 -91 15 -18 -57 -43 -159 -54 -9 -75 -63 31 38 -12 -3 55 -118
2668 -118 10 -26 16 73 7 90 18 -7 11 -24 -54 -63 54 -53 -97 -133 9 40 72 -60 47 -5 77 40 -56 -78 -34
2695c4J5J80r1j17M1J6Qj34J32n5MJ0P3l1Jm3R4r2n3N8k2J04n8k7L9j01J06r9
2723g6O3o9J26K1o6K3rm1n0J61r8O7ll5m8J95j49j11K8M7K1pO0j55O4O9Q5j60
2751d7jJ49n6M2m2j32R9q3J2J29n3K4o8p8P4qM2l4LK9r1N5P7o6Q3j00J74j31r
2780gN4P2j06J3n9n2L6J22l0j03O8p9R2q4N4k5J02J0j00K4M9j06J67m1R3k06J04
2807F2k33K35p1%q2J05j17Q2n6m3P8J37q8K4r2M9j2jJ5k2N4O3k2j26m2J01%j2
2835a4K7o3J30j94O1J06j08N5NK5j2j5K04k89J13j03J8K8M1k4K0j17Q7J29r2M0
2861E8jO4j68K4n9J31j64l4J10P3J2l7R9j55k7mM9q0J06p5J00j31Q0P1n8l6J00
2888D8k9K7n4m0P9N2r6K4j27J61mk5j27J32l7J15m1k3J18j62j07K0L0N9k0J12
$$ plain form
2695 -34 -19 161 70 -47 -6 10 18 -116 16 -39 -35 -25 48 17 18 -25 69 -23 -76 -18 -40 64 6 -21 18 -83 23 -76
2723 -76 -13 -82 44 65 -1 22 13 -28 -78 83 -15 52 49 14 -34 161 12 -99 -71 -24 -3 -10 50 -105 -41 28 113 -47
2751 -47 -48 101 45 87 45 -87 12 -71 -59 70 17 41 -27 -105 -31 -39 3 -31 -28 1 -90 -35 42 -24 59 -41 133 2 -7
2780 -7 47 119 13 26 -33 -85 -49 73 43 -60 8 -71 21 -63 -9 -34 68 78 -22 2 51 -55 112 71 164 -42 62
2807 62 -171 64 -7 -7 -89 16 -101 -19 -75 -118 -40 97 9 33 -59 -10 -22 -23 -8 -30 24 87 65 -61 -103 -2 -2 -14
2835 -14 13 -50 80 -114 -53 53 -55 0 5 30 18 3 207 -82 31 -72 -54 -26 15 -9 11 -106 -19 110 18 58
2861 58 57 121 -47 -23 -82 49 -115 -149 -39 34 46 9 108 -47 -74 -78 -29 -109 -3 -78 22 -109 -29 42 -16 -52 48
2888 48 19 46 -8 -48 31 83 -13 11 -116 45 41 16 -111 21 -16 99 58 35 153 -9 -116 -96 -66 -7 -27 85
2914H5j31P4K7m8M7o5J4k5m1L0L0p5O4j07R6P5m0L0j83J66J1r1J02r9J18kk1r1
2942e0M4L8p1j9M3l2J31j08J24j11O3K4j2o2M0L9j12K1m7L8O2Jj02l3J03k5O7
2969E4p2n7J68k19K7M4n2P5J07q1j2j8OK7J17q3j05J87r2q7J79j43K8l7L5L7q4
2996e1nJ08p6J93j64j7J35j01m1Q5nJ8j45K6q1K64k2k42P7O4J1K4j9oo1K8j29
3023a32O7J41j19k3O5NJ0m7o5R0m4J27j22J9p5J77l8L5M7j48m1J10o5l0Q9L9r3
3050b1k8rQ1j06kQ1J31j47J48j86J49k5l7J8j17L2L7J7j47J87m6P9j85J3PL4J32
3077I0j21j8n2J97j09J09l7k6j1l4r4J3l6M5N7PM4K4P9j99l2P7O7j59K33o9j77
3104a32R0l5J58q1j07K91k76J4O2P8k7q2P3q7Q7M0p7l6N9MM2j18l3K4mQ9oNJ2
$$ plain form
2914 85 -46 28 55 7 54 -11 3 -22 -63 -33 -3 -78 -14 -121 -25 50 10 40 -143 23 34 -57 45 -54 64 62 41 -50
2942 -50 -6 32 -39 -58 -15 -47 84 -24 100 -11 52 76 64 2 42 81 -31 -10 -57 -19 43 44 -58 -91 12 -13 54
2969 54 -18 -75 93 -126 -99 -55 -107 -32 75 -6 -18 -36 -30 -3 114 31 -74 113 21 -66 113 -30 -2 -39 -4 33 -51
2996 -51 -56 52 -24 169 5 -12 123 22 -19 66 61 79 -66 -40 -121 143 121 -121 -44 20 31 55 36 30 -31 -3 -132
3023 -132 -65 76 -43 -66 -1 4 14 -33 -98 -8 -52 75 -47 -28 -103 74 36 71 118 -30 -71 39 -26 -56 33 72 -21
3050 -21 -49 -58 23 -83 -85 -4 127 -20 128 -58 91 66 29 47 -70 -38 -1 16 -131 56 10 89 -96 -83 -76 -42 90
3077 90 -31 -49 -101 96 -13 96 59 33 22 -12 -106 -93 -129 -84 -27 -20 24 48 127 -72 -104 -27 40 -119 114 45 -132
3104 -132 -42 -77 81 0 -107 184 -92 -78 -16 62 35 -47 26 -61 26 66 -11 -47 12 16 58 -60 -93 -69 -73 16 10 15 27
3133B7j11L3nM9N6j36Q0j48R4J44p3J2J5o0Q2K4p7P0j08l9J68j12R9m4O7m0r8
3160c1m5N8Q6r2m3N9J52j47j5M8o4l4M1K7k1q9K11j10njnMQ8n8p3%O3o0N8L2P7
3191A11j05l1K0J1q4Q1K8j40J59l3m7M1k1O4j8p5q1R2M3n0J4L5j04N7L0L9m4L6
3219B8o1l8m3J52J7m0q9L3q4R1L9k2L3j1j00J14r7R3l4j61J16l0K01j68MM2Nq7
3247i7M4J24Qj68J45l3r4Q4r7J17j37J37jJ8j28P9Q0j26O8J1k3P7Qnpr8k6J23
3275H3j59l7O3pM5p7O0M7p7R1o8J7R9j44q1J13q8R8j5PL8K4l0n0P2jj34J61J6
3304F6K4m0j66K62k14j1n2N9M5Q7l6O8j18P9p3l5K1k9J34p9j4j46J40m4PJ81q1
3331C5j16J6O1N0j9q8K4j00K03j46J56l5l8m9O4Nn2M4q0lR1j5Jm7R4ol3M3r6K8
$$ plain form
3133 27 -84 -51 -56 -7 49 -87 -7 -155 -61 83 10 22 37 -23 59 83 6 76 -32 -71 97 -15 84 40 107 67 -31
3160 -31 -76 -18 68 -24 -67 -8 144 -3 -18 30 -34 -68 -27 0 -21 -110 101 -9 -14 -15 -20 -16 72 14 -59 -59 4 -56 2 34 111
3191 111 6 -25 -5 6 -78 3 31 -109 50 17 -30 11 -10 54 36 -39 -120 -28 15 -35 -21 14 -90 -33 -3 36 -8 28
3219 28 -33 -71 -114 38 55 15 -74 -41 -125 -34 5 -17 16 5 -95 19 -78 15 -19 -180 -64 -94 107 -61 -57 -15 -10 -97
3247 -97 -53 71 79 -89 56 23 -71 13 -84 33 -104 33 32 50 -78 1 81 -45 23 34 11 88 96 91 84 -14 -40 83
3275 83 -76 -113 -50 -57 -12 -89 -29 18 -59 32 -36 -19 80 -64 -145 -32 -120 -22 -37 -30 8 32 2 -48 24 23 -111 50 66
3304 66 90 50 -116 146 -68 -79 -131 -72 -27 60 24 92 -26 53 -20 -55 -34 -63 71 -8 -22 -168 -28 -72 -65 116 35
3331 35 -81 -65 -4 46 27 -61 -37 -137 66 -80 76 41 3 -46 18 23 -29 15 -65 -68 23 8 9 -38 56 50 17 60 -36 -8
3361hm6R0K9j12J08K0l5K3j7k8M1J5q1%ro1J80j88R7o1n3J74q1J11q5j24O3J03
3389F5O6k71L73k53k7P1k8J8n8M8j2P2j30Q6k2j5J6%N4J6O6r6j07p8J85k3J40
3416A56q9n1k8O7j5RJ0n5J6k1O0o5Pq1N0j6M8ql8J4K5k7rK2J1q5L4N2Q9J0j24
3447c2n5r2N5J3R9l3J69j97l1J77k6Km2J7ll9rP0k9O5j01P1o9J45j19L9r5Q4l7
3476cl1O2oj5j02N6J04m9j1J3j13MO8P1jm0J0J3o4m9J70m6j30O2j3M0r5m0M8N8
3506b9J34j18k4J00l2J11j68k3J30J1N9k17l5Q2N5j44J20L9n7K7O4j49K7K7l3
3531d3J06m5op6n3J32O9p6j19L8M6P4p5Nj6Q0j24J18o2M6op6J04j11J00m1j5J05
3559G9j37P5L8q1J08o0J39j91p6J06K0L8j15J00j51J66m7k9l2P0p3P1j58K12p4
$$ plain form
3361 -8 -54 36 65 -47 61 81 46 69 52 24 65 80 -1 -1 -10 -71 109 -79 18 -43 -96 78 -3 108 23 -101 -38 65
3389 65 131 -140 233 -20 -47 24 -4 14 -44 4 -8 64 -66 20 -2 -17 -1 -1 53 69 135 39 -68 -146 39 16 156
3416 156 67 16 -12 55 40 49 59 4 20 -1 59 -6 1 -80 -30 -46 2 -6 -44 -30 -5 -32 -41 -19 -8 -93 -59 -7 82 92 -32
3447 -32 -87 -179 -124 -111 -12 -45 124 -73 -104 73 47 49 7 24 21 -18 -27 43 14 79 -22 49 -20 125 6 45 -50 34 -3
3476 -3 -34 28 22 7 -95 -39 65 16 5 18 -95 -91 -23 48 47 7 17 30 -34 -83 87 41 -89 -27 -40 0 -95 -135 -87 -29
3506 -29 105 -13 -37 63 31 142 -26 -49 81 92 151 -66 -101 -19 36 -108 12 51 -6 21 85 -64 -37 -10 -43
3531 -43 63 18 12 -64 -117 15 84 8 -111 -73 -27 47 -28 -23 -39 41 -83 35 -27 19 13 -63 41 -70 30 -11 -26 79
3559 79 -58 17 55 -26 82 22 161 -30 -106 0 20 58 -57 43 -108 58 11 -18 -50 20 -53 18 -140 72 -2
3584bq6J49j74O0R8M6j61n4J03J8J9N9k53J49r6J57n4M1j32K19j70N6O7m1j36
3609a18J48J09k04k1J90L9j74K03j71j05J70nM1j61P4K8k3o5Q7J8r5R5p7J07j03
3634a3L4j4l9J18r6O4J7m1j4o2j05K11j19N3r0N3r0K3p8Q8Q2J6m8n8Nk9Q0K5Q0
3663E3k0L7n1Lk4p8J09QJ08j36j59J90r5L9J9kL2n6Q3j26k0N7P9m1j37N2J47o1
3691A0q9J97r5n4j4K7p5K7J45o1j2j4m9J22k13Q4K4M5MM3N2Oj33k5K0L3J5N0m4
3720B6L4j17K08j71k0j2N8Q0j34n8J99j15J99j17l9l6Nl4L3J28j76j9J19j04O1
3745bj6J46j94R4j00M4jk0J2k6J64j25P6j22K9RJ06J5M0j49j9Jl0J13m3j5O1n4
3773fJ4L2J7J0M8j52N0J69p8n6J0j38J25N4n1o4O3l8n6O4q5J01NKj53L2J27lo
$$ plain form
3584 -2 -88 61 -113 -53 45 91 -70 -124 -21 -3 16 75 -178 -29 -125 32 -22 19 -113 106 -64 -8 59 18 -118
3609 -118 30 139 -65 -86 104 143 -31 172 1 -104 66 61 102 -59 15 43 20 -45 42 60 -35 60 -17 90 -13
3634 -13 21 7 -32 86 -10 54 71 30 16 -46 -151 60 -59 -6 -96 -43 -133 -110 -188 -100 -18 -2 -50 -108 -103 -132 -52 -27 53
3663 53 33 70 19 22 -2 -80 29 37 145 9 -150 40 -55 -16 3 1 33 -23 60 -66 -86 -29 50 9 -128 -76 71 10
3691 10 -79 118 23 -31 -45 -18 -93 -66 79 18 6 -8 -57 65 -148 -64 -40 5 9 52 104 110 -23 -48 -28 5 20 70 26
3720 26 60 -57 151 -20 -40 -52 6 86 -48 -106 93 -22 177 60 21 -15 -10 -44 -11 117 -59 -78 41 -63 -2
3745 -2 -18 128 -66 28 -72 -28 -29 -49 -37 -63 101 -24 52 -70 -41 -32 74 89 129 -20 -39 -38 -68 45 2 -13 48 -6
3773 -6 8 40 57 67 115 -37 13 182 104 48 58 -80 45 99 48 -16 47 9 -47 17 -68 33 38 40 -113 -81 46 43 37
3802C7j71J73l6q0O8J31j43J12j13L3L0N9j09n0L3o1qN0J88j13O9q3KK6j32J47
3828E9o9k9N8K4K2j45N6q6J3J78j18NJ18j35o7J33r5M5m3K9j9N8k7P3r3o2J73
3855E6oj50J44j12M7P0j8k20K86j68J1J12k5l7J1K2l2P9j65J16p5%J76q7L4n2
3881A7n6O6K5rl9Q0L9o0K3o2l8o9J72j49j1P0j2J00L9n3r6Kj27J42n2ll2J59M5
3910A11k05J3O8K2L5m7J25p1O9j23OK9K7j14L4R2N0r0R4p1o0J3L1j35J37Q7l6
3937I1q0j17J07ON3J2j91J12J92k45J75n7O3j79N0M3K8r4RK5M7q7J51j64L9J9
3963Hkn5O8l6l2J67j08Nj8K1J8r9M7J29r0q6P7n6Q2M2j17R4Nj28J43Q5j93Q0K2
3992G3l3n8J0m9J53k6j06Q4j31R8p4K1J9O1j30Q5k3j38J33Q7l7p2J77k61J39K1
$$ plain form
3802 37 -134 39 3 -77 -9 122 -21 91 -22 11 41 100 -9 -59 -26 -87 -95 -45 143 30 99 16 18 44 -88 59
3828 59 -10 -39 19 43 65 -80 -24 -110 -97 81 -37 -32 86 -49 -116 17 -78 -33 -76 -47 -66 -8 -35 38 -55 -117 56
3855 56 50 -100 44 -68 -21 49 31 -189 97 -71 -60 52 27 -10 1 23 -9 70 -95 21 -54 -54 122 35 69 17
3881 17 -39 27 52 43 4 84 123 63 86 24 -14 -83 89 -60 -71 -1 -13 87 126 73 -23 -21 -148 -6 -58 -61 -93 66 111
3910 111 -94 -81 -13 9 44 -3 122 51 120 -3 3 32 59 -55 -21 71 121 31 125 54 -6 7 38 -97 40 127 91
3937 91 11 -106 1 7 60 72 -119 -7 185 -60 115 58 121 -58 -8 35 63 -31 -22 3 50 -37 114 -50 -11 8
3963 8 6 -49 19 -17 -49 118 10 15 -3 18 36 -63 -16 113 23 -63 14 -42 40 82 -35 59 64 -64 79 164 -29 51 73
3992 73 40 -18 -8 -57 96 70 -36 48 -83 15 -59 -38 -19 42 -88 -3 -26 -164 -31 56 19 -53 124 -137 2 23
4018B3j69J51J3j0KJ3L9qj80J46J08j68K4l1J23o8k1Q3j55J2R8j5QP1j03J0P4
4045G0j6M1j44J09K7j35Jo0M7K13k03N5m5j3m2J74n9m8M1j14J00J8n6J9o9O5n0
4072g4j5J60o2K7m7J0Q0k35J96J6Mk5j0J7r9J08n3jm2q9J46mpl2N4J5m1J28j04
4101B1M9n3n5R5r8K02j24o5M4K4j27J35j51J08OQk7j18K09k22L7J74o3l6P4p4
4127b7L7mj09K78j42o7n0P4N0k1q3J18r9M0M6L6K3L8j56j10K3N8OP3j8m2J7j4
4155b5J0l1P4o5K6J22j35p0Q6J9K0pj33J22oq7rj1n9N7J2O0l9L4n4P5Q8l7j14
4184g7P9k5P9j02P7m9o7NK4Q5LQ3j20J3L8j29J41o3P0k9o5m6J05o4Lj53J11N3
4212b0J47k17Q4M7n2N4p9N1j1K1j15J22j01N1J21m4r2K5J3KO3l4n1O4k6K8o9P4
$$ plain form
4018 23 -146 5 18 8 10 23 62 54 -126 20 128 -40 -16 -47 76 8 -13 70 -85 -73 25 10 18 89 -14 -4 70
4045 70 54 95 -49 60 87 -48 -47 -107 -60 153 -50 5 -40 -53 -95 79 20 -28 13 -101 -1 17 -39 -20 -89 -24 -74
4072 -74 -89 71 9 36 -11 -1 79 -156 40 56 60 35 25 42 -57 51 -2 -3 -45 -134 12 8 1 -31 23 38 -3 125 21
4101 21 70 17 -38 57 -41 161 37 -28 16 40 -87 48 -103 5 11 19 -8 -126 83 -139 -102 72 9 -27 47 -27
4127 -27 10 6 -103 175 33 -34 -84 -10 40 19 -64 54 -45 -5 41 77 100 138 -18 -128 -105 -47 -41 32 14 -28 -11 -25
4155 -25 -15 -46 28 -37 -11 111 -24 -94 -8 11 31 24 -109 13 7 -80 -89 -100 -159 -102 -90 -30 -69 -35 -89 -14 74 37 -77
4184 -77 2 -23 56 -46 31 -18 -85 -80 -56 29 32 115 -5 8 46 -83 58 -5 65 36 -29 -75 30 -34 -31 -184 -73 -20
4212 -20 127 -90 -6 41 -11 43 -36 15 4 25 -90 32 -69 -18 103 59 -33 -8 5 7 70 36 -15 49 23 51 -18 56
4240E6j71O3P9KJq6OJ6Q1l2LL0L0r6KkK3m4M5l7O7j29J00L3j54J74k37J66k5n3
4270h9k3N5qJ9j4j5J22j23m9R8R5k65J82k7M1P2m4n9O2l6K0p0j7Q3J88j60P6j9
4298I5j02J12q4l3mO6jj23L8N0j1l5nL9o3q6J73l2j2q3J13P0j23PJ34n2k15J98
4326C1P0j49P5j6k6M5q6L5N4l0O2J5o8j21O4J12j1o7q5J47k7j2R6j09J17r3m7
4353b4L1MQ3j49k1J13l9qM4k33K05r6J56r0j10LJ24p1j5K9J76j6k28O8kj1L5o6
4381a08L5j6K03q3P0j5m6Pj88K44j23q6J59J2j23M3L8LJ0P9K7j81j4R8l8j1K55
4408B51k32K2n7n9J10j4M3q9l9m1J50l2J07j32j4L9j77K07m4l2j4K4l5JR2J4N2
4435A01r0j0p6P1lp6J10n4J3k8l7J83j39n5R7O9j05P4O6p3PJ0r2J08l0j22R3m0
$$ plain form
4240 56 -115 -52 27 29 30 -56 -50 -34 47 15 18 48 78 -18 -16 -18 5 -39 6 -31 36 -93 7 40 -114 60 -177 -11 -36 -89
4270 -89 -112 -57 -65 -46 -60 -75 47 -76 -125 -27 68 -197 -15 -42 -1 71 27 -32 30 -6 14 -56 -73 10 198 38 114 95
4298 95 -7 105 21 -12 -16 50 49 -74 -36 14 3 -32 -37 2 -61 -147 26 -6 -18 -101 12 82 -41 -34 100 48 -167 31
4326 31 101 -48 27 11 -15 30 -56 -21 33 3 65 80 12 -109 -45 67 56 -11 -96 51 24 12 108 -1 116 23 -24
4353 -24 7 11 94 -55 -76 37 -2 -10 34 -199 6 -90 66 -24 -134 -131 -7 -78 -93 -64 112 96 -132 -64 -66 -77 -42 -108
4381 -108 -73 -89 114 31 101 86 40 47 -141 103 -20 -106 53 65 -58 -15 23 26 36 115 142 -39 -53 45 7 -4 251
4408 251 19 41 -16 -75 35 21 64 -25 -64 -105 45 13 120 -12 -26 13 -164 43 -1 -33 -47 -23 -58 -57 35 49 101
4435 101 11 1 -75 -4 -7 -83 27 -27 -14 -42 -79 104 -35 -90 7 76 -29 45 111 38 45 55 -37 71 41 -81 12 -28
4463b8L0Mn4JN4q6R2J36p6j37J21j95O1K6L8K9K2l4p3k1J57j14J01j07L9J42j77
4490d9n7R3m2l9r8K00m5J08lj23R0j3m1O6j30J89l2q4k9M2p1R8j0r6M8M6o9J06
4518E5K5j83J14q4J26j50N7nJ69k27O2M5O0n8j02R7p3R3k7j06R9N5J1q4qN4m9
4545c4N7p6p6J93l9j23J11J66o5q5%j0P8m2r7j8Q6O8m6j0j31R1l1J26mj51M2M5
4573B5j31N9M1r2Q9j62K05r3L8N2k1j09N0j7n0N6Q7j60K67o9j16oJ47r3KJ20j17
4600BL3n9Q4n4J71j07j56Q5L7pj34J49m3l7K6Kj09K00j29R0o1M6J0j73J56m2J1
$$ plain form
4463 -28 2 6 -48 -47 7 -79 13 149 73 -64 57 -138 -77 -51 -13 16 38 4 -69 -90 67 -47 54 -53 -14 128 -49
4490 -49 -106 -13 -55 -94 -192 8 -37 71 68 -55 35 22 -19 47 -83 106 74 -10 -39 3 -68 30 20 -76 -28 18 -51 55
4518 55 80 -103 11 -73 53 -97 -40 -45 124 -103 -41 4 64 6 -96 1 -72 21 -6 -112 -13 42 53 -31 -39 15 -34
4545 -34 23 -53 -129 64 25 -98 13 179 114 29 29 19 97 55 -42 -60 26 94 48 38 -93 -2 -33 93 89 -62 -20 25
4573 25 -106 -47 -6 -98 -9 -171 34 -59 -21 31 10 -99 -49 -66 -116 -60 27 -133 134 65 -51 -57 90 -3 -1 119 2
4600 2 35 -24 60 6 177 70 -86 -1 36 29 -105 44 1 -36 -10 -8 -117 83 -46 44 -17 29 39 -134 22 -20 -9
$$ [...]
8191a24
##END NTUPLES=NMR FID
##END=
