##TITLE=c13 ikalashn
DE-77wk_TFA
19.12.2024
##JCAMPDX= 6.0         $$ Bruker NMR JCAMP-DX V2.0
##DATA TYPE= NMR SPECTRUM
##DATA CLASS= NTUPLES
##ORIGIN= UXNMR, Bruker Analytische Messtechnik GmbH
##OWNER= root
$$ TOPSPIN		Version 1.3
$$ 2024-12-19 13:40:12.265 +0400  Irina@DPX200
$$ Compression mode = diff/dup
##.OBSERVE FREQUENCY= 50.3282639994
##.OBSERVE NUCLEUS= ^13C
##.ACQUISITION MODE= SIMULTANEOUS
##.ACQUISITION SCHEME= undefined
##.AVERAGES= 22800
##.DIGITISER RES= 17
##SPECTROMETER/DATA SYSTEM= spect
##.PULSE SEQUENCE= zgpg
##.SOLVENT NAME= DMSO
##.SHIFT REFERENCE= INTERNAL, DMSO, 1, 234.9338
##AUDIT TRAIL= $$ (NUMBER, WHEN, WHO, WHERE, WHAT)
$$ ##TITLE= Audit trail, TOPSPIN		Version 1.3
$$ ##JCAMPDX= 5.01
$$ ##ORIGIN= Bruker BioSpin GmbH
$$ ##OWNER= Irina
$$ $$ F:/spectra/data/iren/nmr/c13zvl/1/pdata/1/auditp.txt
$$ ##AUDIT TRAIL=  $$ (NUMBER, WHEN, WHO, WHERE, VERSION, WHAT)
(   1,<2024-12-19 13:39:06.031 +0400>,<Irina>,<DPX200>,<TOPSPIN 1.3>,
      <created by zg
	started at 2024-12-18 16:19:22.828 +0400,
	POWCHK disabled, PULCHK disabled
       terminated by command 'halt'
       configuration hash MD5:
       BE 6D 3F 07 2A EA 11 49 91 17 2B D3 AF B3 58 0D
       data hash MD5: 32K
       AA 8A A8 7A D9 4E 9F 5B 0D B6 F0 5A ED 18 77 ED>)
(   2,<2024-12-19 13:39:45.671 +0400>,<Irina>,<DPX200>,<TOPSPIN 1.3>,
      <Start of raw data processing
       efp BC_mod = 2 LB = 2.5 FT_mod = 6 PKNL = 1 PHC0 = 275.7078 PHC1 = 30.384 SI = 32K 
       data hash MD5: 32K
       C8 A4 75 14 88 2A CB FE 72 82 AA 8D C6 04 C7 42>)
(   3,<2024-12-19 13:39:47.671 +0400>,<Irina>,<DPX200>,<TOPSPIN 1.3>,
      <apk 
       data hash MD5: 32K
       27 35 CC 3C FF 40 7C EC 95 CA 70 36 E6 3E 45 F6>)
(   4,<2024-12-19 13:39:49.718 +0400>,<Irina>,<DPX200>,<TOPSPIN 1.3>,
      <abs n ABSG = 5 
       data hash MD5: 32K
       39 7C A2 01 CA C9 72 FD 8D 61 4F 0B E1 81 89 E5>)
(   5,<2024-12-19 13:39:57.781 +0400>,<Irina>,<DPX200>,<TOPSPIN 1.3>,
      <pk fgphup PHC0 = 1.4 PHC1 = 0 
       data hash MD5: 32K
       5B 90 D0 D2 37 AC 87 C1 B1 C1 09 E8 B8 DF 0E 62>)
(   6,<2024-12-19 13:39:59.562 +0400>,<Irina>,<DPX200>,<TOPSPIN 1.3>,
      <abs n ABSG = 5 
       data hash MD5: 32K
       BC 43 54 0D CD BD FE CB EE F6 79 2B 8C 3D 08 E2>)
$$ ##END=
$$ 
$$ $$ hash MD5
$$ $$ 22 DE 0F 46 B1 96 80 F2 58 89 01 C1 41 7A 59 3D
##$RELAX= 
##$RELAX= 
##$RELAX= 
##$RELAX= 
##$RELAX= 
##$RELAX= 
##$RELAX= 
##$RELAX= 
##$RELAX= 
$$ Bruker specific parameters
$$ --------------------------
##$DU= <F:/spectra>
##$EXPNO= 1
##$NAME= <c13zvl>
##$PROCNO= 1
##$TYPE= <nmr>
##$USER= <iren>
##$AMP= (0..31)
100 100 100 100 100 100 100 100 100 100 100 100 100 100 100 100 100 100 
100 100 100 100 100 100 100 100 100 100 100 100 100 100 
##$ANAVPT= -1
##$AQSEQ= 0
##$AQ_mod= 1
##$AUNM= <au_zg>
##$AUTOPOS= <>
##$BF1= 50.322709
##$BF2= 200.13
##$BF3= 200.13
##$BF4= 200.13
##$BF5= 200.13
##$BF6= 200.13
##$BF7= 200.13
##$BF8= 200.13
##$BYTORDA= 1
##$CFDGTYP= 0
##$CFRGTYP= 5
##$CHEMSTR= <none>
$$ [...]
##$SW= 249.617472808154
##$SWIBOX= (0..15)
0 1 3 0 0 0 0 0 0 0 0 0 0 0 0 0 
##$SW_h= 12562.8140703518
##$TD= 32768
##$TD0= 1
##$TE= 300
##$TE2= 300
##$TE3= 300
##$TEG= 300
##$TL= (0..7)
120 120 120 120 120 120 120 120 
##$TP= (0..7)
150 150 150 150 150 150 150 150 
##$TP07= 0
##$TPNAME0= <>
##$TPNAME1= <>
##$TPNAME2= <>
##$TPNAME3= <>
##$TPNAME4= <>
##$TPNAME5= <>
##$TPNAME6= <>
##$TPNAME7= <>
##$TPOAL= (0..7)
0.5 0.5 0.5 0.5 0.5 0.5 0.5 0.5 
##$TPOFFS= (0..7)
0 0 0 0 0 0 0 0 
##$TUNHIN= 0
##$TUNHOUT= 0
##$TUNXOUT= 0
##$USERA1= <user>
##$USERA2= <user>
##$USERA3= <user>
##$USERA4= <user>
##$USERA5= <user>
##$V9= 5
##$VALIST= <valist>
##$VCLIST= <CCCCCCCCCCCCCCC>
##$VD= 0
##$VDLIST= <DDDDDDDDDDDDDDD>
##$VPLIST= <PPPPPPPPPPPPPPP>
##$VTLIST= <TTTTTTTTTTTTTTT>
##$WBST= 1024
##$WBSW= 4
##$XGAIN= (0..3)
0 0 0 0 
##$XL= 0
##$YL= 0
##$YMAX_a= 30768226
##$YMIN_a= -6663797
##$ZGOPTNS= <>
##$ZL1= 120
##$ZL2= 120
##$ZL3= 120
##$ZL4= 120
##$ABSF1= 234.9338
##$ABSF2= -14.71115
##$ABSG= 5
##$ABSL= 3
##$ALPHA= 0
##$AQORDER= 0
##$ASSFAC= 0
##$ASSFACI= 0
##$ASSFACX= 0
##$ASSWID= 0
##$AUNMP= <proc_1d>
##$AXLEFT= 0
##$AXRIGHT= 0
##$AXTYPE= 0
##$AXUNIT= <>
##$AZFE= 0.1
##$AZFW= 0.5
##$BCFW= 0
##$BC_mod= 2
##$BYTORDP= 0
##$COROFFS= 0
##$CY= -3
##$DATMOD= 1
##$DC= 0
##$DFILT= <>
##$DTYPP= 0
##$F1P= 0
##$F2P= 0
##$FCOR= 0.5
##$FTSIZE= 32768
##$FT_mod= 6
##$GAMMA= 0
##$GB= 0
##$INTBC= 1
##$INTSCL= 4.98009e-010
##$ISEN= 30
##$LB= 2.5
##$LEV0= 0
##$LPBIN= 0
##$MAXI= 7.640843
##$MC2= 0
##$MEAN= 0
##$ME_mod= 0
##$MI= 1.154659
##$NCOEF= 0
##$NC_proc= -2
##$NLEV= 6
##$NOISF1= 0
##$NOISF2= 0
##$NSP= 0
##$NTH_PI= 0
##$NZP= 0
##$OFFSET= 234.9338
##$PC= 1.4
##$PHC0= 282.196
##$PHC1= 21.60377
##$PH_mod= 1
##$PKNL= yes
##$PPARMOD= 0
##$PPDIAG= 0
##$PPIPTYP= 0
##$PPMPNUM= 100
##$PPRESOL= 1
##$PSCAL= 0
##$PSIGN= 0
##$REVERSE= no
##$SF= 50.3227228988183
##$SI= 32768
##$SIGF1= 0
##$SIGF2= 0
##$SINO= 80
##$SIOLD= 32768
##$SREGLST= <13C.CDCl3>
##$SSB= 0
##$STSI= 32768
##$STSR= 0
##$SW_p= 12562.8140703518
##$SYMM= 0
##$S_DEV= 0
##$TDeff= 32768
##$TDoff= 0
##$TI= <>
##$TILT= no
##$TM1= 0
##$TM2= 0
##$TOPLEV= 0
##$USERP1= <user>
##$USERP2= <user>
##$USERP3= <user>
##$USERP4= <user>
##$USERP5= <user>
##$WDW= 1
##$XDIM= 32768
##$YMAX_p= 302114042
##$YMIN_p= -480027
$$ End of Bruker specific parameters
$$ ---------------------------------
##NTUPLES= NMR SPECTRUM
##VAR_NAME=  FREQUENCY,     SPECTRUM/REAL,   SPECTRUM/IMAG
##SYMBOL=    X,             R,               I
##VAR_TYPE=  INDEPENDENT,   DEPENDENT,       DEPENDENT
##VAR_FORM=  AFFN,          ASDF,            ASDF
##VAR_DIM=   32768,         32768,           32768
##UNITS=     HZ,            ARBITRARY UNITS, ARBITRARY UNITS
##FACTOR=    0.383398360251222, 1,           1
##FIRST=     12562.8140703518, -273481,      10285895
##LAST=      0,             311550,          -42619788
##MIN=       0,             -480027,         0
##MAX=       12562.8140703518, 302114042,    0
$$ Real data points
##PAGE= N=1
##DATA TABLE= (X++(R..R)), XYDATA
$$ [...]
$$ plain form
10497 77797 102231 118616 131031 140473 143304 140035 139475 147705 162578 178949 190916 189353 168323
10484 168323 130819 85350 40026 4741 -16301 -29203 -42657 -58509 -73425 -89079 -108750
10473 -108750 -133604 -159752 -174331 -167598 -144201 -116557 -92207 -74958 -74608 -95404 -121234 -133386
10461 -133386 -130819 -118680 -96712 -75957 -78276 -109192 -154244 -198842 -236829 -264388 -273118 -260779
10449 -260779 -238034 -214864 -193480 -167481 -127080 -66684 10573 92191 160713 206666 233946
10438 233946 252296 263408 255188 222773 177703 132994 95111 62414 31119 7512 2870 18930
10426 18930 46980 70682 79495 73263 54172 35491 31822 34992 30894 16749 -5416 -30302 -52482
10413 -52482 -70202 -83418 -86861 -70026 -35188 -247 19374 25426 28490 26467 3566 -42339
$$ packed form
10497G7797K4434J6385J2415R442K831l269n60Q230J4873J6371J1967j563k1030
10484A68323l7504m5469m5324l5285k1042j2902j3454j5852j4916j5654j9671
10473a08750k4854k6148j4579O733K3397K7644K4350J7249L50k0796k5830j2152
10461a33386K567J2139K1968K0755k319l0916m5052m4598l7987k7559q730J2339
10449b60779K2745K3170K1384K5999M0401O0396P7257Q1618O8522M5953K7280
10438B33946J8350J1112q220l2415m5070m4709l7883l2697l1295k3607m642J6060
10426A8930K8050K3702Q813o232j9091j8681l669L170m098j4145k2165k4886k2180
10413e2482j7720j3216l443J6835L4838L4941J9621O052L064k023k2901m5905
$$ plain form
10401 -42339 -92647 -131570 -157251 -172150 -179679 -186165 -193053 -194857 -189826 -181035 -168667 -152405 -134541
10388 -134541 -118765 -102444 -81864 -61871 -52921 -58378 -69434 -69089 -45666 -3931 41174 79483
10376 79483 108192 122815 118962 96642 64206 36901 28694 39741 52708 58168 60419 63180 69541
10363 69541 81867 101696 131407 168220 200141 216032 212803 196701 176748 159208 147442 141247
10351 141247 133902 118123 92770 62272 39435 32018 28892 15237 -7977 -28133 -36816 -33364
10339 -33364 -22685 -14620 -13889 -14392 -11822 -12641 -25631 -55197 -93163 -120758 -127408 -122486 -120681 -127709
10325 -127709 -141604 -155516 -161256 -153150 -130777 -95870 -55400 -20910 -1449 1096 2703 30165
10313 30165 89070 159251 222570 275701 322912 366473 402039 426071 433894 420861 398756 384988
$$ packed form
10401d2339n0308l8923k5681j4899p529o486o888j804N031Q791J2368J6262J7864
10388a34541J5776J6321K0580J9993Q950n457j1056L45K3423M1735M5105L8309
10376G9483K8709J4623l853k2320l2436k7305q207J1047J2967N460K251K761O361
10363F9541J2326J9829K9711L6813L1921J5891l229j6102j9953j7540j1766o195
10351A41247p345j5779k5353l0498k2837p417l126j3655k3214k0156q683L452
10339c3364J0679Q065P31n03K570q19j2990k9566l7966k7595o650M922J805p028
10325a27709j3895j3912n740Q106K2373L4907M0470L4490J9461K545J607K7462
10313C0165N8905P0181O3319N3131M7211M3561L5566K4032P823j3033k2105j3768
$$ plain form
10301 384988 387583 403550 418730 424956 433051 460525 517463 599987 698153 807410 930633 1075957
10289 1075957 1249204 1448133 1657987 1855948 2007283 2065017 2006462 1860190 1674583 1480247
10279 1480247 1289236 1108294 948586 818768 718397 642270 579146 510455 428040 349073
10269 349073 296895 271566 254527 230106 195977 157125 115064 77099 54266 49046 57163 74019
10257 74019 94871 113862 128336 140343 158180 190111 232267 274156 310953 339965 353459 346334
10245 346334 320737 282134 237206 188302 135128 82234 40275 19736 24580 48798 79582 104858
10233 104858 114417 105575 85894 67007 58981 62515 70892 74538 68537 55911 40194 21776 4528
10220 4528 4371 29762 70099 112488 149449 176567 195184 207575 213378 214760 213122 206944 194267
$$ packed form
10301C84988K595J5967J5180O226Q095K7474N6938Q2524R8166J09257J23223J45324
10289A075957J73247J98929K09854J97961J51335N7734n8555j46272j85607j94336
10279A480247j91011j80942j59708j29818j00371p6127o3124o8691q2415p8967
10269C49073n2178k5329j7039k4421l4129l8852m2061l7965k2833n220Q117J6856
10257G4019K0852J8991J4474J2007J7837L1931M2156M1889L6797K9012J3494p125
10245C46334k5597l8603m4928m8904n3174n2894m1959k0539M844K4218L0784K5276
10233A04858R559q842j9681j8887q026L534Q377L646o001j2626j5717j8418j7248
10220D528j57K5391M0337M2389L6961K7118J8617J2391N803J382j638o178j2677
$$ plain form
10207 194267 175170 154621 139928 130869 118767 98468 79984 76828 89883 111642 131375 140052
10195 140052 139089 138862 144851 152134 154136 147132 131952 116571 106884 102218 103341 109526 118214 134881
10181 134881 157692 171541 170506 159582 148596 149578 158823 162301 157988 152393 150724 157594 173224
10168 173224 190935 203146 203699 187233 152350 103209 48373 -1608 -38219 -61950 -81099 -97008
10156 -97008 -102567 -97413 -83824 -53792 859 71837 131306 153958 142723 125447 126022 145987
10144 145987 171829 190024 196107 196180 204282 229131 262559 293992 323935 355057 387079 418432
10132 418432 454172 505019 571294 646241 729200 822972 920897 1011652 1095792 1178454 1259308
10121 1259308 1331849 1389334 1436446 1485989 1545851 1613278 1679437 1735945 1785884 1839189 1891494
$$ packed form
10207A94267j9097k0549j4693r059j2102k0299j8484l156J3055K1759J9733Q677
10195A40052r63k27N989P283K002p004j5180j5381r687m666J123O185Q688J6667
10181A34881K2811J3849j035j0924j0986R82R245L478m313n595j669O870J5630
10168A73224J7711J2211N53j6466l4883m9141n4836m9981l6611k3731j9149j5909
10156i7008n559N154J3589L0032N4651P0978N9469K2652j1235j7276N75J9965
10144A45987K5842J8195O083P3Q102K4849L3428L1433K9943L1122L2022L1353
10132D18432L5740N0847O6275P4947Q2959R3772R7925R0755Q4140Q2662Q0854
10121A259308P2541N7485M7112M9543N9862O7427O6159N6508M9939N3305N2305
$$ plain form
10110 1891494 1935236 1973080 2005744 2026430 2031713 2026445 2018389 2014047 2020012 2039174 2063429 2082204
10098 2082204 2100226 2131485 2177764 2232414 2289073 2341929 2384411 2413350 2437455 2464463 2495008
10087 2495008 2531290 2572337 2607363 2628149 2639832 2650377 2657726 2657121 2652087 2645883 2638212 2628921 2618331
10074 2618331 2605999 2582482 2541546 2495111 2457492 2433492 2421547 2417650 2415155 2405618 2383841 2349274
10062 2349274 2298118 2226542 2141197 2052824 1969495 1897561 1835904 1776210 1712271 1645430 1584749
10051 1584749 1540612 1507250 1464692 1409228 1354068 1302968 1249036 1189474 1125934 1058438 990774
10040 990774 932160 887078 855171 837011 832716 838540 852456 872871 895787 918953 938103 948095
10028 948095 950340 954195 970311 1008205 1077889 1188019 1327807 1460545 1553023 1593912 1584213
$$ packed form
10110A891494M3742L7844L2664K0686N283n268q056m342N965J9162K4255J8775
10098B082204J8022L1259M6279N4650N6659N2856M2482K8939K4105K7008L0545
10087B495008L6282M1047L5026K0786J1683J0545P349o05n034o204p671r291j0590
10074B618331j2332k3517m0936m6435l7619k4000j1945l897k495r537k1777l4567
10062B349274n1156p1576q5345q8373q3329p1934o1657n9694o3939o6841o0681
10051A584749m4137l3362m2558n5464n5160n1100n3932n9562o3540o7496o7664
10040I90774n8614m5082l1907j8160m295N824J3916K0415K2916K3166J9150R992
10028I48095K245L855J6116L7894O9684J10130J39788J32738R2478M0889r699
$$ plain form
10017 1584213 1535242 1461772 1371929 1269467 1158196 1048550 951180 865723 791515 732810 687729
10006 687729 648062 609789 575640 548914 531989 527052 533159 550943 582292 620923 649481 652434
9994 652434 630197 597460 571717 557902 548791 534906 509895 477148 450373 434424 417672 389022
9982 389022 347350 300533 257725 224149 202972 194532 208803 256545 317915 355513 353847 332252
9970 332252 318428 320774 332287 346405 359335 371638 390397 417607 445237 467132 487937 515957
9958 515957 551491 585410 606255 612734 612305 611720 618551 644397 693474 749034 788773 809381 828532
9945 828532 866489 925038 985172 1026718 1049882 1072859 1114486 1177030 1245719 1310207 1373342 1445387
9933 1445387 1533776 1631520 1723813 1812227 1916705 2052035 2214088 2392880 2586993 2806290
$$ packed form
10017A584213m8971p3470q9843j02462j11271j09646r7370q5457p4208n8705m5081
10006F87729l9667l8273l4149k6726j6925m937O107J7784L1349L8631K8558K953
9994F52434k2237l2737k5743j3815r111j3885k5011l2747k6775j5949j6752k8650
9982C89022m1672m6817m2808l3576k1177q440J4271M7742O1370L7598j666k1595
9970C32252j3824K346J1513J4118J2930J2303J8759K7210K7630K1895K0805K8020
9958E15957L5534L3919K0845O479m29n85O831K5846M9077N5560L9739K0608J9151
9945H28532L7957N8549O0134M1546K3164K2977M1627O2544O8689O4488O3135P2045
9933A445387Q8389R7744R2293Q8414J04478J35330J62053J78792J94113K19297
$$ plain form
9923 2806290 3069454 3390059 3769031 4202383 4686627 5221020 5803438 6429306 7107085 7862030
9913 7862030 8717192 9682785 10739267 11807020 12732904 13308304 13362692 12884834 12028478
9904 12028478 11003427 9975826 9042712 8247370 7600917 7092712 6693697 6373714 6114492
9895 6114492 5907781 5744524 5608472 5484306 5357575 5208254 5014371 4762492 4459784 4130907
9885 4130907 3804229 3511736 3278815 3105436 2974771 2871402 2783842 2706994 2644840 2603682
9875 2603682 2581031 2568818 2560216 2544340 2512538 2463865 2398942 2312853 2202886 2079669 1958424
9864 1958424 1848174 1755662 1682171 1619083 1553258 1473566 1385245 1307707 1247878 1198500 1157250
9853 1157250 1122876 1086788 1043864 995671 944145 896159 869928 876109 899219 919234 929976 930606
$$ packed form
9923B806290K63164L20605L78972M33352M84244N34393N82418O25868O77779P54945
9913G862030Q55162R65593J056482J067753R25884N75400N4388m77858q56356
9904A2028478j025051j027601r33114p95342o46453n08205l99015l19983k59222
9895F114492k06711j63257j36052j24166j26731j49321j93883k51879l02708l28877
9885D130907l26678k92493k32921j73379j30665j03369q7560p6848o2154m1158
9875B603682k2651j2213q602j5876l1802m8673o4923q6089j09967j23217j21245
9864A958424j10250r2512p3491o3088o5825p9692q8321p7538n9829m9378m1250
9853A157250l4374l6088m2924m8193n1526m7986k6231O181K3110K0015J0742O30
$$ plain form
9841 930606 923552 913867 903572 893771 884008 866864 834578 794184 764526 752555 748700 748985 762982
9828 762982 796002 838772 870779 872269 838971 781668 711305 634131 557090 490020 443247 419087
9816 419087 414979 423004 425183 415288 401915 389354 374787 353322 322466 285697 250254 214537
9804 214537 173484 131737 98474 73171 48974 29708 25691 31987 31903 21955 12907 17051 42098
9791 42098 86929 140037 184048 205124 202164 181797 151048 124074 112885 112374 113275 120746 142532
9778 142532 176529 219595 267954 313208 351636 385450 404992 392598 347643 282708 204988 120775
9766 120775 51190 18605 24099 49494 78941 106767 126241 127747 111443 92506 80271 69445
9754 69445 55988 44377 42889 51862 57079 47756 30897 14523 -112 -14073 -32089 -59495 -89482
$$ packed form
9841I30606p054r685j0295r801r763j7144l2286m0394k9658j1971l855K85J3997
9828G62982L3020M2770L2007J490l3298n7303p0363p7174p7041o7070m6773k4160
9816D19087m108Q025K179r895j3373j2561j4567k1465l0856l6769l5443l5717
9804B14537m1053m1747l3263k5303k4197j9266m017O296q4r948r048M144K5047
9791D2098M4831N3108M4011K1076k960k0367l0749k6974j1189n11R01P471K1786
9778A42532L3997M3066M8359M5254L8428L3814J9542j2394m4955o4935p7720q4213
9766A20775o9585l2585N494K5395K9447K7826J9474J506j6304j8937j2235j0826
9754F9445j3457j1611j488Q973N217r323j6859j6374j4635j3961j8016k7406k9987
$$ plain form
9741 -89482 -107054 -109326 -101612 -85125 -60959 -35825 -15173 7789 43614 93095 143012 173082
9729 173082 174139 149638 111729 79160 61748 53101 47962 54323 74102 93808 106595 119223
9717 119223 136291 155887 168037 161031 131149 83990 34988 4385 -3193 1469 10797 23939
9705 23939 39772 51251 53617 50096 40873 25584 12989 6635 -1753 -15622 -26915 -26197 -11186
9692 -11186 10233 27323 39769 52569 62879 65246 54602 28432 -5420 -31619 -48338 -66033
9680 -66033 -87327 -103358 -104830 -90658 -75172 -74005 -83574 -92461 -95846 -89793 -69634 -38123 -10559
9667 -10559 -7128 -30345 -63498 -93782 -111662 -106675 -84432 -69658 -80196 -110665 -144016 -164696
9655 -164696 -164991 -149446 -130744 -116466 -102579 -87056 -79796 -87480 -101851 -119547 -149579 -193996
$$ packed form
9741h9482j7572k272P714J6487K4166K5134K0652K2962L5825M9481M9917L0070
9729A73082J057k4501l7909l2569j7412q647n139O361J9779J9706J2787J2628
9717A19223J7068J9596J2150p006k9882m7159m9002l0603p578M662R328J3142
9705B3939J5833J1479K366l521r223j5289j2595o354q388j3869j1293P18J5011
9692a1186K1419J7090J2446J2800J0310K367j0644k6170l3852k6199j6719j7695
9680f6033k1294j6031j472J4172J5486J167r569q887l385O053K0159L1511K7564
9667a0559L431k3217l3153l0284j7880M987K2243J4774j0538l0469l3351k0680
9655a64696k95J5545J8702J4278J3887J5523P260p684j4371j7696l0032m4417
$$ plain form
9643 -193996 -241856 -281547 -304205 -305995 -289118 -256021 -209426 -151905 -85891 -20994 29187 59768
9631 59768 71198 65583 53698 47146 46340 43830 31018 5808 -26548 -56719 -76294 -82556 -77683
9618 -77683 -66461 -52867 -39561 -30126 -22471 -11514 -1678 -2147 -11691 -25609 -42473 -60445 -82424
9605 -82424 -112256 -143085 -165719 -182295 -189650 -179948 -161535 -148526 -143042 -145300 -156870 -169687 -173497
9592 -173497 -164539 -148444 -136609 -133911 -136252 -137556 -132506 -120780 -109189 -103382 -105019 -114452 -127840
9579 -127840 -135748 -134141 -125042 -111274 -98004 -88318 -83962 -82158 -74694 -56675 -35592 -25691 -29861
9566 -29861 -41317 -56066 -71422 -83557 -94252 -109458 -131178 -152014 -162034 -160122 -152101 -144568
9554 -144568 -142028 -144342 -153885 -170306 -184669 -191635 -191891 -192190 -205606 -237297 -280522 -325286 -356861
$$ packed form
9643a93996m7860l9691k2658j790J6877L3097M6595N7521O6014O4897N0181L0581
9631E9768J1430n615j1885o552q06k510j2812k5210l2356l0171j9575o262M873
9618g7683J1222J3594J3306R435P655J0957R836m69r544j3918j6864j7972k1979
9605h2424k9832l0829k2634j6576p355R702J8413J3009N484k258j1570j2817l810
9592a73497Q958J6095J1835K698k341j304N050J1726J1591N807j637r433j3388
9579a27840p908J607R099J3768J3270R686M356J804P464J8019K1083R901m170
9566b9861j1456j4749j5356j2135j0695j5206k1720k0836j0020J912Q021P533
9554a44568K540k314r543j6421j4363o966k56k99j3416l1691m3225m4764l1575
$$ plain form
9541 -356861 -360766 -339498 -312373 -294127 -281401 -265110 -243344 -216198 -183812 -150742 -116282 -73869
9529 -73869 -27265 5674 7237 -19061 -54139 -82099 -98666 -109445 -121199 -135208 -147117 -152163
9517 -152163 -148223 -139567 -135366 -141996 -161517 -187940 -206254 -208320 -199256 -184410 -164640 -140749 -116011
9504 -116011 -91010 -66899 -44712 -26041 -20512 -34213 -56194 -74569 -91512 -105892 -111922 -113068
9492 -113068 -117494 -130997 -148617 -157376 -150777 -136114 -124411 -118064 -113342 -109765 -109482 -107868 -99668 -88205
9478 -88205 -76695 -63212 -45124 -23686 879 30177 57224 70318 69482 66681 69184 73518 74799
9465 74799 69019 55573 39765 28132 23063 27473 45659 74375 101271 115735 118572 115925 109291
9452 109291 96890 77409 50480 18053 -15678 -51228 -87469 -116690 -137557 -151905 -160699 -165328
$$ packed form
9541c56861l905K1268K7125J8246J2726J6291K1766K7146L2386L3070L4460M2413
9529g3869M6604L2939J563k6298l5078k7960j6567j0779j1754j4009j1909n046
9517a52163L940Q656M201o630j9521k6423j8314k066R064J4846J9770K3891K4738
9504a16011K5001K4111K2187J8671N529j3701k1981j8375j6943j4380o030j146
9492a13068m426j3503j7620q759O599J4663J1703O347M722L577K83J614Q200J1463
9478h8205J1510J3483J8088K1438K4565K9298K7047J3094q36k801K503M334J281
9465G4799n780j3446j5808j1633n069M410J8186K8716K6896J4464K837k647o634
9452A09291j2401j9481k6929l2427l3731l5550l6241k9221k0867j4348q794m629
$$ plain form
9440 -165328 -169662 -177230 -186509 -193974 -198468 -197549 -183074 -146119 -85230 -16353 35278 63631 79115
9427 79115 86381 84076 70043 38171 -14115 -77108 -137665 -188184 -229260 -262734 -285470 -297469
9415 -297469 -300044 -292515 -274093 -247777 -222066 -204090 -194593 -191746 -194541 -202235 -214859 -231512 -248822
9402 -248822 -263276 -269856 -261134 -233465 -189737 -139833 -98729 -70819 -48890 -24735 6665 42752
9390 42752 77482 102277 108495 93962 62102 20039 -22553 -53007 -59403 -45440 -25327 -16053
9378 -16053 -31976 -66049 -91175 -91939 -75785 -54502 -35544 -18228 1905 21063 32308 35766
9366 35766 33731 26896 20222 22922 39635 62337 76521 74269 54494 19694 -13197 -16891 17830
9353 17830 73381 125609 166894 199864 220082 224112 217835 200587 162933 105241 45868 10469
$$ packed form
9440a65328m334p568r279p465m494R19J4475L6955O0889O8877N1631K8353J5484
9427G9115P266k305j4033l1872n2286o2993o0557n0519m1076l3474k2736j1999
9415b97469k575P529J8422K6316K5711J7976R497K847k795p694j2624j6653j7310
9402b48822j4454o580Q722K7669M3728M9904M1104K7910K1929K4155L1400L6087
9390D2752L4730K4795O218j4533l1860m2063m2592l0454o396J3963K0113R274
9378a6053j5923l4073k5126p64J6154K1283J8958J7316K0133J9158J1245L458
9366C5766k035o835o674K700J6713K2702J4184k252j9775l4800l2891l694L4721
9353A7830N5551N2228M1285L2970K0218M030o277j7248l7654n7692n9373l5399
$$ plain form
9341 10469 9366 34836 70057 93194 93100 78970 62836 43649 13016 -31935 -78767 -116932 -150357
9328 -150357 -178625 -186986 -163814 -117337 -70933 -44959 -47683 -67581 -83749 -88488 -81299 -54504
9316 -54504 -4190 52809 88834 87579 52819 1617 -48938 -88862 -115740 -132205 -139216 -135268
9304 -135268 -124900 -119802 -123249 -126441 -125209 -122120 -120277 -120769 -119025 -110433 -95256 -75843 -60213 -59158
9290 -59158 -76085 -107991 -148885 -188619 -216980 -224628 -204145 -160570 -111170 -71144 -41337 -12793
9278 -12793 14885 34786 45299 47407 45030 46629 58624 76726 84768 74308 59688 57004 60767
9265 60767 55236 37159 15323 -689 -6158 -3679 2756 14117 32894 54635 73979 91172 104306
9252 104306 103388 81019 42183 -4758 -50764 -89159 -120681 -148528 -168153 -168209 -150145 -132305 -127820
$$ packed form
9341A0469j103K5470L5221K3137r4j4130j6134j9187l0633m4951m6832l8165l3425
9328a50357k8268q361K3172M6477M6404K5974k724j9898j6168m739P189K6795
9316e4504N0314N6999L6025j255l4760n1202n0555l9924k6878j6465p011L948
9304a35268J0368N098l447l192J232L089J843m92J744Q592J5177J9413J5630J055
9290e9158j6927l1906m0894l9734k8361p648K0483M3575M9400M0026K9807K8544
9278a2793K7678J9901J0513K108k377J599J1995J8102Q042j0460j4620k684L763
9265F0767n531j8077k1836j6012n469K479O435J1361J8777K1741J9344J7193J3134
9252A04306r18k2369l8836m6941m6006l8395l1522k7847j9625n6J8064J7840M485
$$ plain form
9239 -127820 -128558 -118840 -101717 -94822 -104034 -117847 -124248 -120778 -117533 -123846 -129832 -125478 -117385 -108830
9225 -108830 -93199 -66307 -33067 -6133 3680 4364 10006 16150 14949 5056 -9945 -21477 -24765
9212 -24765 -21787 -17933 -18061 -22313 -31575 -45493 -55940 -61011 -65523 -66999 -61340 -53809 -50086 -44979
9198 -44979 -35338 -30763 -39779 -59855 -80067 -85835 -75607 -64823 -57718 -44131 -21100 2049 16880
9185 16880 26341 36389 49097 67309 92196 115766 131642 140109 142048 144764 153444 161536 163210
9172 163210 162690 167511 180101 195181 203482 207187 218146 233926 239727 230856 215739 198824 176277
9159 176277 146985 120580 106925 100650 92380 85949 90534 108987 141382 182714 225190 265927
9147 265927 299444 314340 308934 293250 280605 286103 309931 331618 334533 320495 297191 270483
$$ packed form
9239a27820p38R718J7123O895r212j3813o401L470L245o313n986M354Q093Q555
9225a08830J5631K6892L3240K6934R813O84N642O144j201r893j5001j1532l288
9212b4765K978L854j28m252r262j3918j0447n071m512j476N659P531L723N107
9198d4979R641M575r016k0076k0212n768J0228J0784P105J3587K3031K3149J4831
9185A6880R461J0048J2708J8212K4887K3570J5876Q467J939K716Q680Q092J674
9172A63210n20M821J2590J5080Q301L705J0959J5780N801q871j5117j6915k2547
9159A76277k9292k6405j3655o275q270o431M585J8453L2395M1332M2476M0737
9147B65927L3517J4896n406j5684j2645N498K3828K1687K915j4038k3304k6708
$$ plain form
9135 270483 248693 240861 248451 263803 273438 267507 251828 236902 229340 234081 254012 293972 350661
9122 350661 408311 451461 474255 483576 489216 495358 500753 502622 498983 492134 490093 501955 531296
9109 531296 572441 610534 636916 659413 685767 712728 736398 757767 781443 812320 852919 900688
9097 900688 942939 972688 1001328 1040726 1086970 1133995 1184676 1242381 1301158 1348635 1380389 1399497
9085 1399497 1405687 1397712 1379026 1356428 1328517 1286046 1231091 1177591 1133366 1104070 1091626 1081436
9073 1081436 1051535 988848 895626 790707 702472 654183 647155 655367 649826 630893 622106 632068
9061 632068 648291 659201 658173 647094 634772 623010 612139 606410 609224 619770 637514 663269
9049 663269 694256 727833 760152 783460 792979 787294 770294 749711 727444 705783 686280 663533
$$ packed form
9135B70483k1790p832P590J5352R635n931j5679j4926p562M741J9931L9960N6689
9122C50661N7650M3150K2794R321N640O142N395J869l639o849k041J1862K9341
9109E31296M1145L8093K6382K2497K6354K6961K3670K1369K3676L0877M0599M7769
9097I00688M2251K9749K8640L9398M6244M7025N0681N7705N8777M7477L1754J9108
9085A399497O190p975j8686k2598k7911m2471n4955n3500m4225k9296j2444j0190
9073A081436k9901o2687r3222j04919q8235m8289p028Q212n541j8933q787R962
9061F32068J6223J0910j028j1079j2322j1762j0871n729K814J0546J7744K5755
9049F63269L0987L3577L2319K3308R519n685j7000k0583k2267k1661j9503k2747
$$ plain form
9037 663533 630531 587253 540797 495168 451381 413352 382869 357519 337754 321348 301887 280526
9025 280526 267614 270978 295095 335573 367691 369759 349676 329061 318409 315822 317514 323603 335783
9012 335783 349976 355232 345221 326477 307633 291461 277606 263766 245970 225624 206124 184713
9000 184713 158810 133335 118930 119920 127808 135291 149926 181111 217924 235171 217154 168669
8988 168669 106756 50117 17697 13236 21074 32625 46044 61908 91087 137463 180008 198151
8976 198151 197904 195129 194886 191959 180347 158884 133166 110721 94906 78908 51719 15997 -14739
8963 -14739 -34093 -42575 -45320 -47862 -47059 -36884 -21301 -9949 -8224 -14090 -24515 -40893 -61795
8950 -61795 -81633 -96703 -98600 -71724 -12343 58621 113601 143637 153686 151022 144701 136157 119413
$$ packed form
9037F63533l3002m3278m6456m5629m3787l8029l0483k5350j9765j6406j9461k1361
9025B80526j2912L364K4117M0478L2118K068k0083k0615j0652k587J692O089J2180
9012C35783J4193N256j0011j8744j8844j6172j3855j3840j7796k0346j9500k1411
9000A84713k5903k5475j4405R90P888P483J4635L1185L6813J7247j8017m8485
8988A68669o1913n6639l2420m461P838J1551J3419J5864K9179M6376M2545J8143
8976A98151k47k775k43k927j1612k1463k5718k2445j5815j5998k7189l5722l0736
8963a4739j9354q482k745k542Q03J0175J5583J1352J725n866j0425j6378k0902
8950f1795j9838j5070j897K6876N9381P0964N4980L0036J0049k664o321q544j6744
$$ plain form
8937 119413 92208 61051 34906 14098 -3526 -16642 -23486 -27820 -35575 -43564 -46364 -47444 -53992
8924 -53992 -66436 -78117 -81381 -72173 -48541 -10828 40085 103816 170574 221258 247147 257419
8912 257419 257960 245926 224518 196108 154076 101782 53301 14421 -13554 -34519 -59717 -92560
8900 -92560 -123561 -144950 -157026 -160380 -156524 -145531 -119420 -71606 -11638 40873 69183 68128
8888 68128 47072 20325 -5247 -28647 -49818 -68241 -74412 -55670 -14453 38967 92001 123893
8876 123893 121653 86462 24325 -50542 -115220 -153394 -168004 -172675 -171573 -156189 -121784 -77109
8864 -77109 -34862 1741 36937 69985 92111 97218 93877 92500 90526 84334 75582 62442 41097
8851 41097 16878 -2331 -18471 -38835 -65211 -95471 -127907 -157774 -178482 -183076 -163773 -119192
$$ packed form
8937A19413k7205l1157k6145k0808j7624j3116o844m334p755p989k800j080o548
8924e3992j2444j1681l264R208K3632L7713N0913O3731O6758N0684K5889J0272
8912B57419N41j2034k1408k8410m2032n2294m8481l8880k7975k0965k5198l2843
8900i2560l1001k1389j2076l354L856J0993K6111M7814N9968N2511K8310j055
8888F8128k1056k6747k5572k3400k1171j8423o171J8742M1217N3420N3034L1892
8876A23893k240l5191o2137p4867o4678l8174j4610m671J102J5384L4405M4675
8864g7109M2247L6603L5196L3048K2126N107l341j377j974o192q752j3140k1345
8851D1097k4219j9209j6140k0364k6376l0260l2436k9867k0708m594J9303M4581
$$ plain form
8839 -119192 -59810 -5174 21559 10381 -22422 -50270 -59677 -53365 -45503 -49132 -60020 -62773 -56109
8826 -56109 -55022 -66108 -80481 -90211 -95607 -96821 -91682 -83395 -82655 -92784 -105690 -110664 -103133 -89174
8812 -89174 -79108 -77080 -77631 -73126 -63834 -59622 -69466 -87770 -97596 -88077 -57860 -12578 36446 76989
8798 76989 103756 119360 127956 133068 134245 126896 109073 87603 79155 93015 120545 143454 148004
8785 148004 136421 119371 105582 106670 129729 160133 174258 165777 142288 110783 77429 53743
8773 53743 44292 37460 26240 16229 14255 24604 48224 80302 109397 120687 111255 91297 68022
8760 68022 41878 14004 -7762 -10519 8118 35525 58209 69538 66913 48541 12343 -36363
8748 -36363 -81454 -112965 -131916 -139439 -133646 -115391 -96243 -90636 -96319 -97234 -83222 -55654 -21059
$$ packed form
8839a19192N9382N4636K6733j1178l2803k7848r407O312P862l629j0888k753O664
8826e6109J087j1086j4373r730n396j214N139Q287P40j0129j2906m974P531J3959
8812h9174J0066K028n51M505R292M212r844j8304r826R519L0217M5282M9024M0543
8798G6989K6767J5604Q596N112J177p349j7823k1470q448J3860K7530K2909M550
8785A48004j1583j7050j3789J088K3059L0404J4125q481k3489l1505l3354k3686
8773E3743r451o832j1220j0011j974J0349K3620L2078K9095J1290r432j9958k3275
8760F8022k6144k7874k1766k757J8637K7407K2684J1329k625j8372l6198m8706
8748c6363m5091l1511j8951p523N793J8255J9148N607n683r15J4012K7568L4595
$$ plain form
8735 -21059 13931 45140 77641 118784 164251 198894 212843 205996 180181 141380 104874 82411
8723 82411 73540 75539 84980 94225 97655 97835 102433 113320 128112 151618 184614 211492 215893 196676
8709 196676 165526 133731 106489 90155 95531 123011 152270 160834 146843 124087 101401 80790
8697 80790 65798 62613 73873 92090 102823 100513 92805 90600 98003 109185 116658 118733 119535 128082
8683 128082 146770 165071 171783 163190 143845 119180 89863 62948 51285 61176 87065 118716
8671 118716 150263 178469 200570 210965 208422 198708 185845 172153 158817 146465 137033 126705
8659 126705 109761 95834 94460 99586 104026 106918 105647 95420 75964 58302 56242 69682 85271
8646 85271 90855 86110 76622 69048 69763 74678 78504 84021 88723 84321 76244 79169 93267 108337
$$ packed form
8735b1059L4990L1209L2501M1143M5467L4643J3949o847k5815l8801l6506k2463
8723H2411q871J999R441R245L430J80M598J0887J4792K3506L2996K6878M401j9217
8709A96676l1150l1795k7242j6334N376K7480K9259Q564j3991k2756k2686k0611
8697H0790j4992l185J1260J8217J0733k310p708k205P403J1182P473K075Q02Q547
8683A28082J8688J8301O712q593j9345k4665k9317k6915j1663R891K5889L1651
8671A18716L1547K8206K2101J0395k543r714j2863j3692j3336j2352r432j0328
8659A26705j6944j3927j374N126M440K892j271j0227j9456j7662k060J3440J5589
8646H5271N584m745r488p574P15M915L826N517M702m402q077K925J4098J5070
$$ plain form
8632 108337 113405 95403 50691 -5408 -49141 -70152 -71782 -59417 -36311 -3422 35979 75486
8620 75486 109455 130990 130374 108721 79338 56991 49891 56219 66747 72901 77070 84671 92230
8607 92230 90736 71586 35995 -6998 -45161 -63891 -57923 -36864 -16794 -7414 -8546 -16937 -28197
8594 -28197 -36269 -34868 -23821 -11885 -6314 -5193 -4950 -2767 1400 4015 1945 -7778 -29794 -71500
8580 -71500 -132490 -194682 -237305 -251917 -236340 -193494 -139668 -97603 -76298 -64853 -47521 -24453
8568 -24453 -8164 -8786 -24310 -42240 -52780 -50577 -30551 9813 60527 99650 112664 105645 88856
8555 88856 66263 48382 48102 57863 59110 48178 32948 21383 19216 28009 42198 54306 61660
8542 61660 64713 61157 43769 14204 -14297 -31975 -34880 -28188 -24107 -32156 -49757 -65210 -67606
$$ packed form
8632A08337N068j8002m4712n6099m3733k1011j630J2365K3106L2889L9401L9507
8620G5486L3969K1535o16k1653k9383k2347p100O328J0528O154M169P601P559
8607I2230j494j9150l5591m2993l8163j8730N968K1059K0070R380j132q391j1260
8594b8197q072J401J1047J1936N571J121K43K183M167K615k070r723k2016m1706
8580g1500o0990o2192m2623j4612J5577M2846N3826M2065K1305J1445J7332K3068
8568b4453J6289o22j5524j7930j0540K203K0026M0364N0714L9123J3014p019j6789
8555H8856k2593j7881k80R761J247j0932j5230j1565k167Q793J4189J2108P354
8542F1660L053l556j7388k9565k8501j7678k905O692M081q049j7601j5453k396
$$ plain form
8529 -67606 -53050 -27358 1487 31954 60991 81787 99221 125121 157661 186471 205474 207649
8517 207649 190734 171993 169604 177635 174810 149599 106725 61676 33001 27960 36761 44918 45960
8504 45960 43958 47505 54766 58694 55488 42717 27945 21017 14401 -7608 -48128 -89994 -115303
8491 -115303 -125048 -135308 -158818 -192414 -224078 -240389 -227071 -183653 -129037 -76952 -28226 18317
8479 18317 66643 115052 144507 133492 88208 39997 12029 3498 4700 13373 32341 60584
8467 60584 87754 99646 92937 80708 74433 67632 51857 29214 2895 -22754 -42269 -54998
8455 -54998 -58777 -46117 -15804 20076 45806 56536 65187 90311 129367 156062 154581 133407
8443 133407 113159 106131 103700 96887 88149 81918 82364 93570 113924 136112 154077 166827 180348
$$ packed form
8529f7606J4556K5692K8845L0467K9037K0796J7434K5900L2540K8810J9003K175
8517B07649j6915j8741k389Q031k825k5211m2874m5049k8675n041Q801Q157J042
8504D5960k002L547P261L928l206j2771j4772o928o616k2009m0520m1866k5309
8491a15303r745j0260k3510l3596l1664j6311J3318M3418N4616N2085M8726M6543
8479A8317M8326M8409K9455j1015m5284m8211k7968q531J202Q673J8968K8243
8467F0584K7170J1892o709j2229o275o801j5775k2643k6319k5649j9515j2729
8455e4998l779J2660L0313L5880K5730J0730Q651K5124L9056K6695j481k1174
8443A33407k0248p028k431o813q738o231M46J1206K0354K2188J7965J2750J3521
$$ plain form
8430 180348 199709 221902 238965 242383 225284 194682 168898 158429 162028 168249 166861 160878 156369
8417 156369 150145 140228 131310 128660 134860 146443 152763 139387 103202 61273 34751 30057 43692
8404 43692 74706 120582 170531 209207 231302 243897 256312 275073 302047 334216 366769 397918
8392 397918 431306 477361 541294 612453 670134 697877 693925 669532 637729 605607 575139 545538
8380 545538 515453 484004 450900 416076 381389 349877 319398 283749 243225 204354 167325 129483
8368 129483 97577 87779 107749 145926 185024 215388 240652 273334 318548 367329 408267 432435
8356 432435 432981 414741 397737 401896 427845 451982 450819 425746 389972 347172 299412 251662
8344 251662 205577 159608 115649 78776 51417 33409 27821 41811 75091 114617 145311 161531
$$ packed form
8430A80348J9361K2193J7063L418j7099l0602k5784j0469L599O221j388n983m509
8417A56369o224r917q918k650O200J1583O320j3376l6185m1929k6522m694J3635
8404D3692L1014M5876M9949L8676K2095J2595J2415J8761K6974L2169L2553L1149
8392C97918L3388M6055O3933P1159N7681K7743l952k4393l1803l2122l0468k9601
8380E45538l0085l1449l3104l4824l4687l1512l0479l5649m0524l8871l7029l7842
8368A29483l1906r798J9970L8177L9098L0364K5264L2682M5214M8781M0938K4168
8356D32435N46j8240j7004M159K5949K4137j163k5073l5774m2800m7760m7750
8344B51662m6085m5969m3959l6873k7359j8008n588J3990L3280L9526L0694J6220
$$ plain form
8332 161531 168480 173435 184387 208337 239517 265602 278959 279190 276469 280955 293767 312968 337084
8319 337084 362466 382929 397141 408863 416491 413272 397029 374227 355002 342116 330206 322280
8307 322280 326481 349262 395275 455681 518969 587358 662940 736477 799475 855229 911900 971970
8295 971970 1030611 1085599 1135867 1178805 1214102 1245643 1279187 1315806 1350463 1379781 1406017 1431487
8283 1431487 1451272 1455756 1449931 1444429 1434659 1409693 1370885 1326568 1275940 1214657 1143792 1065814
8271 1065814 986091 913865 851136 794790 751119 726876 720573 728331 744511 763493 783540 797623
8259 797623 792081 761475 716100 671984 638426 614009 596435 590341 593320 594000 584693 569119 562279
8246 562279 577463 616088 669412 721104 760160 786822 805521 821728 844338 884465 941207 1005124
$$ packed form
8332A61531O949M955J0952K3950L1180K6085J3357K31k721M486J2812J9201K4116
8319C37084K5382K0463J4212J1722P628l219j6243k2802j9225j2886j1910p926
8307C22280M201K2781M6013O0406O3288O8389P5582P3537O2998N5754N6671O0070
8295I71970N8641N4988N0268M2938L5297L1541L3544L6619L4657K9318K6236K5470
8283A431487J9785M484n825n502r770k4966l8808m4317n0628o1283p0865p7978
8271A065814p9723p2226o2729n6346m3671k4243o303P758J6180J8982K0047J4083
8259G97623n542l0606m5375m4116l3558k4417j7574o094K979O80r307j5574o840
8246E62279J5184L8625N3324N1692L9056K6662J8699J6207K2610M0127N6742O3917
$$ plain form
8234 1005124 1064501 1111056 1155305 1215554 1298265 1394473 1479395 1532698 1558360 1567252 1560961 1542654
8222 1542654 1520233 1499524 1482340 1466321 1445983 1417664 1385289 1358273 1342910 1336565 1333442 1331927
8210 1331927 1332344 1336949 1352240 1380350 1415886 1454626 1494157 1530368 1564816 1606428 1662560 1735534
8198 1735534 1822736 1921244 2030316 2149232 2282037 2436226 2613722 2807809 3011663 3232432
8188 3232432 3486451 3783296 4117565 4479915 4869818 5289559 5739158 6211136 6683881 7134643
8178 7134643 7546514 7900360 8177504 8371671 8492672 8555424 8573539 8550581 8472826 8327453
8168 8327453 8115797 7845996 7527009 7172730 6798019 6410304 6022563 5655866 5318847 5007123
8158 5007123 4714345 4436297 4170671 3919064 3686788 3475659 3285500 3118707 2973416 2839868
$$ packed form
8234A005124N9377M6555M4249O0249Q2711R6208Q4922N3303K5662Q892o291j8307
8222A542654k2421k0709j7184j6019k0338k8319l2375k7016j5363o345l123j515
8210A331927M17M605J5291K8110L5536L8740L9531L6211L4448M1612N6132P2974
8198A735534Q7202R8508J09072J18916J32805J54189J77496J94087K03854K20769
8188C232432K54019K96845L34269L62350L89903M19741M49599M71978M72745M50762
8178G134643M11871L53846K77144J94167J21001O2752J8115k2958p7755j45373
8168H327453k11656k69801l18987l54279l74711l87715l87741l66697l37019l11724
8158E007123k92778k78048k65626k51607k32276k11129j90159j66793j45291j33548
$$ plain form
8148 2839868 2704745 2557102 2393864 2225998 2074962 1956821 1879845 1841723 1826582 1815967
8138 1815967 1796163 1759007 1700720 1630381 1566264 1516418 1479854 1449919 1418023 1382017 1343916
8127 1343916 1304217 1261825 1218196 1180656 1158153 1151717 1152780 1152665 1141650 1112177 1065940 1012763
8115 1012763 968506 946472 943501 944544 940167 932272 919682 897738 870877 842253 808320 766497
8103 766497 722472 691576 687166 706645 733834 754883 760818 748095 727723 716136 714256 710764
8091 710764 700306 686086 670263 661207 669188 688952 703537 696557 662825 616208 575453 548011
8079 548011 533305 524801 513803 495780 472611 455733 452240 450123 437688 426365 431754 454023
8067 454023 481755 500696 504409 494880 479063 460875 438682 408742 374455 344557 323561 315298
$$ packed form
8148B839868j35123j47643j63238j67866j51036j18141p6976l8122j5141j0615
8138A815967j9804l7156n8287p0339o4117m9846l6564k9935l1896l6006l8101
8127A343916l9699m2392m3629l7540k2503o436J063j15j1015k9473m6237n3177
8115A012763m4257k2034k971J043m377p895j2590k1944k6861k8624l3933m1823
8103G66497m4025l0896m410J9479K7189K1049N935j2723k0372j1587j880l492
8091G10764j0458j4220j5823r056P981J9764J4585o980l3732m6617m0755k7442
8079E48011j4706q504j0998j8023k3169j6878l493k117j2435j1323N389K2269
8067D54023K7732J8941L713r529j5817j8188k2193k9940l4287k9898k0996q263
$$ plain form
8055 315298 323094 339828 352987 358214 359198 358251 352453 341851 335597 342822 366676 398442 417526
8042 417526 410787 383774 354920 343341 356619 387377 418579 442199 463753 481820 489625 489798
8030 489798 489003 485957 475767 460921 445101 425694 399133 366110 333119 309539 301665 312999
8018 312999 341826 378118 407459 420787 419877 412734 407053 401601 386916 364479 353624 370300 405414
8005 405414 430743 426011 396476 367249 360374 377782 405597 425380 427887 419556 412479 406860 397081
7992 397081 383599 367477 349205 332240 318089 303075 289816 283366 282254 286262 293651 300020 305371
7979 305371 313406 322218 320338 301734 278859 269208 276048 293290 315821 338931 357539 370806 379972
7966 379972 382590 373563 353802 337036 331432 328822 327390 336393 352571 363459 369103 380308 398129
$$ packed form
8055C15298P796J6734J3159N227R84r47n798j0602o254P225K3854L1766J9084
8042D17526o739k7013k8854j1579J3278L0758L1202K3620K1554J8067P805J73
8030D89798p95l046j0190j4846j5820j9407k6561l3023l2991k3580p874J1334
8018C12999K8827L6292K9341J3328r10p143n681n452j4685k2437j0855J6676L5114
8005D05414K5329m732k9535k9227o875J7408K7815J9783K507q331p077n619r779
7992C97081j3482j6122j8272j6965j4151j5014j3259o450j112M008P389O369N351
7979C05371Q035Q812j880j8604k2875r651O840J7242K2531K3110J8608J3267R166
7966C79972K618r027j9761j6766n604k610j432R003J6178J0888N644J1205J7821
$$ plain form
7953 398129 404761 385353 348243 313824 294797 299388 336237 400573 470800 523095 546510 547003
7941 547003 541087 544030 554378 562670 570021 578905 579266 557515 512779 455514 401507 372344 375161
7928 375161 390964 402633 407077 404420 396264 385975 378609 378513 386599 401207 420388 442312 464468
7915 464468 482840 493502 495289 488563 476177 464057 455772 451242 451736 457218 463231 465968 461038 446134
7901 446134 430639 432331 456550 492480 531152 567664 597541 618081 629538 638847 651839 658028
7889 658028 648646 633270 622689 619201 621367 630448 643122 653845 670803 701708 737065 760880
7877 760880 767838 768719 774669 786883 797742 796893 787880 782136 778941 771906 755318 720208 672282 632735
7863 632735 613223 609793 613471 621680 635603 650468 655165 644014 626382 617179 618849 624909 634206
$$ packed form
7953C98129O632j9408l7110l4419j9027M591L6849O4336P0227N2295K3415M93
7941E47003n916K943J0348Q292P351Q884L61k1751m4736n7265n4007k9163K817
7928C75161J5803J1669M444k657q156j0289p366r6Q086J4608J9181K1924K2156
7915D64468J8372J0662J787o726j2386j2120q285m530M94N482O013K737m930j4904
7901D46134j5495J692K4219L5930L8672L6512K9877K0540J1457R309J2992O189
7889F58028r382j5376j0581l488K166R081J2674J0723J6958L0905L5357K3815
7877G60880O958Q81N950J2214J0859q49r013n744l195p035j6588l5110m7926l9547
7863F32735j9512l430L678Q209J3923J4865M697j1151j7632r203J670O060R297
$$ plain form
7850 634206 654795 692660 739101 776280 795170 797185 792035 795445 814410 837767 845791 830264
7838 830264 798199 765426 751457 761092 778359 786337 780873 768950 754256 732197 700962 667089
7826 667089 641948 640564 671323 727474 792739 849583 882997 884595 856637 815131 786910 791731
7814 791731 825243 873360 930316 993664 1057935 1116028 1164439 1204461 1238060 1263975 1275985 1268759
7802 1268759 1248742 1223973 1198474 1175944 1152086 1115824 1066871 1012163 955674 899038 843863
7791 843863 795523 756494 723316 693802 669635 648363 621938 592128 572593 567930 568539 571501
7779 571501 585416 606920 613738 594324 561756 529515 499302 471697 447817 428323 422752 437938
7767 437938 460111 468961 459395 443456 432209 424177 417745 422272 445879 481095 514490 541846 561923
$$ packed form
7850F34206K0589L7865M6441L7179J8890K015n150L410J8965K3357Q024j5527
7838H30264l2065l2773j3969R635J7267P978n464j1923j4694k2059l1235l3873
7826F67089k5141j384L0759N6151O5265N6844L3414J598k7958m1506k8221M821
7814G91731L3512M8117N6956O3348O4271N8093M8411M0022L3599K5915J2010p226
7802A268759k0017k4769k5499k2530k3858l6262m8953n4708n6489n6636n5175
7791H43863m8340l9029l3178k9514k4167k1272k6425k9810j9535m663O09K962
7779E71501J3915K1504O818j9414l2568l2241l0213k7605k3880j9494n571J5186
7767D37938K2173Q850r566j5939j1247q032o432M527K3607L5216L3395K7356K0077
$$ plain form
7754 561923 574026 582640 588981 583201 557453 519408 483276 458154 448008 447640 443472 430162 412108
7741 412108 393623 379775 380577 400391 433585 472225 507062 536540 566864 592416 600508 589004
7729 589004 569374 555111 548493 543122 537147 533386 528812 519203 509596 506544 506817 505717 509378 525052
7715 525052 549567 575494 598445 616962 630195 640216 653058 671991 693312 705563 700689 682734
7703 682734 665047 667071 700699 754072 798884 812964 795362 762324 732707 718267 715104 707734
7691 707734 692093 676037 666359 665341 666971 661513 642842 617820 609213 632399 675725 718717 754812
7678 754812 784148 812377 847280 879257 886535 862657 823618 789441 771709 771673 782945 796874
7666 796874 809857 817922 811444 786838 759057 752104 778215 830947 894948 955712 1001164 1024178
$$ packed form
7754E61923J2103Q614O341n780k5748l8045l6132k5122j0146l68m168j3310j8054
7741D12108j8485j3848Q02J9814L3194L8640L4837K9478L0324K5552Q092j1504
7729E89004j9630j4263o618n371n975l761m574r609r607l052K73j100L661J5674
7715E25052K4515K5927K2951J8517J3233J0021J2842J8933K1321J2251m874j7955
7703F82734j7687K024L3628N3373M4812J4080j7602l3038k9617j4440l163p370
7691G07734j5641j6056r678j018J630n458j8671k5022q607K3186M3326M2992L6095
7678G54812K9336K8229L4903L1977P278k3878l9039l4177j7732l6J1272J3929
7666G96874J2983Q065o478k4606k7781o953K6111N2732O4001O0764M5452K3014
$$ plain form
7654 1024178 1027414 1023745 1030243 1049343 1059210 1043329 1012009 981380 954553 930964 917205 921560
7642 921560 941800 969473 1001982 1040402 1078327 1106574 1121982 1127508 1136618 1159499 1186506 1203197
7630 1203197 1212322 1222695 1232658 1238477 1237857 1228921 1214160 1199072 1190172 1191305 1196747 1196806 1188472 1174254
7616 1174254 1161216 1159343 1169543 1179175 1174236 1151367 1121796 1103973 1108898 1133292 1166013 1199002
7604 1199002 1226308 1242423 1248448 1251434 1258443 1278173 1315343 1358563 1391089 1407815 1409632 1400877
7592 1400877 1389909 1389770 1414292 1456141 1495418 1525331 1549642 1566674 1563943 1530087 1478764 1438326
7580 1438326 1418659 1409335 1405627 1414155 1431477 1443723 1444580 1444161 1455781 1481920 1517072 1556874 1598152
7567 1598152 1634974 1655926 1656675 1654240 1662740 1679617 1703278 1740024 1794409 1863220 1935841 1997127
$$ packed form
7654A024178L236l669O498J9100R867j5881l1320l0629k6827k3589j3759M355
7642I21560K0240K7673L2509L8420L7925K8247J5408N526R110K2881K7007J6691
7630A203197R125J0373R963N819o20q936j4761j5088q900J133N442N9q334j4218
7616A174254j3038j873J0200R632m939k2869k9571j7823M925K4394L2721L2989
7604A199002K7306J6115O025K986P009J9730L7170M3220L2526J6726J817q755
7592A400877j0968j39K4522M1849L9277K9913K4311J7032k731l3856n1323m0438
7580A438326j9667r324l708Q528J7322J2246Q57m19J1620K6139L5152L9802M1278
7567A598152L6822K0952P49k435Q500J6877K3661L6746N4385O8811P2621O1286
$$ plain form
7555 1997127 2037551 2061720 2082981 2114976 2163476 2229838 2312663 2402484 2488374 2559835 2606100
7544 2606100 2624308 2618268 2596750 2571940 2549750 2532791 2524484 2519037 2503683 2479534 2462345 2458483
7532 2458483 2462010 2471042 2483773 2499038 2520249 2546758 2571440 2588996 2603646 2627551 2666914 2712597
7520 2712597 2748286 2768156 2778558 2786876 2799654 2822520 2858696 2899116 2923534 2929158 2928022 2924552
7508 2924552 2915593 2899564 2883368 2875372 2876359 2880986 2884031 2881798 2874879 2869517 2874970 2898733 2938285
7495 2938285 2982333 3019226 3046897 3066593 3075226 3078032 3085374 3100987 3124005 3155540 3196488 3247775
7483 3247775 3304448 3353964 3387971 3404849 3408445 3412131 3433592 3476160 3534848 3611286 3699968 3783159
7471 3783159 3851095 3907672 3954762 3985906 3996595 3996896 4002942 4018541 4039133 4066015 4101314 4138715
$$ packed form
7555A997127M0424K4169K1261L1995M8500O6362Q2825Q9821Q5890P1461M6265
7544B606100J8208o040k1518k4810k2190j6959q307n447j5354k4149j7189l862
7532B458483L527R032J2731J5265K1211K6509K4682J7556J4650K3905L9363M5683
7520B712597L5689J9870J0402Q318J2778K2866L6176M0420K4418N624j136l470
7508B924552q959j6029j6196p996R87M627L045k233o919n362N453K3763L9552
7495B938285M4048L6893K7671J9696Q633K806P342J5613K3018L1535M0948N1287
7483C247775N6673M9516L4007J6878L596L686K1461M2568N8688P6438Q8682Q3191
7471C783159O7936N6577M7090L1144J0689L01O046J5599K0592K6882L5299L7401
$$ plain form
7459 4138715 4171575 4199226 4225019 4253012 4288693 4339085 4407938 4489578 4568470 4633900 4695158
7448 4695158 4773736 4880014 5005947 5138281 5270069 5400155 5526522 5647945 5766814 5878535
7438 5878535 5978131 6068327 6154278 6237950 6309480 6353037 6358684 6329886 6282714 6233687 6192817 6164540
7426 6164540 6147786 6132355 6106237 6069281 6029210 5992812 5964173 5947482 5944720 5951994 5967882 5996357
7414 5996357 6035938 6080110 6123080 6161292 6195428 6231036 6273167 6323262 6377924 6429037 6473900
7403 6473900 6513323 6545799 6576476 6613014 6653677 6696675 6752240 6830849 6927863 7026064 7108403
7392 7108403 7170739 7223176 7274635 7325283 7376233 7440237 7531644 7651495 7793726 7945343 8092720
7381 8092720 8239925 8402153 8584357 8772854 8951552 9123061 9300124 9487146 9684787 9902463
$$ packed form
7459D138715L2860K7651K5793K7993L5681N0392O8853Q1640P8892O5430O1258
7448D695158P8578J06278J25933J32334J31788J30086J26367J21423J18869J11721
7438E878535R9596R0196Q5951Q3672P1530M3557N647k8798m7172m9027m0870k8277
7426F164540j6754j5431k6118l6956m0071l6398k8639j6691k762P274J5888K8475
7414E996357L9581M4172M2970L8212L4136L5608M2131N0095N4662N1113M4863
7403F473900L9423L2476L0677L6538M0663M2998N5565P8609R7014R8201Q2339
7392G108403O2336N2437N1459N0648N0950O4004R1407J19851J42231J51617J47377
7381H092720J47205J62228J82204J88497J78698J71509J77063J87022J97641K17676
$$ plain form
7371 9902463 10153674 10440323 10754384 11096351 11475853 11901000 12373673 12896654 13474651 14103776
7361 14103776 14775967 15494053 16279677 17158818 18148376 19265322 20529738 21956513 23562282
7352 23562282 25375313 27415392 29679446 32151752 34794576 37538622 40290004 42927299
7344 42927299 45302587 47261051 48670362 49439193 49525329 48951941 47805615 46220484 44346745
7335 44346745 42319342 40251105 38238863 36361934 34663796 33154956 31834851 30703628
7327 30703628 29761403 29003461 28409438 27940295 27562685 27269568 27068838 26966558 26959863 27038940
7317 27038940 27191226 27410521 27706665 28100210 28610334 29248724 30022526 30935189 31984229
7308 31984229 33174290 34532636 36104509 37937127 40066595 42522490 45344258 48580377
$$ packed form
7371I902463K51211K86649L14061L41967L79502M25147M72673N22981N77997O29125
7361A4103776O72191P18086P85624Q79141R89558J116946J264416J426775J605769
7352B3562282J813031K040079K264054K472306K642824K744046K751382K637295
7344D2927299K375288J958464J409311P68831Q6136n73388j146326j585131j873739
7335D4346745k027403k068237k012242j876929j698138j508840j320105j131223
7327C0703628r42225p57942n94023m69143l77610k93117k00730j02280o695P9077
7317B7038940J52286K19295K96144L93545N10124O38390P73802R12663J049040
7308C1984229J190061J358346J571873J832618K129468K455895K821768L236119
$$ plain form
7300 48580377 52278570 56491195 61277987 66694074 72770871 79509548 86867339 94724990
7292 94724990 102866054 110974005 118638694 125389837 130754960 134326288 135838368 135221420
7284 135221420 132603822 128282632 122675176 116251043 109456847 102660583 96137285 90061698
7276 90061698 84516396 79533788 75121113 71266841 67941165 65094696 62669389 60608620
7268 60608620 58862933 57394881 56181686 55211004 54469719 53940911 53620581 53521756 53661343
7259 53661343 54048379 54684683 55581024 56760039 58254139 60100119 62326702 64949496 67988757
7250 67988757 71495503 75549129 80240783 85670535 91942423 99162086 107444419 116909766
7242 116909766 127663707 139766150 153193991 167810406 183337368 199306651 215035556
$$ packed form
7300D8580377L698193M212625M786792N416087O076797O738677P357791P857651
7292I4724990Q141064Q107951P664689O751143N365123L571328J512080o16948
7284A35221420k617598m321190n607456o424133o794196o796264o523298o075587
7276I0061698n545302m982608m412675l854272l325676k846469k425307k060769
7268F0608620j745687j468052j213195r70682p41285n28808l20330r8825J39587
7259E3661343L87036O36304Q96341J179015J494100J845980K226583K622794L039261
7250F7988757L506746M053626M691654N429752O271888P219663Q282333R465347
7242A16909766J0753941J2102443J3427841J4616415J5526962J5969283J5728905
$$ plain form
7235 215035556 229666962 242249549 251850943 257701172 259336254 256691528 250112294 240284973
7227 240284973 228102818 214503496 200330491 186254748 172766555 160190466 148699077
7220 148699077 138351422 129130683 120964422 113760629 107434327 101904818 97090965 92909976
7212 92909976 89280647 86133868 83416474 81091857 79143097 77559860 76332813 75466674
7204 75466674 74977344 74877581 75182067 75908218 77064304 78661307 80736742 83343346 86523955
7195 86523955 90323903 94820210 100111101 106298689 113497781 121837776 131452638 142471789
7187 142471789 155002418 169097268 184719676 201695928 219657985 238007046 255912671
7180 255912671 272340207 286134523 296192914 301666996 302114042 297571778 288539485 275879081
$$ packed form
7235B15035556J4631406J2582587R601394N850229J635082k644726o579234r827321
7227B40284973j2182155j3599322j4173005j4075743j3488193j2576089j1491389
7220A48699077j0347655r220739q166261p203793o326302n529509m813853m180989
7212I2909976l629329l146779k717394k324617j948760j583237j227047q66139
7204G5466674m89330r9763L04486P26151J156086J597003K075435K606604L180609
7195H6523955L799948M496307N290891O187588P199092Q339995R614862J1019151
7187A42471789J2530629J4094850J5622408J6976252J7962057J8349061J7905625
7180B55912671J6427536J3794316J0058391N474082M47046m542264r032293j2660404
$$ plain form
7172 275879081 260664762 244005894 226883616 210057374 194053087 179188689 165615071
7165 165615071 153372177 142434296 132726608 124137683 116543453 109827758 103890123 98643134
7157 98643134 94009581 89925200 86339073 83212768 80521798 78248967 76377414 74897422
7149 74897422 73811284 73126428 72850797 72990158 73544808 74522241 75953880 77885653 80353503
7140 80353503 83384989 87021928 91336208 96428522 102414664 109412964 117539320 126898476
7132 126898476 137566986 149567677 162829591 177153704 192185318 207389101 222026450
7125 222026450 235184924 245884207 253222235 256540284 255550311 250377216 241519268 229757311
7117 229757311 216023593 201247811 186229543 171576130 157708029 144876620 133181811
$$ packed form
7172B75879081j5214319j6658868j7122278j6826242j6004287j4864398j3573618
7165A65615071j2242894j0937881r707688q588925p594230o715695n937635n246989
7157I8643134m633553m084381l586127l126305k690970k272831j871553j479992
7149G4897422j086138o84856k75631J39361N54650R77433J431639J931773K467850
7140H0353503L031486L636939M314280N092314N986142O998300Q126356R359156
7132A26898476J0668510J2000691J3261914J4324113J5031614J5203783J4637349
7125B22026450J3158474J0699283P338028L318049r89973n173095q857948j1761957
7117B29757311j3733718j4775782j5018268j4653413j3868101j2831409j1694809
$$ plain form
7110 133181811 122618199 113132491 104658046 97119976 90426331 84476318 79178304 74451783
7102 74451783 70224268 66438526 63059952 60069264 57450856 55185877 53256370 51640744
7094 51640744 50309835 49241443 48432824 47888292 47603995 47579618 47828230 48363646 49198096
7085 49198096 50354400 51865789 53767643 56097112 58902686 62244844 66184110 70758516
7077 70758516 75980035 81848112 88332823 95332229 102638533 109938158 116833948 122868968
7069 122868968 127575593 130542365 131476031 130269522 127032413 122057780 115753685 108571311
7061 108571311 100949387 93264034 85797772 78747154 72233188 66304455 60949417 56122486
7053 56122486 51780003 47891955 44426569 41344804 38603426 36159795 33983132 32053801
$$ packed form
7110A33181811j0563612r485708q474445p538070o693645n950013n298014m726521
7102G4451783m227515l785742l378574k990688k618408k264979j929507j615626
7094E1640744j330909j068392q08619n44532k84297k4377K48612N35416Q34450
7085D9198096J156304J511389J901854K329469K805574L342158L939266M574406
7077G0758516N221519N868077O484711O999406P306304P299625O895790O035020
7069A22868968M706625K966772R33666j206509l237109m974633o304095p182374
7061A08571311p621924p685353p466262p050618o513966n928733n355038m826931
7053E6122486m342483l888048l465386l081765k741378k443631k176663j929331
$$ plain form
7045 32053801 30352721 28855374 27532065 26355104 25311530 24399014 23610277 22937024 22375010
7036 22375010 21914724 21543465 21262796 21093386 21054440 21146370 21358259 21687277 22147314 22759659
7026 22759659 23548424 24536291 25736426 27157515 28807511 30685517 32766386 34988892
7018 34988892 37266545 39500665 41575107 43351888 44676461 45408796 45463505 44825183 43542071
7009 43542071 41716987 39491700 37020383 34446321 31882088 29406206 27072848 24904281
7001 24904281 22904794 21076884 19416979 17919592 16576788 15380024 14319022 13370989
6993 13370989 12504745 11702146 10968791 10315351 9735595 9213691 8737570 8300838 7894674
6984 7894674 7509062 7145854 6816065 6521790 6253115 6005381 5778177 5558780 5333738 5110205
$$ packed form
7045C2053801j701080j497347j323309j176961j043574r12516p88737o73253n62014
7036B2375010m60286l71259k80669j69410l8946R1930K11889L29018M60037O12345
7026B2759659P88765R87867J200135J421089J649996J878006K080869K222506
7018C4988892K277653K234120K074442J776781J324573P32335N4709o38322j283112
7009D3542071j825084k225287k471317k574062k564233k475882k333358k168567
7001B4904281j999487j827910j659905j497387j342804j196764j061002r48033
6993A3370989q66244q02599p33355o53440n79756n21904m76121m36732m06164
6984G894674l85612l63208l29789k94275k68675k47734k27204k19397k25042k23533
$$ plain form
6974 5110205 4907518 4736404 4593801 4469523 4356550 4253837 4163113 4083367 4003457 3909932
6964 3909932 3802189 3692837 3590960 3494440 3397877 3299204 3198085 3096593 3003078 2926502
6954 2926502 2866555 2816899 2774681 2740298 2713774 2694363 2679264 2664881 2648682 2624412 2583871
6943 2583871 2525643 2452407 2368737 2287238 2224156 2188262 2177136 2180794 2184317 2179323 2167874 2151282
6931 2151282 2123428 2080084 2030004 1986246 1956018 1939404 1930629 1920398 1900739 1871083 1832012 1782506
6919 1782506 1728255 1685330 1668994 1674771 1677788 1661937 1633300 1600694 1564915 1528372 1493635 1456432
6907 1456432 1412157 1364871 1321584 1288329 1269735 1264011 1260669 1252072 1237511 1215740 1188362 1158848
6895 1158848 1130085 1109495 1102437 1106382 1116367 1125721 1132339 1139265 1138846 1122754 1096065 1067979 1045390
$$ packed form
6974E110205k02687j71114j42603j24278j12973j02713r0724p9746p9910r3525
6964C909932j07743j09352j01877r6520r6563r8673j01119j01492r3515p6576
6954B926502n9947m9656m2218l4383k6524j9411j5099j4383j6199k4270m0541
6943B583871n8228p3236q3670q1499o3082l5894j1126L658L523m994j1449j6592
6931B151282k7854m3344n0080m3758l0228j6614q775j0231j9659k9656l9071m9506
6919A782506n4251m2925j6336N777L017j5851k8637l2606l5779l6543l4737l7203
6907A456432m4275m7286m3287l3255j8594n724l342q597j4561k1771k7378k9514
6895A158848k8763k0590p058L945R985R354O618O926m19j6092k6689k8086k2589
$$ plain form
6882 1045390 1033660 1030447 1025955 1014488 996949 980537 975571 988082 1010054 1029124 1046921 1069882
6870 1069882 1094562 1111164 1118207 1124930 1136781 1149240 1155183 1147889 1124294 1092193 1060442 1034829
6858 1034829 1018333 1005575 984976 951398 914428 885545 859971 830081 798593 769263 740745
6847 740745 716903 709744 720792 741693 770520 805604 835450 848462 844645 832096 816723 793210
6835 793210 757547 718942 690949 677986 674014 672477 676351 691055 714677 749477 801929 863345
6823 863345 916440 954565 977057 985138 981158 966841 947476 927817 905643 876704 840518 802193
6811 802193 770973 744602 714182 686413 672896 675597 690368 712295 739125 769180 798158 819748
6799 819748 832108 839026 845973 853900 859172 859876 859081 860517 859871 845861 811691 758835 697611 643224
$$ packed form
6882A045390j1730l213m492j1467j7539j6412m966J2511K1972J9070J7797K2961
6870A069882K4680J6602P043O723J1851J2459N943p294k3595l2101l1751k5613
6858A034829j6496j2758k0599l3578l6970k8883k5574k9890l1488k9330k8518
6847G40745k3842p159J1048K0901K8827L5084K9846J3012l817j2549j5373k3513
6835G93210l5663l8605k7993j2963l972j537L874J4704K3622L4800N2452O1416
6823H63345N3095L8125K2492Q081l980j4317j9365j9659k2174k8939l6186l8325
6811H02193l1220k6371l0420k7769j3517K701J4771K1927K6830L0055K8978K1590
6799H19748J2360O918O947P927N272P04p95J436o46j4010l4170n2856o1224n4387
$$ plain form
6785 643224 607181 593423 594021 594979 589517 579065 569472 567612 570440 571385 571085 567385 553520 524025
6771 524025 477554 424200 381741 360803 355859 353389 351112 357924 381911 423323 476790 528391
6759 528391 559386 562723 536438 481077 409757 344316 301690 284107 284172 296185 319251 349127
6747 349127 379249 409947 445062 482985 513686 530315 535312 535263 540551 562158 597240 624912 624527
6734 624527 597169 558830 517654 471520 422210 371835 320371 274833 247525 239383 240426 246260
6722 246260 262579 294341 334862 368728 380492 368069 342969 312280 279287 251609 230892 205901
6710 205901 163531 110070 67018 46089 45240 56166 76017 108026 149688 200627 262544 327078
6698 327078 383965 428867 463481 494187 522337 542204 546864 532157 502861 469842 443837 435884
$$ packed form
6785F43224l6043j3758N98R58n462j0452r593j860K828R45l00l700j3865k9495
6771E24025m6471n3354m2459k0938m944k470k277O812K3987M1412N3467N1601
6759E28391L0995L337k6285n5361p1320o5441m2626j7583O5J2013K3066K9876
6747C49127L0122L0698L5115L7923L0701J6629M997m9N288K1607L5082K7672l85
6734F24527k7358l8339m1176m6134m9310n0375n1464m5538k7308q142J043N834
6722B46260J6319L1762M0521L3866J1764j2423k5100l0689l2993k7678k0717k4991
6710B05901m2370n3461m3052k0929q49J0926J9851L2009M1662N0939O1917O4534
6698C27078N6887M4902L4614L0706K8150J9867M660j4707k9296l3019k6005p953
$$ plain form
6686 435884 449958 469260 465757 429400 376174 322305 271262 227093 194748 173338 164889 178207
6674 178207 220109 279003 329036 359462 376587 379917 366465 338043 298377 258387 226495 205746
6662 205746 193913 183409 171398 163175 167744 187697 217247 246861 268511 279113 281575 285434
6650 285434 301759 332681 367136 390162 397656 396244 392605 391531 394665 398493 401428 400987 391479 374937
6636 374937 357273 342408 330119 316987 295470 258635 220062 204191 218083 247455 270704 277724
6624 277724 273229 263852 253081 246734 250087 263747 280699 289090 285978 279086 280186 297327 327046
6611 327046 354996 368582 364235 342787 314281 298609 310753 346415 384710 407544 413759 410612
6599 410612 399689 383387 365981 345579 322262 306864 306661 317388 332921 350630 366396 374142
$$ packed form
6686D35884J4074J9302l503l6357n3226n3869n1043m4169l2345k1410q449J3318
6674A78207M1902N8894N0033L0426J7125L330j3452k8422l9666l9990l1892k0749
6662B05746j1833j0504j2011q223M569J9953K9550K9614K1650J0602K462L859
6650B85434J6325L0922L4455K3026P494j412l639j074L134L828K935m41r508j6542
6636C74937j7664j4865j2289j3132k1517l6835l8573j5871J3892K9372K3249P020
6624B77724m495r377j0771o347L353J3660J6952Q391l112o892J100J7141K9719
6611C27046K7950J3586m347k1448k8506j5672J2144L5662L8295K2834O215l147
6599D10612j0923j6302j7406k0402k3317j5398k03J0727J5533J7709J5766P746
$$ plain form
6587 374142 372414 362899 346871 326879 302642 269368 227572 189605 169900 165914 159022 134663
6575 134663 100677 81769 96644 140199 190698 231956 260384 278701 287701 284767 265731 233102
6563 233102 201202 181219 174907 185324 214444 256758 302827 340011 356252 347258 318995 279546
6551 279546 234397 189563 156148 139844 135344 136262 139987 140706 134366 125680 120828 121870 125933 127621
6537 127621 124632 124795 134557 142586 137803 128248 131189 154359 192504 235603 273118 297049 300047
6524 300047 280713 249393 221119 203556 192489 182353 177153 180193 185561 185391 175346 154052 121088
6511 121088 83891 61588 65956 91143 124320 154152 177022 197136 208262 197824 172958 156833
6499 156833 163284 187799 218864 247579 270321 287203 299401 308594 317191 326195 331027 329610 330497
$$ packed form
6587C74142j728r515j6028j9992k4237l3274m1796l7967j9705l986o892k4359
6575A34663l3986j8908J4875M3555N0499M1258K8428J8317R000k934j9036l2629
6563B33102l1900j9983o312J0417K9120M2314M6069L7184J6241q994k8263l9449
6551B79546m5149m4834l3415j6304m500R18L725P19o340q686m852J042M063J688
6537A27621k989J63R762Q029m783r555K941K3170L8145M3099L7515K3931K998
6524C00047j9334l1320k8274j7563j1067j0136n200L040N368j70j0045k1294l2964
6511A21088l7197k2303M368K5187L3177K9832K2870K0114J1126j0438k4866j6125
6499A56833O451K4515L1065K8715K2742J6882J2198R193Q597R004M832j417Q87
$$ plain form
6486 330497 337820 343758 346018 353522 366904 368510 342758 301815 269188 247627 224352 195569 166871
6473 166871 142890 123869 108073 96337 85047 68422 50638 41895 50186 74923 105512 136271
6461 136271 166394 191465 207820 212175 199590 168278 123262 72462 24435 -11904 -31018 -32898
6449 -32898 -24717 -11977 9384 40265 76572 118546 163307 197983 215642 225082 240236 262302
6437 262302 275644 271730 257352 239298 218931 202737 202972 219197 234243 227352 193132 146208
6425 146208 102532 67297 45262 48765 82337 130244 171460 195923 198831 177268 135131 83140
6413 83140 35464 5717 -2507 7289 30116 55282 69397 66015 50279 32266 20920 21924 35213
6400 35213 57505 86799 119301 149948 179175 212046 245057 263091 264439 267408 283648 308261
$$ packed form
6486C30497P323N938K260P504J3382J606k5752m0943l2627k1561k3275k8783k8698
6473A66871k3981j9021j5796j1736j1290j6625j7784q743Q291K4737L0589L0759
6461A36271L0123K5071J6355M355j2585l1312m5016n0800m8027l6339j9114j880
6449c2898Q181J2740K1361L0881L6307M1974M4761L4676J7659R440J5154K2066
6437B62302J3342l914j4378j8054k0367j6194K35J6225J5046o891l4220m6924
6425A46208m3676l5235k2035L503L3572M7907M1216K4463K908k1563m2137n1991
6413H3140m7676k9747q224R796K2827K5166J4115l382j5736j8013j1346J004J3289
6400C5213K2292K9294L2502L0647K9227L2871L3011J8034J348K969J6240K4613
$$ plain form
6388 308261 329136 337901 336916 334252 330958 315973 283362 246499 220188 208613 208287 213666 228446
6375 228446 254400 281124 294450 289551 276834 270771 278956 297785 319732 344075 367242 379189
6363 379189 370897 343805 315484 304354 310215 318389 317598 306196 289002 271157 254143 238107 223692
6350 223692 212823 208583 216144 237596 265566 288901 305070 317870 325452 326734 325022 319147 305406
6337 305406 286502 269341 260592 264004 278965 303874 334419 360951 372924 367533 351574 335352
6325 335352 327787 329300 334385 344810 365515 390694 406586 405195 381036 332314 273635 228224
6313 228224 207744 208778 227370 256862 287816 313917 328468 328054 319168 307234 284441 249381
6301 249381 218013 204781 207209 208221 189511 148264 98076 58367 47765 73101 128698 203506
$$ packed form
6388C08261K0875Q765r85k664l294j4985l2611l6863k6311j1575l26N379J4780
6375B28446K5954K6724J3326m899j2717o063Q185J8829K1947K4343K3167J1947
6363C79189q292k7092k8321j1130N861Q174p91j1402j7194j7845j7014j6036j4415
6350B23692j0869m240P561K1452K7970K3335J6169J2800P582J282j712n875j3741
6337C05406j8904j7161q749L412J4961K4909L0545K6532J1973n391j5959j6222
6325C35352p565J513N085J0425K0705K5179J5892j391k4159m8722n8679m5411
6313B28224k0480J034J8592K9492L0954K6101J4551m14q886j1934k2793l5060
6301B49381l1368j3232K428J012j8710m1247n0188l9709j0602K5336N5597P4808
$$ plain form
6289 203506 282425 355991 428584 513254 614868 721304 818926 898297 948789 969479 975360
6278 975360 983136 999586 1015431 1011793 988317 965012 952333 939624 916151 883811 849260 818078
6266 818078 786360 741936 681808 620559 572154 533743 496006 461993 441748 438327 446739 456134
6254 456134 455727 441874 418805 392127 361189 319563 267061 214551 175744 163151 180146 219552
6242 219552 275584 340840 396595 426913 434739 433693 434017 435336 430938 416625 391412 359325 326586
6229 326586 295377 269636 256491 260159 281067 316728 354870 375873 373178 360127 354663 364197
6217 364197 380939 396528 412427 422174 411063 380638 350410 338175 349742 383941 435607 493347
6205 493347 545158 584341 606186 609087 595672 568075 530668 489834 449179 412133 384644 369513
$$ packed form
6289B03506P8919P3566P2593Q4670J01614J06436R7622P9371N0492K0690N881
6278I75360P776J6450J5845l638k3476k3305j2679j2709k3473l2340l4551l1182
6266H18078l1718m4424o0128o1249m8405l8411l7737l4013k0245l421Q412R395
6254D56134m07j3853k3069k6678l0938m1626n2502n2510l8807j2593J6995L9406
6242B19552N6032O5256N5755L0318P826j046L24J319m398j4313k5213l2087l2739
6229C26586l1209k5741j3145L668K0908L5661L8142K1003k695j3051n464R534
6217C64197J6742J5589J5899R747j1111l0425l0228j2235J1567L4199N1666N7740
6205D93347N1811L9183K1845K901j3415k7597l7407m0834m0655l7046k7489j5131
$$ plain form
6193 369513 367878 375915 385664 394485 399073 389364 367239 351130 353536 373566 405670 442085 470067
6180 470067 478870 470525 460219 462289 483357 522854 569856 610144 636481 645300 637735 619056 591556
6167 591556 561019 537263 522662 516445 514649 508355 493704 474202 453045 433221 419814 411870
6155 411870 400964 381933 362890 364917 403922 473153 546685 600431 630274 644234 651537 662571
6143 662571 685979 720658 756607 789608 823535 863086 910137 959562 1000063 1023325 1031621 1033432
6131 1033432 1032681 1028368 1021504 1019819 1025366 1025655 1017334 1013594 1016973 1019043 1015854 1004199 987065 975526
6117 975526 965843 948573 929035 912092 891989 863015 830881 810099 810627 828185 854007 877716
6105 877716 885674 871947 842690 808377 780289 764115 760648 771175 792595 819328 842827 853711
$$ packed form
6193C69513j635Q037R749Q821M588r709k2125j6109K406K0030L2104L6415K7982
6180D70067Q803q345j0306K070K1068L9497M7002M0288K6337Q819p565j8679k7500
6167E91556l0537k3756j4601o217j796o294j4651j9502k1157j9824j3407p944
6155D11870j0906j9031j9043K027L9005O9231P3532N3746K9843J3960P303J1034
6143F62571K3408L4679L5949L3001L3927L9551M7051M9425M0501K3262Q296J811
6131A033432p51m313o864j685N547K89q321l740L379K070l189j1655j7134j1539
6117I75526r683j7270j9538j6943k0103k8974l2134k0782N28J7558K5822K3709
6105H77716P958j3727k9257l4313k8088j6174l467J0527K1420K6733K3499J0884
$$ plain form
6093 853711 858133 871774 901764 942777 979145 998532 994334 962073 910492 862992 839604 837700
6081 837700 842351 844835 841636 832044 817394 799876 786072 782218 786657 792822 793105 782562 761664
6068 761664 732927 698358 664543 642959 640852 652177 663854 672369 683086 694070 698495 698757 704765
6055 704765 719579 737492 756933 781012 810023 841143 873135 909688 952831 997740 1036513 1067017
6043 1067017 1095865 1129412 1164966 1192939 1201659 1182286 1135249 1074667 1017429 967776 922657 883852
6031 883852 854710 834511 822883 811634 785591 742517 700166 679307 680991 685791 676779 657069
6019 657069 645761 653353 668893 674417 662798 641472 618657 592864 558411 516211 481534 477974
6007 477974 509351 551702 586558 616993 646113 664942 664672 645318 612194 571746 529269 491177
$$ packed form
6093H53711M422J3641K9990M1013L6368J9387m198l2261n1581m7500k3388j904
6081H37700M651K484l199r592j4650j7518j3804l854M439O165K83j0543k0898
6068G61664k8737l4569l3815k1584k107J1325J1677Q515J0717J0984M425K62O008
6055G04765J4814J7913J9441K4079K9011L1120L1992L6553M3143M4909L8773L0504
6043A067017K8848L3547L5554K7973Q720j9373m7037o0582n7238m9653m5119l8805
6031H83852k9142k0199j1628j1249k6043m3074m2351k0859J684M800r012j9710
6019F57069j1308P592J5540N524j1619k1326k2815k5793l4453m2200l4677l560
6007D77974L1377M2351L4856L0435K9120J8829k70j9354l3124m0448m2477l8092
$$ plain form
5995 491177 464261 445457 426021 405937 390857 382543 377682 376556 382404 396610 421438 458991
5983 458991 504121 545017 572649 588498 601125 616837 638652 670525 713493 760816 806363 849223
5971 849223 891447 934444 979374 1030318 1087286 1143307 1197909 1260067 1334289 1416022 1495898 1566432
5959 1566432 1626692 1682573 1741485 1810336 1894106 1991327 2100186 2218185 2333543 2432014 2502722
5948 2502722 2534129 2521253 2472235 2400738 2314517 2216732 2115097 2020281 1936687 1859285 1782838
5937 1782838 1708784 1639351 1579075 1533839 1498851 1465966 1438823 1420913 1408157 1395615 1373646
5926 1373646 1331656 1272118 1208941 1158752 1133718 1129636 1132693 1132367 1123478 1105071 1081335 1063737
5914 1063737 1065070 1088995 1127272 1165698 1192250 1197775 1187675 1182960 1192280 1206083 1214525 1218372 1223789
$$ packed form
5995D91177k6916j8804j9436k0084j5080q314m861j126N848J4206K4828L7553
5983D58991M5130M0896K7632J5849J2627J5712K1815L1873M2968M7323M5547M2860
5971H49223M2224M2997M4930N0944N6968N6021N4602O2158P4222Q1733P9876P0534
5959A566432O0260N5881N8912O8851Q3770R7221J08859J17999J15358R8471P0708
5948B502722L1407j2876m9018p1497q6221r7785j01635r4816q3594p7402p6447
5937A782838p4054o9433o0276m5236l4988l2885k7143j7910j2756j2542k1969
5926A373646m1990n9538o3177n0189k5034m082L057l26q889j8407k3736j7598
5914A063737J333K3925L8277L8426K6552N525j0100m715R320J3803Q442L847N417
$$ plain form
5901 1223789 1233165 1243228 1250510 1252192 1247730 1237253 1217384 1188944 1157164 1125314 1096074 1070966
5889 1070966 1052906 1050663 1066853 1089164 1104101 1109125 1107901 1105344 1111854 1133629 1158002 1166031 1151900
5876 1151900 1121816 1086890 1058358 1045960 1052878 1076403 1111203 1151479 1193663 1231635 1260225 1282884
5864 1282884 1304817 1328662 1357987 1395526 1441426 1491251 1528101 1536148 1517256 1482835 1446532 1425622
5852 1425622 1426351 1435481 1435669 1417319 1381447 1338089 1300935 1277360 1261690 1245663 1229805 1219118
5840 1219118 1214198 1211884 1209747 1204871 1196122 1189702 1192870 1204284 1220458 1239019 1261050 1290439 1322050
5827 1322050 1345028 1361048 1381060 1410981 1453666 1513124 1586099 1662331 1735589 1801921 1854221
5816 1854221 1888732 1909757 1919312 1911341 1883647 1838128 1779330 1722438 1680370 1648146 1614469 1573180
$$ packed form
5901A223789R376J0063P282J682m462j0477j9869k8440l1780l1850k9240k5108
5889A070966j8060k243J6190K2311J4937N024j224k557O510K1775K4373Q029j4131
5876A151900l0084l4926k8532j2398O918K3525L4800M0276M2184L7972K8590K2659
5864A282884K1933K3845K9325L7539M5900M9825L6850Q047j8892l4421l6303k0910
5852A425622P29R130J88j8350l5872m3358l7154k3575j5670j6027j5858j0687
5840A219118m920k314k137m876q749o420L168J1414J6174J8561K2031K9389L1611
5827A322050K2978J6020K0012K9921M2685N9458P2975P6232P3258O6332N2300
5816A854221L4511K1025R555p971k7694m5519n8798n6892m2068l2224l3677m1289
$$ plain form
5804 1573180 1519710 1452200 1373802 1289851 1209686 1146081 1107952 1089690 1081253 1077585 1065684 1036221
5792 1036221 997783 967055 958844 975995 1009521 1045751 1074051 1093934 1106927 1111642 1109563 1102590
5780 1102590 1092496 1084061 1078939 1071880 1059559 1042066 1022725 1006524 988904 959376 913521 860457
5768 860457 819506 798160 791267 794913 801686 805282 805813 801239 789762 779474 779369 789695 809042
5755 809042 839870 884224 939758 995191 1035702 1054535 1056746 1056901 1068877 1093468 1122311 1149110
5743 1149110 1171937 1192663 1209318 1218988 1226936 1239765 1256388 1273343 1293573 1322055 1363253 1419737
5731 1419737 1484218 1548601 1618455 1705155 1812274 1933646 2052386 2155624 2248692 2345184 2448942
5720 2448942 2549491 2634892 2697872 2735627 2744015 2715382 2647097 2541411 2405208 2254482 2107604
$$ packed form
5804A573180n3470o7510p8398q3951q0165o3605l8129j8262q437l668j1901k9463
5792A036221l8438l0728q211J7151L3526L6230K8300J9883J2993M715k079o973
5780A102590j0094q435n122p059j2321j7493j9341j6201j7620k9528m5855n3064
5768H60457m0951k1346o893L646O773L596N31m574j1477j0288j05J0326J9347
5755H09042L0828M4354N5534N5433M0511J8833K211J55J1976K4591K8843K6799
5743A149110K2827K0726J6655R670P948J2829J6623J6955K0230K8482M1198N6484
5731A419737O4481O4383O9854Q6700J07119J21372J18740J03238R3068R6492J03758
5720B448942J00549Q5401O2980L7755Q388k8633o8285j05686j36203j50726j46878
$$ plain form
5709 2107604 1975335 1858842 1750853 1644223 1535803 1427876 1328315 1242954 1171195 1112242
5699 1112242 1067848 1038876 1023393 1014667 1002565 979553 949421 922436 903257 890210 881144 877752
5687 877752 885798 906380 928159 944489 960421 975412 980688 971658 950284 920473 888567 863945
5675 863945 853531 853238 850828 837120 816557 803194 800412 799723 796024 787508 774407 758149 734813
5662 734813 703097 671670 646166 627248 614564 609273 618127 640680 666339 685191 695083 699471
5650 699471 697800 682587 646469 587535 509599 424600 349948 298413 273393 271302 280218 290043
5638 290043 298841 309546 322054 327588 324364 320805 320622 318371 312871 312065 324143 355033 403367 457338
5624 457338 499851 519066 518574 513623 513563 513997 509123 494724 469543 444739 433708 444700 472950
$$ packed form
5709B107604j32269j16493j07989j06630j08420j07927r9561q5361p1759n8953
5699A112242m4394k8972j5483q726j2102k3012l0132k6985j9179j3047r066l392
5687H77752Q046K0582K1779J6330J5932J4991N276r030k1374k9811l1906k4622
5675H63945j0414k93k410j3708k0563j3363k782o89l699q516j3101j6258k3336
5662G34813l1716l1427k5504j8918j2684n291Q854K2553K5659J8852R892M388
5650F99471j671j5213l6118n8934p7936q4999p4652n1535k5020k091Q916R825
5638B90043Q798J0705J2508N534l224l559j83k251n500q06J2078L0890M8334N3971
5624D57338M2513J9215m92m951o0M34m874j4399k5181k4804j1031J0992K8250
$$ plain form
5611 472950 501408 520432 523324 500097 452125 395940 349732 317205 292748 273315 260905 259616
5599 259616 270610 287610 299076 300003 290039 265395 224614 179009 145159 129988 129859 140540 162634
5586 162634 190949 212036 219763 221971 232354 262020 310496 362927 405809 437700 459512 465861
5574 465861 450218 416161 380590 359251 347800 330405 303549 274208 249623 236851 239102 247900
5562 247900 250906 248318 256159 287594 333407 373084 396618 407724 413600 413769 394958 355102 313998
5549 313998 293796 301321 326489 352309 361933 350897 334093 332085 356796 403196 459238 516067
5537 516067 561352 585254 590021 581286 557606 522262 488866 465546 448223 432403 419210 415208
5525 415208 428559 455500 482474 503483 516404 511151 480410 434127 392592 371532 372560 385316
$$ packed form
5611D72950K8458J9024K892k3227m7972n6185m6208l2527k4457j9433j2410j289
5599B59616J0994J7000J1466R27r964k4644m0781m5605l3850j5171j29J0681K2094
5586A62634K8315K1087P727K208J0383K9666M8476N2431M2882L1891K1812O349
5574D65861j5643l4057l5571k1339j1451j7395k6856k9341k4585j2772K251Q798
5562B47900L006k588P841L1435M5813L9677K3534J1106N876J69j8811l9856m1104
5549C13998k0202P525K5168K5820R624j1036j6804k008K4711M6400N6042N6829
5537E16067M5285K3902M767q735k3680l5344l3396k3320j7323j5820j3193m002
5525D15208J3351K6941K6974K1009J2921n253l0741m6283m1535k1060J028J2756
$$ plain form
5513 385316 395866 396193 392891 396891 412173 436293 463990 486993 498542 503192 514730 538984 565072
5500 565072 581913 587873 583825 573964 569907 580742 598621 607042 601414 589065 573292 548003 512074
5487 512074 480396 469009 477995 494734 502776 496908 493024 506433 529121 541713 539541 533699 536634
5474 536634 549996 563743 568705 561916 541286 504573 461201 428382 416981 425995 443798 456916
5462 456916 456354 441263 418688 398685 393444 412051 449457 488853 516557 531574 542953 553337
5450 553337 557162 556492 559122 565072 568820 571122 579669 603141 641802 683667 709950 713582 711457 731363
5436 731363 776874 821651 846584 856798 878494 936898 1037816 1172698 1334672 1526190 1754418
5425 1754418 2020001 2305450 2578908 2792151 2883561 2815648 2611991 2337330 2052910 1798528
$$ packed form
5513C85316J0550L27l302M000J5282K4120K7697K3003J1549M650J1538K4254K6088
5500E65072J6841N960m048r861m057J0835J7879Q421n628j2349j5773k5289l5929
5487E12074l1678j1387Q986J6739Q042n868l884J3409K2688J2592k172n842K935
5474E36634J3362J3747M962o789k0630l6713m3372l2819j1401R014J7803J3118
5462D56916n62j5091k2575k0003n241J8607L7406L9396K7704J5017J1379J0384
5450E53337L825o70K630N950L748K302Q547K3472L8661M1865K6283L632k125J9906
5436G31363M5511M4777K4933J0214K1696N8404J00918J34882J61974J91518K28228
5425A754418K65583K85449K73458K13243R1410o7913k03657k74661k84420k54382
$$ plain form
5415 1798528 1591670 1431960 1308620 1205697 1109321 1017103 935353 869248 820046 789619 779933
5404 779933 782527 780522 762587 725417 674359 623320 581513 545616 502214 444784 388927 352856
5392 352856 338166 336701 342361 352879 363528 364486 351633 332366 314091 295285 274475 259767
5380 259767 257092 256363 238363 191762 124443 62546 30313 30041 47006 58714 54588 45686 43131
5367 43131 45304 46370 45852 48253 60424 84508 114600 139391 149381 146602 140544 136004 135859 147256
5353 147256 170049 194387 214792 229137 227627 205238 169303 131057 101633 87707 89724 106776
5341 106776 133867 165762 205270 246650 272055 273348 258113 237102 217051 200886 186551 168801
5329 168801 148830 129501 106057 75847 45327 22700 10545 6061 5384 8288 17360 36949 69726
$$ packed form
5415A798528k06858j59710j23340j02923r6376r2218q1750o6105m9202l0427r686
5404G79933K594k005j7935l7170n1058n1039m1807l5897m3402n7430n5857l6071
5392C52856j4690j465N660J0518J0649R58j2853j9267j8275j8806k0810j4708
5380B59767k675p29j8000m6601o7319o1897l2233k72J6965J1708m126q902k555
5367D3131K173J066n18K401J2171K4084L0092K4791R990k779o058m540j45J1397
5353A47256K2793K4338K0405J4345j510k2389l5935l8246k9424j3926K017J7052
5341A06776K7091L1895L9508M1380K5405J293j5235k1011k0051j6165j4335j7750
5329A68801j9971j9329k3444l0210l0520k2627j2155m484o77K904R072J9589L2777
$$ plain form
5316 69726 108302 136910 150583 155655 154369 142999 123455 102096 79100 59934 56232 60594 47530
5303 47530 16089 -8275 -15614 -13861 -8612 1314 18879 40380 58570 69116 63799 41835 18036
5290 18036 4908 1658 2521 3761 4527 3323 -599 -2549 5720 32259 75544 118687 140439 138656
5276 138656 127838 115957 101849 83611 66339 62863 76652 96613 110008 118481 131320 150510
5264 150510 173238 192766 201491 192985 164273 127360 100978 92981 98982 107667 108021 99846 93894
5251 93894 95823 99227 99397 100862 106065 108864 105207 102190 104932 105510 91345 63432 35741 14926
5237 14926 3614 10367 35498 69273 105435 134948 149544 155242 160703 161785 146479 113692 77602
5224 77602 55608 57549 82290 120535 155206 171627 169711 157736 143760 132266 121646 110608
$$ packed form
5316F9726L8576K8608J3673N072j286j1370j9544k1359k2996j9166l702M362j3064
5303D7530l1441k4364p339J753N249R926J7565K1501J8190J0546n317k1964k3799
5290A8036j3128l250Q63J240P66j204l922j950Q269K6539M3285M3143K1752j783
5276A38656j0818j1881j4108j8238j7272l476J3789J9961J3395Q473J2839J9190
5264A50510K2728J9528Q725q506k8712l6913k6382p997O001Q685L54q175n952
5251I3894J929L404J70J465N203K799l657l017K742N78j4165k7913k7691k0815
5237A4926j1312O753K5131L3775L6162K9513J4596N698N461J082j5306l2787l6090
5224G7602k1994J941K4741L8245L4671J6421j916j1975j3976j1494j0620j1038
$$ plain form
5212 110608 99821 84795 58344 24117 -2449 -8369 9754 48007 92907 120876 116617 92439
5200 92439 72138 63172 60648 60195 63425 71268 78093 83979 94923 111236 126297 138125 148639
5187 148639 163677 185267 203886 207715 197359 189933 193910 198563 191039 167153 132151 91076 46486
5174 46486 5094 -21926 -23106 -620 24709 32352 21189 3584 -5914 5359 40927 87859
5162 87859 130890 167219 194687 204252 185819 143211 98024 68017 52913 46548 49669 63401
5150 63401 86458 111647 124993 120104 109823 107590 109121 105665 98197 92821 91705 90693 80513
5137 80513 58137 35557 31366 48719 69921 78738 74096 65610 60774 58359 54919 55116 67809 91919
5123 91919 113930 114645 89308 56634 35196 25417 22316 27776 40667 50808 50178 36156 11792
$$ packed form
5212A10608j0787j5026k6451l4227k6566n920J8123L8253M4900K7969m259k4178
5200I2439k0301q966k524m53L230P843O825N886J0944J6313J5061J1828J0514
5187A48639J5038K1590J8619L829j0356p426L977M653p524k3886l5002m1075m4590
5174D6486m1392k7020j180K2486K5329P643j1163j7605r498J1273L5568M6932
5162H7859M3031L6329K7468R565j8433m2608m5187l0007j5104o365L121J3732
5150F3401K3057K5189J3346m889j0281k233J531l456p468n376j116j012j0180
5137H0513k2376k2580m191J7353K1202Q817m642q486m836k415l440J97J2693K4110
5123I1919K2011P15k5337l2674k1438r779l101N460J2891J0141o30j4022k4364
$$ plain form
5110 11792 -11723 -27801 -41280 -57581 -72195 -75078 -68089 -63199 -64594 -71546 -85635 -103717 -119113
5097 -119113 -130178 -139676 -148442 -153266 -147469 -127682 -96216 -62619 -39409 -31341 -34272 -41502 -44412
5084 -44412 -32991 -2310 38171 69352 81217 78367 69087 57051 42525 22593 -9979 -58571
5072 -58571 -108305 -133791 -125314 -97146 -66653 -39042 -9909 22503 55584 89070 123366 155353
5060 155353 181521 204154 228572 251875 265585 270426 275708 289284 311092 334646 352352 361330
5048 361330 360883 349304 329014 308975 296319 286865 271641 249100 225670 207893 201647 214603
5036 214603 245679 279562 301066 304288 292272 273894 259641 256699 263721 276009 291219 308298
5024 308298 331473 365907 405965 437791 452657 453621 453095 463427 482624 496207 493886 479694 459448
$$ packed form
5110A1792k3515j6078j3479j6301j4614k883O989M890j395o952j4089j8082j5396
5097a19113j1065r498q766m824N797J9787L1466L3597K3210Q068k931p230k910
5084d4412J1421L0681M0481L1181J1865k850r280j2036j4526j9932l2572m8592
5072e8571m9734k5486Q477K8168L0493K7611K9133L2412L3081L3486L4296L1987
5060A55353K6168K2633K4418K3303J3710M841N282J3576K1808K3554J7706Q978
5048C61330m47j1579k0290k0039j2656r454j5224k2541k3430j7777o246J2956
5036B14603L1076L3883K1504L222j2016j8378j4253k942P022J2288J5210J7079
5024C08298K3175L4434M0058L1826J4866R64n26J0332J9197J3583k321j4192k0246
$$ plain form
5011 459448 431363 396060 365841 349866 341777 331879 319978 317306 330600 349866 359135 350025 328056
4998 328056 310020 307939 322489 350198 384956 419524 451748 482430 511231 534665 555942 585982
4986 585982 629117 676007 714674 742401 762158 777528 794570 826543 886014 966327 1049558 1135741
4974 1135741 1237938 1358248 1493109 1643838 1812902 2008770 2249325 2545507 2890205 3275222
4964 3275222 3699311 4157184 4646773 5182246 5786049 6481296 7300101 8282911 9453172
4955 9453172 10789494 12222490 13617458 14748074 15342452 15218473 14415498 13174640 11778263
4946 11778263 10426931 9223122 8195255 7320049 6561278 5899564 5322577 4811303 4354642
4937 4354642 3956132 3612323 3301836 3008654 2736902 2497296 2294898 2125678 1976297 1835689
$$ packed form
5011D59448k8085l5303l0219j5975q089r898j1901k672J3294J9266R269r110k1969
4998C28056j8036k081J4550K7709L4758L4568L2224L0682K8801K3434K1277L0040
4986E85982M3135M6890L8667K7727J9757J5370J7042L1973N9471Q0313Q3231Q6183
4974A135741J02197J20310J34861J50729J69064J95868K40555K96182L44698L85017
4964C275222M24089M57873M89589N35473O03803O95247Q18805R82810J170261
4955I453172J336322J432996J394968J130616N94378j23979q02975j240858j396377
4946A1778263j351332j203809j027867q75206p58771o61714n76987n11274m56661
4937D354642l98510l43809l10487k93182k71752k39606k02398j69220j49381j40608
$$ plain form
4927 1835689 1704390 1583176 1466672 1355929 1262288 1188792 1126243 1070780 1030636 1007390 992910
4916 992910 984859 988653 1011773 1050191 1084407 1102107 1109417 1118324 1132361 1140447 1126544 1084691 1025188
4903 1025188 963289 904186 843156 783282 734391 698357 676089 670467 679415 698371 716376 719902
4891 719902 703821 670588 625147 579855 549425 536984 537815 545871 552420 549564 535201 510846 478755
4878 478755 440807 400307 363441 338040 328539 332110 338999 342823 341430 335001 322585 304944 286373
4865 286373 268249 250427 236164 229034 230439 241884 261695 286603 317402 357648 408538 463986
4853 463986 511804 543347 555982 555926 560588 583746 625061 676522 735236 805601 889136 985475
4841 985475 1092831 1190345 1244227 1238665 1183434 1103377 1022375 944677 860550 768663 681924 618239
$$ packed form
4927A835689j31299j21214j16504j10743r3641p3496o2549n5463m0144k3246j4480
4916I92910q051L794K3120L8418L4216J7700P310Q907J4037Q086j3903m1853n9503
4903A025188o1899n9103o1030n9874m8891l6034k2268n622Q948J8956J8005L526
4891G19902j6081l3233m5441m5292l0430j2441Q31Q056O549k856j4363k4355l2091
4878D78755l7948m0500l6866k5401r501L571O889L824j393o429j2416j7641j8571
4865B86373j8124j7822j4263p130J405J1445J9811K4908L0799M0246N0890N5448
4853D63986M7818L1543J2635n6M662K3158M1315N1461N8714P0365Q3535R6339
4841I85475J07356R7514N3882n562n5231q0057q1002p7698q4127r1887q6739o3685
$$ plain form
4829 618239 584322 568756 550391 513862 463472 413047 364096 305081 237181 174501 121377 75486
4817 75486 37241 9392 -1403 4424 10869 2890 -19889 -46681 -66471 -74416 -69685 -55939 -39979
4804 -39979 -22788 -1608 21434 40518 46157 38329 31454 35593 43843 40637 25437 12657 7003
4791 7003 -5033 -33022 -65862 -87941 -92485 -77957 -45982 -6529 23044 36672 43164 50608 60299
4778 60299 67821 68701 68071 78075 99197 122293 145699 173931 213885 263957 309648 335440 336088
4765 336088 312003 265529 203922 137944 83947 60502 71968 102697 126373 125660 107239 92953
4753 92953 95652 107599 110881 91119 49387 5517 -20073 -29085 -38932 -58165 -78571 -87877 -80639
4740 -80639 -56006 -14989 36839 91550 139872 170118 173881 155664 126400 94144 62776 34268
$$ packed form
4829F18239l3917j5566j8365l6529n0390n0425m8951n9015o7900o2680n3124m5891
4817G5486l8245k7849j0795N827O445p979k2779k6792j9790p945M731J3746J5960
4804c9979J7191K1180K3042J9084N639p828o875M139Q250l206j5200j2780n654
4791G003j2036k7989l2840k2079m544J4528L1975L9453K9573J3628O492P444R691
4778F0299P522Q80o30J0004K1122K3096K3406K8232L9954N0072M5691K5792O48
4765C36088k4085m6474o1607o5978n3997k3445J1466L0729K3676p13j8421j4286
4753I2953K699J1947L282j9762m1732m3870k5590r012r847j9233k0406r306P238
4740h0639K4633M1017N1828N4711M8322L0246L763j8217k9264l2256l1368k8508
$$ plain form
4728 34268 13112 5971 15659 33700 45155 40634 24203 10131 4683 4298 4184 -1894 -16607 -37412
4714 -37412 -64083 -94810 -121025 -134885 -135943 -131171 -127391 -126513 -124504 -118892 -110745 -104521 -105978 -114173
4700 -114173 -122928 -129699 -134666 -137349 -137352 -135608 -129753 -110970 -75983 -31468 16009 58794 85624 90474
4686 90474 71926 37530 10922 13718 40505 69875 90515 103739 110878 112221 108752 99001 84578
4673 84578 77042 83821 99172 109796 100078 66237 22345 -11268 -24014 -21395 -13799 -3630 6848
4660 6848 8169 -1087 -8645 -4238 13197 38185 61527 68156 44912 1637 -29883 -22880 20291
4647 20291 73166 108698 117134 109056 104162 113314 129623 137522 129107 108358 86257 71879 65985
4634 65985 66134 67965 69070 73816 88793 114979 138388 140533 122516 105356 109584 133881 161554
$$ packed form
4728C4268k1156p141R688J8041J1455m521j6431j4072n448l85j14o078j4713k0805
4714c7412k6671l0727k6215j3860j058M772L780Q78K009N612Q147O224j457q195
4700a14173q755o771m967k683lJ744N855J8783L4987M4515M7477M2785K6830M850
4686I0474j8548l4396k6608K796K6787K9370K0640J3224P139J343l469r751j4423
4673H4578p536O779J5351J0624r718l3841m3892l3613j2746K619P596J0169J0478
4660F848J321r256p558M407J7435K4988K3342O629k3244m3275l1520P003M3171
4647B0291N2875L5532Q436q078m894R152J6309P899q415k0749k2101j4378n894
4634F5985J49J831J105M746J4977K6186K3409K145j8017j7160M228K4297K7673
$$ plain form
4621 161554 181372 190374 185451 162038 122556 76144 32631 -2661 -30985 -52991 -64446 -67475
4609 -67475 -75791 -97383 -123259 -137992 -135987 -122920 -109464 -107074 -120751 -138066 -137062 -110633 -66398
4596 -66398 -17317 22619 48416 67278 80979 80821 63531 35944 3760 -30627 -62531 -86870
4584 -86870 -101300 -112247 -132256 -164123 -197717 -225287 -242239 -240928 -223138 -199005 -177080 -159559
4572 -159559 -141444 -119132 -95032 -72325 -51289 -36794 -28554 -11978 20245 62757 106533 141359
4560 141359 167739 192784 215357 225129 216792 193891 163107 132859 109738 92953 73560 45589
4548 45589 15216 -4790 -7507 4036 26524 61946 103909 139310 163218 181285 198743 210032
4536 210032 209457 199788 184146 157132 121997 96913 89264 93999 107297 123140 132635 133019 126226
$$ packed form
4621A61554J9818R002m923k3413l9482m6412m3513l5292k8324k2006j1455l029
4609f7475q316k1592k5876j4733K005J3067J3456K390j3677j7315J004K6429M4235
4596f6398M9081L9936K5797J8862J3701j58j7290k7587l2184l4387l1904k4339
4584h6870j4430j0947k0009l1867l3594k7570j6952J311J7790K4133K1925J7521
4572a59559J8115K2312K4100K2707K1036J4495Q240J6576L2223M2512M3776L4826
4560A41359K6380K5045K2573R772q337k2901l0784l0248k3121j6785j9393k7971
4548D5589l0373k0006k717J1543K2488L5422M1963L5401K3908J8067J7458J1289
4536B10032n75r669j5642k7014l5135k5084p649M735J3298J5843R495L84o793
$$ plain form
4523 126226 117261 114273 117603 121841 121018 109048 84656 54433 26683 1031 -24587 -44072 -51215
4510 -51215 -50422 -49473 -47084 -33216 -3493 29528 57220 83665 109349 136489 171845 210557 235771
4497 235771 241943 240441 238173 234151 225597 212993 205886 212107 223306 221382 202600 180216 165104
4484 165104 164958 187935 226570 258292 272082 272769 264074 247783 230774 222829 227623 238591 245873
4471 245873 238574 207351 156711 105296 70967 59822 65481 74412 72829 59401 48965 54042 75208
4458 75208 106694 138414 154177 142442 108013 66810 34076 7504 -20875 -42572 -43139 -18502
4446 -18502 23377 70175 113371 146412 163782 169591 176691 194066 215061 228467 235629 242961 251418
4433 251418 255240 242486 210936 180888 169989 171965 166626 140989 100594 61180 33107 15273
$$ packed form
4523A26226q965k988L330M238q23j1970k4392l0223k7750k5652k5618j9485p143
4510e1215P93R49K389J3868K9723L3021K7692K6445K5684K7140L5356L8712K5214
4497B35771O172j502k268m022q554j2604p107O221J1199j924j8782k2384j5112
4484A65104j46K2977L8635L1722J3790O87q695j6291j7009p945M794J0968P282
4471B45873p299l1223n0640n1415l4329j1145N659Q931j583j3428j0436N077K1166
4458G5208L1486L1720J5763j1735l4429m1203l2734k6572k8379k1697n67K4637
4446a8502M1879M6798M3196L3041J7370N809P100J7375K0995J3406P162P332Q457
4433B51418L822j2754l1550l0048j0899J976n339k5637m0395l9414k8073j7834
$$ plain form
4421 15273 6416 8103 17831 30933 42031 45237 39618 30170 24281 25166 24082 10750 -6713 -10148
4407 -10148 6015 31793 56826 76858 92973 107887 116741 112101 98142 94875 115680 147986
4395 147986 174753 189277 185351 160212 121895 83321 53449 35514 26503 21136 17526 12167 4874
4382 4874 1772 7002 18492 25698 17696 -7038 -41851 -81892 -125854 -167787 -196594 -205337 -197675
4369 -197675 -180808 -161530 -145663 -130002 -114473 -111100 -126284 -153455 -180426 -203812 -228778 -253214
4357 -253214 -269365 -275105 -272805 -260933 -232969 -190329 -148767 -121626 -107405 -96676 -82652 -66949
4345 -66949 -57026 -54481 -50712 -43061 -39311 -43843 -48694 -45751 -39085 -31394 -17693 215 12238 13344
4331 13344 7013 3635 12653 28810 35491 22335 -5767 -31861 -42312 -39351 -35606 -36871 -32483
$$ packed form
4421A5273q857J687R728J3102J1098L206n619r448n889Q85j084j3332j7463l435
4407a0148J6163K5778K5033K0032J6115J4914Q854m640j3959l267K0805L2306
4395A47986K6767J4524l926k5139l8317l8574k9872j7935r011n367l610n359p293
4382D874l102N230J1490P206q002k4734l4813m0041m3962m1933k8807q743P662
4369a97675J6867J9278J5867J5661J5529L373j5184k7171k6971k3386k4966k4436
4357b53214j6151n740K300J1872K7964M2640M1562K7141J4221J0729J4024J5703
4345f6949R923K545L769P651L750m532m851K943O666P691J3701J7908J2023J106
4331A3344o331l378R018J6157O681j3156k8102k6094j0451K961L745j265M388
$$ plain form
4318 -32483 -14859 4354 9335 -2952 -29722 -64646 -94957 -112654 -119321 -123799 -136786 -156364
4306 -156364 -166587 -157055 -132911 -108893 -100309 -112974 -139561 -171100 -204919 -239532 -275295 -306567
4294 -306567 -315931 -295777 -265838 -249873 -245416 -233281 -208096 -182776 -167332 -156876 -141406 -117493
4282 -117493 -91694 -74624 -67986 -66024 -68482 -74125 -81024 -88428 -87343 -70269 -40202 -1465 43833
4269 43833 86301 111981 111924 85753 41993 -9627 -58666 -94143 -114809 -127021 -132347 -123718 -99783
4256 -99783 -72107 -54547 -48303 -47657 -55180 -78447 -117628 -160174 -186470 -183684 -153451 -107533 -58532
4243 -58532 -16101 10689 21546 23863 24671 30149 42686 62796 88141 106249 106687 91845 72945
4230 72945 61158 58380 57982 49800 33477 21067 21840 28459 23768 -587 -33411 -58798 -70028
$$ packed form
4318c2483J7624J9213M981j2287k6770l4924l0311j7697o667m478j2987j9578
4306a56364j0223R532K4144K4018Q584j2665k6587l1539l3819l4613l5763l1272
4294c06567r364K0154K9939J5965M457J2135K5185K5320J5444J0456J5470K3913
4282a17493K5799J7070O638J962k458n643o899p404J085J7074L0067L8737M5298
4269D3833M2468K5680n7k6171m3760n1620m9039l5477k0666j2212n326Q629K3935
4256i9783K7676J7560O244O46p523k3267l9181m2546k6296K786L0233M5918M9001
4243e8532M2431K6790J0857K317Q08N478J2537K0110K5345J8108M38j4842j8900
4230G2945j1787k778l98q182j6323j2410P73O619m691k4355l2824k5387j1230
$$ plain form
4217 -70028 -67915 -61453 -62410 -75318 -100105 -128960 -147109 -150206 -148010 -152040 -167891 -192985 -214763
4204 -214763 -221226 -210459 -193073 -179970 -166591 -142230 -106888 -68637 -33867 -9169 709 -1055
4192 -1055 -9122 -22830 -37498 -46421 -55154 -76677 -112841 -150432 -175529 -186835 -197274 -212460 -215661
4179 -215661 -194826 -160338 -125522 -94714 -69754 -48044 -22426 11181 45226 70498 90840 113857
4167 113857 139692 160234 169573 171161 172289 180110 195891 209479 208662 187600 153955 123396 104325
4154 104325 95329 89778 77368 51707 18138 -8907 -18120 -15520 -17377 -29427 -44010 -53472 -52643
4141 -52643 -41776 -28906 -22485 -23999 -26143 -18378 568 19642 33343 50439 77867 109015 133329
4128 133329 148457 158141 165554 172163 175740 168091 143196 109013 80079 63976 57836 54631 50696
$$ packed form
4217g0028K113O462r57j2908k4787k8855j8149l097K196m030j5851k5094k1778
4204b14763o463J0767J7386J3103J3379K4361L5342L8251L4770K4698R878j764
4192a055q067j3708j4668q923q733k1523l6164l7591k5097j1306j0439j5186l201
4179b15661K0835L4488L4816L0808K4960K1710K5618L3607L4045K5272K0342K3017
4167A13857K5835K0542R339J588J128P821J5781J3588q17k1062l3645l0559j9071
4154A04325q996n551j2410k5661l3569k7045r213K600j857j2050j4583r462Q29
4141e2643J0867J2870O421j514k144P765J8946J9074J3701J7096K7428L1148K4314
4128A33329J5128R684P413O609L577p649k4895l4183k8934j6103o140l205l935
$$ plain form
4115 50696 40622 19610 -7526 -30934 -45883 -46832 -25491 16431 70420 126405 170816 194166
4103 194166 196638 184014 163639 140537 114723 81006 35832 -11075 -46015 -65496 -71024 -64109
4091 -64109 -47822 -30494 -20615 -16079 -12914 -9189 -3181 4393 15475 30279 36140 19600 -11915
4078 -11915 -38012 -47419 -39475 -15203 21037 59538 88061 96302 83522 62978 47372 35829
4066 35829 21563 2868 -16431 -34232 -52820 -72725 -83252 -66320 -20805 31688 62171 56809
4054 56809 23649 -18780 -53508 -78403 -104221 -133434 -154986 -156380 -131486 -86254 -38967 -9734
4042 -9734 -1870 -5919 -16511 -31111 -46341 -56610 -58071 -51375 -36604 -11601 21071 55536 85240
4029 85240 103082 106056 97189 82765 68717 57455 52101 57340 70185 84526 94858 93663 78942
$$ packed form
4115E0696j0074k1012k7136k3408j4949r49K1341M1922N3989N5985M4411K3350
4103A94166K472j2624k0375k3102k5814l3717m5174m6907l4940j9481n528O915
4091f4109J6287J7328R879M536L165L725O008P574J1082J4804N861j6540l1515
4078a1915k6097r407P944K4272L6240L8501K8523Q241j2780k0544j5606j1543
4066C5829j4266j8695j9299j7801j8588j9905j0527J6932M5515N2493L0483n362
4054E6809l3160m2429l4728k4895k5818k9213k1552j394K4894M5232M7287K9233
4042i734P864m049j0592j4600j5230j0269j461O696J4771K5003L2672L4465K9704
4029H5240J7842K974q867j4424j4048j1262n354N239J2845J4341J0332j195j4721
$$ plain form
4016 78942 54167 19660 -18401 -45780 -54836 -50099 -36437 -10358 26260 65629 105320 140492
4004 140492 162211 168281 161944 150186 142777 145708 151725 145381 129207 118116 115812 116096 116351 120012
3990 120012 126629 128265 117225 98795 87645 85720 83639 79509 78603 82600 90125 97414 102114 111479
3976 111479 133924 169349 209886 247248 280474 311428 343905 383811 427512 461634 480731 497712
3964 497712 530630 582206 634342 665419 661914 620017 552948 482732 432939 423837 451391 483351
3952 483351 492824 485288 483783 502264 536177 574939 617159 669996 738586 823216 920820 1025760
3940 1025760 1134254 1251050 1380640 1521416 1673669 1837017 2012818 2212307 2452671 2751335
3930 2751335 3126504 3590888 4145100 4790797 5543255 6420254 7441029 8631660 9998018
$$ packed form
4016G8942k4775l4507l8061k7379r056M737J3662K6079L6618L9369L9691L5172
4004A40492K1719O070o337j1758p409K931O017o344j6174j1091k304K84K55L661
3990A20012O617J636j1040j8430j1150j925k081m130r06L997P525P289M700R365
3976A11479K2445L5425M0537L7362L3226L0954L2477L9906M3701L4122J9097J6981
3964D97712L2918N1576N2136L1077l505m1897o7069p0216m9793r102K7554L1960
3952D83351R473p536j505J8481L3913L8762M2220N2837O8590Q4630R7604J04940
3940A025760J08494J16796J29590J40776J52253J63348J75801J99489K40364K98664
3930B751335L75169M64384N54212O45697P52458Q76999J020775J190631J366358
$$ plain form
3921 9998018 11484815 12959817 14233480 15104452 15448533 15294809 14797059 14135990 13431590
3912 13431590 12722813 11997813 11219657 10367134 9473740 8601190 7795454 7073179 6431687
3903 6431687 5869027 5385573 4971810 4613890 4309686 4060580 3857530 3697267 3588448 3535726
3893 3535726 3541915 3612481 3751239 3957370 4222320 4530139 4859607 5193468 5531495 5882695
3883 5882695 6242468 6575580 6824223 6951075 6971323 6930194 6860573 6775442 6680501 6575060
3873 6575060 6445507 6261330 6000528 5677487 5336527 5019564 4743539 4506040 4294560 4098409
3863 4098409 3915226 3748609 3606585 3499017 3421986 3349246 3249057 3098445 2894963 2665914
3853 2665914 2447673 2257099 2093999 1955167 1844069 1762897 1695197 1623730 1552993 1494882
$$ packed form
3921I998018J486797J475002J273663Q70972L44081j53724m97750o61069p04400
3912A3431590p08777p25000p78156q52523q93394q72550q05736p22275o41492
3903F431687n62660m83454m13763l57920l04204k49106k03050j60263j08819n2722
3893C535726O189P0566J38758K06131K64950L07819L29468L33861L38027L51200
3883E882695L59773L33112K48643J26852K0248m1129o9621q5131r4941j05441
3873F575060j29553j84177k60802l23041l40960l16963k76025k37499k11480j96151
3863D098409j83183j66617j42024j07568p7031p2740j00189j50612k03482k29049
3853B665914k18241j90574j63100j38832j11098q1172o7700p1467p0737n8111
$$ plain form
3843 1494882 1455053 1438150 1446485 1472525 1497804 1505545 1498057 1494621 1511131 1547582 1588845 1622683
3831 1622683 1652761 1694536 1764638 1864434 1982265 2117923 2279233 2466171 2677067 2901205
$$ packed form
3843A494882l9829j6903Q335K6040K5279P741p488l436J6510L6451M1263L3838
3831A622683L0078M1775P0102R9796J17831J35658J61310J86938K10896K24138
$$ [...]
##END NTUPLES=NMR SPECTRUM
##END=
