##TITLE=31P ikalashn
DE-79rm_4h30(nlock)
21.11.2024
##JCAMPDX= 6.0         $$ Bruker NMR JCAMP-DX V2.0
##DATA TYPE= NMR SPECTRUM
##DATA CLASS= NTUPLES
##ORIGIN= UXNMR, Bruker Analytische Messtechnik GmbH
##OWNER= root
$$ TOPSPIN		Version 1.3
$$ 2024-11-21 16:20:21.656 +0400  Irina@DPX200
$$ Compression mode = diff/dup
##.OBSERVE FREQUENCY= 81.01967998063
##.OBSERVE NUCLEUS= ^31P
##.ACQUISITION MODE= SIMULTANEOUS
##.ACQUISITION SCHEME= undefined
##.AVERAGES= 64
##.DIGITISER RES= 17
##SPECTROMETER/DATA SYSTEM= spect
##.PULSE SEQUENCE= zgpg
##.SOLVENT NAME= D2O
##.SHIFT REFERENCE= INTERNAL, D2O, 1, 298.5841
##AUDIT TRAIL= $$ (NUMBER, WHEN, WHO, WHERE, WHAT)
$$ ##TITLE= Audit trail, TOPSPIN		Version 1.3
$$ ##JCAMPDX= 5.01
$$ ##ORIGIN= Bruker BioSpin GmbH
$$ ##OWNER= Irina
$$ $$ F:/spectra/data/iren/nmr/P31dec/1/pdata/1/auditp.txt
$$ ##AUDIT TRAIL=  $$ (NUMBER, WHEN, WHO, WHERE, VERSION, WHAT)
(   1,<2024-11-21 16:18:17.546 +0400>,<Irina>,<DPX200>,<TOPSPIN 1.3>,
      <acquisition in progress>)
(   2,<2024-11-21 16:19:59.531 +0400>,<Irina>,<DPX200>,<TOPSPIN 1.3>,
      <Start of raw data processing
       efp BC_mod = 2 LB = 10 FT_mod = 6 PKNL = 1 PHC0 = 178.4125 PHC1 = 167.9563 SI = 32K 
       data hash MD5: 32K
       2B 0D 71 3A 27 E3 35 0C B8 61 F2 2B B5 76 C9 C9>)
(   3,<2024-11-21 16:20:01.921 +0400>,<Irina>,<DPX200>,<TOPSPIN 1.3>,
      <apk 
       data hash MD5: 32K
       E2 77 4B A2 D2 82 12 5E F6 85 3F 9E 7D B1 BD 03>)
(   4,<2024-11-21 16:20:11.390 +0400>,<Irina>,<DPX200>,<TOPSPIN 1.3>,
      <pk fgphup PHC0 = 96.97813 PHC1 = -152.8 
       data hash MD5: 32K
       9C 37 37 E4 FF 6F FF 15 BA F0 1F D0 E4 26 F6 04>)
$$ ##END=
$$ 
$$ $$ hash MD5
$$ $$ DE BA 5B F2 56 DC AF FF 2E A1 B9 AF BC A4 79 1F
##$RELAX= 
##$RELAX= 
##$RELAX= 
##$RELAX= 
##$RELAX= 
##$RELAX= 
##$RELAX= 
##$RELAX= 
##$RELAX= 
##$RELAX= 
##$RELAX= 
$$ Bruker specific parameters
$$ --------------------------
##$DU= <F:/spectra>
##$EXPNO= 1
##$NAME= <P31dec>
##$PROCNO= 1
##$TYPE= <nmr>
##$USER= <iren>
##$AMP= (0..31)
100 100 100 100 100 100 100 100 100 100 100 100 100 100 100 100 100 100 
100 100 100 100 100 100 100 100 100 100 100 100 100 100 
##$ANAVPT= -1
##$AQSEQ= 0
##$AQ_mod= 1
##$AUNM= <au_zg>
##$AUTOPOS= <>
##$BF1= 81.014009
##$BF2= 200.13
##$BF3= 200.13
##$BF4= 200.13
##$BF5= 200.13
##$BF6= 200.13
##$BF7= 200.13
##$BF8= 200.13
##$BYTORDA= 1
##$CFDGTYP= 0
##$CFRGTYP= 5
##$CHEMSTR= <none>
##$CNST= (0..63)
1 1 145 1 1 1 1 1 1 1 1 1 1 1 1 1 1 1 1 1 1 1 1 1 1 1 1 1 1 1 1 1 1 1 
1 1 1 1 1 1 1 1 1 1 1 1 1 1 1 1 1 1 1 1 1 1 1 1 1 1 1 1 1 1 
##$CPDPRG= <waltz16>
##$CPDPRG1= <>
##$CPDPRG2= <waltz16>
##$CPDPRG3= <>
##$CPDPRG4= <mlev>
##$CPDPRG5= <mlev>
##$CPDPRG6= <mlev>
##$CPDPRG7= <mlev>
##$CPDPRG8= <mlev>
##$CPDPRGB= <>
##$CPDPRGT= <>
##$D= (0..63)
0 1 0 0 0 0 0 0 0 0.06 0 0.03 2e-005 3e-006 0 0 0.0002 0 0 0 0 0 0 0 0 
0 0 0 0 0 0 0 0 0 0 0 0 0 0 0 0 0 0 0 0 0 0 0 0 0 0 0 0 0 0 0 0 0 0 0 
0 0 0 0 
##$DATE= 1732191596
##$DBL= (0..7)
120 120 120 11 120 120 24 19 
$$ [...]
0 1 3 0 0 0 0 0 0 0 0 0 0 0 0 0 
##$SW_h= 37037.037037037
##$TD= 32768
##$TD0= 1
##$TE= 300
##$TE2= 300
##$TE3= 300
##$TEG= 300
##$TL= (0..7)
0 120 53 12 22 120 120 120 
##$TP= (0..7)
150 150 150 150 150 150 150 150 
##$TP07= 0
##$TPNAME0= <>
##$TPNAME1= <>
##$TPNAME2= <>
##$TPNAME3= <>
##$TPNAME4= <>
##$TPNAME5= <>
##$TPNAME6= <>
##$TPNAME7= <>
##$TPOAL= (0..7)
0.5 0.5 0.5 0.5 0.5 0.5 0.5 0.5 
##$TPOFFS= (0..7)
0 0 0 0 0 0 0 0 
##$TUNHIN= 0
##$TUNHOUT= 0
##$TUNXOUT= 0
##$USERA1= <user>
##$USERA2= <user>
##$USERA3= <user>
##$USERA4= <user>
##$USERA5= <user>
##$V9= 5
##$VALIST= <valist>
##$VCLIST= <CCCCCCCCCCCCCCC>
##$VD= 0
##$VDLIST= <DDDDDDDDDDDDDDD>
##$VPLIST= <PPPPPPPPPPPPPPP>
##$VTLIST= <TTTTTTTTTTTTTTT>
##$WBST= 1024
##$WBSW= 4
##$XGAIN= (0..3)
0 0 0 0 
##$XL= 0
##$YL= 0
##$YMAX_a= 4225
##$YMIN_a= -1938
##$ZGOPTNS= <>
##$ZL1= 120
##$ZL2= 120
##$ZL3= 120
##$ZL4= 120
##$ABSF1= 0
##$ABSF2= 0
##$ABSG= 0
##$ABSL= 0
##$ALPHA= 0
##$AQORDER= 0
##$ASSFAC= 0
##$ASSFACI= 0
##$ASSFACX= 0
##$ASSWID= 0
##$AUNMP= <proc_1d>
##$AXLEFT= 0
##$AXRIGHT= 0
##$AXTYPE= 0
##$AXUNIT= <>
##$AZFE= 0.1
##$AZFW= 0.5
##$BCFW= 0
##$BC_mod= 2
##$BYTORDP= 0
##$COROFFS= 0
##$CY= 12.5935478210449
##$DATMOD= 1
##$DC= 0
##$DFILT= <>
##$DTYPP= 0
##$F1P= 47.1127640792319
##$F2P= -24.0371245302204
##$FCOR= 0.5
##$FTSIZE= 32768
##$FT_mod= 6
##$GAMMA= 0
##$GB= 0
##$INTBC= 1
##$INTSCL= 7.269226e-011
##$ISEN= 30
##$LB= 10
##$LEV0= 0
##$LPBIN= 0
##$MAXI= 12.09355
##$MC2= 0
##$MEAN= 0
##$ME_mod= 0
##$MI= 0.7550151
##$NCOEF= 0
##$NC_proc= -12
##$NLEV= 6
##$NOISF1= 298.5841
##$NOISF2= 270.0111
##$NSP= 0
##$NTH_PI= 0
##$NZP= 0
##$OFFSET= 298.5841
##$PC= 1.4
##$PHC0= 262.8655
##$PHC1= 34.2881
##$PH_mod= 1
##$PKNL= yes
##$PPARMOD= 0
##$PPDIAG= 0
##$PPIPTYP= 0
##$PPMPNUM= 100
##$PPRESOL= 1
##$PSCAL= 0
##$PSIGN= 0
##$REVERSE= no
##$SF= 81.014009
##$SI= 32768
##$SIGF1= 270.0111
##$SIGF2= -158.5842
##$SINO= 77.54984
##$SIOLD= 32768
##$SREGLST= <31P.CDCl3>
##$SSB= 0
##$STSI= 32768
##$STSR= 0
##$SW_p= 37037.037037037
##$SYMM= 0
##$S_DEV= 0
##$TDeff= 32768
##$TDoff= 0
##$TI= <>
##$TILT= no
##$TM1= 0
##$TM2= 0
##$TOPLEV= 0
##$USERP1= <user>
##$USERP2= <user>
##$USERP3= <user>
##$USERP4= <user>
##$USERP5= <user>
##$WDW= 1
##$XDIM= 32768
##$YMAX_p= 478717249
##$YMIN_p= -15869772
$$ End of Bruker specific parameters
$$ ---------------------------------
##NTUPLES= NMR SPECTRUM
##VAR_NAME=  FREQUENCY,     SPECTRUM/REAL,   SPECTRUM/IMAG
##SYMBOL=    X,             R,               I
##VAR_TYPE=  INDEPENDENT,   DEPENDENT,       DEPENDENT
##VAR_FORM=  AFFN,          ASDF,            ASDF
##VAR_DIM=   32768,         32768,           32768
##UNITS=     HZ,            ARBITRARY UNITS, ARBITRARY UNITS
##FACTOR=    1.13031516577767, 1,            1
##FIRST=     37037.037037037, -1082025,      -275341
##LAST=      0,             177225,          617798
##MIN=       0,             -15869772,       0
##MAX=       37037.037037037, 478717249,     0
$$ Real data points
##PAGE= N=1
##DATA TABLE= (X++(R..R)), XYDATA
$$ [...]
20166 -9757683 -9538398 -9372726 -9180433 -8948852 -8713877 -8504719 -8329391 -8191924 -8087732
20157 -8087732 -7999697 -7901344 -7787379 -7707475 -7691895 -7661844 -7486886 -7092714 -6493935 -5770822
20147 -5770822 -5035730 -4384433 -3852346 -3434186 -3114110 -2881711 -2758570 -2777175 -2930685 -3179330
20137 -3179330 -3474995 -3763015 -3992460 -4155016 -4290089 -4419688 -4512468 -4525309 -4452731 -4317493
20127 -4317493 -4110739 -3771464 -3247993 -2559618 -1781883 -970629 -140279 637721 1198494
20118 1198494 1395461 1165518 533201 -340260 -1190162 -1813305 -2144795 -2187898 -1921296 -1267619
20108 -1267619 -185616 1192974 2571532 3649829 4282441 4514382 4504810 4435771 4454205
20099 4454205 4635775 4955619 5284173 5465982 5435106 5222511 4894161 4582372 4494758 4761236
20089 4761236 5312791 5928028 6362356 6466002 6224673 5711899 5005944 4136793 3132783
20080 3132783 2109020 1256268 712631 455590 341087 212760 -45134 -517465 -1276201
20071 -1276201 -2340460 -3592163 -4769859 -5594496 -5913698 -5737094 -5203425 -4540115 -3979866
20062 -3979866 -3677303 -3670168 -3855578 -4064271 -4233077 -4438526 -4759746 -5189018 -5703557 -6345121
20052 -6345121 -7119234 -7866536 -8336413 -8376802 -7990411 -7261313 -6318389 -5360392 -4636664 -4327335
20042 -4327335 -4399357 -4618639 -4754661 -4695680 -4357431 -3640311 -2537268 -1206110 106239
20033 106239 1198012 1956905 2356643 2469752 2412526 2275521 2109877 1918986 1651858 1251273
20023 1251273 724909 141409 -425520 -881761 -1037243 -686202 171005 1288059 2347370
20014 2347370 3143209 3643043 3880175 3829287 3442361 2731185 1760109 648418 -374314
20005 -374314 -989817 -953782 -267634 824375 2019345 3145208 4179148 5109997 5861492
19996 5861492 6353388 6555244 6480212 6173448 5679399 5006553 4160131 3227206 2393889 1828869
19986 1828869 1574974 1602847 1908224 2464739 3110779 3574173 3637486 3264286 2561853 1676301
19976 1676301 763652 15132 -380189 -334181 84626 696990 1304498 1746135 1926403 1819340
19966 1819340 1449618 880702 259114 -176041 -233552 75761 557282 994887 1304511 1587672
19956 1587672 2014538 2614056 3227770 3664655 3858907 3843565 3616104 3132750 2424374 1616319
19946 1616319 813180 18577 -829835 -1756754 -2700955 -3553113 -4208611 -4655215 -5038268
19937 -5038268 -5526967 -6107829 -6595455 -6778499 -6531667 -5906263 -5100937 -4305339 -3630518
19928 -3630518 -3131383 -2809784 -2600711 -2381774 -2052827 -1591793 -1000887 -244521 750597
19919 750597 1998566 3327604 4429487 5081394 5304441 5305573 5279142 5269157 5194859 4960912
19909 4960912 4539958 3963328 3286263 2599535 1995022 1507912 1125359 796300 449814
19900 449814 54344 -385799 -890154 -1494739 -2196018 -2979910 -3826954 -4590096 -5008346 -4940541
19890 -4940541 -4504919 -3936982 -3354535 -2679300 -1740370 -495525 829494 1899634 2543812
19881 2543812 2834116 2979374 3163644 3415789 3572180 3373757 2684658 1611594 426512
19872 426512 -557233 -1108013 -1180678 -922414 -586748 -434050 -649588 -1289583 -2259640 -3322316
19862 -3322316 -4192776 -4678543 -4719637 -4377319 -3836107 -3273341 -2746492 -2288591 -1993133 -1951765
19852 -1951765 -2180332 -2602317 -3054526 -3337838 -3313033 -2978576 -2457463 -1899642 -1417227 -1079289
19842 -1079289 -900011 -850850 -917018 -1110586 -1422126 -1827761 -2363979 -3096748 -3998843 -4964838
19832 -4964838 -5901923 -6709915 -7256319 -7467970 -7413473 -7251259 -7104288 -7005382 -6944609 -6925815
19822 -6925815 -6940823 -6926228 -6820154 -6613655 -6335554 -6055594 -5847677 -5704759 -5541085 -5281466
19812 -5281466 -4942932 -4618200 -4336685 -3999585 -3515934 -2917568 -2316846 -1849800 -1655367
19803 -1655367 -1782148 -2089305 -2354237 -2471343 -2487957 -2506063 -2576542 -2647522 -2612425 -2407873
19793 -2407873 -2046819 -1587739 -1154726 -962201 -1176074 -1729422 -2312994 -2575073 -2381024
19784 -2381024 -1862328 -1243385 -688758 -255125 110600 513326 1010928 1554729 1995116
19775 1995116 2173766 2050526 1664208 1023605 188566 -680272 -1443670 -2054741 -2506335
19766 -2506335 -2776172 -2854804 -2794478 -2665914 -2466515 -2142889 -1709623 -1251387 -814086 -373013
19756 -373013 97992 541014 780578 632372 86776 -666554 -1408716 -2061129 -2676383 -3320036
19746 -3320036 -4002012 -4641043 -5077054 -5199002 -5075343 -4910518 -4867065 -4936804 -4943475 -4693596
19736 -4693596 -4167976 -3542158 -3010585 -2659698 -2498023 -2510128 -2676387 -2948515 -3211889 -3327960
19726 -3327960 -3227910 -2976400 -2759532 -2765241 -3036362 -3435655 -3765434 -3939209 -4030276 -4164744
19716 -4164744 -4383392 -4605371 -4710762 -4630721 -4367452 -3973133 -3527675 -3135382 -2921927 -2982948
19706 -2982948 -3316579 -3829761 -4377959 -4793762 -4947940 -4829485 -4525600 -4096078 -3529196
19697 -3529196 -2802966 -1926098 -946150 50455 1000339 1914176 2796287 3570160 4158503
19688 4158503 4595550 5011706 5498648 6032863 6546845 6982241 7247950 7226744 6876803 6274726
19678 6274726 5517461 4633016 3645155 2707890 2100455 1998434 2284151 2634334 2731441 2413943
19668 2413943 1729461 878504 68907 -607339 -1179569 -1711866 -2186573 -2506443 -2608485
19659 -2608485 -2506033 -2244762 -1871687 -1452942 -1091072 -853446 -667181 -349268 249176
19650 249176 1115387 2062247 2864966 3411049 3697741 3738035 3530489 3116122 2610935 2161422
19640 2161422 1882970 1817190 1928572 2120524 2270034 2265186 2024698 1538438 896608 254857
19630 254857 -239959 -494714 -493219 -321643 -158607 -182535 -442866 -829257 -1170669 -1354631
19620 -1354631 -1380212 -1314252 -1178333 -920257 -518102 -28440 492211 1010997 1434449 1594328
19610 1594328 1376350 798720 -24601 -925677 -1764773 -2516749 -3234044 -3944542 -4610986
19601 -4610986 -5162437 -5547119 -5757438 -5822062 -5765849 -5554592 -5115138 -4436795 -3659282 -3052167
19591 -3052167 -2851671 -3105739 -3677322 -4318203 -4760907 -4886023 -4798535 -4675185 -4602136 -4580817
19581 -4580817 -4589214 -4588109 -4551813 -4522607 -4563126 -4686197 -4870947 -5076815 -5242930 -5352176 -5457313
19570 -5457313 -5616675 -5824288 -5977944 -5923477 -5576435 -5000570 -4335604 -3672958 -3027224 -2391428
19560 -2391428 -1786083 -1266220 -933675 -927270 -1323773 -2045425 -2913312 -3746611 -4398568 -4803967
19550 -4803967 -5024447 -5180323 -5280284 -5175853 -4789533 -4280570 -3851150 -3514889 -3159717 -2703112
19540 -2703112 -2130316 -1485719 -837727 -224725 335986 824395 1284388 1850071 2631316
19531 2631316 3615687 4656467 5490168 5819599 5496755 4651410 3611980 2701307 2082397
19522 2082397 1740738 1588298 1579883 1693309 1832302 1826611 1536006 952569 200381 -567458
19512 -567458 -1225981 -1671211 -1823000 -1615464 -1020562 -125462 873752 1759633 2374247 2706972
19502 2706972 2870007 2938052 2892796 2702234 2372699 1953403 1507689 1073989 663285 290801
19492 290801 -32245 -359706 -807292 -1456895 -2303953 -3283937 -4302881 -5227435 -5859466
19483 -5859466 -6026305 -5700532 -4972693 -3977398 -2893238 -1931080 -1266050 -978872 -1023525
19474 -1023525 -1217171 -1326867 -1250365 -1075844 -970663 -1082989 -1477023 -2046719 -2517997 -2608815
19464 -2608815 -2184920 -1320206 -271001 670290 1333559 1721979 1979656 2284254 2735358
19455 2735358 3293948 3745178 3791082 3294074 2425253 1606347 1306559 1760235 2829650
19446 2829650 4161228 5415558 6350808 6826992 6811848 6369522 5604461 4605901 3455284
19437 3455284 2254031 1161320 402126 143850 381881 973640 1711509 2398292 2923903
19428 2923903 3271196 3493946 3729861 4158142 4837852 5613185 6237656 6545910 6509652 6241795
19418 6241795 5947250 5799863 5862759 6088822 6336764 6416281 6187436 5666888 5016814 4400107
19408 4400107 3889450 3490489 3172412 2866848 2495398 2006769 1371143 584308 -294287
19399 -294287 -1152318 -1913584 -2577851 -3129722 -3440788 -3342307 -2828532 -2138244 -1584949 -1320636
19389 -1320636 -1249934 -1148584 -907821 -662127 -635019 -902879 -1350121 -1799665 -2141749 -2381004
19379 -2381004 -2589729 -2844291 -3225729 -3773991 -4393943 -4867889 -5021379 -4895347 -4715102
19370 -4715102 -4702137 -4930278 -5336446 -5828080 -6325496 -6750107 -7025359 -7064881 -6794180 -6215979
19360 -6215979 -5440503 -4675664 -4156001 -4013245 -4211361 -4588349 -4954354 -5182608 -5228332 -5068266
19350 -5068266 -4661289 -3988764 -3099487 -2104433 -1169119 -512955 -331106 -632095 -1197717
19341 -1197717 -1740815 -2053394 -2092076 -2004600 -2005717 -2206388 -2569217 -2955327 -3185761 -3149522
19331 -3149522 -2894564 -2573950 -2342964 -2316134 -2502150 -2789876 -3067102 -3306474 -3531736 -3790244
19321 -3790244 -4179576 -4797136 -5615641 -6464814 -7185454 -7739978 -8126948 -8306784 -8226879 -7816256
19311 -7816256 -7037537 -6012316 -5001973 -4198935 -3570439 -2940443 -2179432 -1304926 -475610
19302 -475610 110739 336428 191433 -247706 -837670 -1417542 -1843056 -1968833 -1706415 -1171447
19292 -1171447 -674439 -487033 -636857 -921712 -1091906 -1062572 -983426 -1047997 -1224246 -1248100
19282 -1248100 -913128 -294754 315708 622533 468577 -145091 -1130244 -2384109 -3778850
19273 -3778850 -5168602 -6453412 -7589676 -8558628 -9333482 -9874260 -10162395 -10178445 -9855568
19264 -9855568 -9122848 -7998763 -6615770 -5174045 -3902215 -2986999 -2473060 -2257354 -2171514
19255 -2171514 -2081885 -1932295 -1692853 -1317968 -788677 -179101 366085 729384 884853 874335
19245 874335 708006 318541 -326786 -1114147 -1820018 -2248185 -2343042 -2227718 -2129193 -2206492
19235 -2206492 -2453692 -2787615 -3152754 -3481737 -3673364 -3679758 -3594760 -3605987 -3811478 -4140636
19225 -4140636 -4470930 -4713493 -4779833 -4565344 -4001440 -3117938 -2055705 -1000722 -96922
19216 -96922 579658 1029485 1326408 1529634 1594800 1437591 1067581 585921 66173 -462222
19206 -462222 -929743 -1258354 -1439602 -1459405 -1250537 -821645 -354688 -97781 -155259 -391314
19196 -391314 -572816 -596844 -508158 -359899 -192526 -92387 -147271 -342924 -541044 -570014
19186 -570014 -358846 -2115 330445 536651 612877 541413 233068 -322140 -952005 -1422548
19176 -1422548 -1599723 -1523538 -1342341 -1179556 -1088026 -1104567 -1309143 -1777471 -2457738 -3134264
19166 -3134264 -3531358 -3479091 -3017915 -2340892 -1638241 -1013775 -533711 -239474 -70291 99996
19156 99996 335290 583340 700811 596415 387793 277508 296296 289428 88246 -338297
19146 -338297 -860160 -1324685 -1695313 -2027076 -2384556 -2787788 -3187910 -3531040 -3841825 -4202241
19136 -4202241 -4637784 -5061053 -5345773 -5407709 -5214500 -4781026 -4214704 -3744803 -3572916 -3702539
19126 -3702539 -3982981 -4214382 -4205397 -3843864 -3154709 -2285169 -1427340 -767829 -471324 -604342
19116 -604342 -1068854 -1687272 -2334888 -2956837 -3511147 -3953847 -4258349 -4440026 -4559149 -4684300
19106 -4684300 -4890712 -5293454 -6007628 -7012858 -8070954 -8855197 -9221100 -9313981 -9391925
19097 -9391925 -9632706 -10065650 -10534453 -10753444 -10497399 -9789204 -8898180 -8084648 -7370391
19088 -7370391 -6594003 -5587493 -4274446 -2720729 -1138710 201134 1092819 1453021 1316272
19079 1316272 818737 175231 -424996 -941230 -1447490 -2008192 -2632462 -3262536 -3777313
19070 -3777313 -4099436 -4291830 -4485312 -4751974 -5074382 -5392181 -5659101 -5862604 -6051300
19061 -6051300 -6332938 -6748010 -7163269 -7360102 -7215106 -6800781 -6325814 -5956428 -5705298
19052 -5705298 -5485500 -5223096 -4914568 -4605209 -4314477 -3992689 -3579204 -3113503 -2720368
19043 -2720368 -2454391 -2212059 -1817485 -1238862 -707954 -548275 -891430 -1577567 -2286460
19034 -2286460 -2778986 -3057106 -3246444 -3384340 -3435491 -3416817 -3390005 -3402031 -3480924 -3613194
19024 -3613194 -3711800 -3641979 -3316142 -2781727 -2195940 -1731035 -1483736 -1437423 -1515871 -1648132
19014 -1648132 -1787237 -1939853 -2209583 -2738173 -3563450 -4598990 -5728211 -6867180 -7960191
19005 -7960191 -8941115 -9711752 -10163717 -10223395 -9877318 -9184144 -8279126 -7322613 -6391861 -5434036
18995 -5434036 -4351316 -3128314 -1875458 -745592 165157 833028 1276801 1505623 1507105
18986 1507105 1301870 969974 621642 362113 239497 204257 163166 46374 -152821 -352964
18976 -352964 -457851 -477850 -544923 -782619 -1185509 -1647502 -2089071 -2520494 -2993731 -3528388
18966 -3528388 -4059056 -4457593 -4640929 -4599916 -4331218 -3823599 -3065253 -2061467 -900861
18957 -900861 207584 979542 1221267 998875 569429 139286 -252631 -635978 -993189
18948 -993189 -1249253 -1304365 -1073077 -519466 310796 1273622 2162509 2775897 2962814 2647975
18938 2647975 1891572 897640 -112079 -994286 -1708581 -2347506 -3044632 -3779638 -4362558
18929 -4362558 -4624333 -4564532 -4337722 -4129571 -4028376 -3987901 -3910702 -3783909 -3749608 -4007116
18919 -4007116 -4593214 -5281619 -5733629 -5773088 -5494748 -5101373 -4722533 -4398308 -4138962 -3955813
18909 -3955813 -3857034 -3847956 -3924384 -4039090 -4083450 -3969830 -3742798 -3534253 -3401979 -3276832
18899 -3276832 -3068455 -2758893 -2401246 -2056923 -1736766 -1418370 -1142130 -1031478 -1140951
18890 -1140951 -1383923 -1674049 -2023790 -2498699 -3091995 -3627749 -3883343 -3838807 -3679696 -3539915
18880 -3539915 -3353465 -2967845 -2307708 -1402618 -367551 615257 1350312 1667471 1447720
18871 1447720 682003 -465091 -1696431 -2767025 -3610102 -4279843 -4858257 -5416135 -6015692
18862 -6015692 -6714011 -7522551 -8381387 -9172163 -9767458 -10094422 -10121927 -9828114 -9234896 -8441553
18852 -8441553 -7607085 -6896232 -6415183 -6157405 -5993728 -5741935 -5275325 -4595252 -3797829
18843 -3797829 -3008986 -2367012 -1982370 -1874496 -1954000 -2081441 -2176515 -2257989 -2368215 -2511359
18833 -2511359 -2661831 -2753959 -2692977 -2451969 -2110029 -1805115 -1678404 -1773753 -1971527 -2085102
18823 -2085102 -2048970 -1958415 -1928168 -1981712 -2053120 -2045394 -1893473 -1607154 -1279535 -1007706 -771092
18812 -771092 -440871 75044 772056 1619305 2592167 3628394 4574659 5221625 5423435
18803 5423435 5179796 4633237 3985688 3382413 2853405 2356185 1840515 1256557 558853
18794 558853 -195939 -787018 -974676 -681616 -16476 806683 1546159 2029653 2285814 2503733
18784 2503733 2808896 3145589 3343128 3266064 2954740 2605248 2411346 2442729 2637947 2893772
18774 2893772 3115126 3177020 2940215 2363892 1549324 624143 -335140 -1201980 -1741402 -1739384
18764 -1739384 -1164885 -212177 769084 1422108 1540140 1114638 281547 -716094 -1561654
18755 -1561654 -1987736 -1904969 -1434582 -850163 -435992 -358391 -627183 -1112829 -1618667 -2015544
18745 -2015544 -2332543 -2693807 -3181887 -3805013 -4559231 -5409572 -6215673 -6778126 -6980013
18736 -6980013 -6842231 -6452363 -5884695 -5181718 -4365735 -3441181 -2389909 -1209468 -1009
18727 -1009 1035378 1754194 2162313 2352211 2384248 2227601 1814714 1172970 459546 -168702
18717 -168702 -661639 -1063455 -1469306 -1976166 -2611324 -3293810 -3909519 -4408949 -4776906 -4978441
18707 -4978441 -5008104 -4908619 -4700082 -4339043 -3766292 -2958066 -1934522 -769328 419759
18698 419759 1496249 2321648 2800808 2950443 2896249 2748447 2527754 2290822 2203736 2380183
18688 2380183 2726025 3028562 3165504 3191282 3277835 3582711 4137182 4844145 5531698 5999643
18678 5999643 6113765 5861383 5318393 4652244 4090920 3747895 3497977 3135045 2619877
18669 2619877 2088243 1661822 1352235 1116682 919051 721389 432396 -67605 -750694
18660 -750694 -1357659 -1593837 -1360628 -749089 90817 1001784 1838748 2486369 2881425 3089713
18650 3089713 3289452 3609751 4063205 4601582 5120933 5428564 5335606 4818443 4040137 3259946
18640 3259946 2738230 2642051 2972627 3605249 4418482 5313837 6131678 6672315 6827338 6625911
18630 6625911 6141324 5425802 4551835 3672410 2995533 2660498 2658670 2884334 3234607 3678690
18620 3678690 4220203 4791988 5248616 5461984 5403290 5108240 4622115 4030135 3466446 3021855
18610 3021855 2639661 2171965 1568277 931281 371431 -98281 -492005 -759099 -848407 -817398
18600 -817398 -772136 -713575 -521009 -72358 645524 1488415 2221126 2683087 2896597 3016139
18590 3016139 3129735 3116402 2798376 2214549 1657372 1458448 1776061 2519263 3365355 3891347
18580 3891347 3784058 2970771 1642214 162739 -1119889 -2012118 -2483553 -2586365 -2408296
18571 -2408296 -2087740 -1753905 -1417229 -964730 -291699 525976 1212648 1474973 1208777
18562 1208777 542446 -296320 -1098182 -1687010 -1921972 -1732233 -1157427 -346008 482808
18553 482808 1118532 1462544 1511807 1250578 647274 -275632 -1445474 -2784430 -4180665
18544 -4180665 -5453346 -6436853 -7088703 -7492429 -7786015 -8060270 -8276110 -8288350 -7939946
18535 -7939946 -7165105 -6087572 -4979604 -4051205 -3372131 -2974147 -2857434 -2923258 -2995207
18526 -2995207 -2917023 -2649200 -2291986 -2027708 -2012448 -2274189 -2700924 -3129576 -3444177 -3630912
18516 -3630912 -3782494 -4026534 -4419568 -4878672 -5226452 -5327289 -5179825 -4905263 -4672624
18507 -4672624 -4609300 -4737292 -4962358 -5105676 -4986801 -4532711 -3814753 -3006912 -2323674 -1956133
18497 -1956133 -2038255 -2632381 -3698610 -5062505 -6445058 -7583966 -8345492 -8721573 -8722861
18488 -8722861 -8323062 -7527795 -6398501 -5005154 -3432179 -1819986 -325908 993457
18480 993457 2186930 3242430 4024490 4395648 4318035 3871390 3226719 2597467 2143063
18471 2143063 1822867 1402523 681723 -366855 -1668276 -3115752 -4594940 -6027891 -7393723
18462 -7393723 -8682559 -9815840 -10666804 -11170408 -11335955 -11154980 -10577551 -9634104 -8545817
18453 -8545817 -7601808 -6956951 -6651104 -6695508 -7003798 -7355198 -7524285 -7413693 -7067932 -6617520
18443 -6617520 -6156238 -5642734 -4997729 -4259045 -3551728 -2939589 -2423761 -2074546 -2027906 -2349389
18433 -2349389 -2969037 -3713793 -4384545 -4852468 -5110197 -5229102 -5265490 -5192015 -4924476 -4462375
18423 -4462375 -3975525 -3676094 -3624414 -3685311 -3628327 -3259919 -2495057 -1340079 133432 1775799
18413 1775799 3369105 4704092 5669404 6274162 6605026 6809161 7096826 7634399 8400214
18404 8400214 9204251 9798097 9971185 9613080 8726177 7424570 5895126 4359252 3051526
18395 3051526 2140311 1632102 1338830 968809 341775 -469782 -1257630 -1869931 -2252270
18386 -2252270 -2449222 -2624438 -2950975 -3440241 -3949473 -4356472 -4671842 -4976301 -5310921
18377 -5310921 -5659646 -5985392 -6259870 -6476830 -6638214 -6737305 -6732054 -6553236 -6177608 -5661656
18367 -5661656 -5101568 -4576459 -4106712 -3662559 -3233378 -2872057 -2631579 -2467011 -2247279
18358 -2247279 -1849041 -1181256 -195996 1025876 2235120 3132838 3544959 3499771 3144112
18349 3144112 2578683 1820970 917847 14725 -708290 -1172744 -1476257 -1795320 -2221159
18340 -2221159 -2723176 -3270082 -3907789 -4681048 -5524082 -6276258 -6807470 -7076676 -7084885 -6848157
18330 -6848157 -6416090 -5850592 -5190763 -4487063 -3846292 -3401976 -3250040 -3395956 -3715643
18321 -3715643 -3994978 -4038379 -3740083 -3133880 -2373777 -1615136 -978563 -576119 -442746 -491881
18311 -491881 -593244 -621394 -461672 -105286 291697 538414 543702 330145 -431 -349714
18301 -349714 -725301 -1210135 -1823324 -2487551 -3096993 -3597805 -4009096 -4325593 -4460363 -4338747
18291 -4338747 -3994573 -3540143 -3099406 -2758962 -2506812 -2208897 -1689887 -855199 269386
18282 269386 1503411 2485943 2870443 2594897 1893068 1123163 622411 570778 878576 1250629
18272 1250629 1394192 1185808 708259 179136 -221251 -470859 -618907 -679496 -639914 -499869
18262 -499869 -292823 -94101 -25019 -212902 -687056 -1337154 -2015356 -2623761 -3084809 -3349047
18252 -3349047 -3424121 -3311440 -2994340 -2533210 -2119839 -1987137 -2228682 -2710219 -3174897 -3408590
18242 -3408590 -3335748 -3040038 -2717565 -2595055 -2819861 -3327300 -3812455 -3937259 -3575345 -2798469
18232 -2798469 -1726663 -484861 760546 1793529 2412498 2504455 2077786 1258903 257306
18223 257306 -674897 -1331225 -1659104 -1733255 -1650646 -1474055 -1227762 -929431 -638160 -477416
18213 -477416 -573584 -976469 -1654141 -2510272 -3380772 -4082544 -4521136 -4769593 -5031640 -5469177
18203 -5469177 -6069502 -6692204 -7146993 -7219844 -6797779 -6000288 -5065203 -4118141 -3150117 -2168157
18193 -2168157 -1254518 -517982 -51509 76335 -137900 -586000 -1108571 -1616921 -2163008
18184 -2163008 -2888284 -3849597 -4877577 -5665493 -5988991 -5794499 -5150430 -4168545 -2963469
18175 -2963469 -1664858 -404627 723498 1698234 2570569 3385804 4136192 4811778 5380132
18166 5380132 5746672 5837770 5685907 5386989 4957029 4284968 3295851 2110641 1028985
18157 1028985 382151 333244 788005 1492368 2149663 2501741 2443063 2046154 1465203 887166
18147 887166 518181 468236 622882 731443 621163 225729 -500269 -1517690 -2595044
18138 -2595044 -3368208 -3561072 -3202335 -2605830 -2166964 -2201717 -2841754 -3977356 -5275365
18129 -5275365 -6310022 -6814945 -6807581 -6431948 -5760726 -4822831 -3757733 -2835278 -2320989
18120 -2320989 -2327477 -2742226 -3310648 -3782133 -3968525 -3761608 -3166538 -2330037 -1476471 -778803
18110 -778803 -328798 -236957 -654953 -1612693 -2887271 -4121448 -5051772 -5549259 -5528695 -4972023
18100 -4972023 -4035353 -3008207 -2127283 -1504310 -1219167 -1377077 -2019512 -2969991 -3870220
18091 -3870220 -4472316 -4797797 -5001358 -5210530 -5477808 -5806363 -6203823 -6706451 -7325532
18082 -7325532 -8008950 -8706407 -9406154 -10058883 -10541371 -10721687 -10493646 -9778302 -8595778
18073 -8595778 -7132202 -5683755 -4503425 -3701102 -3293874 -3268309 -3524225 -3851640 -4054118
18064 -4054118 -4033371 -3752814 -3205969 -2453253 -1629923 -885033 -313045 95408 432056 793937
18054 793937 1259041 1889370 2701309 3671122 4773529 5971695 7164235 8183760 8913890
18045 8913890 9387580 9730367 10050717 10357739 10535308 10448950 10074716 9475207 8696247 7736422
18035 7736422 6613749 5412171 4228823 3151451 2268185 1613519 1137126 725015 241291
18026 241291 -375589 -1042408 -1631009 -2097108 -2456082 -2718813 -2880605 -2956604 -3006561 -3076050
18016 -3076050 -3106470 -2965999 -2602704 -2103122 -1592788 -1154664 -820347 -570677 -353257 -138223
18006 -138223 42559 139897 183700 288959 531935 854706 1093838 1115788 971386 882220
17996 882220 1046351 1485695 2064540 2579544 2826743 2651440 1994852 934303 -339952
17987 -339952 -1599257 -2618122 -3217052 -3356077 -3169814 -2864155 -2574435 -2326642 -2125097
17978 -2125097 -2024858 -2089486 -2339394 -2729639 -3144437 -3453674 -3597062 -3581984 -3384673 -2935160
17968 -2935160 -2235123 -1402625 -551605 322097 1267722 2237069 3088796 3692508 3997845
17959 3997845 4049834 3959531 3817333 3659089 3533245 3481702 3463427 3424563 3403377 3489636 3718594
17948 3718594 4017600 4251238 4298121 4095209 3678422 3191254 2803480 2580053 2410834 2070805
17938 2070805 1399827 479480 -392420 -919753 -987577 -653905 -30488 749773 1508653 2061020
17928 2061020 2236099 1906147 1159526 377547 -30551 87261 643352 1464307 2323767
17919 2323767 2922643 2982449 2398381 1261967 -235759 -1861755 -3380599 -4591997 -5342140
17910 -5342140 -5554343 -5280071 -4709714 -4106734 -3689889 -3536982 -3577176 -3665291 -3659084 -3482579
17900 -3482579 -3227808 -3172762 -3584282 -4469535 -5530534 -6374739 -6771904 -6749494 -6518027 -6322677
17890 -6322677 -6308682 -6450905 -6630531 -6805954 -7017852 -7237340 -7313625 -7083696 -6539678 -5868525
17880 -5868525 -5326411 -5116283 -5307327 -5816640 -6497645 -7213007 -7838470 -8288362 -8573601
17871 -8573601 -8816519 -9177564 -9736239 -10425316 -11046190 -11341719 -11109859 -10321816 -9155129
17862 -9155129 -7891912 -6763602 -5898343 -5355336 -5105968 -5040494 -5040601 -5052365 -5110462 -5272160
17852 -5272160 -5522847 -5760491 -5866701 -5809458 -5691491 -5635558 -5618206 -5494119 -5199552 -4869853
17842 -4869853 -4737550 -4927690 -5365841 -5881213 -6342725 -6638589 -6616170 -6205560 -5549815 -4882244
17832 -4882244 -4295009 -3693917 -2969540 -2164663 -1454538 -964178 -682745 -553405 -515316 -459100
17822 -459100 -258994 112302 554401 926822 1146531 1226732 1242208 1269590 1342638 1421197
17812 1421197 1412454 1228164 811637 150962 -660266 -1412542 -1932952 -2232500 -2457514 -2700458
17802 -2700458 -2881306 -2845239 -2548269 -2086528 -1640478 -1403949 -1433726 -1580801 -1605348 -1350843
17792 -1350843 -852347 -306281 81559 236991 222648 152986 121554 179631 348431 635960
17782 635960 1070610 1683595 2426474 3167821 3787073 4222791 4447982 4468400 4355778 4219625
17772 4219625 4108203 3984508 3831476 3717322 3711103 3796294 3910222 4013340 4075864 4023917
17762 4023917 3747794 3162287 2267290 1188128 174389 -521670 -832998 -878488 -798053
17753 -798053 -644797 -370072 103578 723416 1268064 1524223 1456043 1180341 833721 483258
17743 483258 126516 -234565 -558762 -836299 -1145742 -1612534 -2345206 -3398159 -4720524
17734 -4720524 -6109436 -7288755 -8065729 -8371968 -8218940 -7674071 -6850985 -5888586 -4918544
17725 -4918544 -4064474 -3469954 -3225345 -3237389 -3283525 -3205674 -3000689 -2755175 -2570360 -2556094
17715 -2556094 -2817068 -3411009 -4310047 -5354769 -6264711 -6780375 -6834491 -6558902 -6143293
17706 -6143293 -5725663 -5368945 -5077843 -4797332 -4406253 -3809556 -3077678 -2433117 -2088777
17697 -2088777 -2110304 -2377641 -2660653 -2805110 -2810656 -2706205 -2527608 -2414657 -2501646 -2724590
17687 -2724590 -2897476 -2922642 -2810944 -2567604 -2175598 -1661623 -1126523 -690669 -421989 -336128
17677 -336128 -424177 -652055 -956563 -1233449 -1334559 -1162694 -773455 -297686 219146 845030
17667 845030 1669788 2724137 3910360 4981080 5670939 5842077 5493360 4714301 3684803
17658 3684803 2672257 1924496 1526786 1389723 1377685 1430802 1602626 1988194 2558952 3099846
17648 3099846 3394385 3444966 3437082 3499112 3570956 3502645 3227520 2845015 2543326 2469221 2679163
17637 2679163 3160819 3871937 4744619 5656498 6446998 6995681 7249530 7162667 6706292 5952260
17627 5952260 5046220 4111149 3250967 2582785 2174974 1977850 1849423 1662080 1360940
17618 1360940 929199 362703 -278087 -811962 -1018622 -774168 -109800 787416 1642130
17609 1642130 2240858 2557268 2689561 2684297 2480971 2000170 1225309 243605 -726858 -1382618
17599 -1382618 -1479804 -955123 78152 1387456 2673293 3692528 4416439 4992098 5496401
17590 5496401 5830777 5877332 5615136 5079991 4330050 3458995 2594321 1877514 1396777 1116551
17580 1116551 900932 584328 43910 -689391 -1382690 -1753074 -1695347 -1355345 -990750 -744968
17570 -744968 -551524 -280501 74483 360319 381049 73441 -427185 -877072 -1085823 -1055478
17560 -1055478 -954408 -952305 -1140349 -1579003 -2316508 -3310444 -4372015 -5273410 -5916061 -6340961
17550 -6340961 -6593159 -6630840 -6347199 -5651729 -4557886 -3196653 -1764881 -517193 265991
17541 265991 432317 108994 -359965 -652986 -625562 -317424 140596 629703 1011842 1070791
17531 1070791 615414 -379034 -1809462 -3562255 -5494339 -7335979 -8694888 -9227587 -8867323
17522 -8867323 -7885085 -6721591 -5743195 -5114791 -4865576 -5011006 -5554250 -6408463 -7387159
17513 -7387159 -8284416 -8958197 -9350458 -9477684 -9421347 -9294746 -9158448 -8985654 -8762867 -8527682
17503 -8527682 -8249597 -7824060 -7207316 -6447927 -5638881 -4881877 -4199999 -3506546 -2748185
17494 -2748185 -2040796 -1621556 -1644790 -2035804 -2594689 -3186665 -3764143 -4268496 -4610599 -4733809
17484 -4733809 -4605897 -4194847 -3553319 -2820008 -2077491 -1323517 -578924 51479 417718
17475 417718 422080 133406 -208978 -370180 -257162 124509 749581 1567746 2489942 3437904
17465 3437904 4361072 5193370 5851909 6273699 6406648 6207461 5719784 5106579 4530477
17456 4530477 4033180 3546076 2987845 2378577 1878169 1703220 1982187 2672721 3596976
17447 3596976 4549589 5385781 6030999 6428988 6512565 6257303 5707724 4903013 3848744
17438 3848744 2587013 1225669 -108293 -1277212 -2115190 -2489236 -2354477 -1765797 -856097
17429 -856097 262652 1501763 2695759 3648043 4304449 4794223 5236084 5607049 5866744
17420 5866744 6100764 6445444 6917911 7400699 7752568 7893144 7823232 7580089 7214022 6801787
17410 6801787 6372216 5852365 5154690 4269906 3255056 2187483 1181597 388480 -123194
17401 -123194 -448205 -763949 -1168439 -1612787 -1991115 -2211272 -2181171 -1840611 -1278993 -761104
17391 -761104 -515376 -535719 -676578 -854937 -1047594 -1189678 -1200332 -1059380 -829266 -590499
17381 -590499 -349857 -49351 364637 922429 1639896 2465007 3234902 3779741 4083184 4286699
17371 4286699 4536851 4863594 5151327 5181221 4820006 4198077 3582319 3123001 2791589 2484466
17361 2484466 2147184 1847503 1721661 1843186 2187958 2683170 3238087 3750512 4101207
17352 4101207 4198980 4044698 3694652 3180861 2531228 1845793 1268081 859736 555265 255478
17342 255478 -84221 -446266 -786894 -1097250 -1451025 -1948614 -2573769 -3149976 -3462286 -3426372
17332 -3426372 -3134998 -2736419 -2310159 -1842699 -1327095 -860397 -536927 -318871 -100039
17323 -100039 191448 595966 1145258 1829746 2552264 3152548 3499357 3558410 3359784 2931757
17313 2931757 2294317 1491267 616044 -181643 -745770 -1034527 -1169913 -1341228 -1686617
17304 -1686617 -2235157 -2850179 -3239004 -3155315 -2593631 -1737139 -782802 175188 1164685 2251169
17294 2251169 3403508 4468848 5297581 5824246 6012360 5830660 5309781 4557300 3734457
17285 3734457 2995190 2375598 1804360 1261906 847792 688622 827102 1161595 1459435
17276 1459435 1470885 1047666 160594 -1130521 -2648967 -4098363 -5216115 -5951152 -6433194
17267 -6433194 -6750690 -6805621 -6432427 -5614520 -4518740 -3371849 -2364519 -1563838 -880829
17258 -880829 -230163 325088 672873 813846 840419 801626 680183 480850 274666 158124
17248 158124 184379 354452 672907 1147442 1690904 2091276 2134471 1755597 1076087 318108
17238 318108 -312276 -718042 -923452 -977878 -861962 -495042 176095 1107249 2139707 3032582
17228 3032582 3572169 3689344 3468951 3081662 2734970 2624755 2841945 3295669 3746030
17219 3746030 3957310 3848576 3518536 3134448 2784720 2421298 1930636 1243631 380181
17210 380181 -556368 -1401362 -1988709 -2228055 -2109959 -1644336 -864731 117884 1159280
17201 1159280 2175535 3132549 3994374 4725766 5281741 5593740 5609246 5316765 4737318
17192 4737318 3925400 2927612 1742053 371765 -1062620 -2288395 -3002130 -3031047 -2427006
17183 -2427006 -1421587 -230007 1067732 2419812 3651232 4515875 4863047 4698858 4176846
17174 4176846 3540224 2990402 2592061 2346784 2286393 2407229 2603626 2729038 2701299 2566095
17164 2566095 2474014 2573483 2889917 3282042 3557184 3677586 3822092 4209353 4906327 5816539
17154 5816539 6795244 7712012 8401915 8664835 8337534 7340985 5736227 3793951 1935537
17145 1935537 540103 -224876 -458536 -409953 -273301 -115224 41960 162772 216500 195448
17135 195448 112056 -24598 -252983 -670099 -1371893 -2349630 -3451601 -4482013 -5319661
17126 -5319661 -5908961 -6181050 -6069881 -5554728 -4658400 -3477707 -2212277 -1102038 -304967
17117 -304967 177354 490985 813996 1229354 1701338 2122004 2390221 2446209 2240651 1760318
17107 1760318 1104205 447579 -83078 -485734 -876623 -1387730 -2034495 -2722386 -3360821
17098 -3360821 -3877223 -4150784 -4049260 -3561214 -2801218 -1867327 -782531 466487 1875243
17089 1875243 3361087 4744162 5794883 6328493 6289831 5769825 4960177 4059666 3219614
17080 3219614 2552997 2110046 1825030 1554432 1225315 910379 730416 688536 639376 473492
17070 473492 259984 121815 76299 86761 163683 338769 599803 904079 1192011 1370748
17060 1370748 1355050 1113478 653311 36424 -576131 -996417 -1147599 -1108482 -1057304 -1153571
17050 -1153571 -1389420 -1581743 -1575833 -1418381 -1319158 -1487228 -1996788 -2737522 -3494095 -4120578
17040 -4120578 -4594966 -4939438 -5179868 -5349040 -5442006 -5407927 -5221936 -4932182 -4636064 -4371817
17030 -4371817 -4033859 -3467251 -2634267 -1671919 -832238 -304182 -64128 35748 84635 52552
17020 52552 -156159 -624902 -1364791 -2295060 -3269488 -4105334 -4608111 -4628973 -4124761 -3184678
17010 -3184678 -2026233 -927164 -87825 483255 942590 1438183 1964392 2412777 2717229
17001 2717229 2898355 2978106 2905141 2610357 2112243 1552799 1135891 1004821 1137267 1362668
16991 1362668 1488929 1397094 1037135 419915 -328548 -972709 -1267947 -1061788 -374936 590302
16981 590302 1553912 2328119 2930807 3503177 4163883 4943455 5748718 6379335 6629550 6434395
16971 6434395 5939975 5403745 5032734 4912402 5066377 5537100 6332522 7309662 8183372
16962 8183372 8680422 8695198 8322277 7766010 7211336 6737021 6312803 5852128 5266615 4504254
16952 4504254 3566027 2532262 1582493 947952 808341 1204327 2019890 3033286 4018445
16943 4018445 4820285 5388361 5772146 6012522 6095198 6076913 6108603 6289376 6606758 6995926
16933 6995926 7381640 7666469 7755801 7616415 7270617 6778804 6260179 5861623 5659349 5609248
16923 5609248 5613946 5626612 5647189 5637845 5512741 5219627 4817152 4458901 4258541 4154568
16913 4154568 3960280 3539600 2852588 1890113 713344 -440916 -1212592 -1352252 -907177
16904 -907177 -185363 463354 841997 960947 987272 1092554 1300316 1484152 1499422 1336273
16894 1336273 1142797 1102035 1292346 1636427 1988050 2251293 2385252 2346430 2085946 1609486
16884 1609486 1044422 601996 433619 559552 899641 1284386 1484812 1359972 1011507
16875 1011507 736005 786138 1159122 1609310 1890070 1990119 2094974 2347263 2744739 3202716
16865 3202716 3620665 3934905 4119847 4141204 3961869 3602509 3187008 2908494 2911942 3184532
16855 3184532 3583757 3999769 4450089 4999519 5633161 6249505 6757761 7100539 7224473
16846 7224473 7123253 6862278 6524622 6178840 5872544 5610648 5368479 5131832 4903219
16837 4903219 4640043 4196371 3399852 2212159 760601 -730851 -1968119 -2653239 -2605151
16828 -2605151 -1829311 -517643 1026235 2521142 3811333 4841011 5555483 5869553 5734731
16819 5734731 5239565 4626229 4168486 4026061 4184562 4505197 4846382 5131710 5325430
16810 5325430 5380198 5223945 4818609 4234453 3620208 3094732 2715607 2532063 2601669 2887629
16800 2887629 3216913 3443225 3560104 3611725 3598116 3505486 3375206 3321241 3498749 4031759
16790 4031759 4899703 5910532 6816420 7420596 7650976 7612589 7549270 7688875 8054251 8460181
16780 8460181 8743611 8909356 9027631 9139678 9259042 9313442 9146036 8696510 8103120 7549662
16770 7549662 7131633 6884435 6803054 6840451 6939137 7040037 7087035 7049924 6887112 6512249
16760 6512249 5856308 4996628 4215509 3839613 3993533 4526699 5125675 5462332 5341846
16751 5341846 4809197 4113713 3560387 3342203 3449844 3717389 3929851 3931409 3723387 3473672
16741 3473672 3387475 3558453 3958552 4554018 5325660 6128091 6702652 6931030 6953194 6999828
16731 6999828 7200224 7527409 7876278 8198633 8522315 8885389 9336748 9974512 10895875
16722 10895875 12109179 13532417 15029030 16428566 17576230 18385535 18842665 18973560
16714 18973560 18838528 18539910 18152241 17627913 16814811 15596699 14019321 12298711 10733178
16705 10733178 9562690 8849146 8518613 8502828 8752425 9151008 9508213 9636003 9456359
16696 9456359 9033741 8460495 7744757 6845386 5791295 4718314 3763655 2973412 2368310
16687 2368310 1994083 1841316 1789165 1662814 1339714 803559 120664 -615006 -1315800 -1940786
16677 -1940786 -2562459 -3363583 -4499609 -5962360 -7579306 -9107534 -10331999 -11129595 -11507341
16668 -11507341 -11590349 -11526272 -11385473 -11152627 -10802754 -10361364 -9866810 -9315615 -8695612 -8025232
16658 -8025232 -7309303 -6489387 -5513145 -4441887 -3419625 -2525442 -1693640 -814366 109540
16649 109540 975017 1725129 2384724 2975790 3504742 3997032 4452384 4784949 4888941 4764121
16639 4764121 4512889 4231700 3937697 3605978 3270963 3026596 2903292 2786892 2523508
16630 2523508 2113605 1724842 1488331 1353758 1172165 824999 267153 -445042 -1161410
16621 -1161410 -1723447 -2028977 -2013153 -1644536 -990224 -249552 372141 824176 1163259 1410960
16611 1410960 1511785 1355979 832144 -97898 -1349405 -2692338 -3802797 -4439554 -4615346
16602 -4615346 -4557024 -4496216 -4540180 -4663459 -4749489 -4675844 -4393206 -3956800 -3493550 -3114192
16592 -3114192 -2834829 -2579876 -2242135 -1773839 -1214458 -557361 328160 1500923 2744270
16583 2744270 3681840 4044282 3810415 3219472 2636019 2268289 2025230 1707935 1260451
16574 1260451 799852 509172 525983 866655 1413403 1979423 2416338 2685859 2856505 3057444
16564 3057444 3401788 3899051 4446719 4926513 5274037 5464627 5518190 5498472 5476497 5523974
16554 5523974 5717595 6111152 6682481 7307639 7807220 8048130 7996768 7712814 7346429 7062480
16544 7062480 6933321 6964604 7173157 7570175 8121148 8722060 9194907 9382901 9300875 9163403
16534 9163403 9244904 9725604 10618389 11782160 13029963 14260244 15440789 16464539 17120912
16525 17120912 17274590 17057228 16799694 16754894 16957994 17313925 17750918 18283705 18913408
16516 18913408 19486592 19724946 19421164 18578820 17364649 15990096 14625100 13394094 12466953
16507 12466953 12043115 12159885 12593910 13032690 13323230 13488138 13549562 13450105 13138709 12675415
16497 12675415 12206139 11800308 11393356 10936230 10495883 10128454 9743978 9208211 8519016
16488 8519016 7831477 7342826 7149554 7227104 7533634 8044392 8665677 9194926 9454458 9459376
16478 9459376 9359097 9242840 9103841 8946594 8838747 8866603 9069841 9413857 9837826 10323057
16468 10323057 10884015 11500385 12041543 12262474 11957297 11105402 9820927 8267459 6730905
16459 6730905 5697708 5587304 6344924 7524039 8724249 9793217 10686399 11346519 11755511
16450 11755511 11992950 12178709 12347620 12437558 12393899 12230350 11976491 11581442 10920653 9949787
16440 9949787 8831837 7845497 7161680 6755357 6523604 6405352 6374932 6395559 6443286 6574535
16430 6574535 6905679 7519858 8379695 9285304 9955149 10219250 10141512 9956066 9877559 9949596
16420 9949596 10042625 9976086 9687580 9309258 9068263 9115336 9454340 10000375 10669104 11415804
16410 11415804 12230879 13090501 13922465 14632415 15141378 15399143 15384457 15124839 14694899
16401 14694899 14194220 13724666 13364717 13145844 13020769 12889985 12710824 12583927 12684832
16392 12684832 13086529 13664171 14135200 14189488 13654848 12572399 11182970 9899964 9187185
16383 9187185 9339734 10368876 12019693 13811089 15218756 16008549 16333973 16466198 16529220
16374 16529220 16508056 16394224 16243404 16099237 15915269 15594228 15083671 14408273 13644306
16365 13644306 12878964 12198999 11700892 11453476 11413417 11414024 11306102 11065312 10735324 10401150
16355 10401150 10275591 10640549 11609948 13020547 14571013 15990571 17072568 17635414 17569001
16346 17569001 16939729 15972156 14909292 13907253 13055471 12416983 11973672 11615603 11307976
16337 11307976 11205870 11520014 12336213 13570661 14989491 16294783 17239883 17645411 17440657
16328 17440657 16783387 15997203 15318025 14793966 14425633 14277822 14398474 14703637 14989597
16319 14989597 15080090 15016416 15054699 15412803 16106991 17069891 18291007 19740271 21190322
16310 21190322 22188128 22269251 21293921 19590093 17694956 16003477 14647216 13527789 12430966
16301 12430966 11225900 10013822 9037763 8435785 8126493 7958343 7906497 7998452 8125683
16292 8125683 8094103 7848041 7578251 7597851 8106524 9051785 10230645 11478274 12707600
16283 12707600 13833916 14719693 15203380 15221161 14907888 14521630 14282718 14312620 14658922
16274 14658922 15321483 16243193 17271441 18170168 18737866 18933010 18892773 18853777 19024080
16265 19024080 19497135 20266466 21273491 22442178 23731841 25143629 26678111 28315193
16257 28315193 29982740 31561831 32974511 34216931 35272073 36100059 36736897 37258549
16249 37258549 37644647 37763691 37492631 36849889 36004888 35194130 34632856 34449537 34652250
16240 34652250 35155225 35875905 36783428 37882508 39197979 40749073 42552194 44606926
16232 44606926 46827281 49101203 51492063 54245256 57528989 61237458 65022655 68470692
16224 68470692 71291712 73372666 74705585 75354356 75423073 74943973 73878723 72301642 70491346
16215 70491346 68784006 67396343 66405300 65810266 65546284 65461621 65320680 64854060 63840964
16206 63840964 62207853 60064050 57613579 55029579 52351718 49527775 46608194 43798026
16198 43798026 41295730 39153266 37289574 35596457 34001070 32464559 30999817 29669566
16190 29669566 28515388 27519368 26614534 25717659 24808234 23977820 23341408 22871144 22352160
16181 22352160 21550452 20429698 19149523 17916763 16899056 16153167 15594580 15099529 14614241
16172 14614241 14148679 13704655 13211531 12529721 11518886 10153674 8585356 7023784 5619786
16163 5619786 4531502 3961725 4030446 4690870 5792863 7129236 8439173 9489537 10176281
16154 10176281 10551089 10771910 10990189 11273074 11639947 12103331 12604738 12988110 13114314
16145 13114314 12967076 12625873 12203392 11813401 11519756 11315527 11179193 11098213 11004651 10755855
16135 10755855 10247157 9541457 8841559 8306695 7952362 7732699 7673489 7884374 8440533
16126 8440533 9291383 10264090 11153938 11829470 12304693 12759547 13440313 14469514 15734638
16117 15734638 16950305 17854382 18404273 18768564 19124290 19490404 19735884 19712772 19382479
16108 19382479 18829842 18179425 17495042 16767805 16010210 15299941 14734091 14403817 14387275
16099 14387275 14716556 15364096 16272828 17384299 18606947 19795146 20799996 21555107 22114072
16090 22114072 22582299 23016162 23365763 23494101 23252143 22598596 21684267 20760227 20002001
16081 20002001 19462631 19128602 18926144 18742491 18501738 18203518 17895450 17581449 17161875
16072 17161875 16538733 15754304 14930478 14105874 13233321 12329978 11522427 10944146 10681553
16063 10681553 10790511 11270697 12003745 12809350 13594986 14372076 15173063 16009355 16853699
16054 16853699 17646338 18295827 18698071 18814641 18668786 18316078 17895283 17604554 17610319 17993757
16044 17993757 18723857 19690558 20814627 22100188 23523411 24920050 26062568 26791801
16036 26791801 27041608 26817414 26184508 25249157 24155336 23062660 22061927 21149225 20336838
16027 20336838 19734862 19454795 19466574 19614484 19757820 19878548 20045796 20296197 20583666
16018 20583666 20832824 21023094 21237910 21620616 22241738 23041502 23919655 24830465 25791779
16009 25791779 26803253 27763454 28545810 29123768 29538893 29796653 29859338 29712926 29413491
16000 29413491 29084667 28883826 28994466 29630172 30946250 32960055 35645257 39036607 43164866
15991 43164866 48015218 53634190 60146235 67629957 76014095 84979471 93851983 101596976
15983 101596976 107113476 109750849 109518538 106854712 102329347 96454588 89642723 82290359
15975 82290359 74832621 67706681 61246212 55588166 50720015 46607968 43216433 40434050
15967 40434050 38081655 36018167 34205844 32672357 31447863 30538384 29885910 29310214
15959 29310214 28557376 27456762 26021758 24447043 23019896 22010753 21635209 21988976
15951 21988976 22932671 24148471 25367673 26442532 27294340 27933476 28403989 28652249 28530353
15942 28530353 27924528 26853154 25471231 23990724 22593556 21378822 20316062 19293839
15934 19293839 18257575 17219457 16166762 15085333 14034775 13112579 12398658 11940856
15926 11940856 11724957 11696614 11851599 12237119 12855677 13622171 14408755 15105695 15634267
15917 15634267 15920062 15946522 15856495 15872248 16080314 16400343 16766010 17231859 17858710 18581856
15907 18581856 19278541 19853198 20210039 20280287 20123104 19894520 19707719 19608684 19616078 19707681
15897 19707681 19798052 19777391 19598141 19318302 19064064 18924557 18863194 18749720 18464025 17950765
15887 17950765 17239759 16471649 15848843 15497299 15387621 15407886 15488552 15615549 15781828 16014752
15877 16014752 16376054 16896275 17609767 18626206 20048285 21846731 23902303 26113572
15869 26113572 28403713 30688907 32915477 35119745 37398257 39789117 42212092 44591757
15861 44591757 46972844 49401906 51776678 53927762 55709494 56911008 57271832 56679232
15853 56679232 55269709 53342371 51188544 48996021 46863944 44825539 42846725 40859557
15845 40859557 38819890 36731430 34627514 32526713 30450739 28484046 26766057 25423036
15837 25423036 24466692 23748594 23081134 22408404 21825626 21440046 21229568 21071986 20888348
15828 20888348 20678062 20421331 20016258 19360984 18466515 17455865 16472439 15591218 14803985
15819 14803985 14118924 13635493 13447343 13537981 13837378 14298318 14903698 15659426 16571470
15810 16571470 17606648 18675252 19663163 20482312 21080014 21427288 21534462 21487947 21432062
15801 21432062 21506269 21831201 22469009 23375358 24456679 25624995 26808394 27984803 29200859
15792 29200859 30558983 32144156 33934729 35815410 37649282 39311733 40687004 41712314
15784 41712314 42429691 42882506 42962071 42461594 41272066 39504266 37427216 35304341 33339314
15775 33339314 31683881 30435596 29683284 29484503 29748908 30243489 30778220 31307015 31841931
15766 31841931 32345333 32700353 32777740 32530922 32018124 31378173 30818776 30531849 30534414 30644784
15756 30644784 30662870 30522411 30250451 29872732 29406072 28899884 28447387 28112086 27806527
15747 27806527 27326539 26564773 25592228 24562496 23639969 22952890 22526084 22274021 22108693
15738 22108693 22014306 22001472 22057923 22181892 22455176 23041987 24074206 25481182 26955209
15729 26955209 28106485 28655578 28563074 27996507 27182066 26303333 25460329 24696402 24083781
15720 24083781 23709639 23587505 23663729 23908818 24378382 25140771 26151289 27253453 28268570
15711 28268570 29064050 29597850 29963522 30375331 31021628 31918261 32901222 33749936 34332756
15702 34332756 34651326 34799679 34929213 35197084 35637011 36096426 36412804 36618272 36884751
15693 36884751 37371323 38168012 39243375 40404283 41414134 42196110 42878143 43631047 44529559
15684 44529559 45596337 46878883 48391080 49997579 51455377 52616995 53535638 54354432
15676 54354432 55154116 55926508 56674842 57457351 58299607 59130363 59837935 60369522 60737565
15667 60737565 60979258 61156650 61346826 61635554 62173423 63201840 64971972 67610728 71010313
15658 71010313 74854498 78811371 82697048 86478410 90245169 94263228 98965876 104808265
15650 104808265 112170284 121347238 132511595 145750492 161225444 179257498 200274606
15643 200274606 224671340 252531508 283138301 314444282 343085394 365322017 378466319
15636 378466319 381841745 376593275 364692531 348071634 328318039 306749200 284547067
15629 284547067 262764989 242197119 223232352 205878324 190031730 175747440 163244469
15622 163244469 152739985 144326208 137902662 133129441 129545166 126788959 124671235 123113790
15614 123113790 122102614 121664211 121830188 122631843 124125906 126367368 129366921 133123082
15606 133123082 137688421 143193930 149819153 157752966 167213194 178500860 191906153 207454016
15598 207454016 224758210 243060884 261282838 278038388 291747800 300932156 304632062
15591 304632062 302693833 295736247 284866941 271291462 256043651 239970625 223776289
15584 223776289 207994206 192974626 178941583 166069530 154479853 144180620 135075483
15577 135075483 127041115 119958627 113694819 108111989 103089810 98548677 94492709 91019637
15569 91019637 88207029 85984148 84149205 82455801 80702807 78848461 77030842 75417148
15561 75417148 74064736 72928533 71927944 71005971 70193622 69649885 69600939 70167409 71216475
15552 71216475 72395634 73391112 74164546 74897408 75782649 76951154 78490998 80419449 82677849
15543 82677849 85182565 87866425 90722690 93889587 97668704 102325625 107858178 114091327
15535 114091327 121007194 128837612 137818886 147958196 158985962 170423943 181682303
15528 181682303 192144388 201220884 208361260 213098412 215140932 214448181 211302647 206299018
15520 206299018 200112996 193224088 185886814 178338897 170949912 164175114 158430765 153959026
15512 153959026 150775290 148762183 147852928 148215488 150209661 154071429 159671436 166636352
15504 166636352 174684079 183772664 193991214 205424473 218154052 232324450 248139520
15497 248139520 265867568 285869562 308522364 334013214 362129736 392025390 421845003
15490 421845003 448533761 468450747 478717249 478339577 468302521 450752042 428032072
15483 428032072 402146394 374642646 346710150 319314335 293241113 269079340 247207911
15476 247207911 227773449 210700620 195822083 183023562 172275586 163585223 156919331
15469 156919331 152157524 149098011 147476558 147028166 147601491 149226998 152074360 156374806
15461 156374806 162389579 170365725 180415430 192429140 206092267 220916024 236229035
15454 236229035 251194516 264914692 276513636 285097313 289758277 289858955 285405254 277033399
15446 277033399 265636200 252130782 237437057 222353930 207408668 192900070 179008475
15439 179008475 165863412 153590236 142287283 131977981 122610035 114101855 106369099
15432 106369099 99290025 92762982 86866679 81846170 77884798 74934579 72729550 70918674
15424 70918674 69237880 67604355 66090741 64831664 63921696 63367467 63130778 63217634 63695303
15415 63695303 64609657 65899981 67429465 69097431 70896692 72902196 75230515 77972413
15407 77972413 81139505 84726974 88835174 93613442 99038030 104811063 110456337 115495994
15399 115495994 119643725 122938466 125677580 128143139 130388410 132325480 133974316 135573059
15391 135573059 137512969 140233460 144109120 149357439 156058497 164229016 173812717 184617273
15383 184617273 196273027 208214691 219700371 229868958 237785226 242543950 243523344
15376 243523344 240614670 234230254 225132596 214201877 202241025 189876543 177578650
15369 177578650 165749405 154742898 144798312 135999363 128275686 121436632 115308543 109900230
15361 109900230 105385660 101880954 99275359 97321058 95792602 94469697 93103027 91543423
15353 91543423 89839824 88122355 86513827 85242317 84693282 85230868 87000092 89953746
15345 89953746 94018117 99189964 105533294 113053002 121403474 129650032 136439580 140608838
15337 140608838 141793097 140484784 137556830 133778732 129625268 125313268 120924012 116482058
15329 116482058 111925665 107118197 101976440 96573869 91127776 85875546 80982033 76578707
15321 76578707 72803268 69745301 67349959 65366777 63444091 61362078 59176954 57120233
15313 57120233 55418637 54198093 53441914 52980008 52531082 51800751 50592282 48847380 46622973
15304 46622973 44037023 41184978 38109394 34907902 31825744 29132625 26939669 25197647
15296 25197647 23828069 22804144 22115874 21732396 21613677 21690750 21870244 22068026 22220147
15287 22220147 22317722 22428057 22691376 23289342 24351349 25862277 27665242 29537139 31275690
15278 31275690 32790786 34120314 35346288 36520456 37600783 38420875 38739191 38326747
15270 38326747 37098375 35216256 33030849 30887126 28971750 27319509 25891143 24627589
15262 24627589 23509674 22616887 22068770 21851656 21778633 21679478 21528051 21380638 21300614 21316994
15252 21316994 21391746 21472707 21566285 21690844 21826463 21951786 22031411 21989091 21797613 21540938
15242 21540938 21322330 21140689 20926181 20692674 20588534 20808696 21479423 22557802 23807884
15233 23807884 24900788 25541817 25565087 24967972 23867035 22457597 20988463 19678191 18614469
15224 18614469 17754264 17037376 16504090 16300619 16566286 17332811 18531146 20033810 21644157
15215 21644157 23114164 24256148 25030646 25482371 25631942 25503035 25175300 24762553 24381817
15206 24381817 24140089 24121384 24352779 24789183 25381236 26141085 27068697 28048589 28872179
15197 28872179 29328267 29331038 29002410 28553570 28108422 27721558 27478423 27419059 27422856 27288678
15187 27288678 26910522 26382473 25958067 25827639 25893843 25844826 25427900 24607768 23540437
15178 23540437 22444658 21492334 20773305 20287724 19972371 19767300 19607845 19394790 19098561
15169 19098561 18849775 18847647 19146802 19558979 19819597 19787730 19464693 18955482 18439330 18083203
15159 18083203 17996967 18278007 19014315 20213557 21732536 23293135 24589451 25380736 25571315
15150 25571315 25295470 24866580 24554432 24416322 24369995 24364763 24405149 24449875 24382135 24095887
15140 24095887 23557938 22797310 21884837 20921758 20029164 19338069 18967655 18937597 19116639
15131 19116639 19380338 19769868 20384939 21214090 22159890 23135571 24094531 25057731 26102405
15122 26102405 27284651 28595377 29960023 31229682 32184884 32635451 32520167 31886532 30840896
15113 30840896 29528956 28126174 26803704 25703848 24966331 24723739 25045483 25892821 27098153
15104 27098153 28389935 29506269 30334367 30912442 31291759 31430166 31237427 30713008 29966639
15095 29966639 29112329 28213784 27305323 26455838 25815053 25511269 25472356 25428592 25125477 24496667
15085 24496667 23641850 22714323 21844949 21099174 20467490 19943157 19614336 19579720 19797390
15076 19797390 20128876 20481216 20835995 21197028 21513353 21634080 21397203 20784081 19984933
15067 19984933 19288352 18877667 18742808 18742364 18707690 18521597 18135978 17548448 16768637 15864014
15057 15864014 15047656 14596902 14642727 15082441 15701934 16347308 16973673 17544021 17958419
15048 17958419 18121377 18012868 17705244 17300770 16801131 16141159 15380896 14753900 14480539
15039 14480539 14573702 14883437 15270906 15634580 15845160 15793689 15515409 15240365 15266659 15751543
15029 15751543 16624055 17646103 18559409 19214033 19605604 19840546 20045200 20270152 20440434
15020 20440434 20410892 20081003 19382119 18220477 16601409 14810403 13334675 12587554 12722780
15011 12722780 13581765 14780467 15929716 16808064 17388399 17785541 18159389 18591238 18999248
15002 18999248 19185190 19004044 18468083 17700412 16872403 16173507 15755658 15669295 15845246
14993 15845246 16131183 16356221 16387546 16131479 15526197 14616144 13610505 12798437 12381354
14984 12381354 12336938 12461863 12584125 12716103 12995016 13496335 14171807 14935547 15703301
14975 15703301 16361631 16787180 16920420 16773469 16373833 15776815 15119964 14579047 14256177
14966 14256177 14098761 13906150 13450939 12651139 11665685 10810372 10358163 10405947 10900150
14957 10900150 11750681 12886278 14208641 15549184 16698768 17480134 17799667 17649277 17126544
14948 17126544 16468730 15948033 15673978 15544195 15378575 15076644 14688343 14345302 14109619
14939 14109619 13947501 13827738 13742513 13664409 13551747 13363600 13051137 12544774 11781096 10807970
14929 10807970 9834547 9109829 8773839 8826587 9166117 9650259 10180791 10732922 11289386
14920 11289386 11806669 12266315 12696034 13145852 13660478 14216035 14671710 14866152 14781679
14911 14781679 14578956 14481859 14666775 15193502 15946648 16711235 17329839 17744823 17924082
14902 17924082 17821560 17449481 16935392 16474265 16265310 16450199 17015593 17762634 18440294
14893 18440294 18930456 19271716 19525739 19679560 19693674 19609180 19541746 19577449 19721201 19948848
14883 19948848 20251400 20565995 20748742 20717000 20534593 20282748 19950382 19492629 18894731
14874 18894731 18172779 17370667 16553688 15821001 15323573 15157896 15227379 15297594 15155436 14697054
14864 14697054 13991191 13269954 12753476 12503706 12496685 12765110 13367130 14253001 15249081 16112409
14854 16112409 16601420 16639708 16433433 16341519 16624915 17350470 18435698 19734835 21126448
14845 21126448 22493390 23657118 24446530 24803202 24753259 24343192 23656465 22897807 22371294
14836 22371294 22282236 22596688 23140710 23771870 24430115 25114153 25850748 26665028 27588235
14827 27588235 28681888 30003128 31539682 33184278 34791375 36318501 37919990 39840713
14819 39840713 42191149 44904062 47922027 51274133 55006105 59193733 63940633 69248573
14811 69248573 74996947 81083845 87445494 93914392 100153944 105775904 110462868 113952749
14803 113952749 116034476 116642154 115898776 114043779 111344907 108043721 104289716 100098978
14795 100098978 95433334 90361212 85131064 80096176 75560127 71649044 68329631 65498470
14787 65498470 63028286 60836024 58967303 57542007 56604210 56094744 55947735 56129534 56567482
14778 56567482 57110153 57558692 57713700 57442521 56731548 55686459 54486076 53281944 52082124
14769 52082124 50775074 49262440 47532196 45660771 43773512 41974694 40296071 38704598
14761 38704598 37117882 35375038 33322197 31002949 28661290 26582609 25000595 24083202
14753 24083202 23917611 24481308 25633547 27152937 28805787 30383986 31702066 32624576
14745 32624576 33093997 33113991 32725006 32007421 31101036 30186658 29420316 28842766 28366866
14736 28366866 27900789 27421108 26940816 26514332 26230706 26145867 26249761 26497690 26859225
14727 26859225 27360160 28068855 29044147 30320387 31911563 33823828 36057823 38594212
14719 38594212 41388095 44390007 47558999 50797402 53950011 56884679 59439878 61382252
14711 61382252 62561338 63021864 62908523 62361570 61511544 60490387 59411940 58332805 57242479
14702 57242479 56139891 55073064 54038694 52911237 51522538 49836252 48074040 46571843
14694 46571843 45435006 44408998 43131664 41470777 39562711 37579671 35571584 33521166
14686 33521166 31467701 29537029 27878097 26615863 25829068 25544433 25748557 26367684 27238003
14677 27238003 28102866 28656122 28672639 28158329 27329709 26402616 25451640 24469480 23486255
14668 23486255 22627979 22098699 22093089 22650934 23608410 24741035 25923645 27098329 28158088
14659 28158088 29021135 29757187 30497247 31265064 31985871 32638672 33302421 34057029 34897421
14650 34897421 35765274 36663285 37680173 38883901 40256929 41743587 43295395 44917299
14642 44917299 46729311 48901703 51506545 54465065 57606761 60809592 64120207 67746838
14634 67746838 71951440 76918076 82693679 89235590 96492136 104428288 112983338 122005589
14626 122005589 131212318 140250679 148839672 156832556 164158444 170736769 176392042 180797896
14618 180797896 183551282 184343926 183108252 180024810 175373195 169423701 162467291 154854249
14610 154854249 146971300 139197764 131879814 125338094 119881111 115771515 113160758 112030733
14602 112030733 112124873 112890581 113513579 113159830 111355053 108115523 103717354 98446461 92528560
14593 92528560 86136712 79417222 72586323 65980168 59953783 54739631 50397520 46821285
14585 46821285 43786427 41088750 38631537 36375478 34308084 32478457 30980555 29864678
14577 29864678 29060450 28397921 27726172 27018612 26377015 25877534 25406747 24752818 23843462
14568 23843462 22827089 21931998 21280643 20832178 20457526 20054455 19637427 19338043 19279804
14559 19279804 19448476 19742938 20082580 20404636 20645729 20764545 20750987 20637408 20524972
14550 20524972 20528656 20704029 21058173 21559676 22113158 22576341 22868956 23066001 23342636 23860116
14540 23860116 24741900 26056927 27728115 29536765 31270330 32838297 34320272 35971115
14532 35971115 38097291 40894579 44398617 48517655 53093544 57904260 62620944 66849529
14524 66849529 70291908 72896336 74786220 76056774 76718236 76789968 76362722 75526297 74259144
14515 74259144 72474215 70175792 67519711 64741400 62024430 59441259 56986948 54619598
14507 54619598 52319927 50140283 48186892 46557084 45243186 44079353 42812168 41237310
14499 41237310 39299707 37094296 34770226 32453076 30223096 28099650 26090971 24294663
14491 24294663 22892460 22027825 21711416 21815592 22111434 22347114 22365205 22127285 21641178
14482 21641178 20922794 20006897 18945457 17791192 16617437 15552156 14729604 14223842 14089630
14473 14089630 14370651 14976648 15627515 16003560 15960134 15570046 14990134 14381154 13928688
14464 13928688 13801152 14025399 14439929 14808552 14992349 15012927 14957410 14883114 14789200 14612511
14454 14612511 14271794 13738530 13063149 12364658 11783087 11421386 11347901 11588173 12066212
14445 12066212 12621397 13101981 13449664 13744726 14131692 14713799 15536334 16588488 17826470
14436 17826470 19190368 20564374 21764609 22631651 23168631 23538354 23890778 24259420 24628595
14427 24628595 24972093 25204761 25193216 24857451 24264113 23640352 23263226 23277097 23627882 24182230
14417 24182230 24869783 25682453 26622697 27732045 29071808 30594188 32087215 33287048
14409 33287048 34038954 34327561 34174574 33599315 32680653 31556408 30352363 29131355 27874416
14400 27874416 26551970 25270490 24268259 23713557 23576211 23655629 23704827 23595811 23370677
14391 23370677 23154998 23044312 23030304 22992353 22741765 22111479 21080485 19838047 18662961
14382 18662961 17682773 16810456 15946848 15144113 14533304 14208361 14225144 14612657 15354686
14373 15354686 16376277 17542719 18688046 19638848 20231771 20404826 20306047 20226721 20380364
14364 20380364 20800869 21415364 22148935 22960609 23786123 24486542 24900784 24947611 24674327
14355 24674327 24245446 23859732 23648789 23657781 23838827 24037666 24114427 24094554 24116630 24248505
14345 24248505 24397370 24369113 24011904 23326475 22473637 21681825 21113002 20787919 20602188
14336 20602188 20403456 20061484 19520943 18843557 18151663 17517946 16971395 16585593 16482531
14327 16482531 16722407 17219241 17825553 18486449 19236263 20070599 20906641 21664002 22354283
14318 22354283 23043592 23677723 24018506 23837437 23116976 22025947 20800251 19672814 18821997
14309 18821997 18339223 18252822 18544158 19103850 19707208 20099221 20138916 19882015 19546257 19377706
14299 19377706 19502875 19873960 20368315 20921173 21499976 22034911 22481001 22885686 23307119
14290 23307119 23701784 23951630 23989346 23860240 23649155 23389922 23083876 22751776 22416109
14281 22416109 22080871 21775158 21553553 21457997 21518037 21723574 21997384 22230166 22334509 22290210
14271 22290210 22152702 22014230 21958973 22002424 22099115 22240520 22466405 22771989 23041522 23077019
14261 23077019 22780572 22314304 21994516 22056340 22507189 23118683 23573730 23637349 23222408 22395357
14251 22395357 21321508 20162706 18999714 17850949 16755255 15768661 14890250 14100742
14243 14100742 13463130 13077491 12964509 13023874 13060590 12915205 12656894 12582551 12955157 13796924
14233 13796924 14961413 16291964 17621957 18714635 19346333 19459873 19185905 18733107 18302448
14224 18302448 18015392 17823807 17543581 17001543 16135337 15019013 13840951 12826682 12134914
14215 12134914 11813483 11866765 12325490 13173416 14224130 15173847 15801487 16062522 16026801
14206 16026801 15825668 15628308 15590768 15788200 16152906 16479947 16569296 16383222 16015169 15538739
14196 15538739 14981559 14406642 13925407 13677430 13763010 14163712 14824087 15697240 16653139
14187 16653139 17498477 18113140 18507394 18755476 18917317 18996170 18912674 18537022 17808080 16835159
14177 16835159 15842413 15023611 14509283 14387933 14624533 15041290 15479996 15904800 16318142
14168 16318142 16675025 16916173 17032943 17066600 17049231 16971330 16810698 16547710 16178742 15734320
14158 15734320 15240527 14719684 14292012 14144506 14298075 14547531 14702479 14766199 14842854 15006658
14148 15006658 15290908 15682073 16098956 16443566 16676312 16814194 16893095 16941642 16985245 17068765
14138 17068765 17215837 17358115 17370080 17196645 16889889 16500820 16010368 15370167 14560032
14129 14560032 13659662 12903473 12587309 12827516 13431458 14049852 14410899 14422716 14170695
14120 14170695 13843790 13591939 13413972 13186343 12795187 12247767 11690905 11325078 11280474
14111 11280474 11571991 12135087 12882151 13748728 14653969 15443614 15936116 16036903 15807437
14102 15807437 15436046 15089442 14768061 14344138 13726836 12974866 12251388 11709859 11433438
14093 11433438 11389887 11447924 11529456 11681930 11972670 12383167 12804376 13107538 13220264 13133190
14083 13133190 12876797 12545987 12282350 12157237 12113749 12047615 11912179 11728283 11535206 11390843
14073 11390843 11384956 11600296 12058981 12703424 13453382 14250238 15041183 15805259 16556549 17273185
14063 17273185 17875880 18281340 18401560 18130588 17461209 16575234 15748748 15221200 15100816
14054 15100816 15329862 15754319 16212396 16587582 16803649 16786617 16498343 15963329 15219706
14045 15219706 14341637 13471329 12704165 11981295 11143200 10042158 8635883 7044148 5512998
14036 5512998 4299089 3577471 3409885 3741557 4446963 5422564 6630599 8012639 9365809
14027 9365809 10349841 10668766 10282076 9441095 8558378 8003768 7917226 8178253 8575916 8995337
14017 8995337 9410595 9753995 9896472 9753471 9322916 8653143 7851296 7103651 6619984
14008 6619984 6500786 6659766 6905766 7088518 7179559 7255332 7426992 7760670 8215422 8654630
13998 8654630 8895778 8776585 8254709 7435082 6458653 5406631 4345301 3412500 2812310
13989 2812310 2699059 3063941 3788250 4789168 5998487 7220909 8152005 8570110 8503384
13980 8503384 8214437 7976182 7856261 7686196 7196487 6232343 4911310 3587690 2644931
13971 2644931 2333380 2724111 3707653 5070737 6600842 8057845 9116608 9539148 9388836
13962 9388836 8967457 8562458 8268803 8016739 7754652 7557483 7539136 7714819 7992925 8323267
13952 8323267 8837324 9758797 11147117 12779173 14291131 15433266 16200613 16733034 17134872
13943 17134872 17429132 17635209 17815021 18000451 18099369 17928563 17361991 16441495 15368468
13934 15368468 14402952 13719139 13311796 13081381 13015368 13192327 13590757 14016360 14265259
13925 14265259 14240969 13950591 13521534 13128208 12814400 12494911 12135257 11813228 11583404
13916 11583404 11385436 11148551 10879725 10606919 10331692 10069274 9885420 9846804 9940341 10046375
13906 10046375 9991675 9664316 9066978 8298994 7512129 6842312 6379313 6151323 6121426 6244368
13896 6244368 6483188 6771775 7056554 7368269 7777218 8293519 8863123 9433123 9975568
13887 9975568 10464705 10886801 11280941 11719459 12211959 12627798 12763657 12514766 11952306
13878 11952306 11232107 10468649 9700531 8902939 8031320 7092885 6178547 5428033 4945162
13869 4945162 4722829 4650868 4603008 4520992 4443694 4474056 4721292 5222449 5886482 6534124
13859 6534124 6988372 7145181 7006352 6685073 6357122 6134358 6009290 5952124 5958727 5984390
13849 5984390 5948121 5825958 5691805 5662616 5818765 6166383 6638774 7116139 7446525 7509406
13839 7509406 7338696 7149872 7191798 7575899 8227074 8986279 9758474 10524676 11255707 11891883
13829 11891883 12370770 12635065 12634934 12326402 11728252 10990556 10311135 9784209 9373660 9005118
13819 9005118 8607388 8080971 7391892 6733186 6440319 6694454 7372020 8178472 8846728
13810 8846728 9239587 9363338 9322061 9270469 9357442 9643962 10058398 10431960 10609366 10568755
13800 10568755 10417140 10239820 10015478 9717051 9394287 9109266 8885724 8787581 8956231
13791 8956231 9450190 10135875 10820651 11393562 11802789 11980726 11857245 11469280 11011547
13782 11011547 10706955 10632610 10707766 10812615 10857312 10755722 10430034 9901285 9342246 8989517
13772 8989517 8997681 9352921 9901657 10445709 10821562 10957470 10865465 10575658 10147076 9710595
13762 9710595 9400297 9263017 9241517 9188266 8947090 8493391 7969346 7593570 7530974 7760931
13752 7760931 8066576 8209983 8119417 7909153 7779121 7871488 8198553 8735223 9489678 10425735
13742 10425735 11415690 12324060 13072145 13644469 14075987 14382312 14495178 14304349 13753475
13733 13753475 12886040 11852512 10889809 10209779 9860854 9717103 9616505 9506851 9440373
13724 9440373 9443722 9419522 9196712 8702024 8034673 7362395 6832961 6576030 6667691 7043739
13714 7043739 7504697 7853368 8021646 8042869 7951265 7778456 7585136 7397007 7137895 6683619
13704 6683619 5999903 5190258 4379719 3583208 2750640 1902043 1131797 517804 95687
13695 95687 -61423 180114 874848 1896156 3017751 4031544 4790843 5217335 5297683
13686 5297683 5086756 4741450 4497467 4509581 4727491 4960974 4999856 4695136 4033120 3147222
13676 3147222 2244631 1556878 1282364 1478059 2064477 2931258 3972665 5061599 6027746
13667 6027746 6694784 6982541 6961197 6799123 6670294 6691697 6903907 7264852 7656652 7983057
13657 7983057 8284569 8673835 9162297 9675974 10214525 10869429 11701757 12642921 13510248
13648 13510248 14096787 14240638 13860595 13002298 11852754 10663546 9625377 8803952 8170669
13639 8170669 7652158 7149718 6594290 6000373 5432838 4979985 4731254 4699452 4787202 4828807
13629 4828807 4636922 4084708 3239309 2383250 1828546 1687153 1837773 2111074 2473362
13620 2473362 2989222 3631531 4208337 4480102 4339862 3922083 3527338 3378570 3463590 3644514
13610 3644514 3867763 4185385 4599079 4984050 5197679 5260176 5372987 5702988 6216974 6772867
13600 6772867 7282444 7740616 8156690 8474780 8588944 8482788 8290080 8146167 8013442
13591 8013442 7742836 7281263 6694252 6025668 5283489 4527534 3875305 3441410 3282973
13582 3282973 3357672 3523214 3637367 3678885 3734018 3888004 4151083 4479830 4860319 5305370
13572 5305370 5770405 6186296 6545391 6860720 7119772 7327180 7511907 7676788 7773660 7712104
13562 7712104 7430082 6962885 6401195 5804076 5190771 4578347 3985633 3411187 2824355
13553 2824355 2214641 1659551 1317082 1311002 1622081 2089199 2532798 2903925 3263949 3601812
13543 3601812 3770025 3637227 3214822 2643228 2103097 1687531 1371363 1124077 988571
13534 988571 1048197 1362406 1928034 2684949 3511332 4257860 4851729 5305765 5634277 5816630
13524 5816630 5852618 5837276 5931973 6252956 6794473 7419853 7910169 8079759 7898424 7517451
13514 7517451 7165700 7009512 7097722 7362421 7639736 7748793 7629397 7417432 7304555 7291287
13504 7291287 7180045 6834492 6319799 5769045 5240807 4713656 4121187 3404532 2586826
13495 2586826 1798004 1196762 847204 693898 663027 746363 992719 1430553 1989550 2524845
13485 2524845 2913575 3128734 3250320 3414377 3732951 4210280 4724910 5179705 5646553
13476 5646553 6258480 7025700 7854378 8641304 9300709 9795809 10145135 10380093 10525604
13467 10525604 10612777 10680404 10752624 10813601 10800938 10645874 10332734 9915876 9495361 9149956
13457 9149956 8878028 8621050 8321852 7953707 7537900 7155304 6873398 6624982 6225988
13448 6225988 5566064 4736648 3933600 3299742 2896096 2738929 2800835 3024422 3363543 3776188
13438 3776188 4183060 4467345 4526951 4313477 3849533 3237100 2623911 2127748 1793090 1604779
13428 1604779 1516353 1492131 1556327 1785983 2245671 2924312 3717976 4478850 5094195 5523541
13418 5523541 5762636 5791854 5594764 5203536 4716718 4304826 4148166 4302556 4659983 5060652
13408 5060652 5366229 5467182 5320649 4963024 4515394 4164808 4027715 4043398 4035901 3847597
13398 3847597 3418169 2791199 2085825 1424032 851190 342124 -124804 -516092 -742043
13389 -742043 -669983 -189125 673136 1723410 2711618 3456314 3881892 4005612 3939515 3852046
13379 3852046 3857069 3961478 4115147 4284270 4496790 4786372 5087567 5275687 5318375 5293949
13369 5293949 5306466 5477990 5908543 6548641 7201560 7659958 7800486 7636960 7283174 6794976
13359 6794976 6090395 5065627 3790976 2561428 1734428 1498972 1748230 2197130 2648428
13350 2648428 3079498 3490197 3815013 4021750 4158886 4267871 4347288 4356312 4212221 3878862
13340 3878862 3441596 3031720 2732984 2550215 2374674 2050717 1541297 966867 492845
13331 492845 198852 14270 -214889 -585461 -1051957 -1461670 -1701502 -1796062 -1854129 -1973989
13321 -1973989 -2203410 -2539151 -2963829 -3492896 -4142851 -4886098 -5677415 -6458831 -7155290
13312 -7155290 -7697553 -7989423 -7937735 -7573701 -7057556 -6540939 -6071104 -5626577 -5163569 -4581685
13302 -4581685 -3722759 -2488945 -947639 698102 2225567 3483005 4359540 4769041 4765871
13293 4765871 4594742 4543010 4764032 5222130 5736365 6097640 6170260 5884895 5236383 4347331
13283 4347331 3438668 2666534 2013452 1384823 815092 507966 623666 1097531 1722016
13274 1722016 2346574 2962512 3637425 4403638 5203224 5894645 6327895 6460003 6402159 6345423
13264 6345423 6434202 6683678 6992060 7256776 7500981 7838894 8298535 8779664 9208534 9644031
13254 9644031 10175437 10783642 11350545 11718150 11734740 11358823 10712545 9993652 9353724 8837663
13244 8837663 8415823 8058220 7739091 7364015 6800892 6037263 5223575 4534285 4044947
13235 4044947 3718611 3479689 3317528 3266930 3298128 3297538 3132069 2720940 2091355 1371917
13225 1371917 723896 268360 63134 133895 465614 943616 1396242 1760102 2124626 2579586
13215 2579586 3102772 3584704 3911606 4024769 3917593 3592383 3017800 2132365 940945
13206 940945 -344721 -1358075 -1808929 -1628065 -961167 -57325 857718 1626910 2158411
13197 2158411 2426210 2434105 2206491 1877052 1714761 1963171 2630559 3428448 3940998 3877699
13187 3877699 3205312 2149922 1076832 267597 -199086 -387630 -399621 -325640 -298569 -498030
13177 -498030 -1012502 -1740664 -2452026 -2915134 -3012596 -2789689 -2371158 -1810287 -1051355 -33485
13167 -33485 1217281 2558027 3749445 4568381 4910256 4747624 4068146 2953334 1678330
13158 1678330 638181 98678 -11486 14866 -15353 -70555 -49875 23669 -15713 -335928
13148 -335928 -952972 -1683378 -2232142 -2367407 -2064795 -1483128 -807448 -107894 647599 1430314
13138 1430314 2098112 2566140 2915024 3254240 3600896 3914662 4138723 4230089 4200860 4111419
13128 4111419 4036386 4047938 4237317 4688301 5367838 6112413 6754440 7193284 7374831 7289934
13118 7289934 6981906 6519683 5992280 5554275 5402818 5631690 6123618 6677339 7218687
13109 7218687 7782695 8357967 8858300 9203708 9371346 9396336 9360379 9315148 9183432 8808783
13099 8808783 8079211 6993314 5681291 4325041 3015843 1730217 462334 -694008
13091 -694008 -1633249 -2342644 -2908621 -3444729 -4007003 -4534935 -4832608 -4698381 -4132055 -3333317
13081 -3333317 -2523853 -1846362 -1350724 -1008216 -744107 -468239 -109848 347069 802288
13072 802288 1023918 832580 292822 -347221 -822188 -888304 -327832 919260 2627422
13063 2627422 4374490 5815335 6863191 7630827 8284058 8934652 9589693 10177841 10621861
13054 10621861 10887083 10985181 10943942 10764075 10398970 9798057 9022090 8268601 7714843 7400477
13044 7400477 7292199 7368905 7613407 7933674 8139069 8060998 7698980 7213687 6795106 6594011
13034 6594011 6719876 7176660 7826247 8496240 9086088 9553476 9847781 9910529 9750341 9490482
13024 9490482 9331762 9409152 9683818 10049109 10476970 10979131 11512228 12008869 12458812 12898774
13014 12898774 13307702 13540515 13444112 13021420 12381374 11581860 10630432 9552717 8372338
13005 8372338 7099518 5768232 4459859 3305022 2439736 1936698 1798616 1952293 2199725
12996 2199725 2320549 2247113 2059069 1879717 1794971 1812677 1901430 2084125 2438930 2976869
12986 2976869 3595920 4195194 4770545 5346909 5871423 6262828 6542833 6798377 7055786
12977 7055786 7272686 7392968 7392499 7301546 7191447 7141151 7197386 7347494 7522765 7637438
12967 7637438 7651343 7577623 7419116 7179547 6919842 6737917 6735249 6983025 7453810 8011745
12957 8011745 8456132 8589185 8317484 7696824 6905608 6191503 5794307 5857091 6369642 7189931
12947 7189931 8113034 8932471 9514802 9879475 10180141 10553043 10983280 11329048 11455340
12938 11455340 11349246 11141201 11023590 11128215 11484282 12082490 12899429 13836173 14684268
12929 14684268 15238748 15487150 15626540 15859226 16210359 16521930 16590853 16355835 15978200
12920 15978200 15738840 15804692 16116045 16516037 16884982 17125877 17140070 16894498 16452636 15924012
12910 15924012 15426340 15044532 14764708 14464331 13958047 13089873 11855302 10441530 9121598
12901 9121598 8079687 7334318 6791229 6338012 5921106 5546159 5213226 4891531 4575019
12892 4575019 4324087 4213628 4270610 4472131 4790403 5230664 5798180 6420375 6951372 7303184
12882 7303184 7511439 7651279 7754618 7833096 7938104 8174719 8677750 9519377 10591032
12873 10591032 11631681 12434495 13012180 13496784 13906579 14053950 13663855 12617924 11131173
12864 11131173 9648547 8553453 8007237 8005773 8467185 9232525 10119336 11054913 12038317
12855 12038317 12997360 13822548 14469784 14921123 15151890 15185406 15086448 14897450 14594945 14093149
12845 14093149 13288394 12143398 10774118 9400145 8185026 7145002 6195680 5288365
12837 5288365 4490580 3925012 3649339 3585153 3562442 3460390 3263081 2977524 2587020 2090879
12827 2090879 1538313 1013973 552417 75692 -522077 -1232153 -1874921 -2184467 -1988245
12818 -1988245 -1316131 -309956 902350 2160407 3208999 3833613 4003107 3816704 3392616
12809 3392616 2826659 2188409 1571930 1142638 1012462 1111889 1287825 1462930 1667620 1976566
12799 1976566 2428930 2961647 3387769 3482041 3135886 2431273 1559897 693268 -74368 -684908
12789 -684908 -1060504 -1150705 -995595 -707843 -433963 -283657 -265022 -296742 -255803 -48113
12779 -48113 338835 830328 1312925 1742072 2182722 2713344 3313596 3851627 4197781 4332994
12769 4332994 4292276 4095231 3810937 3583305 3501449 3477902 3324866 2935587 2356330 1742895
12759 1742895 1282079 1096220 1151411 1261864 1240963 1038281 756279 599506 779617 1386729
12749 1386729 2293532 3198727 3779690 3885367 3674211 3491550 3560810 3845005 4184901 4492067
12739 4492067 4815148 5259364 5849162 6470969 6926155 7042872 6770690 6207484 5552334
12730 5552334 4991879 4607551 4386048 4273675 4186477 4011375 3646183 3030623 2175562 1196131
12720 1196131 295434 -299569 -439063 -126323 513212 1326457 2195681 3042733 3824026
12711 3824026 4531823 5167302 5734194 6283693 6882526 7512947 8087507 8537946 8799989
12702 8799989 8799403 8576527 8333769 8300004 8592066 9169574 9871172 10468984 10716320 10464402
12692 10464402 9799304 9022917 8464847 8253516 8255485 8246019 8090679 7791902 7403404 6914794
12682 6914794 6238032 5309156 4226746 3257069 2643784 2422558 2406246 2313507 1915978 1124641
12672 1124641 21879 -1148465 -2079357 -2577594 -2659366 -2455877 -2063842 -1502910 -758103
12663 -758103 164735 1170025 2057871 2614536 2723871 2426746 1898345 1350109 914374
12654 914374 607257 390406 223821 74913 -76404 -271735 -590048 -1071039 -1670549 -2318099
12644 -2318099 -2960198 -3521403 -3875860 -3905530 -3581694 -2973896 -2183932 -1298056 -384697 516457
12634 516457 1353995 2020657 2454738 2751017 3089742 3585610 4239715 4998911 5813258 6642482
12624 6642482 7454419 8232667 8979193 9735108 10572524 11518295 12514681 13440729 14142390
12615 14142390 14478954 14358364 13777722 12883332 11917157 11088333 10534398 10338472 10516594
12606 10516594 10986144 11569806 12085711 12473280 12824060 13288470 13922903 14609237 15168368
12597 15168368 15506113 15589391 15382046 14885663 14179352 13395235 12664966 12053560 11521484
12588 11521484 11008551 10577051 10361205 10368451 10427770 10323777 9936619 9301082 8604137 8109260
12578 8109260 8004305 8250505 8615195 8891262 9016919 9048451 9120409 9364975 9784676 10245979
12568 10245979 10618688 10842278 10902437 10818572 10640590 10461508 10381493 10407339 10440764 10397616
12558 10397616 10289722 10170723 10085244 10076351 10159524 10289369 10371091 10288670 9944960 9295516
12548 9295516 8355056 7220310 6063376 5050160 4261909 3696182 3331170 3184457 3328484
12539 3328484 3805609 4513844 5245246 5859551 6370980 6878621 7446479 8059916 8691428
12530 8691428 9326056 9911295 10335005 10471753 10256289 9702452 8875888 7900896 6991772
12521 6991772 6389643 6219651 6464240 7059939 7957680 9088217 10297239 11408637 12334691
12512 12334691 13016193 13345989 13290119 13024638 12821811 12824895 13035176 13454539 14094476 14904129
12502 14904129 15801590 16722864 17585729 18252417 18574578 18467924 17965095 17221385 16425630
12493 16425630 15678575 14935190 14008046 12681403 10929743 8991774 7211185 5845168
12485 5845168 4989641 4603054 4551857 4678732 4880520 5124418 5420012 5778547 6192113 6646068
12475 6646068 7090731 7403494 7443681 7163213 6655086 6075855 5525578 5029769 4598912 4260351
12465 4260351 4026007 3831977 3585579 3306460 3155657 3305220 3803158 4570259 5478937
12456 5478937 6389789 7166967 7762913 8256054 8728057 9162656 9523633 9847495 10165336
12447 10165336 10402439 10466421 10406507 10408538 10626903 11080193 11712294 12444286 13193686 13961006
12437 13961006 14826783 15780141 16645616 17221813 17397394 17114548 16344961 15176797 13853570
12428 13853570 12654084 11738433 11072463 10478170 9819113 9150839 8626368 8292946 8071632
12419 8071632 7872516 7650454 7392250 7112004 6834311 6528969 6096014 5442230 4517659
12410 4517659 3317268 1924809 507538 -732356 -1561809 -1767005 -1298746 -353154 785024
12401 785024 1929234 2937306 3624057 3879300 3819192 3707129 3761839 4081549 4648568 5334455
12391 5334455 5964925 6436090 6744378 6914167 6907523 6660208 6210528 5664858 5090306 4556015
12381 4556015 4196775 4154060 4457036 4963996 5449057 5753787 5859177 5865515 5898306 5981298
12371 5981298 6036392 6025364 5989994 5924255 5724906 5308917 4673932 3875835 3086167 2565622
12361 2565622 2475374 2821111 3531307 4447779 5342853 6074937 6656541 7134636 7484817 7603345
12351 7603345 7350982 6666358 5658767 4535542 3435117 2415496 1599838 1151584 1089736
12342 1089736 1277531 1556316 1818421 2040261 2294107 2652112 3076241 3431966 3586708
12333 3586708 3499736 3168362 2531799 1533518 243966 -1070477 -1987617 -2163481 -1564994
12324 -1564994 -446354 840742 1993110 2771597 2972999 2516475 1558855 453289 -416904
12315 -416904 -821140 -768601 -393880 216883 1010135 1872442 2659225 3298238 3812009 4220546
12305 4220546 4497719 4655821 4775281 4916704 5070901 5204451 5279608 5229304 5017439 4694849
12295 4694849 4317698 3869986 3308028 2611358 1768026 780894 -276836 -1241698 -1933310
12286 -1933310 -2270045 -2328080 -2264570 -2164429 -2002159 -1709692 -1250531 -674673 -73943 544396
12276 544396 1261463 2123020 3057681 3865441 4326671 4393752 4215051 3970592 3777209 3690823
12266 3690823 3695157 3720001 3677448 3504371 3222153 2927821 2724562 2680301 2813836 3090911
12256 3090911 3431156 3709364 3761668 3482232 2992141 2625309 2700260 3349581 4503161 5963060
12246 5963060 7531393 9087202 10529634 11690632 12384224 12567909 12383425 12010578 11547989
12237 11547989 11023165 10472094 9977401 9602223 9317188 9019891 8628694 8141010 7587858
12228 7587858 6962107 6212167 5316084 4363314 3543606 3039770 2935626 3210056 3800462
12219 3800462 4656701 5707502 6804317 7767684 8481986 8914977 9091196 9102881 9097044 9166946
12209 9166946 9293538 9446607 9670385 10011154 10426383 10818291 11155826 11531356 12059249
12200 12059249 12767276 13602953 14486309 15324632 15994975 16389871 16485820 16324197 15957124
12191 15957124 15455027 14895022 14279679 13536183 12648965 11728116 10879790 10073025 9243818
12182 9243818 8475499 7963763 7836490 8057222 8461519 8878575 9231398 9475004 9508984 9271668
12172 9271668 8876640 8550605 8458119 8647677 9089211 9677388 10260233 10715860 11003909 11196408
12162 11196408 11440868 11811132 12236218 12623428 12952601 13211792 13362415 13395735 13304325 12992935
12152 12992935 12338289 11361978 10259117 9205090 8221213 7258713 6294778 5343741 4466946
12143 4466946 3746027 3228470 2963524 3075522 3705966 4822348 6156302 7392887 8329269
12134 8329269 8854894 8921399 8570079 7982549 7462478 7292912 7601468 8314452 9197484 9994308
12124 9994308 10582316 10984980 11230407 11256063 11006941 10593740 10269245 10206381 10368587 10646972
12114 10646972 11016517 11489867 11986744 12337652 12410840 12178329 11688505 11007103 10165730
12105 10165730 9155213 7951207 6556204 5038390 3542248 2267997 1431181 1182303
12097 1182303 1496716 2161445 2885978 3446655 3784014 3978260 4141612 4337280 4561914
12088 4561914 4782083 4961564 5066040 5089247 5086384 5140701 5287530 5511410 5778821 6038629
12078 6038629 6232073 6340558 6413649 6549957 6861133 7395372 8059541 8642982 8927476 8790119
12068 8790119 8228743 7307077 6133766 4886903 3754083 2844314 2181822 1737215 1443596
12059 1443596 1192437 863795 445428 100907 9535 135336 277873 338654 403290 596708
12049 596708 978157 1550436 2284431 3113847 3958395 4754446 5455557 6023711 6404174 6557234
12039 6557234 6506531 6310718 6052986 5839673 5708520 5581248 5393790 5217594 5173743 5273148
12029 5273148 5395932 5426204 5366993 5298971 5279428 5293255 5255247 5049861 4612319 3974893
12019 3974893 3246956 2582034 2137638 2017635 2227588 2706885 3377949 4099034 4639418
12010 4639418 4774945 4379770 3445276 2057992 385512 -1297911 -2603708 -3161561 -2849197
12001 -2849197 -1874624 -625360 524560 1321542 1694737 1776028 1780394 1831882 1953478 2173872
11991 2173872 2539355 3023334 3496165 3828820 4023270 4202826 4480886 4873726 5316920
11982 5316920 5712987 5978522 6118704 6246061 6455788 6725630 6963724 7091165 7077247 6954245
11972 6954245 6825684 6844461 7146532 7768825 8633658 9615880 10610425 11535949 12300667 12796153
11962 12796153 12939446 12707348 12126894 11226657 10000175 8470210 6765417 5082585 3568395
11953 3568395 2270612 1243693 607685 458087 790176 1488330 2369506 3291732 4206901
11944 4206901 5072066 5762108 6129090 6111889 5757762 5152951 4343845 3360412 2313772
11935 2313772 1399166 775605 494851 526111 795196 1232401 1773867 2325333 2801972 3175427
11925 3175427 3439891 3580614 3585904 3460134 3214259 2835095 2249379 1358256 199296 -946934
11915 -946934 -1720199 -1949909 -1713720 -1203473 -600083 -6411 543214 1025385 1473976 2038059
11905 2038059 2847911 3836401 4747029 5295562 5325283 4885835 4190846 3475210 2899991 2512505
11895 2512505 2251509 2055147 1935463 1924374 2030246 2261472 2647658 3251425 4128535 5228117
11885 5228117 6378159 7387264 8101351 8433524 8445445 8346701 8342571 8450485 8525877 8476342
11875 8476342 8327406 8103310 7788340 7420245 7115010 6965005 6960505 7037995 7158364 7307871
11865 7307871 7486238 7739116 8152458 8773634 9508456 10074855 10124126 9490246 8314983
11856 8314983 6914884 5589379 4522082 3742629 3140718 2530974 1759774 806480 -225169
11847 -225169 -1210897 -2077722 -2790468 -3312038 -3633728 -3804428 -3852379 -3731512 -3388296 -2840878
11837 -2840878 -2198692 -1634465 -1295763 -1165215 -1034996 -708909 -211884 264279 570512
11828 570512 709211 786373 905001 1098431 1357023 1712381 2210662 2750528 3053277 2889121
11818 2889121 2280977 1444941 585373 -211510 -916380 -1443455 -1648676 -1448170 -923400
11809 -923400 -291779 261325 732617 1295758 2130004 3200582 4235540 4970622 5378334
11800 5378334 5618327 5842647 6090492 6307563 6409787 6319508 5996588 5514032 5084940 4955911
11790 4955911 5272379 6070266 7316320 8839031 10261697 11127517 11157702 10404902 9165522
11781 9165522 7758395 6360828 4998183 3640953 2307040 1126778 290895 -107081
11773 -107081 -196305 -290998 -675153 -1413690 -2368305 -3313977 -4020819 -4323492 -4180252 -3691499
11763 -3691499 -3060938 -2497827 -2120211 -1937502 -1891984 -1884186 -1799693 -1533615 -1005122 -225855
11753 -225855 653953 1432968 1996335 2353144 2550147 2578651 2376250 1923680 1341530 865240
11743 865240 675756 802203 1208470 1839184 2560448 3181547 3584528 3823677 4099421 4589389
11733 4589389 5280694 5974753 6445657 6590082 6445495 6152523 5905466 5842103 5977887 6283043
11723 6283043 6763696 7404626 8066124 8494379 8431691 7747702 6543510 5129021 3815119
11714 3815119 2696434 1699874 804673 101621 -339763 -563092 -658770 -656858 -545071 -373752
11704 -373752 -228616 -83139 196080 683963 1281336 1781023 2056913 2168263 2289607 2583153
11694 2583153 3143038 3967197 4916756 5797731 6508583 7018600 7242940 7058846 6432985
11685 6432985 5468684 4368665 3354547 2575596 2088550 1911612 2047521 2415213 2811266
11676 2811266 3018529 2971684 2807796 2760019 2979745 3421151 3875763 4123220 4095039 3924667
11666 3924667 3809866 3826380 3882265 3824751 3589993 3254796 2936005 2696734 2589811 2681921
11656 2681921 2986496 3400643 3745366 3919806 3960169 3949967 3944098 3947913 3939561 3906280 3844909
11645 3844909 3768797 3727415 3731234 3673712 3437370 3043869 2647835 2433659 2540389 3008965
11635 3008965 3766352 4697675 5719822 6760211 7706323 8415825 8761677 8662189 8130390
11626 8130390 7334105 6575738 6200300 6442483 7255106 8321003 9286156 9945707 10216449
11617 10216449 10111953 9809415 9550254 9406184 9234055 8854813 8188849 7254090 6149870
11608 6149870 5060404 4203074 3692153 3464481 3369344 3281609 3154965 3012563 2860040 2647159
11598 2647159 2340750 1958581 1504270 918582 146485 -768152 -1675428 -2367747 -2676530
11589 -2676530 -2579264 -2199168 -1684310 -1103692 -482064 135273 697980 1175571 1574569 1933617
11579 1933617 2240260 2396155 2362209 2262381 2282615 2517696 2903804 3256278 3367688 3136151
11569 3136151 2644013 2080984 1585118 1204443 1002576 1112628 1654888 2631134 3890644
11560 3890644 5196999 6335420 7147751 7511954 7379454 6845152 6136235 5505476 5098254
11551 5098254 4903275 4859756 4984408 5363136 6066481 7074540 8222173 9224311 9836804
11542 9836804 10011937 9882505 9651897 9544185 9784378 10493537 11588292 12810964 13823880
11533 13823880 14306464 14061272 13097751 11660981 10134266 8853734 8014504 7643505 7570194
11524 7570194 7533614 7415937 7344865 7531527 8024434 8673802 9288992 9742695 9947797 9827918
11514 9827918 9364547 8652504 7889938 7274816 6889538 6715122 6694590 6742298 6757615 6674239
11504 6674239 6518592 6392949 6371046 6437198 6499739 6456728 6279867 6016892 5743640 5537932
11494 5537932 5462263 5535832 5684428 5741274 5590738 5290905 5015458 4923901 5074385 5423976
11484 5423976 5884712 6367088 6762922 6914063 6685597 6103130 5381424 4810809 4581277
11475 4581277 4693660 5028730 5456946 5917463 6443338 7091501 7831460 8516043 8987417
11466 8987417 9206339 9256729 9252659 9256640 9263736 9266324 9320162 9536488 10026173 10816421 11782220
11455 11782220 12687387 13309450 13532167 13376116 12971718 12492342 12109708 11959521 12117972
11446 12117972 12621041 13429188 14346773 15071799 15389373 15318461 15068368 14842499 14697477
11437 14697477 14581809 14448047 14279366 14032079 13650945 13142982 12578387 12037694 11528020
11428 11528020 10934659 10119024 9066963 7937553 6965415 6280159 5822441 5429245 4958442
11419 4958442 4338007 3545797 2586721 1518476 469537 -418357 -1084568 -1582891 -2042815
11410 -2042815 -2578767 -3196571 -3823363 -4406729 -4884178 -5095070 -4829795 -3947617 -2439902
11401 -2439902 -455557 1712952 3728775 5352384 6493379 7135628 7265884 6902929 6165135
11392 6165135 5259938 4346695 3412862 2329781 1007363 -469022 -1790235 -2575729 -2608252
11383 -2608252 -1908021 -677240 780637 2184957 3384603 4351951 5112189 5702971 6182839
11374 6182839 6627163 7059594 7431219 7699757 7895239 8117607 8439504 8820885 9159169
11365 9159169 9346373 9306673 9074960 8811795 8670543 8668088 8704340 8625391 8274720 7578676
11355 7578676 6610103 5538648 4520625 3667346 3077098 2839127 2969279 3355842 3822796
11346 3822796 4224677 4479407 4587466 4614421 4595727 4528423 4433501 4342596 4268947 4185650 3975347
11335 3975347 3460114 2522844 1214587 -213209 -1427477 -2190959 -2427478 -2204111 -1672188
11326 -1672188 -1009036 -413483 -74608 -86675 -435440 -1044509 -1780605 -2441148 -2789003 -2690852
11316 -2690852 -2270750 -1838877 -1628122 -1628042 -1611397 -1302885 -620405 235627 977254 1490290
11306 1490290 1871693 2284899 2840484 3577655 4464292 5386033 6184415 6712881 6891656
11297 6891656 6745367 6366086 5847214 5256964 4603127 3840243 3011505 2302963 1866009
11288 1866009 1662010 1518139 1309120 1052335 856359 863516 1210851 1918836 2806255 3610653
11278 3610653 4197039 4608868 4947245 5250752 5488781 5617032 5619488 5522612 5402362 5346123
11268 5346123 5335735 5230785 4933943 4482934 4002701 3663945 3628514 3950965 4503122 5006999
11258 5006999 5190904 4910461 4150207 3003735 1631746 190541 -1216045 -2535737 -3704947
11249 -3704947 -4591511 -5039558 -4999723 -4603638 -4090641 -3659263 -3372280 -3156176 -2894262 -2558480
11239 -2558480 -2202134 -1803851 -1214309 -293473 915495 2151538 3083279 3506847 3429147
11230 3429147 3006176 2444483 1937068 1589395 1332861 959925 319870 -539697 -1469011
11221 -1469011 -2387334 -3276546 -4102451 -4830472 -5429026 -5810236 -5880148 -5683941 -5395959 -5147857
11211 -5147857 -4961246 -4822384 -4753400 -4808048 -5004958 -5295015 -5588568 -5791868 -5845435 -5723595
11201 -5723595 -5396844 -4838185 -4093873 -3305105 -2602812 -2006731 -1467972 -981647 -610905
11192 -610905 -414798 -384538 -464166 -631217 -913851 -1341485 -1905473 -2522466 -3053674 -3398229
11182 -3398229 -3551596 -3566407 -3469228 -3234729 -2850992 -2368731 -1859423 -1383610 -986594 -680887
11172 -680887 -462510 -330985 -267815 -195691 -11682 335064 802218 1266788 1636903 1939857
11162 1939857 2269812 2717367 3322936 3981647 4417437 4355908 3761995 2918010 2234788 1958451
11152 1958451 2083633 2504050 3143046 3893360 4546349 4938778 5128651 5342452 5778805
11143 5778805 6449597 7151092 7576517 7486526 6847899 5845676 4733410 3681256 2761668
11134 2761668 1993485 1396443 1048144 1038671 1375723 1944367 2535106 2950097 3090232 2919211
11124 2919211 2425010 1672593 840432 174704 -127579 -17190 447303 1198595 2165337
11115 2165337 3237669 4283985 5181176 5815469 6099329 6024163 5681033 5195335 4631273
11106 4631273 3958945 3118013 2118399 1060869 52553 -850530 -1616400 -2240780 -2790191
11097 -2790191 -3361114 -3957620 -4505985 -4996671 -5453528 -5766745 -5729105 -5252928 -4427635 -3422499
11087 -3422499 -2406498 -1476673 -659271 -15815 305753 175648 -385594 -1208527 -2091971
11078 -2091971 -2918485 -3647074 -4210449 -4444429 -4139605 -3201199 -1741232 1838 1785716
11069 1785716 3420963 4799920 5902214 6744424 7313037 7553922 7442313 7019365 6352097
11060 6352097 5543071 4736055 4009227 3303638 2502002 1523469 391897 -730827 -1614878
11051 -1614878 -2052958 -1920204 -1231906 -169712 962417 1878520 2462248 2762669 2849834
11042 2849834 2732150 2409883 1941151 1451171 1086685 879076 682411 320286 -251209
11033 -251209 -928641 -1573367 -2113316 -2552573 -2919470 -3193741 -3301942 -3194094 -2887226 -2477089
11023 -2477089 -2114469 -1898833 -1814370 -1770314 -1693533 -1628200 -1709605 -1991777 -2328709 -2445553
11013 -2445553 -2151553 -1482500 -628964 245901 1113541 1991925 2787900 3311883 3412669
11004 3412669 3062229 2375911 1585490 949952 580009 359076 121140 -135205 -257909
10995 -257909 -122354 267323 822941 1449448 2081712 2645326 3042570 3227120 3221577 3075019
10985 3075019 2829432 2498333 2094801 1677526 1346862 1192321 1229716 1401693 1640369 1927991
10975 1927991 2326819 2891833 3515671 3932045 3916537 3438415 2654658 1815611 1116941 617096
10965 617096 285988 70412 -96142 -272536 -467393 -639236 -717401 -619669 -309748 148193
10955 148193 629549 1036455 1299691 1320898 996724 337926 -442043 -1042447 -1337025 -1476952
10945 -1476952 -1694837 -2046736 -2394208 -2576852 -2567777 -2502668 -2572974 -2900758 -3486861 -4249117
10935 -4249117 -5101712 -5999631 -6880662 -7551582 -7732123 -7285213 -6344912 -5208652 -4165622
10926 -4165622 -3405175 -3015186 -2993544 -3263549 -3724699 -4262530 -4723221 -4961143 -4934965 -4740150
10916 -4740150 -4538855 -4443282 -4484370 -4641496 -4821585 -4868857 -4685316 -4353957 -4097816 -4100947
10906 -4100947 -4403129 -4942446 -5646199 -6470955 -7346649 -8117900 -8597470 -8662804 -8299073 -7599760
10896 -7599760 -6730077 -5885004 -5234447 -4845235 -4680212 -4658221 -4696904 -4743803 -4777625 -4792175
10886 -4792175 -4787648 -4776805 -4763362 -4663307 -4317485 -3664173 -2803393 -1843104 -800896 296823
10876 296823 1307471 2028645 2326800 2182983 1661380 875745 13245 -633489 -773225
10867 -773225 -323949 536200 1522861 2403182 2997767 3114375 2657132 1792846 875187 180252
10857 180252 -265644 -611375 -971620 -1313582 -1506784 -1417363 -951215 -90238 1051892 2250472
10847 2250472 3304340 4144181 4817936 5376122 5796847 6052281 6178159 6242723 6283776 6281177
10837 6281177 6174929 5904142 5455860 4894614 4321697 3800686 3347596 2988387 2788560
10828 2788560 2800691 2999578 3275757 3491042 3555440 3474109 3349880 3322550 3482922 3821202
$$ [...]
##END NTUPLES=NMR SPECTRUM
##END=
