##TITLE=31P ikalashn
DE-79k_TFA
22.11.2024
##JCAMPDX= 6.0         $$ Bruker NMR JCAMP-DX V2.0
##DATA TYPE= NMR SPECTRUM
##DATA CLASS= NTUPLES
##ORIGIN= UXNMR, Bruker Analytische Messtechnik GmbH
##OWNER= root
$$ TOPSPIN		Version 1.3
$$ 2024-11-22 13:58:16.031 +0400  Irina@DPX200
$$ Compression mode = diff/dup
##.OBSERVE FREQUENCY= 81.01967998063
##.OBSERVE NUCLEUS= ^31P
##.ACQUISITION MODE= SIMULTANEOUS
##.ACQUISITION SCHEME= undefined
##.AVERAGES= 64
##.DIGITISER RES= 17
##SPECTROMETER/DATA SYSTEM= spect
##.PULSE SEQUENCE= zgpg
##.SOLVENT NAME= D2O
##.SHIFT REFERENCE= INTERNAL, D2O, 1, 298.5841
##AUDIT TRAIL= $$ (NUMBER, WHEN, WHO, WHERE, WHAT)
$$ ##TITLE= Audit trail, TOPSPIN		Version 1.3
$$ ##JCAMPDX= 5.01
$$ ##ORIGIN= Bruker BioSpin GmbH
$$ ##OWNER= Irina
$$ $$ F:/spectra/data/iren/nmr/P31dec/1/pdata/1/auditp.txt
$$ ##AUDIT TRAIL=  $$ (NUMBER, WHEN, WHO, WHERE, VERSION, WHAT)
(   1,<2024-11-22 13:56:05.453 +0400>,<Irina>,<DPX200>,<TOPSPIN 1.3>,
      <acquisition in progress>)
(   2,<2024-11-22 13:57:48.500 +0400>,<Irina>,<DPX200>,<TOPSPIN 1.3>,
      <Start of raw data processing
       efp BC_mod = 2 LB = 10 FT_mod = 6 PKNL = 1 PHC0 = 262.8655 PHC1 = 34.2881 SI = 32K 
       data hash MD5: 32K
       F4 13 3A B3 D6 05 D7 2D 1B 35 69 CF 2C F7 1B C8>)
(   3,<2024-11-22 13:58:01.656 +0400>,<Irina>,<DPX200>,<TOPSPIN 1.3>,
      <pk fgphup PHC0 = 7 PHC1 = 0 
       data hash MD5: 32K
       8B E4 4C 9A 74 3E D9 DF 34 52 BB 59 82 75 5B 59>)
$$ ##END=
$$ 
$$ $$ hash MD5
$$ $$ F9 DC AA 67 1E 46 FB E5 15 32 4C 18 F6 18 FB 14
##$RELAX= 
##$RELAX= 
##$RELAX= 
##$RELAX= 
##$RELAX= 
##$RELAX= 
##$RELAX= 
##$RELAX= 
##$RELAX= 
##$RELAX= 
##$RELAX= 
$$ Bruker specific parameters
$$ --------------------------
##$DU= <F:/spectra>
##$EXPNO= 1
##$NAME= <P31dec>
##$PROCNO= 1
##$TYPE= <nmr>
##$USER= <iren>
##$AMP= (0..31)
100 100 100 100 100 100 100 100 100 100 100 100 100 100 100 100 100 100 
100 100 100 100 100 100 100 100 100 100 100 100 100 100 
##$ANAVPT= -1
##$AQSEQ= 0
##$AQ_mod= 1
##$AUNM= <au_zg>
##$AUTOPOS= <>
##$BF1= 81.014009
##$BF2= 200.13
##$BF3= 200.13
##$BF4= 200.13
##$BF5= 200.13
##$BF6= 200.13
##$BF7= 200.13
##$BF8= 200.13
##$BYTORDA= 1
##$CFDGTYP= 0
##$CFRGTYP= 5
##$CHEMSTR= <none>
##$CNST= (0..63)
1 1 145 1 1 1 1 1 1 1 1 1 1 1 1 1 1 1 1 1 1 1 1 1 1 1 1 1 1 1 1 1 1 1 
1 1 1 1 1 1 1 1 1 1 1 1 1 1 1 1 1 1 1 1 1 1 1 1 1 1 1 1 1 1 
##$CPDPRG= <waltz16>
##$CPDPRG1= <>
##$CPDPRG2= <waltz16>
##$CPDPRG3= <>
##$CPDPRG4= <mlev>
##$CPDPRG5= <mlev>
##$CPDPRG6= <mlev>
##$CPDPRG7= <mlev>
##$CPDPRG8= <mlev>
##$CPDPRGB= <>
##$CPDPRGT= <>
##$D= (0..63)
0 1 0 0 0 0 0 0 0 0.06 0 0.03 2e-005 3e-006 0 0 0.0002 0 0 0 0 0 0 0 0 
0 0 0 0 0 0 0 0 0 0 0 0 0 0 0 0 0 0 0 0 0 0 0 0 0 0 0 0 0 0 0 0 0 0 0 
0 0 0 0 
##$DATE= 1732269464
##$DBL= (0..7)
120 120 120 11 120 120 24 19 
##$DBP= (0..7)
150 150 150 150 150 150 150 150 
##$DBP07= 0
##$DBPNAM0= <>
##$DBPNAM1= <>
##$DBPNAM2= <>
##$DBPNAM3= <>
##$DBPNAM4= <>
##$DBPNAM5= <>
##$DBPNAM6= <>
##$DBPNAM7= <>
##$DBPOAL= (0..7)
$$ [...]
0 1 3 0 0 0 0 0 0 0 0 0 0 0 0 0 
##$SW_h= 37037.037037037
##$TD= 32768
##$TD0= 1
##$TE= 300
##$TE2= 300
##$TE3= 300
##$TEG= 300
##$TL= (0..7)
0 120 53 12 22 120 120 120 
##$TP= (0..7)
150 150 150 150 150 150 150 150 
##$TP07= 0
##$TPNAME0= <>
##$TPNAME1= <>
##$TPNAME2= <>
##$TPNAME3= <>
##$TPNAME4= <>
##$TPNAME5= <>
##$TPNAME6= <>
##$TPNAME7= <>
##$TPOAL= (0..7)
0.5 0.5 0.5 0.5 0.5 0.5 0.5 0.5 
##$TPOFFS= (0..7)
0 0 0 0 0 0 0 0 
##$TUNHIN= 0
##$TUNHOUT= 0
##$TUNXOUT= 0
##$USERA1= <user>
##$USERA2= <user>
##$USERA3= <user>
##$USERA4= <user>
##$USERA5= <user>
##$V9= 5
##$VALIST= <valist>
##$VCLIST= <CCCCCCCCCCCCCCC>
##$VD= 0
##$VDLIST= <DDDDDDDDDDDDDDD>
##$VPLIST= <PPPPPPPPPPPPPPP>
##$VTLIST= <TTTTTTTTTTTTTTT>
##$WBST= 1024
##$WBSW= 4
##$XGAIN= (0..3)
0 0 0 0 
##$XL= 0
##$YL= 0
##$YMAX_a= 1519
##$YMIN_a= -1163
##$ZGOPTNS= <>
##$ZL1= 120
##$ZL2= 120
##$ZL3= 120
##$ZL4= 120
##$ABSF1= 0
##$ABSF2= 0
##$ABSG= 0
##$ABSL= 0
##$ALPHA= 0
##$AQORDER= 0
##$ASSFAC= 0
##$ASSFACI= 0
##$ASSFACX= 0
##$ASSWID= 0
##$AUNMP= <proc_1d>
##$AXLEFT= 0
##$AXRIGHT= 0
##$AXTYPE= 0
##$AXUNIT= <>
##$AZFE= 0.1
##$AZFW= 0.5
##$BCFW= 0
##$BC_mod= 2
##$BYTORDP= 0
##$COROFFS= 0
##$CY= 12.5935478210449
##$DATMOD= 1
##$DC= 0
##$DFILT= <>
##$DTYPP= 0
##$F1P= 47.1127640792319
##$F2P= -24.0371245302204
##$FCOR= 0.5
##$FTSIZE= 32768
##$FT_mod= 6
##$GAMMA= 0
##$GB= 0
##$INTBC= 1
##$INTSCL= 7.269226e-011
##$ISEN= 30
##$LB= 10
##$LEV0= 0
##$LPBIN= 0
##$MAXI= 12.09355
##$MC2= 0
##$MEAN= 0
##$ME_mod= 0
##$MI= 0.7550151
##$NCOEF= 0
##$NC_proc= -12
##$NLEV= 6
##$NOISF1= 298.5841
##$NOISF2= 270.0111
##$NSP= 0
##$NTH_PI= 0
##$NZP= 0
##$OFFSET= 298.5841
##$PC= 1.4
##$PHC0= 269.8655
##$PHC1= 34.2881
##$PH_mod= 1
##$PKNL= yes
##$PPARMOD= 0
##$PPDIAG= 0
##$PPIPTYP= 0
##$PPMPNUM= 100
##$PPRESOL= 1
##$PSCAL= 0
##$PSIGN= 0
##$REVERSE= no
##$SF= 81.014009
##$SI= 32768
##$SIGF1= 270.0111
##$SIGF2= -158.5842
##$SINO= 77.54984
##$SIOLD= 32768
##$SREGLST= <31P.CDCl3>
##$SSB= 0
##$STSI= 32768
##$STSR= 0
##$SW_p= 37037.037037037
##$SYMM= 0
##$S_DEV= 0
##$TDeff= 32768
##$TDoff= 0
##$TI= <>
##$TILT= no
##$TM1= 0
##$TM2= 0
##$TOPLEV= 0
##$USERP1= <user>
##$USERP2= <user>
##$USERP3= <user>
##$USERP4= <user>
##$USERP5= <user>
##$WDW= 1
##$XDIM= 32768
##$YMAX_p= 360466253
##$YMIN_p= -20944112
$$ End of Bruker specific parameters
$$ ---------------------------------
##NTUPLES= NMR SPECTRUM
##VAR_NAME=  FREQUENCY,     SPECTRUM/REAL,   SPECTRUM/IMAG
##SYMBOL=    X,             R,               I
##VAR_TYPE=  INDEPENDENT,   DEPENDENT,       DEPENDENT
##VAR_FORM=  AFFN,          ASDF,            ASDF
##VAR_DIM=   32768,         32768,           32768
##UNITS=     HZ,            ARBITRARY UNITS, ARBITRARY UNITS
##FACTOR=    1.13031516577767, 1,            1
##FIRST=     37037.037037037, 4608577,       -6306346
##LAST=      0,             -6999656,        -3645599
##MIN=       0,             -20944112,       0
##MAX=       37037.037037037, 360466253,     0
$$ Real data points
##PAGE= N=1
##DATA TABLE= (X++(R..R)), XYDATA
$$ [...]
17801A45826M31349N30223O30219N86903L17081r9727n00133p68924q96122q92621
17791e15926p50409n11969k32541P1322L72408O24676P77561P87091O86650N72649
17781A881512M71047L18266J02106j24762l81394p15349j069699j316550j352193
17772b187016j140253p46058l15766j9665L5979m3104j2743J82692L49200L36231
17762c560503J97197R1135J28389K72619L95252M40946M69399N21314N39737M66990
17752c7525L41930K32174J27784j1980j85123l79375n73161o97977o88162n52106
17742b423521l69542k05280k9884K37634N76359P92702O68775J82046m51761r52385
17732a974857j188785j186068r87540o40396k71847R936K39409M64365O15443
$$ y = [145826, 577175, 1107398, 1737617, 2324520, 2641601, 2541874, 2041741, 1272817, 376695, -515926, -1266335, -1778304, -2010845, -1939523, -1567115, -942439, -164878, 622213, 1308863, 1881512, 2352559, 2670825, 2772931, 2648169, 2266775, 1551426, 481727, -834823, -2187016, -3327269, -4073327, -4389093, -4408758, -4372779, -4415883, -4428626, -4245934, -3896734, -3560503, -3363306, -3272171, -3143782, -2871163, -2475911, -2034965, -1565566, -1044252, -504515, -37525, 304405, 536579, 664363, 652383, 467260, 87885, -485276, -1183253, -1871415, -2423521, -2793063, -2998343, -3028227, -2790593, -2214234, -1421532, -752757, -570711, -1022472, -1974857, -3163642, -4349710, -5337250, -5977646, -6249493, -6239557, -6000148, -5535783, -4920340]
17723d920340N91051L88773J43975K5768R4438K72343M37771N39318N90345N84307
17713a252251M77342K66239L6653q5955o0256L2346J25998K55977M40231N62070
17703G98394M51641R2517l45081p07105r80292j202434j345123j350578j235234
17694e823295j103560j080824j245533j536612j716234j560205j073241m57338
17686a5596842O5405M15163O81351R83095J339063J688478J975102K163423K200764
17677d084998K057971J786746J456427J053678N12582j47388p83827j225183j356802
17668g30794j172659p76516l26934R83P2036q8701l12218m71267n18224m09055
17658d733349j42337J95592M74272N70717M56251K50815J35341K16911M78504
$$ y = [-4920340, -4329289, -3940516, -3796541, -3770773, -3676335, -3403992, -2966221, -2426903, -1836558, -1252251, -774909, -508670, -472017, -557972, -618228, -585882, -459884, -203907, 236324, 798394, 1250035, 1342552, 997471, 290366, -689926, -1892360, -3237483, -4588061, -5823295, -6926855, -8007679, -9253212, -10789824, -12506058, -14066263, -15139504, -15596842, -15531437, -15116274, -14434923, -13451828, -12112765, -10424287, -8449185, -6285762, -4084998, -2027027, -240281, 1216146, 2269824, 2782406, 2635018, 1851191, 626008, -730794, -1903453, -2679969, -3006903, -3005920, -2933884, -3022585, -3334803, -3806070, -4324294, -4733349, -4875686, -4680094, -4205822, -3635105, -3178854, -2928039, -2792698, -2575787, -2097283]
17649b097283P90515R65256Q99789O53395L49641O7526j92975m82565q03851j097621
17639i48173j305994j374370j241729r02991m68612p3060K31019M50982N77574
17630e055354N68236M35665K94970K41479K55891K49497J25070j70620n60142
17621c615308q31169p90924m09223J63253O77886R74908J070986J043238R10833
17612h05520O66515L51516M7593j81721l40780m76074o00087p18032q36845r24829
17602c818264r49329r04010q04973o83787n73916n00937m85593n39769o41918
17593i902496p15455o53622m11555k8798M23521Q52619J151048J230389J073946
17584f980403P74230M85820K99348J90607J28855J36921K19511L36199M26651
$$ y = [-2097283, -1306768, -341512, 558277, 1211672, 1561313, 1628839, 1435864, 953299, 149448, -948173, -2254167, -3628537, -4870266, -5773257, -6241869, -6314929, -6083910, -5632928, -5055354, -4487118, -4051453, -3756483, -3515004, -3259113, -3009616, -2884546, -3055166, -3615308, -4446477, -5237401, -5646624, -5483371, -4805485, -3830577, -2759591, -1716353, -805520, -139005, 212511, 260104, 78383, -262397, -738471, -1338558, -2056590, -2893435, -3818264, -4767593, -5671603, -6476576, -7160363, -7734279, -8235216, -8720809, -9260578, -9902496, -10617951, -11271573, -11683128, -11711926, -11288405, -10435786, -9284738, -8054349, -6980403, -6206173, -5720353, -5421005, -5230398, -5101543, -4964622, -4745111, -4408912, -3982261]
17575c982261M43394L96068L49955L48660L68310L65118L18642K36492J74737
17566i80885J94092L07144M97769P08969Q29366P73546N59022K67869j2821k04269
17556B939802k64126k26885j67546j12200m8678Q474M0202N5743L4382p1584k38376
17545A949208m17779o27613q79326j102671j199711j121734q94467o14111l81630
17536e289834k35194j41000l6225R1676K33530M23602O52901P67720N83411R1789
17526b857624m87312q62223q87367o25577k69105P765J74556K83434L48364L33492
17516d841597K05690j7643k86579n59730p89834r12821q73364o74868l88151q8244
17506i227141J36752J99831J40034J15576K40035N05416Q17810J082074J259578
$$ y = [-3982261, -3538867, -3142799, -2792844, -2444184, -2075874, -1710756, -1392114, -1155622, -980885, -786793, -479649, 18120, 727089, 1556455, 2330001, 2889023, 3156892, 3144071, 2939802, 2675676, 2448791, 2281245, 2169045, 2120367, 2128841, 2169043, 2224786, 2259168, 2187584, 1949208, 1531429, 903816, 24490, -1078181, -2277892, -3399626, -4294093, -4908204, -5289834, -5525028, -5666028, -5702253, -5610577, -5377047, -4953445, -4300544, -3532824, -2949413, -2857624, -3344936, -4207159, -5094526, -5720103, -5989208, -5981443, -5806887, -5523453, -5175089, -4841597, -4635907, -4653550, -4940129, -5499859, -6289693, -7202514, -8075878, -8750746, -9138897, -9227141, -9090389, -8890558, -8750524, -8634948, -8394913, -7889497, -7071687, -5989613, -4730035]
17497d730035J347538J342979J214982R09287M45759j8624k86863k69237r291
17488e3505L99285Q12919J005241P95631K24037m61011r71881j152975j058905
17479d61164q85698p86555p28553n62612k52760M0508J44176N4300p9414j03128
17469c620900R813J62438K31248J64773L4792n923J24612L35540M43225L53818
17459a766564J19817j51611l60826m49997m05474k23506O5120L86934O72759Q29061
17449a284287P48153M08697o3700m49759o09090o01853n72305n60914n20172m09297
17439c914527j90724J28024M59416O90748P40935O30132M85740L97565L26161
17430b46530J97732n053k73941o07101r48050j179626j222162j063600p16683
$$ y = [-4730035, -3382497, -2039518, -824536, 84751, 530510, 511886, 225023, -44214, -53505, 345780, 1158699, 2163940, 2959571, 3183608, 2722597, 1750716, 597741, -461164, -1346862, -2133417, -2861970, -3424582, -3677342, -3636834, -3492658, -3438358, -3517772, -3620900, -3611087, -3448649, -3217401, -3052628, -3017836, -3023759, -2899147, -2563607, -2120382, -1766564, -1646747, -1798358, -2159184, -2609181, -3014655, -3238161, -3173041, -2786107, -2113348, -1284287, -536134, -127437, -191137, -640896, -1249986, -1851839, -2424144, -2985058, -3505230, -3914527, -4105251, -3977227, -3517811, -2827063, -2086128, -1455996, -970256, -572691, -246530, -48798, -53851, -327792, -934893, -1882943, -3062569, -4284731, -5348331, -6065014]
17421f065014k32439K93926P55481J050307J101055R13738O06002L10282R9293
17412a167369j6328r8697k37281m81126p97073j056629j110595r17419n78976
17403f461493k41370m959J06910J43366J54221J29863L7217j11486k56780l29715
17393f834226l20171l02134k99694k20950m710K78351M94927N65890N04180L84067
17383e754470K92122K79089L14771L18258K60731J61806N5676k53Q743O5375J79740
17372c818412L52513N84442Q50607J021381R84680P70900M57699R2837k75149
17363A021498n87764p85795q30607p46033o02249m74381m13029m00849l58532
17354d177741k19851K6904L50230O89890R86246J202797J275111J118272P64066
$$ y = [-6065014, -6297453, -6003527, -5248046, -4197739, -3096684, -2182946, -1576944, -1266662, -1167369, -1183697, -1282394, -1519675, -2000801, -2797874, -3854503, -4965098, -5882517, -6461493, -6702863, -6707822, -6600912, -6457546, -6303325, -6173462, -6136245, -6247731, -6504511, -6834226, -7154397, -7456531, -7756225, -7977175, -7981885, -7703534, -7208607, -6642717, -6138537, -5754470, -5462348, -5183259, -4868488, -4550230, -4289499, -4127693, -4072017, -4072270, -4063527, -3998152, -3818412, -3465899, -2881457, -2030850, -1009469, -24789, 746111, 1203810, 1296647, 1021498, 433734, -352061, -1182668, -1928701, -2530950, -3005331, -3418360, -3819209, -4177741, -4397592, -4370688, -4020458, -3330568, -2344322, -1141525, 133586, 1251858, 2015924]
17345B015924L63172K471l33824o28189p90168p45904n57137l86945l09245k54151
17335a623996j48305m3853l3833o9506k6340P4712R3776n569j27097k04472k48196
17324b362679k77158k96307l26478l83558m21859l86025l08180l00835m33560
17315e496639o07954o42234m82264k41000o4887n170j7388n3079p9680p4207p6736
17304g841238j61578l14795m22039l74290j35356K44725O81223J100437J421280
17295e801631J562134J483402J209399Q16866L94011j8817m13091p52564r55558
17286b475849r31785o97729m11423k12101q9097L3731J75785L10507M12979M91512
17276c393470N87813P18441Q39071Q69402P51580M81111J25964j92939l73191
$$ y = [2015924, 2379096, 2381567, 2047743, 1419554, 629386, -116518, -673655, -1060600, -1369845, -1623996, -1772301, -1816154, -1849987, -1919493, -1945833, -1871121, -1777345, -1782914, -1910011, -2114483, -2362679, -2639837, -2936144, -3262622, -3646180, -4068039, -4454064, -4762244, -5063079, -5496639, -6104593, -6746827, -7229091, -7470091, -7534978, -7540148, -7557536, -7610615, -7690295, -7764502, -7841238, -8002816, -8317611, -8739650, -9113940, -9249296, -9004571, -8323348, -7222911, -5801631, -4239497, -2756095, -1546696, -729830, -335819, -354636, -767727, -1520291, -2475849, -3407634, -4105363, -4516786, -4728887, -4817984, -4784253, -4608468, -4297961, -3884982, -3393470, -2805657, -2087216, -1248145, -378743, 372837, 853948, 979912, 786973, 413782]
17267D13782l89378l00028j60558M1448K99805N32621O66609O73997N73181M56886
17257B808365M15756M38384M51184M02849K64754j0309m17207q20463j058134
17248B475179j089167r86327q26483n91543k19730K29327N94424P89271Q29885
17239A204836P50605N98563M30235K68346R9607j00266l34573n50410o64950n94894
17229A107099l23420K9186L06487M34210M48437M23338L27396O8051l07083o34147
17219A879554q03016q08973p68123p72539p33925n49836k73421l9033Q4481J35670
17209b649161J68229J75894J44466J21613J93799L83464N81804O39527N13481
17200B73116K85481O7420q0741j61286j95150j90375j88776k69298m32038n35872
$$ y = [413782, 24404, -275624, -436182, -394734, -94929, 437692, 1104301, 1778298, 2351479, 2808365, 3224121, 3662505, 4113689, 4516538, 4781292, 4770983, 4353776, 3533313, 2475179, 1386012, 399685, -426798, -1018341, -1238071, -1008744, -414320, 374951, 1204836, 1955441, 2554004, 2984239, 3252585, 3352192, 3251926, 2917353, 2366943, 1701993, 1107099, 783679, 812865, 1119352, 1553562, 2001999, 2425337, 2752733, 2820784, 2513701, 1879554, 1076538, 267565, -500558, -1273097, -2007022, -2556858, -2830279, -2869312, -2784831, -2649161, -2480932, -2305038, -2160572, -2038959, -1845160, -1461696, -879892, -240365, 273116, 558597, 626017, 545276, 383990, 188840, -1535, -190311, -459609, -891647, -1427519]
17190a427519m28965j30338J99595M39934N78836O36798O25591N50574L86105
17181A430611J34292j23819l01793l47164k06151J23375N35899Q98513J092426
17172C236189J008006O66909K86833P6359L4101N8400J11861J79700K02139J09212
17162E969709j20664m33708p23131q68389p96172n59531k90786r8771n3928j34400
17152A890229k03709j28284J03739L23041K97964j7249m41069p56050q86642q70919
17142f88949p06964l66298L7960K69133J94301r9468m13978o07547o57395o23053
17132c662258n75390n29727m20884k02949P0504L33137N51302O64378O01873L96097
17122b773917J36629j46356l81303m33560k98129j33721o9148j02878k02919l60364
$$ y = [-1427519, -1856484, -1986822, -1787227, -1347293, -768457, -131659, 493932, 1044506, 1430611, 1564903, 1441084, 1139291, 792127, 585976, 709351, 1245250, 2143763, 3236189, 4244195, 4911104, 5197937, 5274296, 5308397, 5366797, 5478658, 5658358, 5860497, 5969709, 5849045, 5415337, 4692206, 3823817, 3027645, 2468114, 2177328, 2078557, 2024629, 1890229, 1686520, 1558236, 1661975, 1985016, 2282980, 2265731, 1824662, 1068612, 181970, -688949, -1395913, -1762211, -1724251, -1455118, -1260817, -1360285, -1774263, -2381810, -3039205, -3662258, -4237648, -4767375, -5188259, -5391208, -5320704, -4987567, -4436265, -3771887, -3170014, -2773917, -2637288, -2783644, -3164947, -3598507, -3896636, -4030357, -4099505, -4202383, -4405302, -4765666]
17112d765666n29045o24908o04654m71993k25949J01461M31927P37348J022205
17103d929274J214742J222863J014085N92003K7922m81028p38605p48685o35666
17094c461643m52042k12359J4941J47177J41665L2651n7207k0770J17787K52626
17084c497174L45888M42014N21806M86519L05532M1451k31244m43362n49376n74144
17074c152090n48365m52205k92631j28218J6065J89113M12729N99540O62967N91126
17064b101969M07408J76171O222k6446K9673L6514q4801k45847k63873o5278K27426
17053a904800M49765N53347N74000N70598N87538N72261L56295j59733p99306
17044G99965j248714j367323j189045p77237k53787K04487N08509O64721O78294
$$ y = [-4765666, -5294711, -5919619, -6524273, -6996266, -7222215, -7120754, -6688827, -5951479, -4929274, -3714532, -2491669, -1477584, -885581, -857659, -1338687, -2077292, -2825977, -3461643, -3913685, -4126044, -4111103, -3963926, -3822261, -3789610, -3846817, -3867587, -3749800, -3497174, -3151286, -2709272, -2187466, -1700947, -1395415, -1353964, -1585208, -2028570, -2577946, -3152090, -3700455, -4152660, -4445291, -4573509, -4557444, -4368331, -3955602, -3356062, -2693095, -2101969, -1694561, -1518390, -1512168, -1538614, -1508941, -1472427, -1557228, -1803075, -2066948, -2132226, -1904800, -1455035, -901688, -327688, 242910, 830448, 1402709, 1759004, 1599271, 799965, -448749, -1816072, -3005117, -3782354, -4036141, -3831654, -3323145, -2658424, -1980130]
17035a980130N73794M37710L63334L44929K46559n9511n11148q84284j042848
17026b511595j058390j024719r12288o77423l73037p6813J60772K85026K66189
17017e922278J56096L4848p1535j62778k24301k16088o7669K68901P40736J185425
17007d278643J444740J478223J359932J147594Q23041M00380j6459k79436k85961
16998A793411n5814K48567M27017M32619L50215K28750P5152r6660k73137m22244
16988B707876m75517l92773k31052o5619P0703J36613R8834m6632k95141o25761
16978H81531r77507j252156j350877j211099q53728m12347m5176J57460J71935
16969d891964M3962j46695l52103m99824m72481k37963J16714M69121O98908P23234
$$ y = [-1980130, -1406336, -968626, -605292, -260363, -13804, -73315, -584463, -1468747, -2511595, -3569985, -4594704, -5506992, -6184415, -6557452, -6634265, -6473493, -6188467, -5922278, -5766182, -5731334, -5802869, -5965647, -6189948, -6406036, -6473705, -6204804, -5464068, -4278643, -2833903, -1355680, 4252, 1151846, 1974887, 2375267, 2358808, 2079372, 1793411, 1737597, 1986164, 2413181, 2845800, 3196015, 3424765, 3499917, 3403257, 3130120, 2707876, 2232359, 1839586, 1608534, 1542915, 1613618, 1750231, 1849065, 1802433, 1507292, 881531, -95976, -1348132, -2699009, -3910108, -4763836, -5176183, -5221359, -5063899, -4891964, -4848002, -4994697, -5346800, -5846624, -6319105, -6557068, -6440354, -5971233, -5272325, -4549091]
16959d549091N19830J39083k73844n68212p06886o99021n30167k18799J60394
16950f726713M85828O74450P46165P36821O22717L79880Q2896j24553j67221j27474
16940c417204j24617j52894j51208q8188N9959K76322M37634M15075K30531R083
16930b505507j42643j76794j08248Q0O3069M0613q735P396J02874J72100J05826
16919b449969p0223k13375k30599j78733j50956j63321j70261j13767L6036K58825
16909c446343M70568N72950N12363K69861j05682m80528p30930p93851o39724
16900d371316l10501L8721K27254J91167K1743j21203j09350P1503L23329N59820
16890c478833P35838P92777O88418M65567K24186M0532m1397j6659N0325O5919
$$ y = [-4549091, -4029261, -3890178, -4164022, -4732234, -5439120, -6138141, -6668308, -6887107, -6726713, -6240885, -5566435, -4820270, -4083449, -3460732, -3080852, -2997956, -3122509, -3289730, -3417204, -3541821, -3694715, -3845923, -3934111, -3874152, -3597830, -3160196, -2745121, -2514590, -2505507, -2648150, -2824944, -2933192, -2933112, -2870043, -2829430, -2838165, -2830769, -2727895, -2555795, -2449969, -2520192, -2733567, -2964166, -3142899, -3293855, -3457176, -3627437, -3741204, -3705168, -3446343, -2975775, -2402825, -1890462, -1620601, -1726283, -2206811, -2937741, -3731592, -4371316, -4681817, -4643096, -4415842, -4224675, -4202932, -4324135, -4433485, -4361982, -4038653, -3478833, -2742995, -1950218, -1261800, -796233, -572047, -531515, -572912, -589571, -539246, -473327]
16880d73327m428j28785k28423j94027j0096J78189K23696J42299L7001n3537
16870e11438j62196l06618m57361n75687o04183m71647k02850P9488K89644M09212
16860b513636M12819K93719J10849p3933k38592l45452k96212n304M76683R59538
16850a219521J268592J362291J277398J060449P93785O11519N94530O47273N70123
16841F966439K38531l07009q68650j202757j170610q19744l56277K6328K62020
16832B768271L38579K51090L2784k34123m55662n51022m69291k66501p2116M8385
16822A390394J10642J38933J17939P531j90122l80164m35455l31156j63103l3772
16812B31667M0355O5652k4654k93834o72221r92306j125944j055237q33310n28670
$$ y = [-473327, -477755, -606540, -834963, -1028990, -1039086, -860897, -637201, -494902, -457901, -511438, -673634, -980252, -1437613, -2013300, -2617483, -3089130, -3291980, -3212492, -2922848, -2513636, -2100817, -1807098, -1696249, -1770182, -2008774, -2354226, -2650438, -2655742, -2179059, -1219521, 49071, 1411362, 2688760, 3749209, 4542994, 5154513, 5749043, 6396316, 6966439, 7204970, 6897961, 6029311, 4826554, 3655944, 2836200, 2479923, 2506251, 2768271, 3106850, 3357940, 3390724, 3156601, 2700939, 2149917, 1680626, 1414125, 1342009, 1390394, 1501036, 1639969, 1757908, 1765439, 1575317, 1195153, 759698, 428542, 265439, 231667, 272022, 337674, 313020, 19186, -653035, -1645341, -2771285, -3826522, -4659832, -5188502]
16802e188502k17682N8481L58547P55387J170686J392229J290901R55919N84956
16793A160922L30260K29448J80324L9781k22414n21368p78306r69620j066819
16784a617792j034677r07354p81909p24564p37780p63977p18412n81128m07763
16775h275356k66774j81795r9168O3439L43296O99170J016705J175359J139199
16766d385925R64486P27571N12324L84930K94170J44408j1055j1948J65710L25003
16756h90326K79377N0638k17206m19964n43199n99605n70391m44604k65102j41317
16746c761699j55787k31499k24321p9288J88749N62532R94292J376619J584633
16737B54231J519090J136812M81434k49893p24684p59206n00440k27976j14897
$$ y = [-5188502, -5406184, -5347703, -4989156, -4233769, -3063083, -1670854, -379953, 575966, 1160922, 1491182, 1720630, 1900954, 1940735, 1718321, 1196953, 418647, -550973, -1617792, -2652469, -3559823, -4341732, -5066296, -5804076, -6568053, -7286465, -7867593, -8275356, -8542130, -8723925, -8823093, -8759654, -8416358, -7717188, -6700483, -5525124, -4385925, -3421439, -2693868, -2181544, -1796614, -1502444, -1358036, -1369091, -1381039, -1215329, -890326, -610949, -560311, -777517, -1197481, -1740680, -2340285, -2910676, -3355280, -3620382, -3761699, -3917486, -4148985, -4373306, -4452594, -4263845, -3701313, -2707021, -1330402, 254231, 1773321, 2910133, 3391567, 3141674, 2416990, 1657784, 1157344, 929368, 814471]
16728H14471j54854k13989j53604M3661K41411K51288m0184n66209j090671j390162
16718b258842j420585j245945q83220l72970J33368M67548N41797L98748K32709
16709d407392K22347L38127M12882L24022Q6988j70478l07477k49269j1767L08946
16699c453071O03320Q06927R01426Q88297P75847N63963K48200j36230m80060
16690G18619o88772q20180j022578j324415j573698j597394j342164q63690k76117
16681h790389K38147M92375M68836L51875L50401N06316O80316P49336P30690
16672d222097O94485O87462O96732O25082L62058r5355n90236q99740q98324o36775
16662d276708k95013m6173P4522J54071K62188L84284N03324O44887P91721Q80462
$$ y = [814471, 659617, 445628, 292024, 335685, 577096, 828384, 788200, 221991, -868680, -2258842, -3679427, -4925372, -5808592, -6181562, -6048194, -5580646, -5038849, -4640101, -4407392, -4185045, -3846918, -3434036, -3110014, -3023026, -3193504, -3500981, -3750250, -3762017, -3453071, -2849751, -2042824, -1141398, -253101, 522746, 1086709, 1334909, 1198679, 718619, 29847, -790333, -1812911, -3137326, -4711024, -6308418, -7650582, -8514272, -8790389, -8552242, -8059867, -7591031, -7239156, -6888755, -6382439, -5702123, -4952787, -4222097, -3527612, -2840150, -2143418, -1518336, -1156278, -1251633, -1841869, -2741609, -3639933, -4276708, -4571721, -4617894, -4543372, -4389301, -4127113, -3742829, -3239505, -2594618, -1802897, -922435]
16652i22435Q91926Q51254P71134O14363L53876O4102j26202j44685j2584K13365
16642B554114M58340N64739M40798K55975K09580K52847J74759j58458o43731
16633D108963j031341j169521j092057r02871o87318n24428n03353o70637r45130
16624c417693j172292j236429j084895p35729k44604L42049R35872J391642J612251
16615c609828J580710J323552R22361N07298J86330K2428N2522K36763M43002
16606A665138N09303L43425J9849k54075l01500j29181R6424K08051J13945j63570
16596B107809n00697p67267q61406o99762k93380K04109O07742Q11832P62818
16587A371798M26532j34260o93503r63287q45378n14368j73177J40259M73376
$$ y = [-922435, -30509, 820745, 1591879, 2206242, 2560118, 2624220, 2498018, 2353333, 2340749, 2554114, 3012454, 3577193, 4017991, 4273966, 4483546, 4736393, 4911152, 4752694, 4108963, 3077622, 1908101, 816044, -86827, -774145, -1298573, -1801926, -2472563, -3417693, -4589985, -5826414, -6911309, -7647038, -7891642, -7549593, -6613721, -5222079, -3609828, -2029118, -705566, 216795, 724093, 910423, 932851, 985373, 1222136, 1665138, 2174441, 2517866, 2537715, 2283640, 1982140, 1852959, 1949383, 2157434, 2271379, 2107809, 1607112, 839845, -21561, -721323, -1014703, -810594, -202852, 608980, 1371798, 1798330, 1664070, 970567, 7280, -838098, -1352466, -1525643, -1385384, -912008]
16578i12008Q38569J138981J151567O99558r5855q52109j261741j286236j038661
16569a617935o33878j72258K21988M27549M16490K68990J14247K1517r5075l56969
16559a405334p09272r45815r10971o50997l48495j13362L6772J06768J44411K46188
16549d550107M96586Q97210J356355J693349J719196J396140Q71938L64034K1165
16540D265866j36694j62290q4771Q0191K57136L48053K92363N5435l18867o82452
16530C913970r18025r95638r18353p38125n58930m94610n86978p34304p79506
16521b810499o44396l58177j1412K85867M38917M13392K46837K9009j37847k05161
16511b753470k11582k18344k33766k46162k63319k54141j57880K300J37586K15344
$$ y = [-912008, -73439, 1065542, 2217109, 2916667, 2820812, 1968703, 706962, -579274, -1617935, -2251813, -2424071, -2202083, -1774534, -1358044, -1089054, -974807, -953290, -1048365, -1405334, -2114606, -3060421, -3971392, -4622389, -4970884, -5084246, -5047474, -4940706, -4796295, -4550107, -4053521, -3156311, -1799956, -106607, 1612589, 3008729, 3880667, 4244701, 4265866, 4129172, 3966882, 3882111, 3962302, 4219438, 4567491, 4859854, 4915289, 4596422, 3913970, 2995945, 2000307, 1081954, 343829, -215101, -709711, -1296689, -2030993, -2810499, -3454895, -3813072, -3824484, -3538617, -3099700, -2686308, -2439471, -2410462, -2548309, -2753470, -2965052, -3183396, -3417162, -3663324, -3926643, -4180784, -4338664, -4336364, -4198778, -3983434]
16501c983434K72787L54301N02122P33136R87737J146821J096510P88696K96599
16492B195275k04251n41322o55786o37214n99824n50146m44106k96732j45948
16483a880054L2068K85568O03750Q73338R16009O51729J95635k52122n81384p67900
16473G6637p45593m41849N6216N49607R17017J103916J041954P13580J81032m70902
16463B981615j170157j827554k267819k220381j572836o76934j7434L22233N61571
16454e887696Q42170J146654J387999J443204J225777P91494L26262m6673l66726
16445H62465o67070q62547q76048p48428n81091m65874m43030m48314l87403k71268
16435d888608j81678j20905m137K07097M57474O69566P77310P09222M48714P6596
$$ y = [-3983434, -3710647, -3356346, -2854224, -2121088, -1133351, 13470, 1109980, 1898676, 2195275, 1991024, 1449702, 793916, 156702, -443122, -993268, -1437374, -1734106, -1880054, -1847986, -1562418, -958668, -85330, 830679, 1482408, 1678043, 1425921, 844537, 76637, -668956, -1110805, -1054589, -504982, 412035, 1515951, 2557905, 3271485, 3452517, 2981615, 1811458, -16096, -2283915, -4504296, -6077132, -6754066, -6771500, -6449267, -5887696, -5045526, -3898872, -2510873, -1067669, 158108, 949602, 1275864, 1229191, 862465, 195395, -667152, -1543200, -2291628, -2872719, -3338593, -3781623, -4229937, -4617340, -4888608, -5070286, -5191191, -5195328, -4988231, -4530757, -3861191, -3083881, -2374659, -1925945, -1849349]
16425a849349k78528n02124n65646n37193m72218l51909j70805m770L6699j05219
16415d801062l77547o28254o89443m99434j44556K38872N33917O47494N33244
16406e186769J99591k97949q50108j307384j564457j605377j436251j086585o53491
16397a3788780k77966o7539P950O5478J60812K65506L05954K23925N1304p8876
16387a3132232k3798K70261Q24298J564739K124148K106780J577176R70341O37730
16378c080557O05498O26402M31124j8864m88652o98113o10333m26120l19683l30234
16368d309532m18633m86684m65233l72763k27296k9467J67532K73934K61637K03527
16358e402978J63396J19386L9082n4729j02363o1311J0971N457n8386j03998j87718
$$ y = [-1849349, -2127877, -2630001, -3195647, -3732840, -4205058, -4556967, -4727772, -4732542, -4695843, -4801062, -5178609, -5806863, -6496306, -6995740, -7140296, -6901424, -6367507, -5720013, -5186769, -4987178, -5285127, -6135235, -7442619, -9007076, -10612453, -12048704, -13135289, -13788780, -14066746, -14134285, -14126335, -14060857, -13900045, -13634539, -13328585, -13104660, -13053356, -13132232, -13156030, -12885769, -12061471, -10496732, -8372584, -6265804, -4688628, -3718287, -3080557, -2475059, -1848657, -1417533, -1436397, -1925049, -2623162, -3233495, -3659615, -3979298, -4309532, -4728165, -5214849, -5680082, -6052845, -6280141, -6309608, -6142076, -5868142, -5606505, -5402978, -5239582, -5120196, -5081114, -5135843, -5238206, -5299517, -5288546, -5283089, -5341475, -5445473, -5633191]
16347e633191l73226n77732o99549p14862o17714l50370J09870O11966R42793
16338g302015J058184J063276J016407R19451Q13903P25589O02608M21633K68281
16329d12683K10389K05750J93872J46839M7507j17569l80064p64906j213481j590671
16319c675017j824308j983958k147758k279074k280320k075139j698819j323183
16311a9287576j041123o15413M02783K105019L830780M781200M817582M282550
16303g24198L528888K758339K042899J396716Q11099K87839j16561l25990l02148
16294I356883j02424O8420j2039l35004o49566p41654o39145n25414n32954o64307
16284E222796q33152r22768q59966o65197m09327j47295J14022L64972N03620
$$ y = [-5633191, -6006417, -6584149, -7283698, -7998560, -8616274, -8966644, -8856774, -8244808, -7302015, -6243831, -5180555, -4164148, -3244697, -2430794, -1705205, -1102597, -680964, -412683, -202294, 3456, 197328, 344167, 391674, 274105, -105959, -870865, -2084346, -3675017, -5499325, -7483283, -9631041, -11910115, -14190435, -16265574, -17964393, -19287576, -20328699, -20944112, -20541329, -18436310, -14605530, -9824330, -5006748, -724198, 2804690, 5563029, 7605928, 9002644, 9813743, 10101582, 9985021, 9659031, 9356883, 9254459, 9322879, 9310840, 8975836, 8326270, 7584616, 6945471, 6420057, 5887103, 5222796, 4389644, 3466876, 2606910, 1941713, 1532386, 1385091, 1499113, 1864085, 2367705]
16275B367705M06391J20814j48586k72650l00220l24491l38250k42980L830K86566
16265A558129M46521M49256L81114L38163L35856L28198K90814K13647N7317j72833
16255D226182l71564m17404k84883n6642J84435L69607L85635J70935j84384n05922
16245C515995o80373p42089q02958q94817r24201q05722o07409m56106l42928
16236b740608j71226N8837K40031K89833K11798Q8730L2392J16429L32785N91886
16226i49113P77808Q45231Q37562P94867P32669O89128O80802O62844O13299N69161
16216F254258N41855M83566L71411K30261L6372k95097p82113j257544j476606
16207D106363j354074r95316n22498j0541M40468P58573R48604R85603Q17060
$$ y = [2367705, 2774096, 2894910, 2746324, 2473674, 2173454, 1848963, 1510713, 1267733, 1271563, 1558129, 2004650, 2453906, 2835020, 3173183, 3509039, 3837237, 4128051, 4341698, 4399015, 4226182, 3854618, 3437214, 3152331, 3095689, 3280124, 3649731, 4035366, 4206301, 4021917, 3515995, 2835622, 2093533, 1290575, 395758, -528443, -1334165, -1941574, -2397680, -2740608, -2911834, -2852997, -2612966, -2323133, -2111335, -2022605, -1990213, -1873784, -1540999, -949113, -171305, 673926, 1511488, 2306355, 3039024, 3728152, 4408954, 5071798, 5685097, 6254258, 6796113, 7279679, 7651090, 7881351, 7917723, 7622626, 6840513, 5582969, 4106363, 2752289, 1756973, 1234475, 1223934, 1664402, 2422975, 3371579, 4357182, 5174242]
16198E174242M70625O4675k73803m99662o40089p03137o30845l52292J27962O71019
16188C408695J059526J145163R60665O78740M42008L02394K85385L45879L48825
16179H977280K39265J19919R3513J20277J16094Q2002M8067J9494J7570O4879
16169I898360J06431M9857q9995j98276k33980l15880n91621j013105j342832
16160F268959j422563j356988j369142j517047j685920j758640j640295j240030
16152e721666n69556J89827Q05932J127275J133343R35360O61949L43241n3983
16143a148278m92093q30539r51094q44131n66504j95646J77855M55758N56073
16134c838599M64228K50814M4259k8322R7983L94641P26154R13134Q34149M90109
$$ y = [5174242, 5644867, 5709542, 5435739, 4936077, 4295988, 3592851, 2962006, 2609714, 2737676, 3408695, 4468221, 5613384, 6574049, 7252789, 7694797, 7997191, 8282576, 8628455, 8977280, 9216545, 9336464, 9429977, 9550254, 9666348, 9748350, 9796417, 9815911, 9833481, 9898360, 10004791, 10054648, 9964653, 9766377, 9532397, 9216517, 8624896, 7611791, 6268959, 4846396, 3489408, 2120266, 603219, -1082701, -2841341, -4481636, -5721666, -6291222, -6101395, -5295463, -4168188, -3034845, -2099485, -1437536, -1094295, -1148278, -1640371, -2470910, -3422004, -4266135, -4832639, -5028285, -4850430, -4394672, -3838599, -3374371, -3123557, -3079298, -3107620, -3009637, -2614996, -1888842, -975708, -141559, 348550]
16124C48550N7793k13151k23061p0268O7658O0814q2293j95507j36674N3771K86194
16113d6174N25845P20797P81439O37866L03262r3529l93013n55542o51487p12489
16103E16975o83962n60534m82530n82494q12442r92488r93772q55631p22513o75884
16093f845275o64723n96234m37662k22766J3211K53359N02257P92482J081791
16084f123560J211964J076635P60210M78151L87110M42143M76423M03720K72833
16075f14371J70019J59563K61983M36252O13638P59165Q85774J010588J135160
16066D817771J216526J145974Q65307M61354N5762l34275p36612j072144j199801
16057E219862j084404q51272o41919m55230k22328K9091J98160K69810L31171
$$ y = [348550, 406343, 193192, -29869, -100137, -32479, 28335, -53958, -249465, -386139, -332368, -46174, 479671, 1200468, 1981907, 2619773, 2923035, 2829506, 2436493, 1880951, 1229464, 516975, -166987, -727521, -1210051, -1792545, -2604987, -3597475, -4591247, -5446878, -6169391, -6845275, -7509998, -8106232, -8543894, -8766660, -8753449, -8500090, -7997833, -7205351, -6123560, -4911596, -3834961, -3074751, -2596600, -2209490, -1767347, -1290924, -887204, -614371, -444352, -284789, -22806, 413446, 1027084, 1786249, 2672023, 3682611, 4817771, 6034297, 7180271, 8045578, 8506932, 8562694, 8228419, 7491807, 6419663, 5219862, 4135458, 3284186, 2642267, 2187037, 1964709, 1993800, 2191960, 2461770, 2792941]
16048B792941M11529M46580M00058L13536K23509J33666P9222P6696N8648l3411
16038D902974j59966k47919k87363l27518l96703m39500l68627j77022N7800K29965
16028B786121K74172K30841J61701N6273q8200k07968k74489l53131m83887o07728
16018A493705o58068o33603n91118n73208n19121l40224p9182J11851J20044k4868
16008a693792j61403j16782J56011N52967R38566J219923J328837J218304Q58925
15999D301556K97530l04786p82348j067482j184731j206426j188608j099382q51384
15990c086061m59783p5841K20118M98867P89171R95142J026543Q64663N30697
15981A303516J06342k66179n04350o34076o83110o21388m21975j00032K68981
$$ y = [2792941, 3204470, 3651050, 4051108, 4364644, 4588153, 4721819, 4801041, 4877737, 4936385, 4902974, 4743008, 4495089, 4207726, 3880208, 3483505, 3044005, 2675378, 2498356, 2556156, 2786121, 3060293, 3291134, 3452835, 3509108, 3420908, 3212940, 2938451, 2585320, 2101433, 1493705, 835637, 202034, -389084, -962292, -1481413, -1821637, -1900819, -1788968, -1668924, -1693792, -1855195, -1971977, -1815966, -1262999, -324433, 895490, 2224327, 3442631, 4301556, 4599086, 4294300, 3511952, 2444470, 1259739, 53313, -1135295, -2234677, -3086061, -3545844, -3621685, -3401567, -2902700, -2113529, -1118387, -91844, 772819, 1303516, 1409858, 1143679, 639329, 5253, -677857, -1299245, -1721220, -1821252, -1552271]
15972a552271N40329O12043N38385M01380J73354j39382l83713m19960k54082
15963d83917N069K40767M08029N18943N53653M55828K46564M3905q4359j73092
15953A731390k83609m13511m77214m41536l58770k43537o4398J73395M09965N74657
15943F06832N94377M09050M2454l58638o16333o46631m78456k34623n5078K8440
15933g08606Q4282J46767J73871J46605J21040J59980K36512K57606J79497J5043
15923H12597k09217m50357o66796q33317q88741p53501l99580R6596N20577O66791
15913b104948M94956Q8148m18291q54449j084843j053132p35097j77311M14087
15904e430880P73287Q09087O57271N03662M05556K66204l258l22252m83315l60789
$$ y = [-1552271, -1011942, -399899, 138486, 539866, 713220, 573838, 190125, -229835, -483917, -478848, -238081, 169948, 688891, 1242544, 1698372, 1944936, 1988841, 1904482, 1731390, 1447781, 1034270, 557056, 115520, -243250, -486787, -551185, -377790, 32175, 606832, 1201209, 1610259, 1652713, 1294075, 677742, 31111, -447345, -681968, -737046, -708606, -624324, -477557, -303686, -157081, -36041, 123939, 360451, 618057, 797554, 812597, 603380, 153023, -513773, -1347090, -2235831, -2989332, -3388912, -3292316, -2771739, -2104948, -1609992, -1521844, -1940135, -2794584, -3879427, -4932559, -5667656, -5844967, -5430880, -4657593, -3848506, -3191235, -2687573, -2282017, -2015813, -2019071, -2341323, -2824638, -3185427]
15894c185427m1115K87121M90145N25651M36990L21710K50435K41347K97386M23270
15884D7513O04683Q02937R85077J097158J078445R22614O36589K20632k79168
15875F116480p33141r69999r14837o36834k57365J12396L81219M72691L25100
15866C895710k0872l92099n96080n52529l50758j22398Q2554K23284K38157J17843
15856B522812j05755l91871o72011q34807p90516n65840k30987J90379O54271
15847b24325J029016J161977J000720O09784J44046k08694l03402j00806K87394
15838C395710O49341P98493O95364M53229K12677L9352q9394k35272m21787o17298
15828D880415p88168r00401q92214p46395n49955l96942k94212k10936j38105
$$ y = [-3185427, -3226542, -2939421, -2449276, -1923625, -1486635, -1164925, -914490, -673143, -375757, 47513, 652196, 1455133, 2440210, 3537368, 4615813, 5538427, 6175016, 6395648, 6116480, 5383339, 4413340, 3498503, 2861669, 2604304, 2716700, 3097919, 3570610, 3895710, 3874838, 3482739, 2886659, 2334130, 1983372, 1860974, 1943528, 2166812, 2404969, 2522812, 2417057, 2025186, 1353175, 518368, -272148, -837988, -1068975, -878596, -224325, 804691, 1966668, 2967388, 3577172, 3721218, 3512524, 3209122, 3108316, 3395710, 4045051, 4843544, 5538908, 5992137, 6204814, 6244166, 6154772, 5919500, 5497713, 4880415, 4092247, 3191846, 2299632, 1553237, 1003282, 606340, 312128, 101192, -36913]
15819c6913p4426l316J02980K52063L97302M36836K54898j71060o85620j038085
15809e65341j085299r05125o85482n15879l48298j85144j54646l06378m85643
15800e237235n07123l59302k02437k13615m12865o28912o98014n79412k62523
15791i101438K12828P04185J057159J175780J031266O58997J46901l45237o07958
15782e067517n33539k38880J05161M31108O80107Q00419Q36543Q66321Q79429
15773a240848P86180N64392L17441J36854L1734j3649K422Q3374J77259K10961
15763A056120J67105R1132P3625J67350L34544N05200N96024N42689L67745J62171
15753D063705L8076R1631L35550O42607P93483O37417K33406j53455k68610j05945
$$ y = [-36913, -111339, -114655, -11675, 240388, 637690, 1074526, 1329424, 1158364, 472744, -565341, -1650640, -2555765, -3241247, -3757126, -4105424, -4290568, -4445214, -4751592, -5237235, -5744358, -6103660, -6306097, -6519712, -6932577, -7561489, -8259503, -8838915, -9101438, -8888610, -8184425, -7127266, -5951486, -4920220, -4261223, -4114322, -4459559, -5067517, -5601056, -5839936, -5734775, -5303667, -4623560, -3823141, -2986598, -2120277, -1240848, -454668, 109724, 427165, 564019, 595753, 582104, 584526, 667900, 845159, 1056120, 1223225, 1314357, 1387982, 1555332, 1889876, 2395076, 2991100, 3533789, 3901534, 4063705, 4101781, 4193412, 4528962, 5171569, 5965052, 6602469, 6835875, 6682420, 6413810, 6307865]
15743F307865J25254K39762K69999L69389N30551N59945L12165j50992o28431
15734G935507r69716j172196j313760j438233j522322j499495j279724q16215
15726b076154j64866N37171J104385J364235J221850O91763p7799q39822j341767
15717D18996j434178j151080p01313l04729k0136K14821M02646M50971K95842
15708a828160J4863j45064K1935L89842O26489N79695L19734m2535l85900n31774
15698i80875l63226L4748M63450P59931Q36351P06890M62855J80934p2356k13535
15688A815167k42363k75625m11423o43627q79061r80911q82074o47685l82045
15679c529647j35481Q7295K97903N15531P03266P33445N22290J54741j84964l53095
$$ y = [6307865, 6433119, 6672881, 6942880, 7312269, 7842820, 8402765, 8714930, 8563938, 7935507, 6965791, 5793595, 4479835, 3041602, 1519280, 19785, -1259939, -2076154, -2241020, -1703849, -599464, 764771, 1986621, 2678384, 2600585, 1760763, 418996, -1015182, -2166262, -2867575, -3172304, -3192440, -2977619, -2574973, -2124002, -1828160, -1813297, -1958361, -1936426, -1546584, -920095, -340400, -20666, -63201, -449101, -980875, -1344101, -1309353, -845903, -85972, 750379, 1457269, 1920124, 2101058, 2028702, 1815167, 1572804, 1297179, 885756, 242129, -636932, -1617843, -2499917, -3147602, -3529647, -3665128, -3577833, -3279930, -2764399, -2061133, -1327688, -805398, -650657, -835621, -1188716]
15669a188716l31170k11489j34192j77709k91036l60324l08278j48391M7701K18753
15659b884851L21622L14837J99217M0683p2247q6841k2703L2628j18q7830q3115
15648b328718J32406M75990P25644P70365O79876N74866M80877L04636k1899l94028
15638A400015o01250n65497m19486l21346l32530m85168p81156j113847j305913
15629d526178j216042q38973l19594J56261M66581N71454M85231K89232J14427
15620d817601M4557Q4104J96392L07367L23257K22598J05516J20965L55544P48767
15610b308534J095832J225238J140076R34773O87208M29654J77566j6187j13128
15601C252498j10149K1250L05299O64076R28691R92441Q79789O60175L71517M1140
$$ y = [-1188716, -1519886, -1731375, -1865567, -2043276, -2334312, -2694636, -3002914, -3151305, -3103604, -2884851, -2563229, -2248392, -2049175, -2008492, -2080739, -2167580, -2190283, -2157655, -2157773, -2245603, -2328718, -2196312, -1720322, -994678, -224313, 455563, 1030429, 1511306, 1815942, 1794043, 1400015, 798765, 233268, -186218, -507564, -840094, -1325262, -2106418, -3220265, -4526178, -5742220, -6581193, -6900787, -6744526, -6277945, -5706491, -5221260, -4932028, -4817601, -4773044, -4688940, -4492548, -4185181, -3861924, -3639326, -3533810, -3412845, -3057301, -2308534, -1212702, 12536, 1152612, 2087385, 2774593, 3204247, 3381813, 3365626, 3252498, 3142349, 3163599, 3468898, 4132974, 5061665, 6054106, 6933895, 7594070, 7965587, 8006727]
15591H006727k72176n07106o68138q13771r48774j004615r39762p65144n07385
15582A579856k42586p5947n5937j48697k69652l86468n51860p61636q90717q54152
15572b657796p25156o11204n04174l55698k10596j23669n9564M7986K22861M09853
15562d567157N11130M87728L85214K38602L4638j79425k87542k30071n3117J17344
15552c542656J69545Q8582p0337k16235k41003j02946J16052K48883J98170P1845
15542c280100K2225L5009K3856q724J9493J56699L64350N89977P74799Q19687
15532d82729O68035L69861N1193j43253j38288k111J04545M9424j86324n04939
15522b14586p60970q31333o82414l77321L0644M83900Q28427R01714O96155L51207
$$ y = [8006727, 7734551, 7227445, 6559307, 5745536, 4796762, 3792147, 2852385, 2087241, 1579856, 1337270, 1261323, 1205386, 1056689, 787037, 400569, -151291, -912927, -1803644, -2657796, -3382952, -3994156, -4498330, -4854028, -5064624, -5188293, -5247857, -5199871, -4977010, -4567157, -4056027, -3568299, -3183085, -2944483, -2909845, -3089270, -3376812, -3606883, -3660000, -3542656, -3373111, -3284529, -3354866, -3571101, -3812104, -3915050, -3798998, -3550115, -3351945, -3280100, -3257875, -3222866, -3199010, -3207734, -3188241, -3031542, -2667192, -2077215, -1302416, -482729, 185306, 555167, 606360, 463107, 324819, 322708, 427253, 476677, 290353, -214586, -975556, -1806889, -2489303, -2866624, -2835980, -2352080, -1523653, -621939, 74216, 425423]
15512D25423M990l05594o21685r49655j212933j360466j448857j521662j493545
15503h483984j264197q70431m27849k6338K54554L48724K84360K11017K89516
15494i684628N42874Q35217R90534R35242P71766O43087N67664N13431N10178
15485c374635N98327P62371R66235J173320J323921J320706J077239O04086N1381
15476D502951l47058m48726k88829K3340L54245N69028O43435O36947N39813K95098
15466F480244m2363l42109n54163p06829q12354q70981q84922q23551o65043m32256
15456C45673j63301O4500J51076O4500j26020k84765k99386j95379j05139o8432
15446f16673J8880J76851K46982P7460l15486p22924q71301o51572j93083K57617
$$ y = [425423, 430413, 124819, -496866, -1446521, -2659454, -4019920, -5468777, -6990439, -8483984, -9748181, -10618612, -11046461, -11072799, -10818245, -10469521, -10185161, -9974144, -9684628, -9141754, -8306537, -7316003, -6380761, -5608995, -4965908, -4398244, -3884813, -3374635, -2776308, -2013937, -1047702, 125618, 1449539, 2770245, 3847484, 4451570, 4502951, 4155893, 3707167, 3418338, 3441678, 3795923, 4364951, 5008386, 5645333, 6185146, 6480244, 6437881, 6095772, 5541609, 4834780, 4022426, 3151445, 2266523, 1442972, 777929, 345673, 182372, 246872, 397948, 462448, 336428, 51663, -247723, -443102, -548241, -616673, -597793, -420942, -173960, -96500, -411986, -1134910, -2006211, -2657783, -2850866, -2593249]
15436b593249N22102O03606O12550O17326N93344M94143L08713M9386k26810m15497
15426E65614m55033l47784j18230J72758M15545N07963M07980J72384l4724n5225
15416A231248J57537N26567Q26952P88107L96835l4797j83626J4638L60587N74922
15406D658970M95829J66896k33124n42331o83820o48028n06853m01058l99793
15397A906688m57199n27486o04266o58419o24129m47416j10660L55059Q27962
15388c39866J093025R71124M93170r2844n23573o84916n99847l67528j08447Q4446
15378g5256J56058J07092L529q7336j54118j80805r2512J41777M15733N81691
15368H15853N74029M29046K28591K8924j55607l17686m18423m24713l47029k14741
$$ y = [-2593249, -2071147, -1467541, -854991, -237665, 355679, 849822, 1158535, 1207921, 981111, 565614, 110581, -237203, -355433, -182675, 232870, 740833, 1148813, 1321197, 1286473, 1231248, 1388785, 1915352, 2742304, 3530411, 3927246, 3892449, 3708823, 3723461, 4084048, 4658970, 5154799, 5321695, 5088571, 4546240, 3862420, 3214392, 2707539, 2306481, 1906688, 1449489, 922003, 317737, -340682, -964811, -1412227, -1522887, -1167828, -339866, 753159, 1724283, 2217453, 2124609, 1601036, 916120, 316273, -51255, -159702, -75256, 80802, 187894, 191423, 104087, -50031, -230836, -323348, -181571, 234162, 815853, 1389882, 1818928, 2047519, 2076443, 1920836, 1603150, 1184727, 760014, 412985, 198244]
15358A98244q4535q115P1134K49866M96185O75708P02516N65220K71728j02004
15348C035947l57548l35520r8929J60344L09097L18417K07666K9398j15527j59220
15338B994125j33458j07141j17640j33913n3112K09306O07756R79245J159896
15329E405064J048173O60880K00239r4132j81128j93795k40008l44740n13290
15320E747263p15158q55998q41708o48818l33970k543K32863L41467M30584O04975
15310C958957P96193Q75439Q55289Q22583P70209O20523L63052R0569q8126j40118
15300H924570j42244k03830l06730l42111k93028j98381r1302j7447K6006M0951
15290G396454n9991l10220n22405m52340p6401M12788Q21760J066559J144556
$$ y = [198244, 113709, 105594, 176728, 426594, 922779, 1598487, 2301003, 2866223, 3137951, 3035947, 2678399, 2342879, 2243950, 2404294, 2713391, 3031808, 3239474, 3268872, 3153345, 2994125, 2860667, 2753526, 2635886, 2501973, 2448861, 2658167, 3265923, 4245168, 5405064, 6453237, 7114117, 7314356, 7220224, 7039096, 6845301, 6605293, 6260553, 5747263, 5032105, 4176107, 3334399, 2685581, 2351611, 2349068, 2581931, 2923398, 3353982, 3958957, 4755150, 5630589, 6485878, 7308461, 8078670, 8699193, 9062245, 9152814, 9064688, 8924570, 8782326, 8578496, 8271766, 7929655, 7636627, 7438246, 7346944, 7329497, 7355503, 7396454, 7336463, 7026243, 6503838, 6051498, 5975097, 6387885, 7209645, 8276204, 9420760]
15281I420760J094761R27720O45094L56291K01581J60952J12133J8798o7415j07556
15271A2763119j04127p6734k2578P6008J92993K54116J86275m5922m46804r75211
15261A1801135j450428j608662j337039p53295p2870N39493J007165J284946J306507
15252A0716952J053154O30773J50335l68712q83388j244564j319815j116114p20185
15243F898436j79546M67138J057737J354360J284662R87733O17914K47804o5899
15234A2670339k31679j48848J81798O08886R68969J171846J117689P00447k1974
15225A7017473p62650j214250j269102r89595n07182M692L83193N56266N60587
15216A3779432M71732L05201M8120k26417m03261m44257l72317k09977K9822L60524
$$ y = [9420760, 10515521, 11443241, 12088335, 12444626, 12646207, 12807159, 12919292, 12938090, 12870675, 12763119, 12658992, 12582258, 12559680, 12635688, 12828681, 13082797, 13269072, 13223150, 12776346, 11801135, 10350707, 8742045, 7405006, 6651711, 6578841, 7118334, 8125499, 9410445, 10716952, 11770106, 12400879, 12551214, 12182502, 11299114, 10054550, 8734735, 7618621, 6898436, 6718890, 7186028, 8243765, 9598125, 10882787, 11870520, 12488434, 12736238, 12670339, 12438660, 12289812, 12471610, 13080496, 14049465, 15221311, 16339000, 17039447, 17017473, 16254823, 15040573, 13771471, 12781876, 12274694, 12279386, 12662579, 13218845, 13779432, 14251164, 14556365, 14604485, 14378068, 13974807, 13530550, 13158233, 12948256, 12978078, 13338602]
15206A3338602Q02760J289385J673383J839248J743174J435591J069622P93313
15198B3985078O31674N21188M33924M25859N04808N16503K91512k00379q68944
15189B6241223j545904k041586k191579j899731j240538m65753J39841L94866
15181A7390839K80091o4615m01835n40370n03426m58492m85594n29066n38182
15172A4149350n69297o96014q53699q84812p32595m94710l09030k39313k21771
15163I148109q6787K98615Q83427J446317J765410J752246J453938R85687M97509
15154A8144471J65100P8286J49595K15422K15686K41193M22343P56031J035367
15145B1423494J022703O90998K53626m6544j30420n4229J03320K69763L88586
$$ y = [13338602, 14141362, 15430747, 17104130, 18943378, 20686552, 22122143, 23191765, 23985078, 24616752, 25137940, 25571864, 25997723, 26502531, 27019034, 27310546, 27110167, 26241223, 24695319, 22653733, 20462154, 18562423, 17321885, 16856132, 16995973, 17390839, 17670930, 17606315, 17204480, 16664110, 16160684, 15702192, 15216598, 14687532, 14149350, 13580053, 12884039, 12030340, 11145528, 10412933, 9918223, 9609193, 9369880, 9148109, 9061322, 9359937, 10243364, 11689681, 13455091, 15207337, 16661275, 17646962, 18144471, 18309571, 18387857, 18537452, 18752874, 18968560, 19209753, 19632096, 20388127, 21423494, 22446197, 23137195, 23390821, 23344277, 23213857, 23159628, 23262948, 23532711, 23921297]
15136B3921297M62006N70136Q03686J131544J425101J599372J630847J495940
15128C3039929J216949R81494J060966J537651K250030L011721L736184M356820
15120E1191744M818897N175746N572537O107980O697442P121073P169132O685503
15112A00540054N607129M072146K456196J258963R03441J514910K904674M815133
15104A24072646P112521R778909J2847781J6342285K0168057K4066824K7613021
15097B42002044L0160927L0741556K8007483K0708618Q845625n426749j8448882
15090C36590622k7162118l0716711l0237487k7497411k3876511k0125876j6599432
15083A60375076j3466605j0763355q445845o445126m673361l036326j503804j96588
$$ y = [23921297, 24383303, 24953439, 25757125, 26888669, 28313770, 29913142, 31543989, 33039929, 34256878, 35238372, 36299338, 37836989, 40087019, 43098740, 46834924, 51191744, 56010641, 61186387, 66758924, 72866904, 79564346, 86685419, 93854551, 100540054, 106147183, 110219329, 112675525, 113934488, 114837929, 116352839, 119257513, 124072646, 131185167, 140964076, 153811857, 170154142, 190322199, 214389023, 242002044, 272162971, 302904527, 330912010, 351620628, 360466253, 355039504, 336590622, 309428504, 278711793, 248474306, 220976895, 197100384, 176974508, 160375076, 146908471, 136145116, 127699271, 121254145, 116580784, 113544458, 112040654, 111844066]
15075A11844066O52149Q69205M76180l46433j346232k202638k600420k416721
15067A04929156j789779r48820m3103R02340J975315L261978M792786O622676
15059A19702549Q836773J1440762J4332969J7387270K0473487K3365357K5576453
15052B41115620K6237146K4204187J8485407Q925132l125887j4926056k3692691
15045B77222858k8130676k8712491k6809207k3745323k0380629j7185336j4407598
15038A17851598j2084515j0116696q399308o845702n408903m125523l073642k262674
15030F5534635j588151r42576l53281N4289J70217j6264m06886q80287j354010
15021F0217686j797034k159152k334085k263426j981832j559996j098214p07227
$$ y = [111844066, 112496215, 113365420, 113841600, 113495167, 112148935, 109946297, 107345877, 104929156, 103139377, 102190557, 102147454, 103049794, 105025109, 108287087, 113079873, 119702549, 128539322, 139980084, 154313053, 171700323, 192173810, 215539167, 241115620, 267352766, 291556953, 310042360, 318967492, 315841605, 300915549, 277222858, 249092182, 220379691, 193570484, 169825161, 149444532, 132259196, 117851598, 105767083, 95650387, 87251079, 80405377, 74996474, 70870951, 67797309, 65534635, 63946484, 63003908, 62650627, 62704916, 62875133, 62858869, 62451983, 61571696, 60217686, 58420652, 56261500, 53927415, 51663989, 49682157, 48122161, 47023947, 46316720]
15013D6316720m61225l74573l59700k78907n3025L40663R16219J677884K587186
15004E0311242L532590M372935N062095N699542O422487P310546Q376494R556569
14996A00644500J0706362J1664279J2336825J2652728J2387295J1059389Q176404
14989A79627782L769061j333716n865598q847625r993442r544018p935212n636380
14981A34240852l124442q19272R15696J724959J352039k56800k824799n681376
14973A25526857q050926r491794j0035625r958688r515563q868940q104783p273954
14965E4226584o417424n536570m627027l744351k978690k386220j960542j642151
14957B4933609j387584j189855j004465p43763l89635m5892J78232K65286K46227
$$ y = [46316720, 45855495, 45480922, 45121222, 44842315, 44789290, 45129953, 46046172, 47724056, 50311242, 53843832, 58216767, 63278862, 68978404, 75400891, 82711437, 91087931, 100644500, 111350862, 123015141, 135351966, 148004694, 160391989, 171451378, 179627782, 183396843, 182063127, 176197529, 167349904, 157356462, 147812444, 139877232, 134240852, 131116410, 130297138, 131212834, 132937793, 134289832, 134033032, 131208233, 125526857, 117475931, 107984137, 97948512, 87989824, 78474261, 69605321, 61500538, 54226584, 47809160, 42272590, 37645563, 33901212, 30922522, 28536302, 26575760, 24933609, 23546025, 22356170, 21351705, 20607942, 20218307, 20172415, 20350647, 20615933, 20862160]
14948B0862160J50829K2064n6592m61J56062K43807R0035l43644r03821j338118
14938A8882321j457611j253155q79625m93752j80020m789N46j00310j94186k19074
14928A4100345j96839j94355k69915m26609n87524o04918l70518N3579N15116
14919A2018362R24245J219431J324488J216171R56225O61110M37554L47192M10740
14910A9515518N59821O56622O50871O51838P77324J034098J355982J642468J829676
14901B8674218J949943K074490K234073K412678K570581K621757K402876J739910
14893D6680526O44178n99357j641291k295986k582282k645085k556464k250427
14885C2753812j722818j128323o68411n23983q13970j438295k057631k329179
$$ y = [20862160, 21012989, 21035053, 20978461, 20978000, 21134062, 21377869, 21467904, 21124260, 20220439, 18882321, 17424710, 16171555, 15291930, 14798178, 14618158, 14613369, 14613915, 14513605, 14319419, 14100345, 13903506, 13709151, 13439236, 13012627, 12425103, 11820185, 11449667, 11503246, 12018362, 12942607, 14162038, 15486526, 16702697, 17658922, 18320032, 18757586, 19104778, 19515518, 20075339, 20731961, 21382832, 22034670, 22811994, 23846092, 25202074, 26844542, 28674218, 30624161, 32698651, 34932724, 37345402, 39915983, 42537740, 44940616, 46680526, 47324704, 46725347, 45084056, 42788070, 40205788, 37560703, 35004239, 32753812, 31030994, 29902671, 29234260, 28710277, 27896307, 26458012, 24400381, 22071202]
14877B2071202k128044j568029q93221l52190p7711o4489k18934l84818l92532
14868A5991234j79565J70198N66389R46565J199941J194414Q61569K89914k65098
14859B0775561n13332l33353J41667O42143R59889J075619J125225J219770J339969
14850B6433158J401688J345674J198641J101665J229733J683953K495472L624696
14842D0514680M899137O047615O870508P302491P266632O562924M929288K259785
14834H6653060j096853m328719o600577p563598p476358o873947o177190n551903
14826D0983915m981163m425469l903247l418021k914288k359856j819835j392027
14818A5770009j091773q49124n96819l30027j10568P866O3593J03063R1991K9612
$$ y = [22071202, 19943158, 18375129, 17481908, 17129718, 17052007, 16987518, 16768584, 16383766, 15991234, 15811669, 15981867, 16548256, 17494821, 18694762, 19889176, 20750745, 21040659, 20775561, 20262229, 19928876, 20070543, 20712686, 21672575, 22748194, 23873419, 25093189, 26433158, 27834846, 29180520, 30379161, 31480826, 32710559, 34394512, 36889984, 40514680, 45413817, 51461432, 58331940, 65634431, 72901063, 79463987, 84393275, 86653060, 85556207, 81227488, 74626911, 67063313, 59586955, 52713008, 46535818, 40983915, 36002752, 31577283, 27674036, 24256015, 21341727, 18981871, 17162036, 15770009, 14678236, 13829112, 13232293, 12902266, 12791698, 12799564, 12863157, 12966220, 13058211, 13087823]
14808A3087823K9124J63884L42019M33244M09124L00949J43024R369K2387K52253
14798A5193200O14537Q94131R16746P04812M14655J53085n1110j63911j69501
14789A8506644j19487m5421Q6219K17836J58598j83268o35342q80786p38272l08167
14779A6058554J63242M98096O64554P13694O77664N58243L61544P5883k95550
14770A9475924o85581j014085j261467j469910j636203j665168j480420j099097
14762I163993o24211j99316J00760K78218L27094K76056K44538L16299M30740
14753A0314171M96610N10003N10031N15221N29601N53698N72975N90557O68707
14744A5261574Q48003J005583R53684O96047M17256J97693r1928n63720j086328
$$ y = [13087823, 13116947, 13280831, 13622850, 14056094, 14465218, 14766167, 14909191, 14918560, 14940947, 15193200, 15807737, 16701868, 17618614, 18323426, 18738081, 18891166, 18840056, 18676145, 18506644, 18387157, 18341736, 18427955, 18645791, 18804389, 18621121, 17985779, 17104993, 16366721, 16058554, 16221796, 16719892, 17384446, 18098140, 18775804, 19334047, 19695591, 19771474, 19475924, 18790343, 17776258, 16514791, 15044881, 13408678, 11743510, 10263090, 9163993, 8539782, 8340466, 8441226, 8719444, 9046538, 9322594, 9567132, 9883431, 10314171, 10810781, 11320784, 11830815, 12346036, 12875637, 13429335, 14002310, 14592867, 15261574, 16109577, 17115160, 18068844, 18764891, 19182147, 19379840, 19287912, 18724192, 17637864]
14735A7637864j357383j206799p62335k94673M1351K23332K68368K21996J28792
14726A4900513j0962k20733m49996n49229m09768r7180J73921K18941N6942j49204
14716A3463245l02505m42591o34556q74100j077452j098559q04380k04825N44833
14707H569110J240340J687331J782967J559322J133395O29651J25159l43281p38244
14698A5645750j028493j209936j316978j367448j296492j027501n84767j30778
14690G683357J04494N2073q5863j06632m1921q636j47P0935K26005M18415N74532
14679H886612O05204M85085L04797K17282L24786O04867R22907J129683J142752
14670A4623975R87843Q23296P88208Q40908Q44515O91628L73911R696k56846l79715
$$ y = [17637864, 16280481, 15073682, 14311347, 14016674, 14058025, 14281357, 14549725, 14771721, 14900513, 14889551, 14668818, 14218822, 13669593, 13259825, 13162645, 13336566, 13555507, 13612449, 13463245, 13160740, 12718149, 12083593, 11209493, 10132041, 9033482, 8229102, 8024277, 8569110, 9809450, 11496781, 13279748, 14839070, 15972465, 16602116, 16727275, 16383994, 15645750, 14617257, 13407321, 12090343, 10722895, 9426403, 8398902, 7814135, 7683357, 7787851, 7839924, 7754061, 7647429, 7605508, 7596872, 7596725, 7667660, 7893665, 8312080, 8886612, 9491816, 9976901, 10281698, 10498980, 10823766, 11428633, 12351540, 13481223, 14623975, 15611818, 16435114, 17223322, 18064230, 18908745, 19600373, 19974284, 19983980, 19727134, 19347419]
14660A9347419m35660n25766o40556o57439m78358j43939K15075M71904N37792
14651A7690472L98726J15473k13909m98225o51236n93275l65296j60887j66827
14642A5555016m06596p52624j071074j297076j394302j325013j053546o32052
14634G622733k68787j53342k54498l74808l38827j28549J26703K61607J76504
14625F668736j15276n32622r61446j264989j337817j173447q68877n39169k50619
14616c75526j4249J95870L78074M69881M27752L04641K05288J89978K56388L57668
14606B395765M35108M53235M18737L84891L69250K87754N0326l26513p17327j013660
14596B737566j187564j186658r47160m98472K3397M31637N84795M64218K06672
$$ y = [19347419, 18911759, 18385993, 17745437, 17087998, 16609640, 16465701, 16680776, 17152680, 17690472, 18089198, 18204671, 17990762, 17492537, 16841301, 16248026, 15882730, 15721843, 15555016, 15148420, 14395796, 13324722, 12027646, 10633344, 9308331, 8254785, 7622733, 7353946, 7200604, 6946106, 6571298, 6232471, 6103922, 6230625, 6492232, 6668736, 6553460, 6020838, 5059392, 3794403, 2456586, 1283139, 414262, -124907, -375526, -389775, -193905, 184169, 654050, 1081802, 1386443, 1591731, 1781709, 2038097, 2395765, 2830873, 3284108, 3702845, 4087736, 4456986, 4744740, 4795066, 4468553, 3751226, 2737566, 1550002, 363344, -583816, -1082288, -1058891, -627254, -42459, 421759, 628431]
14587F28431L4420M8275J65889K69154K84129J93471M3646j20462k90867m42128
14577H13958n27289n33016m59556k49677J71608P20030J103058J073497P03627
14568B816240L13014J40204J71861K37491K02601Q7988J3134L3995P5095P7585
14558D169208Q7461J24224J34528Q7968K268j33415l50362n87945p19958p15093
14548B098884o43490n50106m04786j73497J19504L99239N79142O55676O99748
14539B780314P33014P19290O43822N10737L04616K1673l08297o26592q47233r02284
14529C029060p81514m90818o8667L39757N51049M90261K48431K944j36632j61719
14519C022152r4085j8269j7938j1083J17021K79172L16229K57967K30529K25221
$$ y = [628431, 662851, 711126, 877015, 1146169, 1430298, 1623769, 1667415, 1546953, 1256086, 813958, 286669, -246347, -705903, -955580, -783972, -63942, 1039116, 2112613, 2816240, 3129254, 3269458, 3441319, 3678810, 3881411, 3969399, 3982533, 4016528, 4091623, 4169208, 4256669, 4380893, 4515421, 4603389, 4605657, 4472242, 4121880, 3533935, 2813977, 2098884, 1455394, 905288, 500502, 327005, 446509, 845748, 1424890, 2080566, 2780314, 3513328, 4232618, 4876440, 5387177, 5691793, 5713466, 5405169, 4778577, 3931344, 3029060, 2247546, 1756728, 1688061, 2027818, 2578867, 3069128, 3317559, 3320503, 3183871, 3022152, 2928067, 2909798, 2891860, 2880777, 2997798, 3276970, 3593199, 3851166, 4081695, 4306916]
14509D306916J44673m1577k89235n08364n78751m15733m0434L60814N14485L08413
14499C761207p3144k84561j00481L72325P77936Q41168N56215P4664m54105r08933
14489D562291j171805j149138q30160l30093J51453M31354M10477J31966k38116
14480A968229n29994o46620n60881l15262n1546M2530o8753k17206k26361r107
14470f14971M25286R05472J183500J156889Q89620N18814K22260J16502J61476
14461D964848K23073J82857p703k96798n48222o24296m88555k37261m1074j1085
14451C115784p5159q0984k1301k4369j46158k85149l06025j66365Q7828L45960
14441B444062M65972L35994n0936n27295q23535p64522m11825J0443L37057N28307
$$ y = [4306916, 4451589, 4410012, 4120777, 3612413, 3033662, 2617929, 2577495, 2938309, 3452794, 3761207, 3688063, 3403502, 3303021, 3675346, 4453282, 5294450, 5850665, 5925329, 5471224, 4562291, 3390486, 2241348, 1411188, 1081095, 1232548, 1663902, 2074379, 2206345, 1968229, 1438235, 791615, 230734, -84528, -136074, -93544, -162297, -379503, -605864, -614971, -189685, 715787, 1899287, 3056176, 3945796, 4464610, 4686870, 4803372, 4964848, 5187921, 5370778, 5363075, 5066277, 4518055, 3893759, 3405204, 3167943, 3126869, 3115784, 3040625, 2959641, 2938340, 2913971, 2767813, 2482664, 2176639, 2010274, 2098102, 2444062, 2910034, 3246028, 3195092, 2667797, 1844262, 1079740, 667915, 678358, 1015415, 1543722]
14431A543722N63352M17573J59956p6413k04113j81638l0408J41425K37530K38200
14421B809186J25494j20059m31678o45295n99876l17686m7970k2932k17298l86388
14411A45498l02185N7391N13589Q51888R69568Q94328P10734M80832K47407O1971
14401D631021n1544j36348k53972l88749m44476l31712m7730K75073M33794L25972
14391D011329J5600l35555n91372p31835q16013r02673r89010r90717q23232n14704
14381b668182j97014N7587K94830N26785O51386N60719K51902j69647n37462o82637
14371a911733n19981j30227K81689N77114Q01765J030689J200677J192796R84411
14362C507200P01747M97311L65981K08983J4943j94219m76029q71422j284768
$$ y = [1543722, 2107074, 2524647, 2684603, 2608190, 2404077, 2222439, 2192031, 2333456, 2570986, 2809186, 2934680, 2814621, 2382943, 1737648, 1137772, 820086, 772116, 749184, 531886, 145498, -156687, -99296, 414293, 1266181, 2235749, 3130077, 3840811, 4321643, 4569050, 4631021, 4579477, 4443129, 4189157, 3800408, 3355932, 3024220, 2976490, 3251563, 3685357, 4011329, 4026929, 3691374, 3100002, 2368167, 1552154, 649481, -339529, -1330246, -2153478, -2668182, -2865196, -2807609, -2512779, -1985994, -1334608, -773889, -521987, -691634, -1229096, -1911733, -2431714, -2561941, -2280252, -1703138, -901373, 129316, 1329993, 2522789, 3507200, 4208947, 4706258, 5072239, 5281222, 5296165, 5101946, 4625917, 3754495, 2469727]
14353B469727j515564j404984j009282n82779l59021l97120n85051p35764p15359
14344d835197n10579j80525J85101M39530M55887K81458J23056J40882K80636
14335c619751L69438L11966J09987j60776l42420l23498j67867j799J45436K55124
14325c424160K63470J96673J58676J99080K83631L39465L05199J83183O2907J1242
14315a420634L386K1600J23237L43017N85793P06923O56900M84712K72104R2939
14305A869977o779N081J40462L37504M87605N08876M00085K43278J35881J42955
14295D264925K48166L41719L18180J86040N9560K6945P3892J35023J86119K74126
14285F114695M24909N80287O77692O68138N34356L95941L98433N10149N60731
$$ y = [2469727, 954163, -450821, -1460103, -2042882, -2401903, -2799023, -3384074, -4119838, -4835197, -5345776, -5526301, -5341200, -4901670, -4445783, -4164325, -4041269, -3900387, -3619751, -3250313, -2938347, -2828360, -2989136, -3331556, -3655054, -3822921, -3824720, -3679284, -3424160, -3160690, -2964017, -2805341, -2606261, -2322630, -1983165, -1677966, -1494783, -1431876, -1420634, -1417248, -1395648, -1272411, -929394, -343601, 363322, 1020222, 1504934, 1777038, 1869977, 1863198, 1868279, 2008741, 2346245, 2833850, 3342726, 3742811, 3986089, 4121970, 4264925, 4513091, 4854810, 5172990, 5359030, 5418590, 5445535, 5519427, 5654450, 5840569, 6114695, 6539604, 7119891, 7797583, 8465721, 9000077, 9396018, 9794451, 10304600, 10865331]
14276A0865331M60086L18331K73903K74201J91749L4163j05226j61960j40212
14267A2010366j11179j51893k68534l75307l82996l19030k99184l98349n96079
14258I107815p81186q22154p02785n39019m60883m72863m61664l96552l86863
14249D083846n23433p53877q98698p81093m39767j64385j84327m30576o88337
14240g80647q53975r37284r48755q82061p28830n17848l44044k72682k24873r2218
14230f583217J04804K91803M32334M89892M05757J63847j44802l76181m48300
14221e664063l89044l09741k96183l24606l35516l07048k20349m3513K27134N20152
14211g142777P41250R06628J112649J334048J407926J239486R07069N63736K97825
$$ y = [10865331, 11325417, 11643748, 11917651, 12191852, 12383601, 12417764, 12312538, 12150578, 12010366, 11899187, 11747294, 11478760, 11103453, 10720457, 10401427, 10102243, 9703894, 9107815, 8326629, 7504475, 6801690, 6262671, 5801788, 5328925, 4867261, 4470709, 4083846, 3560413, 2806536, 1907838, 1126745, 686978, 522593, 338266, -92310, -780647, -1634622, -2571906, -3520661, -4402722, -5131552, -5649400, -5993444, -6266126, -6490999, -6583217, -6478413, -6186610, -5754276, -5264384, -4858627, -4694780, -4839582, -5215763, -5664063, -6053107, -6362848, -6659031, -6983637, -7319153, -7626201, -7846550, -7890063, -7662929, -7142777, -6401527, -5494899, -4382250, -3048202, -1640276, -400790, 506279, 1070015, 1367840]
14202A367840J46859J19857J50122J75557K32549L59613M76517M53715K74657
14193C757286O0255p4498j31613j60910j77194j87487k29400k92680k92225k03580
14183B067954j14505j27479k68256m59679n56337m27176q2761K81951M52705L68052
14173A134469J43209l6943q1556l9735j8546n6232o5434L0000J58966J83645P5953
14162A427796o2287j38276j53880j42822p1244J00123K89009L34026J49072j75406
14152A556111m23011m47384l20630k05668j64088j79663k25336k47473j87691
14143h44833m1460J21125J72109N2155j20327j78973p0236J58210M30531O49685
14133C27986P12566N65138K59282o5395l10127m48274m84569m43757l63207k79305
$$ y = [1367840, 1514699, 1634556, 1784678, 1960235, 2192784, 2552397, 3028914, 3482629, 3757286, 3817541, 3743043, 3611430, 3450520, 3273326, 3085839, 2856439, 2563759, 2271534, 2067954, 1953449, 1825970, 1557714, 1098035, 541698, 114522, 31761, 313712, 766417, 1134469, 1277678, 1240735, 1159179, 1119444, 1100898, 1044666, 979232, 1009232, 1168198, 1351843, 1427796, 1365509, 1227233, 1073353, 930531, 859287, 959410, 1248419, 1582445, 1731517, 1556111, 1133100, 685716, 365086, 159418, -4670, -184333, -409669, -657142, -844833, -886293, -765168, -593059, -540904, -661231, -840204, -910440, -752230, -321699, 327986, 1040552, 1605690, 1864972, 1799577, 1489450, 1041176, 556607, 112850, -250357, -529662]
14123e29662k30190k51383l46050m75975n90453o69798p01527o20856l72439k4800
14113d813133K51335L59799L61175L30011K69923J81878Q5502j9433j28892k04179
14103c326014k16780j73423o0128J54096M32484O43202O33977L90957Q6366q5016
14093a520279p6491l5282j48652m29566p20020q45192p19969l83856N2306M74302
14083d352699P55920Q11708P02241N92647N61204N15539L25403n5765n59694j018563
14073a722059j260090j221484j006368p78379n74475l18912M129L00312M80439
14064f096887N50318N55077M98119L24595J231l67171n91372n83918m07358j50429
14054f267795J43061M05510N23176M95477M47827M18115L40482J88052k6209k77622
$$ y = [-529662, -759852, -1011235, -1357285, -1833260, -2423713, -3093511, -3795038, -4415894, -4788333, -4813133, -4561798, -4201999, -3840824, -3510813, -3240890, -3059012, -2973510, -2992943, -3121835, -3326014, -3542794, -3716217, -3776345, -3622249, -3189765, -2546563, -1912586, -1521629, -1435263, -1520279, -1596770, -1632052, -1780704, -2210270, -2930290, -3775482, -4495451, -4879307, -4827001, -4352699, -3596779, -2785071, -2082830, -1490183, -928979, -413440, -88037, -143802, -703496, -1722059, -2982149, -4203633, -5210001, -5988380, -6562855, -6881767, -6877638, -6577326, -6096887, -5546569, -4991492, -4493373, -4168778, -4167547, -4534718, -5126090, -5710008, -6117366, -6267795, -6124734, -5719224, -5196048, -4700571, -4252744, -3834629, -3494147, -3306095, -3332304, -3609926]
14044c609926m57103m27125k13912J2754J77466L42443N49326P71127R41232R98174
14034i15544R51387Q63607P78395P01161O06200M64769L17769K64807L06960K89899
14024D629410Q4223k60072n91126p95720q49957q08218p46449o90754o13583m71937
14014a114183k51799K7262L09785N06727N59046M80890L41459K20905J54043R6388
14004A330523m1677k88840n71702p72850q07849p03479n89508n77461o68810p91909
13994d483562q93596r46751q99782o90413l20451R6566L68841L44844M6516l25002
13984g702790n36013m92856k69966J1524K76498M99825O82267Q06233Q23269P04080
13974e197929N00724L08726J54907K2923j8616J54067N08884Q17092Q78058O68490
$$ y = [-3609926, -4067029, -4494154, -4708066, -4695312, -4517846, -4175403, -3626077, -2854950, -1913718, -915544, 35843, 899450, 1677845, 2379006, 2985206, 3449975, 3767744, 4032551, 4339511, 4629410, 4713633, 4453561, 3862435, 3066715, 2216758, 1408540, 662091, -28663, -642246, -1114183, -1365982, -1338720, -1028935, -522208, 36838, 517728, 859187, 1080092, 1234135, 1330523, 1288846, 1000006, 428304, -344546, -1152395, -1855874, -2445382, -3022843, -3691653, -4483562, -5377158, -6323909, -7223691, -7914104, -8234555, -8137989, -7769148, -7424304, -7377788, -7702790, -8238803, -8731659, -9001625, -8990101, -8713603, -8213778, -7531511, -6725278, -5902009, -5197929, -4697205, -4388479, -4233572, -4210649, -4229265, -4075198, -3566314, -2749222, -1871164, -1202674]
13964a202674K93098r1704l49982m51892m56502m13419l07496p7751K92187O83785
13954b082350R23453R44830P79075M65019P9204k28525l46894l39070l27891k83256
13944d16405p3199L50079Q34520J074319Q62953K76746m32120r97062j240133
13935B39698j169799r27092o37889l72347j86513j49001k81686m90243o18207
13926d593079n54831k97740L9249K88510L90239M46196N53847O69553O67705M84764
13916a905587J78199j32907l64811n05882n70671n80078n88390o45820p30979
13907e846926p73842p48791p04903o53335n07528j93540K15189N41104O56969
13898h015603N53578L60947K57085K94618L86865M38668M38486M44772M65804
$$ y = [-1202674, -909576, -1001280, -1351262, -1803154, -2259656, -2673075, -2980571, -3058322, -2766135, -2082350, -1158897, -214067, 565008, 1030027, 1109231, 880706, 533812, 194742, -133149, -416405, -489604, -139525, 694995, 1769314, 2632267, 2909013, 2476893, 1479831, 239698, -930101, -1857193, -2495082, -2867429, -3053942, -3202943, -3484629, -3974872, -4593079, -5147910, -5445650, -5406401, -5117891, -4727652, -4281456, -3727609, -3058056, -2390351, -1905587, -1727388, -1860295, -2225106, -2730988, -3301659, -3881737, -4470127, -5115947, -5846926, -6620768, -7369559, -8074462, -8727797, -9235325, -9428865, -9213676, -8672572, -8015603, -7462025, -7101078, -6843993, -6549375, -6162510, -5723842, -5285356, -4840584, -4374780]
13889d374780M09294K45121Q8364L4488O7076J24128J41895Q1899j5031N708K67733
13878b924105O54035Q96731Q63881O46491M32450L52039L85975M06173L12963
13869B026633J30259k0726k7481J03615K60830L79991M41679L79923J68072q0989
13859C761806j80760n0943J89773L43473L13569J70965O3814M2369N8721J05809
13849D818596J92514K28939P0350l01975p25193j005284j058826r09724o12204
13840F97193k51713M0949J41198K2450j95929l30253k96825j39100R8700L65238
13830A51908N00329L76355N1435l74036q32047j194086j315740j153354p60933
13821d550169k36156K84266O79276R35117J086097J109670R37576N48347M3442
$$ y = [-4374780, -3965486, -3720365, -3632001, -3597513, -3530437, -3406309, -3264414, -3182515, -3197546, -3191838, -2924105, -2270070, -1373339, -509458, 137033, 569483, 921522, 1307497, 1713670, 2026633, 2156892, 2136166, 2108685, 2212300, 2473130, 2853121, 3294800, 3674723, 3842795, 3761806, 3581046, 3530103, 3719876, 4063349, 4376918, 4547883, 4611697, 4654066, 4712787, 4818596, 5011110, 5240049, 5310399, 5008424, 4283231, 3277947, 2219121, 1309397, 697193, 445480, 486429, 627627, 650077, 454148, 123895, -172930, -312030, -213330, 151908, 652237, 1028592, 1080027, 705991, -126056, -1320142, -2635882, -3789236, -4550169, -4786325, -4502059, -3822783, -2887666, -1801569, -691899, 245677, 794024, 837466]
13812H37466l91006o01430n73758m18198k42078j08457n1945m6077j5713M6784
13802a564412N1152m0847j40211j46643o4967O5568K58176M74965O08514O04793
13792A06088M82274K87684N9179j96192m33957n52138n00275l67679l09932l46364
13782a771312l18564j36775N6322M3093k36212o29181q85504q39324n24658j22685
13772e364800J65205K60398K60621L09104M68621O85307Q04224O76249K85192
13763a449879j99334n46578o63562n86834l60491j8569L31770N22861N39939N73426
13753a857251P48932R77461J104093J067000R21074P71066O76488N94177M45197
13744E448237K29316p886k61391n30932p92785j054899j338538j589041j674600
$$ y = [837466, 446460, -154970, -728728, -1146926, -1389004, -1497461, -1549406, -1595483, -1611196, -1564412, -1513260, -1554107, -1694318, -1840961, -1905928, -1840360, -1582184, -1107219, -498705, 106088, 588362, 876046, 935225, 739033, 305076, -247062, -747337, -1115016, -1424948, -1771312, -2089876, -2226651, -2170329, -2127236, -2363448, -2992629, -3878133, -4717457, -5242115, -5364800, -5199595, -4939197, -4678576, -4369472, -3900851, -3215544, -2411320, -1735071, -1449879, -1649213, -2195791, -2859353, -3446187, -3806678, -3825247, -3493477, -2970616, -2430677, -1857251, -1108319, -130858, 973235, 2040235, 2961309, 3732375, 4408863, 5003040, 5448237, 5677553, 5669667, 5408276, 4877344, 4084559, 3029660, 1691122, 102081, -1572519]
13735a572519j498097j128158p34193l79917j5460L61226O52392P35923N68961
13726c009842K49933m4465k34536l80343n17785n50306l28070J63807P61224J277274
13716b613109J579488J559017J214922P38649L60185J42536q501j79431l64682
13707B429074n15066o11095o87168p59278p80627p32142o80575o75075o76445
13698c688397o22542m98896l44664j84408l0423O2046K5234j13124j74522k2569
13688e592265K27086L53580L19188L02290M70556P49158Q70054O38503J05510
13679a556340m61577q06122q90103q51641p97263o97809n23890l42987j91969
13670g119701O324L16426O88555J030244J252093J288313J164114R62723P15043
$$ y = [-1572519, -3070616, -4198774, -4932967, -5312884, -5328344, -4967118, -4314726, -3578803, -3009842, -2759909, -2804374, -3038910, -3419253, -3937038, -4487344, -4815414, -4651607, -3890383, -2613109, -1033621, 525396, 1740318, 2478967, 2839152, 2981688, 2973187, 2793756, 2429074, 1914008, 1302913, 615745, -143533, -924160, -1656302, -2336877, -3011952, -3688397, -4310939, -4809835, -5154499, -5338907, -5369330, -5307284, -5282050, -5395174, -5569696, -5592265, -5365179, -5011599, -4692411, -4390121, -3919565, -3170407, -2300353, -1661850, -1556340, -2017917, -2824039, -3714142, -4565783, -5363046, -6060855, -6584745, -6927732, -7119701, -7113377, -6796951, -6108396, -5078152, -3826059, -2537746, -1373632, -410909, 304134]
13661C04134M10323J03254j09333j54050j7063K10545L75869L96333L23331K60272
13651B103615K34092J77602M5846q9107j20607p3066p5336j87415l62044n08410
13641A145170n46385m41426k15540M5041K36392L21614L23414K55967J20329q1340
13631A163236l17230m81389m68977l00612r7231N8648J56032J81758J09317o1926
13621e8374k93009m93283n42373l71797l9618K87848M64432M91613N10138O43929
13611E99506Q70666J053654J074649Q96110N39508R5234k77039m33456l81225
13602D037607k83160k80202l76695n11503o40347p00648o28620m43231k11664
13593c8463M6160L08249M70891M13902J30677k14885m15538l89505k12369n5201
$$ y = [304134, 714457, 817711, 708378, 554328, 537265, 747810, 1123679, 1520012, 1843343, 2103615, 2337707, 2515309, 2561155, 2472048, 2351441, 2278375, 2203039, 2015624, 1653580, 1145170, 598785, 157359, -58181, -13140, 223252, 544866, 868280, 1124247, 1244576, 1163236, 846006, 364617, -104360, -404972, -502203, -443555, -287523, -105765, 3552, -58374, -351383, -844666, -1387039, -1758836, -1798454, -1510606, -1046174, -554561, -44423, 599506, 1470172, 2523826, 3598475, 4494585, 5034093, 5129327, 4852288, 4418832, 4037607, 3754447, 3474245, 3097550, 2586047, 1945700, 1245052, 616432, 173201, -38463, 7697, 315946, 786837, 1200739, 1331416, 1116531, 700993, 311488, 99119, 43918]
13583D3918n2028j71200k73087k58840j31722R135O8738Q7133J79790L48699M78198
13572C28734N07439M85722M91731N41173N64856N17508M18873K72923Q0491j02318
13562D107132k18524k82295l35638m17921o06281r39946j293030j457233j301685
13553b745421p86551O236Q06714J291231J345820J116021P72762L56994j20984
13544B042822n73249q63174r17078p73820n40045l53272l03063l38031l04694
13535b923604o7600L79918Q68554J146088J111205Q99966O99273N78462M83002
13526C175264L27237R1028j89221m61858o64709p68099q00563q10816q37757q84299
13516a823793q98529p89392m91593k6583M99357R21529J102261J023480P61098
$$ y = [43918, -8110, -179310, -452397, -711237, -842959, -833824, -765086, -677953, -498163, -149464, 328734, 836173, 1321895, 1813626, 2354799, 2919655, 3437163, 3856036, 4128959, 4209450, 4107132, 3888608, 3606313, 3270675, 2852754, 2246473, 1306527, 13497, -1443736, -2745421, -3531972, -3525736, -2719022, -1427791, -81971, 1034050, 1806812, 2163806, 2042822, 1469573, 606399, -310679, -1084499, -1624544, -1977816, -2280879, -2618910, -2923604, -2991204, -2611286, -1742732, -596644, 514561, 1414527, 2113800, 2692262, 3175264, 3502501, 3593529, 3404308, 2942450, 2277741, 1509642, 709079, -101737, -939494, -1823793, -2722322, -3511714, -4003307, -4029890, -3530533, -2609004, -1506743, -483263, 277835]
13507B77835L92209l3402m41982p31663q47550q12103p20364o66354n99758l79171
13497d562303p362L69462O58530Q28838Q45364P43151O55385O61885O95037O36420
13487A524407M40963J79676k9889j34659j72432k13581l04020m10154m37099l58888
13477H4324k54632k07807k48035l61818m90533n41010m38629j73227K00564N65930
13467a864873P79791P85662O32561L94549J51601m6203j92466k78662k85582j99110
13457a22732m3957J18270K44713L23998L66653M11474M84454N84197P02072P74141
13447C843283P23867N84769M51189L55404K62491J52692M4310k9484n4010o6791
13437F267720q5527q5560q9601j40337k13907k62686k75134k72705k67834k43404
$$ y = [277835, 670044, 636642, 194660, -537003, -1384553, -2196656, -2917020, -3583374, -4183132, -4562303, -4569665, -4200203, -3541673, -2712835, -1867471, -1124320, -468935, 192950, 887987, 1524407, 1965370, 2145046, 2115157, 1980498, 1808066, 1594485, 1290465, 880311, 443212, 84324, -170308, -378115, -626150, -987968, -1478501, -2019511, -2458140, -2631367, -2430803, -1864873, -1085082, -299420, 333141, 727690, 879291, 833088, 640622, 361960, 76378, -122732, -166689, -48419, 196294, 520292, 886945, 1298419, 1782873, 2367070, 3069142, 3843283, 4567150, 5151919, 5603108, 5958512, 6221003, 6373695, 6418005, 6388521, 6334511, 6267720, 6182193, 6096633, 6007032, 5866695, 5652788, 5390102, 5114968, 4842263, 4574429, 4331025]
13427D331025j92016j24281o8969p3535j68943l33887m93074n68899n44436m78594
13417A284391m52023n02439o20951p58025q13491o73021l15672J77153P13600
13408a960478J189265J469397J452399J168994Q25378O50999P09886Q93682J028629
13399G428151J007034Q49153O30062L81523J30350m6833r2619l32J93353M00889
13389A0880731N13056M29419J17555l31858p62740j046109j127223j042058q82129
13380F748644p45020p04999p24522o61401m84366l44768m00314o33516q59674
13371A190064r02571p05515l20465J17801M47683N67460N00306L54400K02419
13362A451582O6564J035P9185K73332M60129N58152N76628N26554L72001Q6056
$$ y = [4331025, 4139009, 4014728, 3945759, 3872224, 3703281, 3369394, 2876320, 2307421, 1762985, 1284391, 832368, 329929, -291022, -1049047, -1862538, -2535559, -2851231, -2674078, -1960478, -771213, 698184, 2150583, 3319577, 4144955, 4795954, 5505840, 6399522, 7428151, 8435185, 9284338, 9914400, 10295923, 10426273, 10379440, 10286821, 10286489, 10479842, 10880731, 11393787, 11823206, 11940761, 11608903, 10846163, 9800054, 8672831, 7630773, 6748644, 6003624, 5298625, 4574103, 3912702, 3428336, 3083568, 2683254, 2049738, 1190064, 287493, -418022, -738487, -620686, -173003, 394457, 894763, 1249163, 1451582, 1518146, 1519181, 1598366, 1871698, 2331827, 2889979, 3466607, 3993161, 4365162, 4451218]
13352D451218k74180n52504n98798l87848l1319K92789M27475L25571J19473J8466
13342C790343R2536K31845L00688K72221J90144R7799N9191J25756K54462L24225
13332E739210K73623J69531Q8494K2559l6374m8694j8818N359j5364j16974k91825
13321E770727m58522n07882m25309l32817l05815k92931k41242j85161j82961
13312B838087k22707k29270j10401J27508L35596L95019L60193L85283N55349
13303D434657P93970R13773P86299M24589n8219n24283q65957j002671q92561
13294D009597n91428k63796p6295q6640k48659m56835n78192n42345m12718l03457
13284D49232k70873l26817m44795n69031o71418p17904o32681l74620l029L64241
$$ y = [4451218, 4177038, 3624534, 3025736, 2637888, 2606569, 2899358, 3326833, 3652404, 3771877, 3790343, 3882879, 4114724, 4415412, 4687633, 4877777, 4975576, 5034767, 5160523, 5414985, 5739210, 6012833, 6182364, 6270858, 6293417, 6257043, 6208349, 6189531, 6194890, 6179526, 6062552, 5770727, 5312205, 4804323, 4379014, 4046197, 3740382, 3447451, 3206209, 3021048, 2838087, 2615380, 2386110, 2275709, 2403217, 2738813, 3133832, 3494025, 3879308, 4434657, 5228627, 6142400, 6928699, 7353288, 7295069, 6770786, 5904829, 4902158, 4009597, 3418169, 3154373, 3078078, 2991438, 2742779, 2285944, 1707752, 1165407, 752689, 449232, 178359, -148458, -593253, -1162284, -1833702, -2551606, -3184287, -3558907, -3561936, -3197695]
13274c197695O32761P39324O48695M36955K76372K47196K56032J59415n7186k58096
13264a16227l58608m45554o04928p59382p66339n86659l43140j90372j68163k26568
13254d565940k89498k90885k30310j78476k01706k91039l67846l48234j82763
13245f946697J27084M82142P54412R21610R89979Q99521O16080K10717j74075
13236b119227l93955l71964j42058J78940M71305O49857O70261N29862K54934
13227b72045r2273l97967n46746n33645m54947l58899j87801J22731N10845Q12712
13217a398035R15283Q08957N71896L38754J79781Q2183O2692J13474J20343k7026
13207A768302l31780p03154j008013j149693j151277j134799j182622j263394
$$ y = [-3197695, -2564934, -1825610, -1176915, -739960, -463588, -216392, 39640, 199055, 141869, -116227, -474835, -920389, -1525317, -2284699, -3051038, -3637697, -3980837, -4171209, -4339372, -4565940, -4855438, -5146323, -5376633, -5555109, -5756815, -6047854, -6415700, -6763934, -6946697, -6819613, -6337471, -5583059, -4661449, -3671470, -2771949, -2155869, -1945152, -2119227, -2513182, -2885146, -3027204, -2848264, -2376959, -1727102, -1056841, -526979, -272045, -364318, -762285, -1309031, -1842676, -2297623, -2656522, -2844323, -2721592, -2210747, -1398035, -482752, 326205, 898101, 1236855, 1416636, 1498819, 1561511, 1674985, 1795328, 1768302, 1436522, 733368, -274645, -1424338, -2575615, -3710414, -4893036, -6156430]
13199f156430j264531j049889n94975l1203M85350Q41733R60272Q59960O96522
13190e253191O55429Q07146J046757J185622J161096J090773J066200J022370
13182B782202Q42173M78820r97m17726n81457m37114q9497L00127O28272Q25867
13172D330670Q05794N62908K21583q1230k79824m06755n72395q19823j020319
13163B740609j010449p82113n07652l88869m47752n01636l56183p014L32686M36681
13153d91692K97906J20394P6910J29993J52370J34259J67567L29632O36741R88066
13143B542146J195451J127296Q20205M71078K60183K02212J96048J43806K8704
13134F987129p0904q2560l4005j1522n7161j39194j87910j73771j52018j69758
$$ y = [-6156430, -7420961, -8470850, -9065825, -9097028, -8611678, -7769945, -6809673, -5949713, -5253191, -4597762, -3790616, -2743859, -1558237, -397141, 693632, 1759832, 2782202, 3624375, 4103195, 4102198, 3684472, 3103015, 2665901, 2576404, 2876531, 3504803, 4330670, 5136464, 5699372, 5920955, 5839725, 5559901, 5153146, 4580751, 3760928, 2740609, 1730160, 948047, 440395, 51526, -396226, -897862, -1254045, -1261059, -928373, -491692, -193786, -73392, 3518, 133511, 285881, 420140, 587707, 917339, 1554080, 2542146, 3737597, 4864893, 5685098, 6156176, 6416359, 6618571, 6814619, 6958425, 6987129, 6916225, 6833665, 6799660, 6788138, 6730977, 6591783, 6403873, 6230102, 6078084, 5908326]
13124E908326k09680k25938j89588j22330l4196J08620K78481L60414K75264O3096
13114F212469j79800l92674n28258n35555m46221l59844l29641l47665m10108
13105B682703n18201o02777n50067l35782m7088K36536M68882N55533L94965O567
13095B291271m43746p17970o77488m62838l54878m47163o30040p92884q78565
13086c114301q28043o33051l78535j55846j3745O6090J77663L92707O58421Q37343
13076b991297Q59722P75788O58309N56455M86536M15013L20561K30600J83607
13067A495294K02813L04760M38532M78208L78276K21207J14633P4008m639j87476
13057C515616l90310n24970o55646q95603j207617j402979j321761r86042n80880
$$ y = [5908326, 5698646, 5472708, 5283120, 5160790, 5126594, 5235214, 5513695, 5874109, 6149373, 6212469, 6032669, 5639995, 5111737, 4576182, 4129961, 3770117, 3440476, 3092811, 2682703, 2164502, 1561725, 1011658, 675876, 628788, 865324, 1334206, 1889739, 2284704, 2291271, 1847525, 1129555, 452067, -10771, -365649, -812812, -1442852, -2235736, -3114301, -3942344, -4575395, -4953930, -5109776, -5123521, -5057431, -4879768, -4487061, -3828640, -2991297, -2131575, -1355787, -697478, -141023, 345513, 760526, 1081087, 1311687, 1495294, 1698107, 2002867, 2441399, 2919607, 3297883, 3519090, 3633723, 3707731, 3703092, 3515616, 3125306, 2600336, 1944690, 1049087, -158530, -1561509, -2883270, -3869312, -4450192]
13048d450192k90699j87136k19083k52402j78644J289J81442K61540K74922L38390
13038d520573M71793N62214N44809N09905N79020P91302J085063J326256J407781
13029B757570J300859J012582N65029O8803k54589k43869M9666M24717O57745
13020F338513N84080J85205l57290p66340q92578q18655p07435o03377m36230
13011B525893j30569K96750O80120Q08757O20659K41897j39417l96780m89218
13002D018092l95648j00369K97517N90945O38926M65235J93546o5726k91676n44913
12992D805929q07106r26735q28313o19388m30162k88421j74748r4406p8717j36116
12982D21817k57879m65316p04008p62211m68104P1635N26895O65816N25446K68951
$$ y = [-4450192, -4740891, -4928027, -5147110, -5399512, -5578156, -5576867, -5395425, -5133885, -4858963, -4520573, -4048780, -3486566, -2941757, -2431852, -1852832, -1061530, 23533, 1349789, 2757570, 4058429, 5071011, 5636040, 5704843, 5450254, 5206385, 5256051, 5680768, 6338513, 6922593, 7107798, 6750508, 5984168, 5091590, 4272935, 3565500, 2962123, 2525893, 2395324, 2692074, 3372194, 4180951, 4801610, 5043507, 4904090, 4507310, 4018092, 3622444, 3522075, 3819592, 4410537, 5049463, 5514698, 5708244, 5642518, 5350842, 4805929, 3998823, 3072088, 2243775, 1624387, 1194225, 905804, 731056, 636650, 557933, 421817, 163938, -301378, -1005386, -1767597, -2235701, -2164066, -1637171, -971355, -445909, -176958]
12972a76958J8200j64415k27082j43602M2504K40904L81542M37348M01162K99518
12962A109121J85333Q1714r833r6956k33715m38364n86412n59337m08164k56298
12952a212911j75797j56234j27491n3737L9807R4943M3846q5318j25146N5090
12942a702948L59996N36975M63433K79655J72699J47770J12235P0790J23281L05113
12932H68999N21264O77915P45659O60873L75392k1211l68506n80540o90730p89784
12922A399331r00740r34741q06119n38806k20174J10795M75401Q48508J073916
12913E07371J000594P18926M75561L62553K57151M5072k29434m21888m39804l45535
12903A930567k66641k50077k44762k32040k67673l60131m53912m98758m74221
$$ y = [-176958, -158758, -323173, -550255, -693857, -651353, -410449, -28907, 408441, 809603, 1109121, 1294454, 1376168, 1366335, 1269379, 1035664, 597300, 10888, -548449, -956613, -1212911, -1388708, -1544942, -1672433, -1726170, -1686363, -1591420, -1547574, -1632892, -1758038, -1702948, -1342952, -805977, -342544, -62889, 109810, 257580, 369815, 440605, 563886, 868999, 1390263, 2068178, 2813837, 3474710, 3850102, 3828891, 3460385, 2879845, 2189115, 1399331, 498591, -436150, -1242269, -1781075, -2001249, -1890454, -1415053, -566545, 507371, 1507965, 2226891, 2702452, 3065005, 3322156, 3367228, 3137794, 2715906, 2276102, 1930567, 1663926, 1413849, 1169087, 937047, 669374, 309243, -144669, -643427, -1117648]
12894a117648l70369j73043Q4349L15157M62721M82151K70990k20776q28361j261339
12884b356168j352868j136845p28545k54331J32456L36329M08384M37436M08985
12875d105167K62058K7694j67925k22431j61710j00678j06090j26667k8479K60077
12865d469318O19232Q24352P56429M87397J38881k41024o04862q69947r54487
12856d313347q44851o80764o42699p24698p46080n69299k25872J62250M98093
12847h087267P10283P21280N08805J79566r5188k02620j30232O5170K94781M66473
12837e568949N15678M64549L95242L24870K34281J59209J41934J84599K61505
12828b887082L40642M03775M53251M86248M67046L38139Q0014k42933n29364o85670
$$ y = [-1117648, -1488017, -1661060, -1576711, -1261554, -798833, -316682, -45692, -266468, -1094829, -2356168, -3709036, -4845881, -5574426, -5828757, -5696301, -5359972, -4951588, -4514152, -4105167, -3843109, -3815415, -3983340, -4205771, -4367481, -4468159, -4574249, -4700916, -4729395, -4469318, -3850086, -3025734, -2269305, -1781908, -1643027, -1884051, -2488913, -3358860, -4313347, -5158198, -5838962, -6481661, -7206359, -7952439, -8521738, -8747610, -8585360, -8087267, -7376984, -6655704, -6146899, -5967333, -6062521, -6265141, -6395373, -6330203, -6035422, -5568949, -5053271, -4588722, -4193480, -3868610, -3634329, -3475120, -3333186, -3148587, -2887082, -2546440, -2142665, -1689414, -1203166, -736120, -397981, -317967, -560900, -1090264, -1775934]
12818a775934o41200l95590l2364L29276N77596O47368N87785N26553N04146M52088
12808G79724L51560K57180J73946M9735j44674l47147m62731m95275m92908m37704
12798g68294l06423j38886p339J2820q1937j88849k32871k30750j94934r1492
12788b228955P1993K28187L57927M99751O30434O25112M04505N5777k63390m64580
12778h3239n45950n34762m77569m47975m82540m98691l56678o0369K18752L17554
12768b951467K19693M6267p4841n5707J83328O04360R83928J096082R15703O20605
12758A587951M26343M17133M94212M83731L13157N2327k10439m25549n29484m93322
12748B116060l59275j72559L5740K37820M09059N12096N09529M16493L32531L75655
$$ y = [-1775934, -2417134, -2812724, -2845088, -2515812, -1938216, -1290848, -703063, -176510, 327636, 779724, 1131284, 1388464, 1562410, 1612145, 1467471, 1120324, 657593, 162318, -330590, -768294, -1074717, -1213603, -1220942, -1208122, -1290059, -1478908, -1711779, -1942529, -2137463, -2228955, -2156962, -1928775, -1570848, -1071097, -440663, 184449, 588954, 644731, 381341, -83239, -629189, -1163951, -1641520, -2089495, -2572035, -3070726, -3427404, -3487773, -3269021, -2951467, -2731774, -2685507, -2760348, -2816055, -2632727, -2028367, -1044439, 51643, 967346, 1587951, 2014294, 2431427, 2925639, 3409370, 3722527, 3774854, 3564415, 3138866, 2609382, 2116060, 1756785, 1584226, 1619966, 1857786, 2266845, 2778941, 3288470, 3704963, 4037494, 4413149]
12738D413149N02898M93878K33036j65159n69737r19469j115477j090684r61346
12729H21089r14781j002863j122698j144353j046529q98976p42270n10924j43986
12720f706291K52964N06303N77534N55720N06745M51059M59829O16708Q63538
12711a915891J028424J017875Q59732O22761L79302K07380J79760K99011M50751
12702C129105N29174N35836M70071L00733M0287k53479n18703o89998p24264o74290
12692B144472o22359n70689m84386l84263k97187j99152j31376k12778m24102
12683a181820n71596n18563l25021j69007j58839k22320k15046j21625n0301m3933
12673c578071o8628j26602k49821m42842o64131q20363p84673m86070m539M72096
$$ y = [4413149, 4916047, 5409925, 5642961, 5477802, 4908065, 3988596, 2873119, 1782435, 821089, -93692, -1096555, -2219253, -3363606, -4410135, -5309111, -6051381, -6562305, -6706291, -6453327, -5947024, -5369490, -4813770, -4307025, -3855966, -3396137, -2779429, -1915891, -887467, 130408, 990140, 1612901, 1992203, 2199583, 2379343, 2678354, 3129105, 3658279, 4194115, 4664186, 4964919, 5005206, 4751727, 4233024, 3543026, 2818762, 2144472, 1522113, 951424, 467038, 82775, -214412, -413564, -544940, -757718, -1181820, -1753416, -2271979, -2597000, -2766007, -2924846, -3147166, -3362212, -3483837, -3534138, -3578071, -3646699, -3773301, -4023122, -4465964, -5130095, -5950458, -6735131, -7221201, -7225740, -6753644]
12663f753644P70127Q11290O56981M50944K93036K24741K53530L12489L22404
12654b658102K83607K27734J93126K11478K16829P5077k70177p35702j157083
12645c613213j358745j230837q47807m52590k19189j13197l5748K1176K8915J935
12635g819300l7418m5635L1696J73529K96170L46619L53879L70769M31129N73557
12625e325005P71982Q71004P54324M87594J84447j12124l47887m04744k13129
12616c333538J38212M71758O48935O22081M27948J45406q3156j01597R5942L42783
12606f25226M77814M94646M63442L93772K49196K5319k33844m58918n88922o16767
12596d19488n82231n15925m39556l80470l41442l08674k94167k88208k00089L7704
$$ y = [-6753644, -5983517, -5172227, -4515246, -4064302, -3771266, -3546525, -3292995, -2980506, -2658102, -2374495, -2146761, -1953635, -1742157, -1525328, -1450251, -1720428, -2456130, -3613213, -4971958, -6202795, -7050602, -7503192, -7722381, -7835578, -7871326, -7850150, -7821235, -7819300, -7856718, -7902353, -7870657, -7697128, -7400958, -7054339, -6700460, -6329691, -5898562, -5325005, -4553023, -3682019, -2927695, -2440101, -2255654, -2367778, -2715665, -3120409, -3333538, -3195326, -2723568, -2074633, -1452552, -1024604, -879198, -962354, -1063951, -968009, -625226, -147412, 347234, 810676, 1204448, 1453644, 1478963, 1245119, 786201, 197279, -419488, -1001719, -1517644, -1957200, -2337670, -2679112, -2987786, -3281953, -3570161, -3770250, -3732546]
12586c732546L49856N77266O11354M59576K16901m49j06457q1843J4105J22441
12576a569796K94030N78296Q44838Q71115N69176O9860m06222p53271r97828j128148
12566a627950j054382p79772m18987n786M92024J002877J323243J275131R18477
12557A124875N00144J71562r0601l31950n33128o64745p23960p32405p49213q30938
12547b860359r41403r65212q44973o32643m12544k26836m3814J74566L85932M72046
12537e895240L02316j27566o23461r30876r33574o98453l51707K1771L38950M87585
12527h410255M08079J57377j28573l16309l63616l05876j40992J65099M98849
12518h436217O13666M03523m104m09746o61773o93521n47413l48868k20339j68449
$$ y = [-3732546, -3382690, -2805424, -2194070, -1734494, -1517593, -1518042, -1624499, -1706342, -1692237, -1569796, -1275766, -697470, 147368, 1018483, 1587659, 1657519, 1251297, 498026, -499802, -1627950, -2682332, -3462104, -3881091, -3886877, -3394853, -2391976, -1068733, 206398, 1124875, 1625019, 1796581, 1705980, 1374030, 840902, 176157, -547803, -1280208, -2029421, -2860359, -3801762, -4766974, -5611947, -6244590, -6657134, -6883970, -6927784, -6753218, -6367286, -5895240, -5592924, -5720490, -6343951, -7274827, -8208401, -8906854, -9258561, -9236790, -8897840, -8410255, -8002176, -7844799, -7973372, -8289681, -8653297, -8959173, -9100165, -8935066, -8436217, -7822551, -7419028, -7423132, -7832878, -8494651, -9188172, -9735585, -10084453, -10304792, -10473241]
12508a0473241j06989l989P9681P7777o279j14318j96197k34950k07948o3976
12498a1250429J82920M53105P14156R43211J049690R36539N87122R7657l71305
12489f657334o71790p13348n25928k44588j0044M9736j27752m09508n46174l93651
12479a0250381K763M65141P99787R38543R69538J020224J132713J240885J223815
12470b456972R92147N55429J0080m92053q18613r47716r66573r80630r96448q96871
12460f998220o11206k27568J48518M78128P14690Q15459Q37990Q51630P70380
12451c220199M78993P0669k49766m15890m68048m25734l14157j71924K2214L20937
12441d372905O64128Q80413Q94596P69093N27846J37584l50434p59427r02886
$$ y = [-10473241, -10580230, -10584219, -10504538, -10426761, -10433040, -10547358, -10743555, -10978505, -11186453, -11250429, -11067509, -10614404, -9900248, -8957037, -7907347, -6970808, -6383686, -6286029, -6657334, -7329124, -8042472, -8568400, -8812988, -8823032, -8773296, -8901048, -9310556, -9856730, -10250381, -10247618, -9782477, -8982690, -8044147, -7074609, -6054385, -4921672, -3680787, -2456972, -1464825, -909396, -899316, -1391369, -2209982, -3157698, -4124271, -5104901, -6101349, -6998220, -7609426, -7836994, -7688476, -7210348, -6495658, -5680199, -4842209, -3990579, -3220199, -2741206, -2670537, -2920303, -3336193, -3804241, -4229975, -4544132, -4716056, -4693842, -4372905, -3708777, -2828364, -1933768, -1164675, -636829, -499245, -849679, -1609106, -2511992]
12432b511992p39115m14755j40938n6980j88405m48016o86138p91317p22859m65058
12422g165573o0622L53691O50416P66446O92006N19984L90497L52732L73886M16071
12412b710466M42609M02785L09244K37590J65968r150l19624o88811r71336j039599
12402d180790r02391p08771n87179n40814m97325l90927j96557O8346L31799N08943
12392g095666N85620N94764N27130L63138J64642L9005J7060M6799J12402K39669
$$ y = [-2511992, -3251107, -3665862, -3806800, -3863780, -4052185, -4500201, -5186339, -5977656, -6700515, -7165573, -7226195, -6872504, -6222088, -5455642, -4763636, -4243652, -3853155, -3500423, -3126537, -2710466, -2267857, -1865072, -1555828, -1318238, -1152270, -1161420, -1481044, -2169855, -3141191, -4180790, -5083181, -5791952, -6379131, -6919945, -7417270, -7808197, -8004754, -7936408, -7604609, -7095666, -6510046, -5915282, -5388152, -5025014, -4860372, -4821367, -4804307, -4757508, -4645106, -4405437]
$$ [...]
##END NTUPLES=NMR SPECTRUM
##END=
