##TITLE=31P ikalashn
DE-78 rm_3h(nlock)
18.11.2024
##JCAMPDX= 6.0         $$ Bruker NMR JCAMP-DX V2.0
##DATA TYPE= NMR SPECTRUM
##DATA CLASS= NTUPLES
##ORIGIN= UXNMR, Bruker Analytische Messtechnik GmbH
##OWNER= root
$$ TOPSPIN		Version 1.3
$$ 2024-11-18 15:07:55.296 +0400  Irina@DPX200
$$ Compression mode = diff/dup
##.OBSERVE FREQUENCY= 81.01967998063
##.OBSERVE NUCLEUS= ^31P
##.ACQUISITION MODE= SIMULTANEOUS
##.ACQUISITION SCHEME= undefined
##.AVERAGES= 64
##.DIGITISER RES= 17
##SPECTROMETER/DATA SYSTEM= spect
##.PULSE SEQUENCE= zgpg
##.SOLVENT NAME= DMSO
##.SHIFT REFERENCE= INTERNAL, DMSO, 1, 298.5841
##AUDIT TRAIL= $$ (NUMBER, WHEN, WHO, WHERE, WHAT)
$$ ##TITLE= Audit trail, TOPSPIN		Version 1.3
$$ ##JCAMPDX= 5.01
$$ ##ORIGIN= Bruker BioSpin GmbH
$$ ##OWNER= Irina
$$ $$ F:/spectra/data/iren/nmr/P31dec/1/pdata/1/auditp.txt
$$ ##AUDIT TRAIL=  $$ (NUMBER, WHEN, WHO, WHERE, VERSION, WHAT)
(   1,<2024-11-18 15:07:19.203 +0400>,<Irina>,<DPX200>,<TOPSPIN 1.3>,
      <created by zg
	started at 2024-11-18 15:05:35.968 +0400,
	POWCHK disabled, PULCHK disabled
       configuration hash MD5:
       BE 6D 3F 07 2A EA 11 49 91 17 2B D3 AF B3 58 0D
       data hash MD5: 32K
       D3 B7 F8 D1 DC A5 71 E9 8D 4A 1D 2E EA B6 A9 A6>)
(   2,<2024-11-18 15:07:33.687 +0400>,<Irina>,<DPX200>,<TOPSPIN 1.3>,
      <Start of raw data processing
       efp BC_mod = 2 LB = 12 FT_mod = 6 PKNL = 1 PHC0 = 242.7383 PHC1 = -21.9452 SI = 32K 
       data hash MD5: 32K
       8B 33 DB 36 AB 0D D4 AF E9 32 7E DC DA DE 2B 39>)
(   3,<2024-11-18 15:07:36.406 +0400>,<Irina>,<DPX200>,<TOPSPIN 1.3>,
      <abs n ABSG = 5 
       data hash MD5: 32K
       4A 0A 1A E7 9D CB B4 40 F3 C3 FF 3A 54 B7 35 A8>)
(   4,<2024-11-18 15:07:45.140 +0400>,<Irina>,<DPX200>,<TOPSPIN 1.3>,
      <pk fgphup PHC0 = 1 PHC1 = 0 
       data hash MD5: 32K
       9C 45 E2 63 00 1C 24 02 CE EE 92 BB 19 24 81 54>)
$$ ##END=
$$ 
$$ $$ hash MD5
$$ $$ E7 A9 A4 94 92 C5 B0 AD F5 BF 41 F9 63 DE F8 73
##$RELAX= 
##$RELAX= 
##$RELAX= 
##$RELAX= 
##$RELAX= 
##$RELAX= 
##$RELAX= 
##$RELAX= 
##$RELAX= 
##$RELAX= 
##$RELAX= 
$$ Bruker specific parameters
$$ --------------------------
##$DU= <F:/spectra>
##$EXPNO= 1
##$NAME= <P31dec>
##$PROCNO= 1
##$TYPE= <nmr>
##$USER= <iren>
##$AMP= (0..31)
100 100 100 100 100 100 100 100 100 100 100 100 100 100 100 100 100 100 
100 100 100 100 100 100 100 100 100 100 100 100 100 100 
##$ANAVPT= -1
##$AQSEQ= 0
##$AQ_mod= 1
##$AUNM= <au_zg>
##$AUTOPOS= <>
##$BF1= 81.014009
##$BF2= 200.13
##$BF3= 200.13
##$BF4= 200.13
##$BF5= 200.13
##$BF6= 200.13
##$BF7= 200.13
##$BF8= 200.13
##$BYTORDA= 1
##$CFDGTYP= 0
##$CFRGTYP= 5
##$CHEMSTR= <none>
##$CNST= (0..63)
1 1 145 1 1 1 1 1 1 1 1 1 1 1 1 1 1 1 1 1 1 1 1 1 1 1 1 1 1 1 1 1 1 1 
1 1 1 1 1 1 1 1 1 1 1 1 1 1 1 1 1 1 1 1 1 1 1 1 1 1 1 1 1 1 
##$CPDPRG= <waltz16>
##$CPDPRG1= <>
##$CPDPRG2= <waltz16>
##$CPDPRG3= <>
##$CPDPRG4= <mlev>
##$CPDPRG5= <mlev>
##$CPDPRG6= <mlev>
##$CPDPRG7= <mlev>
##$CPDPRG8= <mlev>
##$CPDPRGB= <>
##$CPDPRGT= <>
$$ [...]
##$SW_h= 37037.037037037
##$TD= 32768
##$TD0= 1
##$TE= 300
##$TE2= 300
##$TE3= 300
##$TEG= 300
##$TL= (0..7)
0 120 53 12 22 120 120 120 
##$TP= (0..7)
150 150 150 150 150 150 150 150 
##$TP07= 0
##$TPNAME0= <>
##$TPNAME1= <>
##$TPNAME2= <>
##$TPNAME3= <>
##$TPNAME4= <>
##$TPNAME5= <>
##$TPNAME6= <>
##$TPNAME7= <>
##$TPOAL= (0..7)
0.5 0.5 0.5 0.5 0.5 0.5 0.5 0.5 
##$TPOFFS= (0..7)
0 0 0 0 0 0 0 0 
##$TUNHIN= 0
##$TUNHOUT= 0
##$TUNXOUT= 0
##$USERA1= <user>
##$USERA2= <user>
##$USERA3= <user>
##$USERA4= <user>
##$USERA5= <user>
##$V9= 5
##$VALIST= <valist>
##$VCLIST= <CCCCCCCCCCCCCCC>
##$VD= 0
##$VDLIST= <DDDDDDDDDDDDDDD>
##$VPLIST= <PPPPPPPPPPPPPPP>
##$VTLIST= <TTTTTTTTTTTTTTT>
##$WBST= 1024
##$WBSW= 4
##$XGAIN= (0..3)
0 0 0 0 
##$XL= 0
##$YL= 0
##$YMAX_a= 10481
##$YMIN_a= -5135
##$ZGOPTNS= <>
##$ZL1= 120
##$ZL2= 120
##$ZL3= 120
##$ZL4= 120
##$ABSF1= 298.5841
##$ABSF2= -158.5842
##$ABSG= 5
##$ABSL= 5
##$ALPHA= 0
##$AQORDER= 0
##$ASSFAC= 0
##$ASSFACI= 0
##$ASSFACX= 0
##$ASSWID= 0
##$AUNMP= <proc_1d>
##$AXLEFT= 0
##$AXRIGHT= 0
##$AXTYPE= 0
##$AXUNIT= <>
##$AZFE= 0.1
##$AZFW= 0.5
##$BCFW= 0
##$BC_mod= 2
##$BYTORDP= 0
##$COROFFS= 0
##$CY= 12.5935478210449
##$DATMOD= 1
##$DC= 0
##$DFILT= <>
##$DTYPP= 0
##$F1P= 47.1127640792319
##$F2P= -24.0371245302204
##$FCOR= 0.5
##$FTSIZE= 32768
##$FT_mod= 6
##$GAMMA= 0
##$GB= 0
##$INTBC= 1
##$INTSCL= 7.269226e-011
##$ISEN= 30
##$LB= 12
##$LEV0= 0
##$LPBIN= 0
##$MAXI= 12.09355
##$MC2= 0
##$MEAN= 0
##$ME_mod= 0
##$MI= 0.7550151
##$NCOEF= 0
##$NC_proc= -12
##$NLEV= 6
##$NOISF1= 298.5841
##$NOISF2= 270.0111
##$NSP= 0
##$NTH_PI= 0
##$NZP= 0
##$OFFSET= 298.5841
##$PC= 1.4
##$PHC0= 243.7383
##$PHC1= -21.9452
##$PH_mod= 1
##$PKNL= yes
##$PPARMOD= 0
##$PPDIAG= 0
##$PPIPTYP= 0
##$PPMPNUM= 100
##$PPRESOL= 1
##$PSCAL= 0
##$PSIGN= 0
##$REVERSE= no
##$SF= 81.014009
##$SI= 32768
##$SIGF1= 270.0111
##$SIGF2= -158.5842
##$SINO= 77.54984
##$SIOLD= 32768
##$SREGLST= <31P.CDCl3>
##$SSB= 0
##$STSI= 32768
##$STSR= 0
##$SW_p= 37037.037037037
##$SYMM= 0
##$S_DEV= 0
##$TDeff= 32768
##$TDoff= 0
##$TI= <>
##$TILT= no
##$TM1= 0
##$TM2= 0
##$TOPLEV= 0
##$USERP1= <user>
##$USERP2= <user>
##$USERP3= <user>
##$USERP4= <user>
##$USERP5= <user>
##$WDW= 1
##$XDIM= 32768
##$YMAX_p= 288995709
##$YMIN_p= -25823189
$$ End of Bruker specific parameters
$$ ---------------------------------
##NTUPLES= NMR SPECTRUM
##VAR_NAME=  FREQUENCY,     SPECTRUM/REAL,   SPECTRUM/IMAG
##SYMBOL=    X,             R,               I
##VAR_TYPE=  INDEPENDENT,   DEPENDENT,       DEPENDENT
##VAR_FORM=  AFFN,          ASDF,            ASDF
##VAR_DIM=   32768,         32768,           32768
##UNITS=     HZ,            ARBITRARY UNITS, ARBITRARY UNITS
##FACTOR=    1.13031516577767, 1,            1
##FIRST=     37037.037037037, -6487990,      18358163
##LAST=      0,             116303,          -16364108
##MIN=       0,             -25823189,       0
##MAX=       37037.037037037, 288995709,     0
$$ Real data points
##PAGE= N=1
##DATA TABLE= (X++(R..R)), XYDATA
$$ [...]
17634d38422R0750j6992q3324o2528N8555K41374M15643N29669N79459N86204
17624A900388N54881M72430L34805J48823q0456l42978o20169q87438j105652
17615C74634j237445j279636j242908j112083q67083n24650j34579K55611O22291
17606e145848R49406J203985J347000J364278J273606J108118Q99725O71463M45718
17597D117451K45943P6944o8586j75455k07989j51329l1957R3692J48837O0995
17587D108546j81610n04338p88423r45867r71342r27784q87615q90827r39087
17578b928347j003666j034803r84366q37025o18598l84230j98606j05208j06284
17569h201133j57929j85964j40401l5437P6219J51136J76503J62491J21384O6467
$$ y = [-438422, -347672, -364664, -447988, -510516, -451961, -210587, 205056, 734725, 1314184, 1900388, 2455269, 2927699, 3262504, 3411327, 3330871, 2987893, 2367724, 1480286, 374634, -862811, -2142447, -3385355, -4497438, -5364521, -5889171, -6023750, -5768139, -5145848, -4196442, -2992457, -1645457, -281179, 992427, 2100545, 3000270, 3671733, 4117451, 4363394, 4440338, 4371752, 4196297, 3988308, 3836979, 3805022, 3898714, 4047551, 4108546, 3926936, 3422598, 2634175, 1688308, 716966, -210818, -1098433, -1989260, -2928347, -3932013, -4966816, -5951182, -6788207, -7406805, -7791035, -7989641, -8094849, -8201133, -8359062, -8545026, -8685427, -8720864, -8644645, -8493509, -8317006, -8154515, -8033131, -7966664]
17559g966664L8679J00134K59173M25079M77164L67701J51422o3795j93001k09458
17549f613566j17121Q1003L57841O27003P83502P77446O28082L92227J38572o7296
17539c012307j73576j62544p6848n858k4166j40636k98106m17116m48013l86804
17529e145974k56662r2648P0330K10215L09249L40910K81164J30453p3305k72578
17519d498846m38714n85810p21928q18519q38864p75814o59826n21473l53276
17510a0213070j30866J44778M38107O85016Q11118P78091O28465M75015M11654
17501e971692M26386M28639L63695K72245K34834K81599L63418L96665L20167
17492b884044J15030j95253n35485p99562r16405q82694p34646n25212l15120
$$ y = [-7966664, -7927985, -7827851, -7568678, -7143599, -6666435, -6298734, -6147312, -6211107, -6404108, -6613566, -6730687, -6649684, -6291843, -5664840, -4881338, -4103892, -3475810, -3083583, -2945011, -3012307, -3185883, -3348427, -3425275, -3431133, -3455299, -3595935, -3894041, -4311157, -4759170, -5145974, -5402636, -5495284, -5424954, -5214739, -4905490, -4564580, -4283416, -4152963, -4226268, -4498846, -4937560, -5523370, -6245298, -7063817, -7902681, -8678495, -9338321, -9859794, -10213070, -10343936, -10199158, -9761051, -9076035, -8264917, -7486826, -6858361, -6383346, -5971692, -5545306, -5116667, -4752972, -4480727, -4245893, -3964294, -3600876, -3204211, -2884044, -2769014, -2964267, -3499752, -4299314, -5215719, -6098413, -6833059, -7358271, -7673391]
17483g673391j34742L5952K24933M24563N93045O80529O70190O07307N68712N96224
17473c406678O66476P23483P31493O89238N98499M48357K46569M4154j01565j83341
17463D56685k29577k46079k14296j34504l7283M3962R8030J32157J49464J33035
17453A51594N0885j15042l34610n27497o05409n30676l45850j49397l6393m2095
17443b484490j32102k47959l59097m61626n27448m96170l51852j74763q0558j15725
17433e431790k17687k71691j95506K8948L66381P47322J089985J322852J404262
17424a156924J324237J094380P53022L73405M7979j42220j61627m8156R5382J66683
17414B346161J33614M2171l1133m4057k2399k2485o2978j07458r8084K649J84673
$$ y = [-7673391, -7808133, -7772181, -7547248, -7122685, -6529640, -5849111, -5178921, -4571614, -4002902, -3406678, -2740202, -2016719, -1285226, -595988, 2511, 450868, 697437, 741591, 640026, 456685, 227108, -18971, -233267, -367771, -405054, -361092, -263062, -130905, 18559, 151594, 202479, 87437, -247173, -774670, -1380079, -1910755, -2256605, -2406002, -2442395, -2484490, -2616592, -2864551, -3223648, -3685274, -4212722, -4708892, -5060744, -5235507, -5316065, -5431790, -5649477, -5921168, -6116674, -6087726, -5721345, -4974023, -3884038, -2561186, -1156924, 167313, 1261693, 2014715, 2388120, 2436099, 2293879, 2132252, 2084096, 2179478, 2346161, 2479775, 2521946, 2490813, 2446756, 2424357, 2401872, 2338894, 2231436, 2133352, 2136001, 2320674]
17403B320674L93509N61739O34669N67022L27742n6948m74883p76720q75243q05516
17393A816045o80894n83650n18671m55989l68952k48597j10006K4726J51162K81961
17383f92865M17378N25161N56027M80249L19607J41234O489p2113j23427j83631
17373A374109k60743l05712k27290K6938M03948P73831J005420J024363Q48821
17364D663685N88265L80430L02613L38090M16166M66905M45847L25832R2096k22093
17354G797836n16727o91059p29768p03951o89680o99877o90398o08589m31727
17345B036060j75351J16424L82678N70811O63171O68003N92760M45122K49736
17336E549414M5234j28838k38488k73678k65950k65557l00988l59336l98183l84070
$$ y = [2320674, 2714183, 3275922, 3910591, 4477613, 4805355, 4748407, 4273524, 3496804, 2621561, 1816045, 1135151, 551501, 32830, -423159, -792111, -1040708, -1150714, -1125988, -974826, -692865, -275487, 249674, 805701, 1285950, 1605557, 1746791, 1753280, 1681167, 1557740, 1374109, 1113366, 807654, 580364, 607302, 1011250, 1785081, 2790501, 3814864, 4663685, 5251950, 5632380, 5934993, 6273083, 6689249, 7156154, 7602001, 7927833, 8019929, 7797836, 7281109, 6590050, 5860282, 5156331, 4466651, 3766774, 3076376, 2467787, 2036060, 1860709, 1977133, 2359811, 2930622, 3593793, 4261796, 4854556, 5299678, 5549414, 5594648, 5465810, 5227322, 4953644, 4687694, 4422137, 4121149, 3761813, 3363630, 2979560]
17326B979560l24460k62039k40560k77852l60410m53761n23655n45395n00444
17317e09016l90735k52726j37740q3916j09349k00997k92744k90478j52766O9397
17307b351070K95377M88520O40838P38206P88194Q33507Q86027Q76410P15928
17298C911937M03192L7780k70893m84110o22312p07946p47677p51196p28873o65422
17288f25520n22123k85762j2095K01461K94103K81988K34098K30923L23218M84259
17278F04550O02941N71116L93129J79091L0954k8472k7514j1882m1171j49611
17268B123131k97848l99465l90871k67136p7443J04822K30832L01764L45502L74689
17258B047977L65951K79497J08407q4983j95913j66689m9797L9230L3937k8893
$$ y = [2979560, 2655100, 2393061, 2152501, 1874649, 1514239, 1060478, 536823, -8572, -509016, -899751, -1152477, -1290217, -1374133, -1483482, -1684479, -1977223, -2267701, -2420467, -2351070, -2055693, -1567173, -926335, -188129, 600065, 1433572, 2319599, 3196009, 3911937, 4315129, 4352909, 4082016, 3597906, 2975594, 2267648, 1519971, 768775, 39902, -625520, -1147643, -1433405, -1445500, -1244039, -949936, -667948, -433850, -202927, 120291, 604550, 1207491, 1778607, 2171736, 2350827, 2381781, 2353309, 2325795, 2313913, 2272742, 2123131, 1825283, 1425818, 1034947, 767811, 690368, 795190, 1026022, 1327786, 1673288, 2047977, 2413928, 2693425, 2801832, 2716849, 2520936, 2354247, 2304450, 2343680, 2377617, 2348724]
17248B348724o6318n1562l9604q3713j59503j95423j52302n3976L5908N6167j6153
17237A622245j63471l54389n55544p27767q36179q61288q04584o89908n49008
17228c919893m02685k51656q5659R2143K52402L52622L67418L16158K44395J76816
17218b857939J25842J29948K38606M62899P51811J006129J115216J018860P73092
17209B764464N33119M32579M96338O68465Q63322R83957R58880Q02065O10481
17200I113670M73299L95642L23884K24108J07446n766j07608j92882k56912l02296
17190I772585l41888l96372m94400o64738r01937j143640j297410j297800j143947
17181B090453q86912n91217l18244j33760r5825k18139m49200o81572p99791p60045
$$ y = [2348724, 2282406, 2230844, 2191240, 2107527, 1948024, 1752601, 1600299, 1546323, 1582231, 1638398, 1622245, 1458774, 1104385, 548841, -178926, -1015105, -1876393, -2680977, -3370885, -3919893, -4322578, -4574234, -4659893, -4567750, -4315348, -3962726, -3595308, -3279150, -3034755, -2857939, -2732097, -2602149, -2363543, -1900644, -1148833, -142704, 972512, 1991372, 2764464, 3297583, 3730162, 4226500, 4894965, 5758287, 6742244, 7701124, 8503189, 9113670, 9586969, 9982611, 10306495, 10530603, 10638049, 10632283, 10524675, 10331793, 10074881, 9772585, 9430697, 9034325, 8539925, 7875187, 6973250, 5829610, 4532200, 3234400, 2090453, 1203541, 612324, 294080, 160320, 64495, -153644, -602844, -1284416, -2084207, -2844252]
17171b844252o23754m90120m01884l32316k35353p7543J51767M27941O95949Q86299
17161b843266R24285P59127M16871J7455k97801m75174n69711o61206p67662q32198
17151d329280p80247n83196k77609N3597L18726M63751M90078M17371K62349O6704
17141c897756j07238k25326k87402k91391k28162r4367J07834L65645O36084Q38999
17131c183080Q87606P45742M67847J73536k5345q3114l4879L1463L1388o2319
17121a051155k05092l19488l53761l13748k47795k01875j89840j96410j95873
17112c275037j72122j28990q0886l7296l071J8821L8377Q3009J76679L16992M89302
17101b574222O80864Q55133R56875R63234Q93920P74978O15998M25101K31333
$$ y = [-2844252, -3468006, -3958126, -4360010, -4692326, -4927679, -5005222, -4853455, -4425514, -3729565, -2843266, -1918981, -1159854, -742983, -725528, -1023329, -1498503, -2068214, -2729420, -3497082, -4329280, -5109527, -5692723, -5970332, -5916735, -5598009, -5134258, -4644180, -4226809, -3964460, -3897756, -4004994, -4230320, -4517722, -4809113, -5037275, -5131642, -5023808, -4658163, -4022079, -3183080, -2295474, -1549732, -1081885, -908349, -933694, -1016808, -1051687, -1020224, -988836, -1051155, -1256247, -1575735, -1929496, -2243244, -2491039, -2692914, -2882754, -3079164, -3275037, -3447159, -3576149, -3657035, -3694331, -3697402, -3678581, -3640204, -3557195, -3380516, -3063524, -2574222, -1893358, -1038225, -81350, 881884, 1775804, 2550782, 3166780, 3591881, 3823214]
17092C823214P0912m7638j54985k97187m96312p27482r31691j052052j062121
17083h75342r76575q45391p10748n56847l32894k9506K90160N40820O89495P65199
17073b041629P98200P75914O57803M23780J15663j76545l72424m40015l95499
17064f54752k80184j29771L4468J87848K99138L47793L30861K61048J68324R5740
17054F60513Q8690J80635L69911N97965P59344P65143O06440L47564Q0242j05333
17044D351114j48812n6721J00766K44265L32278L57579L20539K23974Q5666o0016
17034E750632j82970k73066l26542l32523k83684j86499o2005M6899Q0577Q341
17024D239160j35367k94903m59621o45828q29194r46576r57688q69743p17201
$$ y = [3823214, 3894126, 3846488, 3691503, 3394316, 2898004, 2170522, 1238831, 186779, -875342, -1851917, -2697308, -3408056, -3964903, -4297797, -4327303, -4037143, -3496323, -2806828, -2041629, -1243429, -467515, 190288, 614068, 729731, 553186, 180762, -259253, -654752, -934936, -1064707, -1030239, -842391, -543253, -195460, 135401, 396449, 564773, 660513, 749203, 929838, 1299749, 1897714, 2657058, 3422201, 4028641, 4376205, 4456447, 4351114, 4202302, 4145581, 4246347, 4490612, 4822890, 5180469, 5501008, 5724982, 5810648, 5750632, 5567662, 5294596, 4968054, 4635531, 4351847, 4165348, 4103343, 4150242, 4230819, 4239160, 4103793, 3808890, 3349269, 2703441, 1874247, 927671, -30017, -899760, -1616961]
17015a616961n37755l55603j73739J8605K18408L92925N08465N60437N65921N46365
17005A27068N21152M98480M65616M00100K96426J82217J02408P1941M9499j5590
16995B699317j11345j66432j25832m418J27625K07249K35564K61440L08402L41411
16985C772981L00130J49122r8708l91993o58713q38322r26686r73244j024336
16976f89769j082958j113490j071401r43973p63076n65997l63791j48047R2000
16967f650502L45637N68947P11360P47984O79829N39011M11156L99581N39130
16958a707867P73356J006272J144849J125026R45378O68428L75762J25984o2045
16949D395143k01226l05979l78798m29520m82609n57181o44459p07252o97512
$$ y = [-1616961, -2154716, -2510319, -2684058, -2665453, -2447045, -2054120, -1545655, -985218, -419297, 127068, 648220, 1146700, 1612316, 2012416, 2308842, 2491059, 2593467, 2665408, 2714907, 2699317, 2587972, 2421540, 2295708, 2291290, 2418915, 2626164, 2861728, 3123168, 3431570, 3772981, 4073111, 4222233, 4123525, 3731532, 3072819, 2234497, 1307811, 334567, -689769, -1772727, -2886217, -3957618, -4901591, -5664667, -6230664, -6594455, -6742502, -6650502, -6304865, -5735918, -5024558, -4276574, -3596745, -3057734, -2646578, -2246997, -1707867, -934511, 71761, 1216610, 2341636, 3287014, 3955442, 4331204, 4457188, 4395143, 4193917, 3887938, 3509140, 3079620, 2597011, 2039830, 1395371, 688119, -9393]
16940i393n85317l88940j64107L4612J77332K71890L53686M37870M96610M93986
16930A118229M13498K54713L2913k18406m53064o26207p18661p44960p27066o69675
16920b338686n63308m04007k01705L7871L20638O34916R29193J135817J219882
16911G70611J197569J098497R34963P20701M81565K39560J2685j68915k67494
16902E019742k77947k56463k83162l87642n18450n88450n40951l70429j07188
16893A689060J89479M44710O10830O82079O61544N49187L63634J47511m7411j68304
16883E122319j69614l2195K07903M53156N95060N77955M08815J23951k19906n40010
16873F527434p59849q50983q42130q02716q07873q76655r34068q73857o74296
$$ y = [-9393, -594710, -983650, -1147757, -1113145, -935813, -663923, -310237, 127633, 624243, 1118229, 1531727, 1786440, 1819353, 1600947, 1147883, 521676, -196985, -941945, -1669011, -2338686, -2901994, -3306001, -3507706, -3469835, -3149197, -2514281, -1585088, -449271, 770611, 1968180, 3066677, 4001640, 4722341, 5203906, 5443466, 5456151, 5287236, 5019742, 4741795, 4485332, 4202170, 3814528, 3296078, 2707628, 2166677, 1796248, 1689060, 1878539, 2323249, 2934079, 3616158, 4277702, 4826889, 5190523, 5338034, 5290623, 5122319, 4952705, 4920510, 5128413, 5581569, 6176629, 6754584, 7163399, 7287350, 7067444, 6527434, 5767585, 4916602, 4074472, 3271756, 2463883, 1587228, 653160, -220697, -894993]
16864h94993m21857k13402p6440J4442R0296J70333K64207L61902M25438M20975
16854A40901L54483K56490J60851R9661P4542M2227l9616j60381k66850l26666
16844C35642l54747l62448l24694k28183j14819m6646m9815j05366j72141k06924
16834a630141j80407r5516Q189P7763P6851J438j16796k14273k22079j20718L9390
16823b376299J92456L07900L80677M08515L88044L23748K33396J35851L2188r0493
16813f4017k26515l34264l60479k77922r5791J60115M51904P11612Q56006Q41556
16803A662205P02949N30786M05934L53409L35569K72834J08130j16975k80241
16794C974600k96516j84608k4642J00075J38207R1783M231p4420j11067r8494
$$ y = [-894993, -1316850, -1530252, -1606692, -1592250, -1501954, -1331621, -1067414, -705512, -280074, 140901, 495384, 751874, 912725, 1012386, 1086928, 1129155, 1089539, 929158, 662308, 335642, -19105, -381553, -706247, -934430, -1049249, -1095895, -1145710, -1251076, -1423217, -1630141, -1810548, -1906064, -1897875, -1820112, -1743261, -1741823, -1858619, -2072892, -2294971, -2415689, -2376299, -2183843, -1875943, -1495266, -1086751, -698707, -374959, -141563, -5712, 26476, -64017, -290532, -624796, -985275, -1263197, -1358988, -1198873, -746969, -35357, 820649, 1662205, 2365154, 2895940, 3301874, 3655283, 3990852, 4263686, 4371816, 4254841, 3974600, 3678084, 3493476, 3468834, 3568909, 3707116, 3798899, 3803130, 3728710, 3617643, 3519149]
16784C519149n8692l0852m1372q6318j46372k02098k36956k52643k82740l72690
16774A808416n33935p18929q43649q35165o71109l89675o1494K52398N13487O85475
16764g94180P22577N97486L51697J06135j1504L0747J47928K28197K31969K01317
16754A812369J91117K04402J96624J26718r678j79896l29729m10975m10378l53817
16744H36757k75035j80443o8016K1894K2016p9581k06259k58867j97352n8871
16734d43757Q1369J67009K04978K54028L47285M42812M77372M43867L79116L01020
16724B655099J94276M1714j53818l72088n83941p47825q00159o75367l62235O9611
16714g34733N12219Q75657J110418J202566J150158R45286O02281J93260j84368
$$ y = [3519149, 3460457, 3429605, 3388233, 3301915, 3155543, 2953445, 2716489, 2463846, 2181106, 1808416, 1274481, 555552, -288097, -1123262, -1794371, -2184046, -2245540, -1993142, -1479655, -794180, -71603, 525883, 877580, 983715, 972211, 1002958, 1150886, 1379083, 1611052, 1812369, 2003486, 2207888, 2404512, 2531230, 2521552, 2341656, 2011927, 1600952, 1190574, 836757, 561722, 381279, 313263, 335157, 357173, 277592, 71333, -187534, -384886, -443757, -362388, -195379, 9599, 263627, 610912, 1053724, 1531096, 1974963, 2354079, 2655099, 2849375, 2891089, 2737271, 2365183, 1781242, 1033417, 233258, -442109, -804344, -734733, -222514, 653143, 1763561, 2966127, 4116285, 5061571, 5663852, 5857112, 5672744]
16705E672744m73147o69982p93125q53311q43869p43751n46911k95309n9257J08061
16695E02143J73923J10546r3912m13939p80296j095868j270645j258885j073369
16686e200302p66524l93712Q126M03538P30442R06285Q76623O65917L81721J64088
16676b223798R8975J46613J67159M5928k05211m66369o15833o29011n77387n32196
16666d791130n01527m63288m10248l44643k56042j23855N3356K45078M02998M73104
16656e716197M30887L26049K62149L26391N37211Q30933J100744J267651J311770
16647F77588J245774J090130Q73439O27494L81238J62076r302j21494j70113j62524
16637D594306j25111r4462r6465j43879k44118l86037n15671n50068m50059k71448
$$ y = [5672744, 5199597, 4529615, 3736490, 2883179, 2039310, 1295559, 748648, 453339, 394082, 502143, 676066, 786612, 692700, 278761, -501535, -1597403, -2868048, -4126933, -5200302, -5966826, -6360538, -6352412, -5948874, -5218432, -4312147, -3435524, -2769607, -2387886, -2223798, -2124823, -1978210, -1811051, -1765123, -1970334, -2436703, -3052536, -3681547, -4258934, -4791130, -5292657, -5755945, -6166193, -6510836, -6766878, -6890733, -6837377, -6592299, -6189301, -5716197, -5285310, -4959261, -4697112, -4370721, -3833510, -3002577, -1901833, -634182, 677588, 1923362, 3013492, 3886931, 4514425, 4895663, 5057739, 5048437, 4926943, 4756830, 4594306, 4469195, 4374733, 4278268, 4134389, 3890271, 3504234, 2988563, 2438495, 1988436, 1716988]
16627A716988j14407l4720k0724l7576p1190j23627j86213k31382k23297j41307
16617E32545o03J56112K88865L79612M29712M44748M22614L51688K14080M251
16607C223624k42216m49642n48382n27024m37349l48157k98477k80894k55888
16598a64405j94224j12556o3715r2190j94693l19706l99719l73268j97237J21348
16588a990365M99087Q07200R55613R55133Q93321Q48767Q20110P31672N22219
16579E042757K27299m3252k02453k37287j72207k9006J51937K88840L06038J93452
16569E526118j415k23417m38749o24696p57816q18782p93733o83196n13345l14736
16559C56233r3215J52015L79757N04964M61579K65767J7015j69774k39814k18538
$$ y = [1716988, 1602581, 1567861, 1547137, 1509561, 1438371, 1314744, 1128531, 897149, 673852, 532545, 531942, 688054, 976919, 1356531, 1786243, 2230991, 2653605, 3005293, 3219373, 3223624, 2981408, 2531766, 1983384, 1456360, 1019011, 670854, 372377, 91483, -164405, -358629, -471185, -534900, -627090, -821783, -1141489, -1541208, -1914476, -2111713, -1990365, -1491278, -684078, 271535, 1226668, 2119989, 2968756, 3788866, 4520538, 5042757, 5270056, 5226804, 5024351, 4787064, 4614857, 4585851, 4737788, 5026628, 5332666, 5526118, 5524703, 5301286, 4862537, 4237841, 3480025, 2661243, 1867510, 1184314, 670969, 356233, 263018, 415033, 794790, 1299754, 1761333, 2027100, 2044115, 1874341, 1634527, 1415989]
16549A415989j70106j34020j00542m3966N2594K02885L98415N88665P17952P64411
16539C692277P13663N36012K46601n1899k43526k87014k04562l4771J61484L01176
16529D829441L38150K91526J90276K6164k08390m56579o04634n51849k70698J68616
16519C752023O05726Q51173P99072N04911J34125j71824l61969m49483m72215
16510E191539m60775m13759l06173j21400J24507L81580O02210P73452Q86864
16501F658045Q98496P55663M50235K8794m29509q37672j129938j287120j333564
16492C773430j307772j232347j109688r44667p60859n92316m65959l87237l39651
16483c367066k96800k24069q5631J17917L23341M50904M82899M75225M88929N24916
$$ y = [1415989, 1245883, 1111863, 1011321, 967355, 1019949, 1222834, 1621249, 2209914, 2927866, 3692277, 4405940, 4941952, 5188553, 5136654, 4893128, 4606114, 4401552, 4366781, 4528265, 4829441, 5167591, 5459117, 5649393, 5675557, 5467167, 5010588, 4405954, 3854105, 3583407, 3752023, 4357749, 5208922, 6007994, 6512905, 6647030, 6475206, 6113237, 5663754, 5191539, 4730764, 4317005, 4010832, 3889432, 4013939, 4395519, 4997729, 5771181, 6658045, 7556541, 8312204, 8762439, 8791233, 8361724, 7524052, 6394114, 5106994, 3773430, 2465658, 1233311, 123623, -821044, -1581903, -2174219, -2640178, -3027415, -3367066, -3663866, -3887935, -3973566, -3855649, -3532308, -3081404, -2598505, -2123280, -1634351, -1109435]
16473a109435N42092N24303M90192M45621L66495K40364J05473L6116J04025L52941
16463B098187P89221J367399J938792K241661K066260J457509O68369n1221n66566
16454A2009611q58322r81209j004521r70917q95643p85615o41529m52241k22254
16445E197360m705J18222R1806p0959k99044n11277o55491p07541o54014n07305
16435A997052l33745k29674k51316l79485n49724o89286p18608n70719k64772
16426a990277P6302L29233M62116N24862N89489O96800Q32699R19818Q42497N43287
16416C826826J06386k90106n04375n04589l50126j30629Q8133K80436M47172O06212
16406C575340P82296R78641J164392J293307J323564J225082R80304N96508J26511
$$ y = [-1109435, -567343, -43040, 447152, 892773, 1259268, 1499632, 1605105, 1641221, 1745246, 2098187, 2887408, 4254807, 6193599, 8435260, 10501520, 11959029, 12627398, 12576177, 12009611, 11151289, 10170080, 9165559, 8194642, 7298999, 6513384, 5871855, 5419614, 5197360, 5192655, 5310877, 5402683, 5331724, 5032680, 4521403, 3865912, 3158371, 2504357, 1997052, 1663307, 1433633, 1182317, 802832, 253108, -436178, -1154786, -1725505, -1990277, -1913975, -1584742, -1122626, -597764, -8275, 688525, 1521224, 2441042, 3283539, 3826826, 3933212, 3643106, 3138731, 2634142, 2284016, 2153387, 2241520, 2521956, 2969128, 3575340, 4357636, 5336277, 6500669, 7793976, 9117540, 10342622, 11322926, 11919434, 12045945]
16397A2045945l36255o92660q71606q39367n96854j87852L05112P90989J177712
16388A0795164J362490J266120Q82678K97576l22399p85852r75485r16164p45975
16379A0858153o06061n51354n58481n88679o15807o05755n05899k79720M3137
16370F589534L67815N97358P00445P19201P02826O51031N33245L31497O0003k25948
16360A1027007m40829n12716m31673k70783j52574j61338k84237m44409n72527
16351G755921o44280o83255p29657p80116p81389o98487n64000m57842m53063
16342A963832n72541p70968r52316j025638r67464q25345o50800m55045k35533
16333d491818j3820J77899L46350N40328P88987J063193J306752J474800J530363
$$ y = [12045945, 11709690, 11017030, 10145424, 9306057, 8709203, 8521351, 8826463, 9617452, 10795164, 12157654, 13423774, 14306452, 14604028, 14281629, 13495777, 12520292, 11604128, 10858153, 10252092, 9700738, 9142257, 8553578, 7937771, 7332016, 6826117, 6546397, 6589534, 6957349, 7554707, 8255152, 8974353, 9677179, 10328210, 10861455, 11192952, 11252955, 11027007, 10586178, 10073462, 9641789, 9371006, 9218432, 9057094, 8772857, 8328448, 7755921, 7111641, 6428386, 5698729, 4918613, 4137224, 3438737, 2874737, 2416895, 1963832, 1391291, 620323, -331993, -1357631, -2325095, -3150440, -3801240, -4256285, -4491818, -4505638, -4327739, -3981389, -3441061, -2652074, -1588881, -282129, 1192671, 2723034]
16324B723034J441910J205646Q51253M23434j7590l80327n75218n87757m98589
16315D585796m17804l99898m24617m42372m07968k86868q3874J23239K30080K13745
16305B689459J41915O3898l1578j57303k99272m33455n25254n28831m10887j87998
16295C20694O4320K72263M14277M87623M81722M14888L41193K94393K68001K51270
16285C610644K44214K35032J90430P8676j11840l66560o32053q26970q96613q47321
16275F77639p12621n04787k16552J40789N13926Q14448R46743Q56717N74417K04986
16265C295705j27801l37926l93751l11406j48776J9301J37830J85025J60473O9787
16255B548461q1684k80049m80856o10033o10706m83162k74880n3754J09245J70884
$$ y = [2723034, 4164944, 5370590, 6221843, 6645277, 6627687, 6247360, 5672142, 5084385, 4585796, 4167992, 3768094, 3343477, 2901105, 2493137, 2206269, 2122395, 2245634, 2475714, 2689459, 2831374, 2895272, 2863694, 2706391, 2407119, 1973664, 1448410, 919579, 508692, 320694, 385014, 657277, 1071554, 1559177, 2040899, 2455787, 2796980, 3091373, 3359374, 3610644, 3854858, 4089890, 4280320, 4358996, 4247156, 3880596, 3248543, 2421573, 1524960, 677639, -34982, -539769, -756321, -615532, -101606, 712842, 1659585, 2516302, 3090719, 3295705, 3167904, 2829978, 2436227, 2124821, 1976045, 1995346, 2133176, 2318201, 2478674, 2548461, 2466777, 2186728, 1705872, 1095839, 485133, 1971, -272909, -326663, -217418, -46534]
16245d6534J50210J09711R9374J28159J67507J72160J10590r289j33345j86477
16235E62066j26664R770J27546J43263K4524k12501n04825p61594r02647q81321
16225b522383p03217m36505j66690O2048K48265M03999N46776P08369R18761J167335
16215B26758J392940J530291J566472J529545J426667J229284R24202N56444K17636
16206A0600239j34n4260J5784J04231J05868j1004j82384l07599l33281k75036
16196I662424j77342p3337K4331J12881J78517J87835J14860l1247k08456l51186
16186I439280l88547k88991r4171J04274K26708K38031J39688l2075k09412l41158
16176H793627m41899n61826p20372q87411j004581j020174r26131p55040n36622
$$ y = [-46534, 103676, 213387, 312761, 440920, 608427, 780587, 891177, 881888, 748543, 562066, 435402, 445172, 572718, 715981, 740505, 528004, 23179, -738415, -1641062, -2522383, -3225600, -3662105, -3828795, -3766747, -3518482, -3114483, -2567707, -1859338, -940577, 226758, 1619698, 3149989, 4716461, 6246006, 7672673, 8901957, 9826159, 10382603, 10600239, 10600105, 10545845, 10561629, 10665860, 10771728, 10760724, 10578340, 10270741, 9937460, 9662424, 9485082, 9411745, 9436076, 9548957, 9727474, 9915309, 10030169, 9998922, 9790466, 9439280, 9050733, 8761742, 8667571, 8771845, 8998553, 9236584, 9376272, 9344197, 9134785, 8793627, 8351728, 7789902, 7069530, 6182119, 5177538, 4157364, 3231233, 2476193, 1939571]
16167A939571k87361m4788J24446J70579J17869O2028Q4755J78877K65603K62639
16157B874218J43390l4648j59603j50427k0057J43800K53488K84739K79854L00542
16147C915296L84576N30113O96147Q33798R28750R95790J035637J014125Q93593
16138A1227825O66105L46619k1225l43510n24476n53247m97965m20556l35396
16129I544174k34510j24118l4689M040j2946p4917j75165l00884m16843m94948
16119G679194n47802o07218o75136p14287o93299o20238n18376l92498k40404
16110B669936p7019O9103J59954J52618M2437r7392j61047j06570N413P2610N2170
16099B782213q018l1552J8947J24654K36147L24150M11605N40472P10983Q65996
$$ y = [1939571, 1652210, 1607422, 1731868, 1902447, 2020316, 2082344, 2167099, 2345976, 2611579, 2874218, 3017608, 2982960, 2823357, 2672930, 2652873, 2796673, 3050161, 3334900, 3614754, 3915296, 4299872, 4829985, 5526132, 6359930, 7288680, 8284470, 9320107, 10334232, 11227825, 11893930, 12240549, 12219324, 11875814, 11351338, 10798091, 10300126, 9879570, 9544174, 9309664, 9185546, 9150857, 9154897, 9141951, 9067034, 8891869, 8590985, 8174142, 7679194, 7131392, 6524174, 5849038, 5134751, 4441452, 3821214, 3302838, 2910340, 2669936, 2592917, 2662020, 2821974, 2974592, 3017029, 2919637, 2758590, 2652020, 2657433, 2730043, 2782213, 2774195, 2742643, 2761590, 2886244, 3122391, 3446541, 3858146, 4398618, 5109601, 5975597]
16089E975597R24001Q30457O03650L35369J24396K886o5193j24388j86041k47059
16079H173675l18252m12439n20504o10357o49431o21059n14218l22190p5270J51246
16069D281201K87060L19018K96696K99177L87147N60817P60009R14818R94922
16060I100865J009117R72235Q90553P63352N76845L19886L1275j79449k02628
16051A3282051l7124K06279M00028M70259M17930L12855K49242K85247M17252
16042A6004019N94833P53835Q60437R39087J055228J259045J532216J800712K014374
16033B6813786K196002K403184K667273K986889L368723L849595M472851N248719
16025E4007022O140636P085419Q015989Q850209R433272R483043Q633411O621939
$$ y = [5975597, 6899598, 7730055, 8333705, 8669074, 8793470, 8796356, 8731163, 8606775, 8420734, 8173675, 7855423, 7442984, 6922480, 6312123, 5662692, 5041633, 4527415, 4205225, 4129955, 4281201, 4568261, 4887279, 5183975, 5483152, 5870299, 6431116, 7191125, 8105943, 9100865, 10109982, 11082217, 11972770, 12736122, 13312967, 13632853, 13664128, 13484679, 13282051, 13244927, 13451206, 13851234, 14321493, 14739423, 15052278, 15301520, 15586767, 16004019, 16598852, 17352687, 18213124, 19152211, 20207439, 21466484, 22998700, 24799412, 26813786, 29009788, 31412972, 34080245, 37067134, 40435857, 44285452, 48758303, 54007022, 60147658, 67233077, 75249066, 84099275, 93532547, 103015590, 111649001, 118270940]
16017A18270940L528866j38152l633991o318793p902912q461832q283161p685363
16009G9375602o910959o106304n336609m610216l918062l266099k681825k211219
16001D4334309j902335j772898j784053j843576j852788j758478j561026j292688
15993C0566467r96910p11034m53006k22671k1720J30119K06361K07341J75681
15984B8880628J55974J40658Q2059m3100k02646l38158l97753l45790j90357p240
15974B7734275J13855J48233J36175J27768J38516J30920L8350j71210m49197
15965B7947685o89406q03457p81789o91779o14127n83360n86431n83617n34346
15956B2079373m37495l31580k50945k17102k64933m28622o86293r44416j101030
$$ y = [118270940, 121799806, 121661654, 118027663, 111708870, 103805958, 95344126, 87060965, 79375602, 72464643, 66358339, 61021730, 56411514, 52493452, 49227353, 46545528, 44334309, 42431974, 40659076, 38875023, 37031447, 35178659, 33420181, 31859155, 30566467, 29569557, 28858523, 28405517, 28182846, 28161126, 28291245, 28497606, 28704947, 28880628, 29036602, 29177260, 29259319, 29216219, 29013573, 28675415, 28277662, 27931872, 27741515, 27734275, 27848130, 27996363, 28132538, 28260306, 28398822, 28529742, 28568092, 28396882, 27947685, 27258279, 26454822, 25673033, 24981254, 24367127, 23783767, 23197336, 22613719, 22079373, 21641878, 21310298, 21059353, 20842251, 20577318, 20148696, 19462403, 18517987, 17416957]
15947A7416957j122130j046887r28766p97852o84983o31870o39661o43462n77530
15938A0343816m45759l01047j76299p1940M636L1835m68p7009j67852k50069l14509
15927H575335l58463l84648m01828m12719m06380l66453k81823j54366J67J58700
15917E967522K88093L43246L01390J98349J01581L6284m3806j94262m02469n85107
15907F010821o49262n60715l73310j92341r5458p4497n2819L8521K04868L94328
15897D650136N41587O12629O14365N62698M54277K74949L1221k33287m54591n76593
15887F477391n75720m56142k20845J18876M99932Q07301R40353Q79285O86135
15878I156566M50305K42215J02261M2812N3092J03290J45154J26078K4328j28142
$$ y = [17416957, 16294827, 15247940, 14319174, 13521322, 12836339, 12204469, 11564808, 10921346, 10343816, 9898057, 9597010, 9420711, 9348771, 9353407, 9385242, 9384774, 9307765, 9139913, 8889844, 8575335, 8216872, 7832224, 7430396, 7017677, 6611297, 6244844, 5963021, 5808655, 5808822, 5967522, 6255615, 6598861, 6900251, 7098600, 7200181, 7236465, 7192659, 6998397, 6595928, 6010821, 5361559, 4800844, 4427534, 4235193, 4139735, 4065238, 4012419, 4050940, 4255808, 4650136, 5191723, 5804352, 6418717, 6981415, 7435692, 7710641, 7741862, 7508575, 7053984, 6477391, 5901671, 5445529, 5224684, 5343560, 5843492, 6650793, 7591146, 8470431, 9156566, 9606871, 9849086, 9951347, 9994159, 10047251, 10150541, 10295695, 10421773, 10446101, 10317959]
15868A0317959k78040m07518n33220o62273p80808q76209r54713j028030j069422
15859C727726j002435p75213m42734j34588O0528J46699J70959J75717K06404
15850B133063L13461N16901P79971J027778J188643J220728J115621R00735O35518
15841I832419L78003J43714r9739l85090o83560q96923r32771q02753o19972m80368
15831E452960l69370k01071P1183M00172O77171P97480P20309M91181K02149o0884
15821H181280k38332l03769k69924j79726q0150k405M9788R9653J67691K47492
15811G671598L12428L28729K70635J45205k623j29156k33297l39792m36922m65341
15801G121464l92055k58867j41429p7463k7580Q5226K87102N24924P18554Q11236
$$ y = [10317959, 10039919, 9632401, 9099181, 8436908, 7656100, 6779891, 5825178, 4797148, 3727726, 2725291, 1950078, 1507344, 1372756, 1433284, 1579983, 1750942, 1926659, 2133063, 2446524, 2963425, 3743396, 4771174, 5959817, 7180545, 8296166, 9196901, 9832419, 10210422, 10354136, 10254397, 9869307, 9185747, 8288824, 7356053, 6553300, 5933328, 5452960, 5083590, 4882519, 4953702, 5353874, 6031045, 6828525, 7548834, 8040015, 8242164, 8181280, 7942948, 7639179, 7369255, 7189529, 7109379, 7106974, 7156762, 7256415, 7424106, 7671598, 7984026, 8312755, 8583390, 8728595, 8725972, 8596816, 8363519, 8023727, 7586805, 7121464, 6729409, 6470542, 6329113, 6251650, 6224070, 6309296, 6596398, 7121322, 7839876, 8651112]
15791H651112P75670O04335L11659m6827l59268n02268m37017k46480o3815K7341
15781H714442K4212l5204j09864j53753j24645j9232J17875K14633K07052R5067
15771H930583m0080r7608k4296J69715M18556O18060O74860N64912L49874J35829
15761A1700405N800k3328M269K9011K8102J2762j1290l9493m2887J4323J41075
15750A1818749L11633M75489N78555N95983N45043M55198L34185J79659J6741
15741A5311235r1226q4270L0306J66497K19266J48121J4270p5517o1073L7182
15731A5614791J59779K59946L09660L00075K49903J76599O7722r4489k95306m89523
15721A6259157o29097o80657o25494m49267j55805J92772M85404O35943O31076
$$ y = [8651112, 9426782, 10031117, 10342776, 10295949, 9936681, 9434413, 8997396, 8750916, 8687101, 8714442, 8738654, 8703450, 8593586, 8439833, 8315188, 8295956, 8413831, 8628464, 8835516, 8930583, 8890503, 8792895, 8768599, 8938314, 9356870, 9974930, 10649790, 11214702, 11564576, 11700405, 11706205, 11682877, 11687146, 11716157, 11744259, 11757021, 11745731, 11706238, 11663351, 11677674, 11818749, 12130382, 12605871, 13184426, 13780409, 14325452, 14780650, 15114835, 15294494, 15311235, 15220009, 15135739, 15166045, 15332542, 15551808, 15699929, 15714199, 15638682, 15577609, 15614791, 15774570, 16034516, 16344176, 16644251, 16894154, 17070753, 17138475, 17043986, 16748680, 16259157, 15630060, 14949403, 14323909, 13874642, 13718837, 13911609, 14397013, 15032956, 15664032]
15712A5664032M95363K40538j12072m78142p26288p57216n60565k04046K10969
15703A3772573N78980Q07671Q49495P24281M95206K22461n9988l27717n30002
15694A6532960n98487n06457k94612l1522K30355M58804O21676O83856O37061
15685A7733634N16234L72935K40493J28138L6772l7242j08893j91102k68518l00741
15675A8121710k60410j64184o7563l0065p4200j62096k16412j93783j34513j08461
15665A6710023j30320j46836q3062R4448L45652N89384P54676Q07361P58966O62826
15655B0363118N87817N69662N77331N39805M13884K18772m40k25089m53677o55176
15645B1936007p73901p72130o39770l86757n0563K98003N72586P04333O65162
$$ y = [15664032, 16159395, 16399933, 16287861, 15809719, 15083431, 14326215, 13765650, 13561604, 13772573, 14351553, 15159224, 16008719, 16733000, 17228206, 17450667, 17390679, 17062962, 16532960, 15934473, 15428016, 15133404, 15101882, 15332237, 15791041, 16412717, 17096573, 17733634, 18249868, 18622803, 18863296, 18991434, 19028206, 18990964, 18882071, 18690969, 18422451, 18121710, 17861300, 17697116, 17629553, 17599488, 17525288, 17363192, 17146780, 16952997, 16818484, 16710023, 16579703, 16432867, 16349805, 16444253, 16789905, 17379289, 18133965, 18941326, 19700292, 20363118, 20950935, 21520597, 22097928, 22637733, 23051617, 23270389, 23269949, 23044860, 22591183, 21936007, 21162106, 20389976, 19750206, 19363449, 19312886, 19610889, 20183475, 20887808, 21552970]
15636B1552970M78390K20204k388j05805q0963P395P4453P6976L6331O547J6571
15625B2280681L8690J4487q4509k30189l76906n07082o21072o94694o70420m96889
15615A8652097j78562K04684N26496O68968N72537K73531r8342l93466n36850
15606A9691093n62564n69861o29370p16859p43236o37656m00088r8332J69337
15597A5502464L27318L67475L36594K74168J94044J18929Q0170Q9334J48268K69950
15587A7708714M52444O49943Q07500R14158R95347J073937J157682J229192J237493
15578B6226410J131914R11963O32211L65754J72319P9359O8524R2178J14362J32543
15568B9927537J65319K20224K70843K75879K23051J41349O5018r12o2303j04549
$$ y = [21552970, 22031360, 22251564, 22249176, 22143371, 22062408, 22069803, 22144256, 22221232, 22257563, 22264110, 22280681, 22319371, 22333858, 22249349, 22019160, 21642254, 21135172, 20514100, 19819406, 19148986, 18652097, 18473535, 18678219, 19204715, 19873683, 20446220, 20719751, 20621409, 20227943, 19691093, 19128529, 18558668, 17929298, 17212439, 16469203, 15831547, 15431459, 15333127, 15502464, 15829782, 16197257, 16533851, 16808019, 17002063, 17120992, 17201162, 17290496, 17438764, 17708714, 18161158, 18811101, 19618601, 20532759, 21528106, 22602043, 23759725, 24988917, 26226410, 27358324, 28270287, 28902498, 29268252, 29440571, 29519930, 29588454, 29680632, 29794994, 29927537, 30092856, 30313080, 30583923, 30859802, 31082853, 31224202, 31289220, 31288308, 31226005, 31121456]
15558C1121456j02495m9623K8307J05118J99571L44096N12186O31549O67672O42109
15548C4099946N75459M61307K87757O3466j57458k96351l19046k43350r0226J15285
15538C4496789L20736M66620N18341M73688L64787K50539J71442J15759N8219
15529C7236920J3042J8616Q4630J74056K28232K04798J07597k712m1550K7640
15519C8051269J54702K41372K03625J0831k91294n92805p81354p98748o40769
15510C5556829l37396M1492L93308O39300P65528P92768P37636O16207M54074
15501C9659746K66018L8784k37742n37350q03878r73778j006726r15512p64207
15492C4725355o24643n43189n40743o02088o72821p08345p19808p47287q00179
$$ y = [31121456, 31018961, 30969338, 30997645, 31102763, 31302334, 31646430, 32158616, 32790165, 33457837, 34099946, 34675405, 35136712, 35424469, 35487935, 35330477, 35034126, 34715080, 34471730, 34381504, 34496789, 34817525, 35284145, 35802486, 36276174, 36640961, 36891500, 37062942, 37178701, 37236920, 37249962, 37268578, 37353208, 37527264, 37755496, 37960294, 38067891, 38065179, 38023629, 38051269, 38205971, 38447343, 38650968, 38661799, 38370505, 37777700, 36996346, 36197598, 35556829, 35219433, 35260925, 35654233, 36293533, 37059061, 37851829, 38589465, 39205672, 39659746, 39925764, 39964548, 39726806, 39189456, 38385578, 37411800, 36405074, 35489562, 34725355, 34100712, 33557523, 33016780, 32414692, 31741871, 31033526, 30313718, 29566431, 28766252]
15483B8766252q29124p51781n31193k33486J5000J27557R6919m4627k60590n12089
15473B5842838p59763r69413j110449j153571j077729q84470o09349l15303o0795
15464A8901996J28720K59992L40756L42678K27635K3695j61330k06479m4360L09573
15454B0122876P69491J229731J602963J823912J860578J737110J513640J230721
15446C1891022Q94842N20217J59949j21152k89103l35709k62453r8889R8357K85472
15436C2742553M42665N41477N30530L72939R9074j92444m07060n27757o12208
15427C2989769p25340q68625r62671r12346o99939m09247j61832l1394p133j8454
15417B8192788J5103J39180L41375N57364P03786P15502N61104K53097j31801
$$ y = [28766252, 27937128, 27185347, 26654154, 26420668, 26435668, 26563225, 26660144, 26615517, 26354927, 25842838, 25083075, 24113662, 23003213, 21849642, 20771913, 19887443, 19278094, 18962791, 18901996, 19030716, 19290708, 19631464, 19974142, 20201777, 20225472, 20064142, 19857663, 19813303, 20122876, 20892367, 22122098, 23725061, 25548973, 27409551, 29146661, 30660301, 31891022, 32785864, 33306081, 33466030, 33344878, 33055775, 32720066, 32457613, 32358724, 32457081, 32742553, 33185218, 33726695, 34257225, 34630164, 34729238, 34536794, 34129734, 33601977, 32989769, 32264429, 31395804, 30433133, 29520787, 28820848, 28411601, 28249769, 28218375, 28211242, 28192788, 28207891, 28347071, 28688446, 29245810, 29949596, 30665098, 31226202, 31479299, 31347498]
15408C1347498m64008o35631o37797n57793m99256n01454n30032n29202m73162
15399B6519163l84402l19474l24894l79757l81511k20562J04997M58507O67587
15390B5739654O55504M64472J76163j52151m76834p34830q52591p97322o14989
15381B3407076m04981k50760j72367j35984r2197J698J69445M04018O71835R14135
15371B4511918J051826J029758Q66551O55040N02372M57413M92547N41671N54759
15362C0663855N27184M90940M76779M62493L77544J82615q1129l22598m52513
15353C2325170m19057k35545J5262K27511L33361L19476K02861P265k47330n38475
15343C1990499q17611j011739j070658j005775q82996p75859o97886n89606l95282
$$ y = [31347498, 30883490, 30247859, 29610062, 29052269, 28553013, 28051559, 27521527, 26992325, 26519163, 26134761, 25815287, 25490393, 25110636, 24729125, 24508563, 24613560, 25072067, 25739654, 26395158, 26859630, 27035793, 26883642, 26406808, 25671978, 24819387, 24022065, 23407076, 23002095, 22751335, 22578968, 22442984, 22350787, 22352485, 22521930, 22925948, 23597783, 24511918, 25563744, 26593502, 27460053, 28115093, 28617465, 29074878, 29567425, 30109096, 30663855, 31191039, 31681979, 32158758, 32621251, 32998795, 33181410, 33100281, 32777683, 32325170, 31906113, 31670568, 31685830, 31913341, 32246702, 32566178, 32769039, 32776304, 32528974, 31990499, 31172888, 30161149, 29090491, 28084716, 27201720, 26425861, 25727975, 25138369, 24743087]
15334B4743087j34255J10578K56606K68022J50615o8088l36671n82403p33359
15325B3674132p39972n94454l42321o1568J78900L45792M31942M27869L24969
15316B3645289J42310p8677l00349m96281o51198p66952q45310q57500p68441
15307A9022891n82625l29518l5941K62988N05541O20506N98483N32711N30861
15298B1125897N99584O60463O48173N51709L87307J79901l2187k13712l52423
15289B3554712m43856m89640n29844o33946q24613j025216j105389r82421o80962
15280A6838825l06279L1180K67219L88742M18185L84021K90242J38616k2062j23495
15270A8305194j62034k11195l51481o08071r23894j172094j221263j021925o47340
$$ y = [24743087, 24608832, 24719410, 24976016, 25244038, 25394653, 25326565, 24989894, 24407491, 23674132, 22934160, 22339706, 21997385, 21935817, 22114717, 22460509, 22892451, 23320320, 23645289, 23787599, 23708922, 23408573, 22912292, 22261094, 21494142, 20648832, 19791332, 19022891, 18440266, 18110748, 18074807, 18337795, 18843336, 19463842, 20062325, 20595036, 21125897, 21725481, 22385944, 23034117, 23585826, 23973133, 24153034, 24120847, 23907135, 23554712, 23110856, 22621216, 22091372, 21457426, 20632813, 19607597, 18502208, 17519787, 16838825, 16532546, 16563726, 16830945, 17219687, 17637872, 18021893, 18312135, 18450751, 18428689, 18305194, 18143160, 17931965, 17580484, 16972413, 16048519, 14876425, 13655162, 12633237, 11985897]
15261A1985897k43397P7487K93107M30959N03958M99973M10569K63406J35894
15252A4357853J20141K50596M59018O32244P31049Q08594R03713R73851R51251
15243B0188310Q17154N97025L23847M6097j67863k76165k88375k29661j16876
15234B0893493J3936R9008J00393N5796M5117R9526J76096K23122K28688K03683
15224B2138858J54623Q6627J2941n2465j02574j34428j51731j63441j70424j68607
15214B1449379j64796j72162j87969j82049j08875O8220L47829O63579Q91260
15205B2604416R11704O97851L40889j6361k63065l55320l16271k18814j38169
15196B3246860r9686p4996k5530O2000J82218L29585M85117N96081O04251N01169
$$ y = [11985897, 11742500, 11819987, 12113094, 12544053, 13048011, 13547984, 13958553, 14221959, 14357853, 14477994, 14728590, 15187608, 15819852, 16550901, 17359495, 18263208, 19237059, 20188310, 21005464, 21602489, 21926336, 21972433, 21804570, 21528405, 21240030, 21010369, 20893493, 20907429, 21006437, 21106830, 21162626, 21207743, 21307269, 21483365, 21706487, 21935175, 22138858, 22293481, 22380108, 22393049, 22340584, 22238010, 22103582, 21951851, 21788410, 21617986, 21449379, 21284583, 21112421, 20924452, 20742403, 20633528, 20701748, 21049577, 21713156, 22604416, 23516120, 24213971, 24554860, 24538499, 24275434, 23920114, 23603843, 23385029, 23246860, 23147174, 23072178, 23046648, 23108648, 23290866, 23620451, 24105568, 24701649, 25305900, 25807069]
15186B5807069L39083J78906L2897j29868l23267n06318o11656o01514m91745
15177B3693587l28676j53423J4487J76252L38774M92305O12462O95142P72888
15168B6313798Q68211R44689R35811Q11799O08286M00373K49016J64484J11637
15159C1408104M2597p6694k57421m81003o98490q43020q46966o74695l59880Q777
15149B7221309L44878N91319P16315P20488O52505N94821O03159O55395O75458
15140C2775647O14684M98788L86380L00548K18847J14150p410j03065j24429m4678
15130C4629462J47220M50662Q24306J175723J405421J446378J274402R24680M97248
15121D2775502J03978k06833m62940p03429q99443r46958p58779l61056J11069
$$ y = [25807069, 26146152, 26325058, 26357955, 26228087, 25904820, 25398502, 24786846, 24185332, 23693587, 23364911, 23211488, 23225975, 23402227, 23741001, 24233306, 24845768, 25540910, 26313798, 27182009, 28126698, 29062509, 29874308, 30482594, 30882967, 31131983, 31296467, 31408104, 31450701, 31374007, 31116586, 30635583, 29937093, 29094073, 28247107, 27572412, 27212532, 27221309, 27566187, 28157506, 28873821, 29594309, 30246814, 30841635, 31444794, 32100189, 32775647, 33390331, 33889119, 34275499, 34576047, 34794894, 34909044, 34901634, 34798569, 34674140, 34629462, 34776682, 35227344, 36051650, 37227373, 38632794, 40079172, 41353574, 42278254, 42775502, 42879480, 42672647, 42209707, 41506278, 40606835, 39659877, 38901098, 38540042, 38651111]
15112C8651111N09584P69398R16258R95562J025354J014821R73413Q86666P25938
15103D6468105M94510K40643L6450l5934Q6156L83798P41970J032590J196729
15094E0645017J243181J201605J086661Q95478O34277L41798Q1308q6254j33064
15085E5910007q5595p98R2747K17287M05854O61234R56047J245398J472701J579352
15075F2454234J523383J305454R89241O85100M87974M21344M44264N04567N73118
15066F9388679O37953O98754P76000Q96337J059214J239643J415715J567220J669712
15057G9349227J714076J709822J667876J604354J546391J522258J558388J677648
15049I2350040J883813K143351K394392K583282K694098K759626K829700K903879
$$ y = [38651111, 39160695, 39930093, 40846351, 41841913, 42867267, 43882088, 44855501, 45742167, 46468105, 46962615, 47203258, 47239708, 47203774, 47289930, 47673728, 48415698, 49448288, 50645017, 51888198, 53089803, 54176464, 55071942, 55706219, 56048017, 56129325, 56043071, 55910007, 55824412, 55823614, 55916361, 56133648, 56539502, 57200736, 58156783, 59402181, 60874882, 62454234, 63977617, 65283071, 66272312, 66957412, 67445386, 67866730, 68310994, 68815561, 69388679, 70026632, 70725386, 71501386, 72397723, 73456937, 74696580, 76112295, 77679515, 79349227, 81063303, 82773125, 84441001, 86045355, 87591746, 89114004, 90672392, 92350040, 94233853, 96377204, 98771596, 101354878, 104048976, 106808602, 109638302, 112542181]
15041A12542181K920902K830296K644773K411793K165662J912551J645806J380779
15033A30454743J163695J020630R23834Q33886P40442O55533N95032N60874N28279
15024A37476948M68948M04770M16160N69292Q51546J194303J519506J757485J869085
15015A46528043J865039J781457J646340J490541J369090J342199J434822J620621
15007A59078152J838182K026474K158205K240052K296572K369459K509569K755933
14999A77272598L121206L576434M056406M507420M909577N241509N475170N608235
14991B13768555N664994N673341N634016N494510N184093M692621M095990L508882
14983B53717002L030226K705042K502198K354197K223090K103836J995164J894108
$$ y = [112542181, 115463083, 118293379, 120938152, 123349945, 125515607, 127428158, 129073964, 130454743, 131618438, 132639068, 133562902, 134396788, 135137230, 135792763, 136387795, 136948669, 137476948, 137945896, 138350666, 138766826, 139336118, 140187664, 141381967, 142901473, 144658958, 146528043, 148393082, 150174539, 151820879, 153311420, 154680510, 156022709, 157457531, 159078152, 160916334, 162942808, 165101013, 167341065, 169637637, 172007096, 174516665, 177272598, 180393804, 183970238, 188026644, 192534064, 197443641, 202685150, 208160320, 213768555, 219433549, 225106890, 230740906, 236235416, 241419509, 246112130, 250208120, 253717002, 256747228, 259452270, 261954468, 264308665, 266531755, 268635591, 270630755, 272524863]
14975B72524863J790289J658985J483582J275259J064535Q92035P99772Q05535
14967B82294855Q81481R67453J007874R82772R07696P96714O36906M08867J11091
14958B88995709k42241o23274r83188j269292j459209j572115j654623j745257
14950B79446510j843786j933909k020975k121438k237074k356923k461660k516675
14942B61954070k480461k326085k047630j660395j215533p92162m44569j67623
14934B50819612P5339L01624M98494O60858Q17271J003998J222861J434469J585515
14925B58420041J634857J569688J421993J257032J123817J026532R47316Q80314
14917B68281590Q35822Q18142Q07004P62945O53661M78351K57797J364l00370
$$ y = [272524863, 274315152, 275974137, 277457719, 278732978, 279797513, 280689548, 281489320, 282294855, 283176336, 284143789, 285151663, 286134435, 287042131, 287838845, 288475751, 288884618, 288995709, 288753468, 288130194, 287147006, 285877714, 284418505, 282846390, 281191767, 279446510, 277602724, 275668815, 273647840, 271526402, 269289328, 266932405, 264470745, 261954070, 259473609, 257147524, 255099894, 253439499, 252223966, 251431804, 250987235, 250819612, 250894951, 251196575, 251695069, 252355927, 253173198, 254177196, 255400057, 256834526, 258420041, 260054898, 261624586, 263046579, 264303611, 265427428, 266453960, 267401276, 268281590, 269117412, 269935554, 270742558, 271505503, 272159164, 272637515, 272895312, 272896676, 272596306]
14908B72596306o54931j052291j468238j865551k174629k304266k217614j980921
14900B58877865j704058j449002j214752r91981q07679p14731p55725r41559j250817
14891B49047561j639223k046338k394546k595552k591995k407844k132034j838106
14883B31401923j536872j204336q31864m51313j23418J03584K31546L07642L69276
14874B28266168M04337L86248L19864K32659J40639K9061j36302l71181o53894
14865B28617599r49837j234785j489101j679465j754580j680131j482189j229629
14857B17117882r76444p47125n64071m60519m60931n60057p27442r18341j083230
14848B10619722j176193j138739r00694m63558K2923L51055M34542L39738J67305
$$ y = [272596306, 271941375, 270889084, 269420846, 267555295, 265380666, 263076400, 260858786, 258877865, 257173807, 255724805, 254510053, 253518072, 252710393, 251995662, 251239937, 250298378, 249047561, 247408338, 245362000, 242967454, 240371902, 237779907, 235372063, 233240029, 231401923, 229865051, 228660715, 227828851, 227377538, 227254120, 227357704, 227589250, 227896892, 228266168, 228670505, 229056753, 229376617, 229609276, 229749915, 229778976, 229642674, 229271493, 228617599, 227667762, 226432977, 224943876, 223264411, 221509831, 219829700, 218347511, 217117882, 216141438, 215394313, 214830242, 214369723, 213908792, 213348735, 212621293, 211702952, 210619722, 209443529, 208304790, 207404096, 206940538, 206963461, 207314516, 207749058, 208088796, 208256101]
14839B08256101k4992j98650l06658l17037k39509j11455L4582J67313K26303
14830B07485998J42319r8043m22470o96774p83034o24701l07703j2019J27667
14821B04811240J05378q968j67272l72211o32739r14411j144982j270185j297976
14812A99107874j291359j322119j419742j555916j678304j749317j756083j703588
14804A86631446j601031j454318j279638j111304r82195r05751q68749q31833
14796A77596627p66579o94630o61910o81611p20850p35503p02083o29719n63356
14787A71440386n62266o60565q40649j033665j155813j172838j140148j153680
14779A63720762j244378j343392j360676j274815j136173j005533r04211q16553
$$ y = [208256101, 208231109, 208032459, 207725801, 207408764, 207169255, 207057800, 207092382, 207259695, 207485998, 207628317, 207530274, 207107804, 206411030, 205627996, 205003295, 204695592, 204683573, 204811240, 204916618, 204907650, 204740378, 204368167, 203735428, 202821017, 201676035, 200405850, 199107874, 197816515, 196494396, 195074654, 193518738, 191840434, 190091117, 188335034, 186631446, 185030415, 183576097, 182296459, 181185155, 180202960, 179297209, 178428460, 177596627, 176830048, 176135418, 175473508, 174791897, 174071047, 173335544, 172633461, 172003742, 171440386, 170878120, 170217555, 169376906, 168343241, 167187428, 166014590, 164874442, 163720762, 162476384, 161132992, 159772316, 158497501, 157361328, 156355795, 155451584, 154635031]
14771A54635031p23038o14050m93080l82361l01950k48944k17007k18137k63451
14762A51173013l31486l80192l89932l82007m00257m78005o12604p64186q75084
14753A46559260q95959q17620o83450n53549m66317m45483n13681o74221q83097
14744A40625883j047672j076550r45584p16210m97644l80104l88933n02248o92021
14735A34378917r39172j231392j542936j801930j908214j809924j544887j196631
14727A22403831q26178m56654j21959R2462R6263j26138n05684r31847j299661
14718A18324435j547513j663895j658431j529076j284288r95875p71769o67904
14710A08205684o55373o64958o48356n94915n06414l90141k71769j92557j99102
$$ y = [154635031, 153911993, 153297943, 152804863, 152422502, 152120552, 151871608, 151654601, 151436464, 151173013, 150841527, 150461335, 150071403, 149689396, 149289139, 148811134, 148198530, 147434344, 146559260, 145663301, 144845681, 144162231, 143608682, 143142365, 142696882, 142183201, 141508980, 140625883, 139578211, 138501661, 137556077, 136839867, 136342223, 135962119, 135573186, 135070938, 134378917, 133439745, 132208353, 130665417, 128863487, 126955273, 125145349, 123600462, 122403831, 121577653, 121120999, 120999040, 121091502, 121187765, 121061627, 120555943, 119624096, 118324435, 116776922, 115113027, 113454596, 111925520, 110641232, 109645357, 108873588, 108205684, 107550311, 106885353, 106236997, 105642082, 105135668, 104745527, 104473758, 104281201, 104082099]
14701A04082099l17457n18196p24852q61697q85334p89817o02821l70554j35925
14692I8875446P1458K26619L01668K76114J54149l2868k40484m39810o45658q89613
14682I7657021j147579j318758j299891j083924p77021n14813l74541l56531m19005
14673I0364958n20635o29369p10317p27785o54968m87658k51297J5758K73176
14664H6671863M64530N16973L78849O6999l28174o96328r75970j173348j316675
14655H3608719j415173j473997j511599j526571j469831j292979j009303o77038
14647G3232228l55320r8929M2447N3467k7998j29805j78504j37489m0766K8785
14637G2388116K0333m3754j11597j54106j89940k84012m94695q02631j096636
$$ y = [104082099, 103764642, 103246446, 102521594, 101659897, 100774563, 99984746, 99381925, 99011371, 98875446, 98946904, 99173523, 99475191, 99751305, 99905454, 99872586, 99632102, 99192292, 98546634, 97657021, 96509442, 95190684, 93890793, 92806869, 92029848, 91515035, 91140494, 90783963, 90364958, 89844323, 89214954, 88504637, 87776852, 87121884, 86634226, 86382929, 86398687, 86671863, 87136393, 87653366, 88032215, 88099214, 87771040, 87074712, 86098742, 84925394, 83608719, 82193546, 80719549, 79207950, 77681379, 76211548, 74918569, 73909266, 73232228, 72876908, 72777979, 72820426, 72873893, 72845895, 72716090, 72537586, 72400097, 72359331, 72388116, 72408449, 72364695, 72253098, 72098992, 71909052, 71625040, 71130345, 70327714, 69231078]
14628F9231078j245953j201746j030414q38211o65633m78291k49768j7755J43454
14619F3646761J84597J06343n3859k41990m15919n61541o67073o94456o02656
14610F0700207m03504j72474J8054J67007L26214N12393O67079P19921O56889
14601F3191786N07629L11989J23620J203k0735O0585K08165L32125L33875J93854
14591F5244096j4721k16582m00222n76157p20041p91371p82887p24188o52217
14582F0365710n92105n48080n09515m71750m34868l91571l43719l06639k77616
14573E6489847k36173j90197j84154k36050l01688l19293k60484j48238m7651
14564E4565919k9958j40288l72323o57721r10750j078471j134374j054966q41060
$$ y = [69231078, 67985125, 66783379, 65752965, 64914754, 64249121, 63770830, 63521062, 63503307, 63646761, 63831358, 63937701, 63883842, 63641852, 63225933, 62664392, 61997319, 61302863, 60700207, 60296703, 60124229, 60142283, 60309290, 60635504, 61147897, 61814976, 62534897, 63191786, 63699415, 64011404, 64135024, 64136227, 64115492, 64176077, 64384242, 64716367, 65050242, 65244096, 65229375, 65012793, 64612571, 64036414, 63316373, 62525002, 61742115, 61017927, 60365710, 59773605, 59225525, 58716010, 58244260, 57809392, 57417821, 57074102, 56767463, 56489847, 56253674, 56063477, 55879323, 55643273, 55341585, 55022292, 54761808, 54613570, 54565919, 54535961, 54395673, 54023350, 53365629, 52454879, 51376408, 50242034, 49187068, 48346008]
14555D8346008n52301k83435r6331J2914P5998J05557J00010P2638M9103L4360
14545D7864521Q7q7442k19054l26615l40155k61579j63052j15406j27045j40366
14535D6083894q7207L2732J35542J26799j0634j98103l31147l73228l68311l72681
14525D4637656m02920m29399m01292k89087j19513K2868N6025j9799j29949k19314
14515D2705276k91001l53382l91716l88866l30354k06346m2675J02574K12778
14506D1016288L37520N05889O61765P11523O12355M08448K05231J09897J55689
14497D4724605K71233L50235L47777K95235K45505K24836K24716K17837J82430
14488D7084409J21023N6508J3135K643K2322O2384J07745J30098J04048M3160
$$ y = [48346008, 47793707, 47510272, 47413941, 47426855, 47502853, 47608410, 47708420, 47781058, 47830161, 47864521, 47864608, 47777166, 47558112, 47231497, 46891342, 46629763, 46466711, 46351305, 46224260, 46083894, 45996687, 46029419, 46164961, 46291760, 46281126, 46083023, 45751876, 45378648, 45010337, 44637656, 44234736, 43805337, 43404045, 43114958, 42995445, 43018313, 43074338, 43054539, 42924590, 42705276, 42414275, 42060893, 41669177, 41280311, 40949957, 40743611, 40700936, 40803510, 41016288, 41353808, 41859697, 42521462, 43232985, 43845340, 44253788, 44459019, 44568916, 44724605, 44995838, 45346073, 45693850, 45989085, 46234590, 46459426, 46684142, 46901979, 47084409, 47205432, 47261940, 47275075, 47277718, 47300040, 47362424, 47470169, 47600267, 47704315, 47747475]
14478D7747475r719l9632p8301j52747k33206k53126j85814q4029k6321l7937
14468D6646643p9384r6011o2052J3610J16347K57365M54987O77609Q43386Q97911
14458D9670411Q61745P80318O53184M48547J73202j19221l77317n73882p01403
14449E0815584p67348p82312p52941o99002o56023o24006n38065l31432j3091
14440D5651364L34803O21644Q03049Q86815R04450Q86614Q52419Q10016P63357
14431E2514531P01892N91141L94970J12409k04920m83022o71023p49820p26166
14422E1479992o32383n14682m12028l48683l45831m20862n57892o86482p10265
14413D6850884n78826l38057r3319Q1320J81277K27709K23708J62759N7846n0848
$$ y = [47747475, 47737756, 47698124, 47619823, 47467076, 47233870, 46980744, 46794930, 46710901, 46684580, 46646643, 46567259, 46471248, 46409196, 46422806, 46539153, 46796518, 47251505, 47929114, 48772500, 49670411, 50532156, 51312474, 51965658, 52414205, 52587407, 52468186, 52090869, 51516987, 50815584, 50048236, 49265924, 48512983, 47813981, 47157958, 46533952, 45995887, 45664455, 45651364, 45986167, 46607811, 47410860, 48297675, 49202125, 50088739, 50941158, 51751174, 52514531, 53216423, 53807564, 54202534, 54314943, 54110023, 53627001, 52955978, 52206158, 51479992, 50847609, 50332927, 49920899, 49572216, 49226385, 48805523, 48247631, 47561149, 46850884, 46272058, 45934001, 45840682, 45922002, 46103279, 46330988, 46554696, 46717455, 46775301, 46724453]
14403D6724453j12927r1261J0797J30403J78772J26086M6295N7146K06058M18611
14393D7694433N60432N38831L50119O6071k06957l81262m27791l77155k90444
14384D7526277k25566k01796j74670o2757J73166M73634P23897Q54614Q77163
14375D9963962Q33774P56071O67818N85634N06341L97001K08715p1873l93060
14366E3454383o73276q48660q86686p82806n67163l09417r1789L1988N4200J1592
14356D9392366l0046r100R9576K72806M45030N32823M82203L18323J39113L5175
14346E1678269L0080R8454J98941K87077L26483L03111K32965J45261N3853m2777
14336E3311717j32640j84949j81444j28301l2257J06024K65582L95091M40106
$$ y = [46724453, 46611526, 46520265, 46531062, 46661465, 46840237, 46966323, 47012618, 47069764, 47275822, 47694433, 48254865, 48793696, 49143815, 49209886, 49002929, 48621667, 48193876, 47816721, 47526277, 47300711, 47098915, 46924245, 46861488, 47034654, 47508288, 48232185, 49086799, 49963962, 50797736, 51553807, 52221625, 52807259, 53313600, 53710601, 53919316, 53847443, 53454383, 52781107, 51932447, 51045761, 50262955, 49695792, 49386375, 49294586, 49326574, 49380774, 49392366, 49362320, 49353220, 49452796, 49725602, 50170632, 50703455, 51185658, 51503981, 51643094, 51678269, 51708349, 51806803, 52005744, 52292821, 52619304, 52922415, 53155380, 53300641, 53354494, 53311717, 53179077, 52994128, 52812684, 52684383, 52652126, 52758150, 53023732, 53418823, 53858929]
14327E3858929L76752K16720r548k53118m49701n50473n39925m35026k91864j88566
14317E1734180j67921k07531k53232k63427k25895j52117n3560P9472K61012M70678
14307E1221659O50907P47435P46949O72539N46991L81753K08161Q4123M8287R3082
14297E5401886J88538K97454L73627L93074L80130L72451L80051L86934L70324
14288E8544469L17824K37409J52460Q7205N8529P5421J33574K00982K16643J30164
14278F0154680l8399j91661k28607j22785Q2474L32326N84782Q05870R71680J079658
14268F3430018J155438J233109J327737J426605J488548J462685J330588J132618
14260G3987346R46587Q27987P70696P23090O37559N09303L65633K25751Q9186
$$ y = [53858929, 54235681, 54452401, 54442853, 54189735, 53740034, 53189561, 52649636, 52214610, 51922746, 51734180, 51566259, 51358728, 51105496, 50842069, 50616174, 50464057, 50410497, 50489969, 50750981, 51221659, 51872566, 52620001, 53366950, 54039489, 54586480, 54968233, 55176394, 55260517, 55308804, 55401886, 55590424, 55887878, 56261505, 56654579, 57034709, 57407160, 57787211, 58174145, 58544469, 58862293, 59099702, 59252162, 59339367, 59397896, 59473317, 59606891, 59807873, 60024516, 60154680, 60116281, 59924620, 59696013, 59573228, 59655702, 59988028, 60572810, 61378680, 62350360, 63430018, 64585456, 65818565, 67146302, 68572907, 70061455, 71524140, 72854728, 73987346, 74933933, 75761920, 76532616, 77255706, 77893265, 78402568, 78768201, 78993952, 79083138]
14251G9083138l7333j24231j42162q4702M2108K30349M53573O66596Q46239J015330
14241H1948905J200375J368730J438358J352650J120577Q08442N21066L53285
14233I0112388L25444L80865M58971N45415O37523O96440O61606N02535K45306
14224I4566493m6203l09109n10039o28917o34960n27824l87522l30981m07204
14215I0783734n57678o75779o76328n31411k82767k6033J36068J64434J21394
14206H8455634J10465J74412K69325L15494K49124N7764j99430m16245n08300
14197H8508243m70210l74465l16573l46623m41607n46793o39336p29803q12120
14188H3830713q48238p97635o43139l95985q6142K40985N14652O62048O60391
$$ y = [79083138, 79045805, 78921574, 78779412, 78694710, 78736818, 78967167, 79420740, 80087336, 80933575, 81948905, 83149280, 84518010, 85956368, 87309018, 88429595, 89238037, 89759103, 90112388, 90437832, 90818697, 91277668, 91823083, 92460606, 93157046, 93818652, 94321187, 94566493, 94520290, 94211181, 93701142, 93072225, 92437265, 91909441, 91521919, 91190938, 90783734, 90226056, 89550277, 88873949, 88342538, 88059771, 88033738, 88169806, 88334240, 88455634, 88566099, 88740511, 89009836, 89325330, 89574454, 89632218, 89432788, 89016543, 88508243, 88038033, 87663568, 87346995, 87000372, 86558765, 86011972, 85372636, 84642833, 83830713, 82982475, 82184840, 81541701, 81145716, 81059574, 81300559, 81815211, 82477259, 83137650]
14179H3137650N50176M02805K89199K60114L14295L82302L63213J87995j34538
14170H5753211n16627q37505j004923r87372q08167n23868k01317R6346L20615
14161H1290393M58025N41864O22536P11394P58714O92980M89449K08786l6825
14152H5737316j67152j80440j16027N559J82075L79947N29312N78701N29758M27044
14142H7906093L23961K53980K36939K82872L66728M30694M35279L96702L64824
14133I0998072L69145L94164M09497M09769M10910M16250M07744L76450L39001
14124I4531002L03325K46686J50590K6633r8052j92553k25304j71438k4018J79341
14114I4726212L47933L86837K60694J6416k47414m41688n27196n15793m56990
$$ y = [83137650, 83687826, 84090631, 84379830, 84639944, 84954239, 85336541, 85699754, 85887749, 85753211, 85236584, 84399079, 83394156, 82406784, 81598617, 81074749, 80873432, 80969778, 81290393, 81748418, 82290282, 82912818, 83624212, 84382926, 85075906, 85565355, 85774141, 85737316, 85570164, 85389724, 85273697, 85279256, 85461331, 85841278, 86370590, 86949291, 87479049, 87906093, 88230054, 88484034, 88720973, 89003845, 89370573, 89801267, 90236546, 90633248, 90998072, 91367217, 91761381, 92170878, 92580647, 92991557, 93407807, 93815551, 94192001, 94531002, 94834327, 95081013, 95231603, 95258236, 95160184, 94967631, 94742327, 94570889, 94546871, 94726212, 95074145, 95460982, 95721676, 95738092, 95490678, 95048990, 94521794, 94006001, 93549011]
14105I3549011m09934l89658l31599j41824J96550N83759Q78788R97467R42223
14096I5874783P77327N89352M49293L88495L93623M22619M30606L83402K56463
14087I9965963M4793k17843m64681o29161o73818o07299m88719m00343l96145
14078I6132747m72797n93760p25199q43153r31913r89175j014832r89961q97301
14069H8674656p73406p01545p29559q18711q82698q66668p95693p42874p44513
14060H1618989p68406p66658p22907o42984n29567l80464k07601m5360P2475J36701
14050G7764218J55288J36765Q2647j4418j61976l52084n46575o76391o86618n93698
14040G5107158m75559m11563m32963n03730n42610m86206l47759k12859j73321
$$ y = [93549011, 93139077, 92749419, 92417820, 92275996, 92472546, 93056305, 93935093, 94932560, 95874783, 96652110, 97241462, 97690755, 98079250, 98472873, 98895492, 99326098, 99709500, 99965963, 100010756, 99792913, 99328232, 98699071, 98025253, 97417954, 96929235, 96528892, 96132747, 95659950, 95066190, 94340991, 93497838, 92565925, 91576750, 90561918, 89571957, 88674656, 87901250, 87199705, 86470146, 85651435, 84768737, 83902069, 83106376, 82363502, 81618989, 80850583, 80083925, 79361018, 78718034, 78188467, 77808003, 77600402, 77555042, 77627517, 77764218, 77919506, 78056271, 78138918, 78124500, 77962524, 77610440, 77063865, 76387474, 75700856, 75107158, 74631599, 74220036, 73787073, 73283343, 72740733, 72254527, 71906768, 71693909, 71520588]
14031G1520588k47051l51987l82527l25051k80262l59394n62944p70937q42031
14022F7398404p18736m62115j97300k7898O654p4902k25209l92386n22282n73324
14012F4210906n52325n06783m68360m24600l52329k68420k29000k64438l35982
14003F0808669l77836l65150l30136l16382l28226l29911k80182j69841l7695
13994E8273310N8800Q9970N8734l1217j92309m19729o39192p33526o46946m27967
13984E5389928j68168N9595K17801K96654K91788J99150L1358j79208l84202n19234
13974E5235462n26257l95905j82335K1228J28740J13359K5181m7310m6711Q803
13964E4334255N9033P8973R9122J45339J82421J30950o0749l62225o71180q76571
$$ y = [71520588, 71273537, 70921550, 70539023, 70213972, 69933710, 69574316, 69011372, 68240435, 67398404, 66679668, 66217553, 66020253, 65992355, 65999009, 65924107, 65698898, 65306512, 64784230, 64210906, 63658581, 63151798, 62683438, 62258838, 61906509, 61638089, 61409089, 61144651, 60808669, 60430833, 60065683, 59735547, 59419165, 59090939, 58761028, 58480846, 58311005, 58273310, 58332110, 58422080, 58480814, 58449597, 58257288, 57837559, 57198367, 56464841, 55817895, 55389928, 55221760, 55281355, 55499156, 55795810, 56087598, 56286748, 56318106, 56138898, 55754696, 55235462, 54709205, 54313300, 54130965, 54152193, 54280933, 54394292, 54419473, 54372163, 54325452, 54334255, 54393288, 54472261, 54571383, 54716722, 54899143, 55030093, 54969344, 54607119, 53935939, 53059368]
13954E3059368r22375q19137o20275m03495k35682j35701j07270j83285l76179
13945D9255969o20262q15601r03637q81791p74414o12909m44474l33977l09512
13936D3559392l10070k38187o5326J42325K91383L34930K91431K15185J49650
13927D4370713R4092J4667j10775k62649l84878m18383l41014j94752q4688j16202
13917D2566131l00124n34632o85158o74927n27308l50730k65369l04714l93283
13908C8529886m45541m57876m78923n21702n33264m46114k57971o2504J9718m4046
13898C5301663j66267k26429j73935m1629J14624K60229L67085L86972K76724
13889C6099037N3409j99276l87520m69291m66974m31781m06682m11773m42305
$$ y = [53059368, 52136993, 51317856, 50697581, 50294086, 50058404, 49922703, 49815433, 49632148, 49255969, 48635707, 47820106, 46916469, 46034678, 45260264, 44647355, 44202881, 43868904, 43559392, 43249322, 43011135, 42945809, 43088134, 43379517, 43714447, 44005878, 44221063, 44370713, 44464805, 44479472, 44368697, 44106048, 43721170, 43302787, 42961773, 42767021, 42682333, 42566131, 42266007, 41731375, 41046217, 40371290, 39843982, 39493252, 39227883, 38923169, 38529886, 38084345, 37626469, 37147546, 36625844, 36092580, 35646466, 35388495, 35325991, 35345709, 35301663, 35135396, 34908967, 34735032, 34693403, 34808027, 35068256, 35435341, 35822313, 36099037, 36152446, 35953170, 35565650, 35096359, 34629385, 34197604, 33790922, 33379149, 32936844]
13880C2936844m85030n38942o10739o96952p80636q52263r26958j018747j097926
13871B5928651j099469r87799p93464n71678l62743k01483j11969q3455q5233
13862B1631358r6137j01220q0682k4158N5591J46805K63936M22994N97406P21924
13852B3537817P47698O84813N87186N03600M55137M41967M37185L92620K85889
13843B8073912J44041j279j61069l65050o01920q04898q95199q33929o39696l74271
13833B3540642j03989J45882L96610O73993R61629J182939J240179J098828Q31301
13824B9968014N65538L89918L05710K59880K10371J66124J71150K42259L45793
13815C2624757M46460N32665N80661N43639L92914J45273j34695l38312l64515
$$ y = [32936844, 32451814, 31912872, 31302133, 30605181, 29824545, 28972282, 28045324, 27026577, 25928651, 24829182, 23841383, 23047919, 22476241, 22113498, 21912015, 21800046, 21716591, 21631358, 21535221, 21434001, 21353319, 21329161, 21384752, 21531557, 21795493, 22218487, 22815893, 23537817, 24285515, 24970328, 25557514, 26061114, 26516251, 26958218, 27395403, 27788023, 28073912, 28217953, 28216674, 28055605, 27690555, 27088635, 26283737, 25388538, 24554609, 23914913, 23540642, 23436653, 23582535, 23979145, 24653138, 25614767, 26797706, 28037885, 29136713, 29968014, 30533552, 30923470, 31229180, 31489060, 31699431, 31865555, 32036705, 32278964, 32624757, 33071217, 33603882, 34184543, 34728182, 35121096, 35266369, 35131674, 34793362, 34428847]
13806C4428847k15065k1353O2324m536j39254k46551k98853l12750k93910k27730
13796C2731169j08099L6169J50103J89654J43249K6101j32652k99479m46923n66910
13786C1722382o66444p45599p89048p82636p34385o65252n76622m45937k59009
13777B6057450m0878J44050K27806J86523O0793p9908j90244k60589k98878l08014
13767B5498111k73825j85385o4570M4111J08951J27399J17887J01188Q6595P4026
13757B5634488N8032L2996Q795J1096M7888Q1904O3063j6204j19326j96171j95157
13746B5411404q4573J12351L26607M88067N48605M87982L29306J44047J0901m3035
13736B7731662n1926p5632j67974l48709n71349p29271p30415n74107l52255j82409
$$ y = [34428847, 34213782, 34192429, 34254753, 34250217, 34110963, 33864412, 33565559, 33252809, 32958899, 32731169, 32623070, 32659239, 32809342, 32998996, 33142245, 33168346, 33035694, 32736215, 32289292, 31722382, 31055938, 30310339, 29521291, 28738655, 28004270, 27339018, 26762396, 26316459, 26057450, 26016572, 26160622, 26388428, 26574951, 26635744, 26555836, 26365592, 26105003, 25806125, 25498111, 25224286, 25038901, 24974331, 25018442, 25127393, 25254792, 25372679, 25473867, 25560462, 25634488, 25692520, 25725516, 25734311, 25745407, 25793295, 25875199, 25938262, 25922058, 25802732, 25606561, 25411404, 25326831, 25439182, 25765789, 26253856, 26802461, 27290443, 27619749, 27763796, 27774697, 27731662, 27679736, 27604104, 27436130, 27087421, 26516072, 25786801, 25056386, 24482279, 24130024, 23947615]
13726B3947615j21952j32418j28950o8820Q432L8553R923m2878r0307j15790r4851
13715B3208557l565J57784L59471N33985N72241L84573R64m14724o75422p01633
13705B3422231n49362l25073j09786L7995P8133K4298m4154l1594J02664L17162
13695B2922514N28070O69137P15940O82276O08527N29598M45688L48507K59280
13686B7709537K04432J75748J48163J24685J32698J78069K27956K37475J80289
13677B9319052O3721p5030j80488j87634n7161J75064M05458N38696N60054N36147
13667C1097879N56753O74535Q75921J094117J247107J276219J174435R84433P65297
13658C9746696N68253M41902M36702N88557Q87187J252764J549562J644288J492290
$$ y = [23947615, 23825663, 23693245, 23564295, 23495475, 23503907, 23542460, 23552383, 23509505, 23419198, 23303408, 23208557, 23204992, 23362776, 23722247, 24256232, 24828473, 25213046, 25214010, 24799286, 24123864, 23422231, 22872869, 22547796, 22438010, 22476005, 22554138, 22578436, 22534282, 22502688, 22605352, 22922514, 23450584, 24119721, 24835661, 25517937, 26126464, 26656062, 27101750, 27450257, 27709537, 27913969, 28089717, 28237880, 28362565, 28495263, 28673332, 28901288, 29138763, 29319052, 29382773, 29307743, 29127255, 28939621, 28882460, 29057524, 29462982, 30001678, 30561732, 31097879, 31654632, 32329167, 33205088, 34299205, 35546312, 36822531, 37996966, 38981399, 39746696, 40314949, 40756851, 41193553, 41782110, 42669297, 43922061, 45471623, 47115911, 48608201]
13649D8608201J179065Q64102O82636O82181Q26071J047042J285010J483594J585813
13640E8243715J550870J379888J130115Q88198P08825N82247M68311L50033K40851
13631F5543053J55046R1365N2033O2097J38065K49582L41742L68056K89146Q0216
13621F7370401k41257o06671r18202j092371j103983r91082q23487o75549o06202
13612F0311597o28650o96931p42191p35637p05011o75545o14239m55197j78357
13603E4879839J47965L96015M46891K66575o7949m31431p27221r05445r58331
13594E3046908r33409r25464j009729j173223j334586j432983j475405j493880
13586D3268229j477464j376336j167301q86407o04210l85156k58572k25286k92474
$$ y = [48608201, 49787266, 50651368, 51334004, 52016185, 52842256, 53889298, 55174308, 56657902, 58243715, 59794585, 61174473, 62304588, 63192786, 63901611, 64483858, 64952169, 65302202, 65543053, 65698099, 65789464, 65841497, 65903594, 66041659, 66291241, 66632983, 67001039, 67290185, 67370401, 67129144, 66522473, 65604271, 64511900, 63407917, 62416835, 61593348, 60917799, 60311597, 59682947, 58986016, 58243825, 57508188, 56803177, 56127632, 55513393, 55058196, 54879839, 55027804, 55423819, 55870710, 56137285, 56069336, 55637905, 54910684, 54005239, 53046908, 52113499, 51188035, 50178306, 49005083, 47670497, 46237514, 44762109, 43268229, 41790765, 40414429, 39247128, 38360721, 37756511, 37371355, 37112783, 36887497, 36595023]
13577C6595023m66646p05261r06821r65413q42405n84405k79038r953J66344K36272
13567C2237697K25946J76155J09273J5214j08712k05227j96014q3391M1935R6464
13557C2309340O5728j4280r0333j11221n7578L6180J03434R8780M1252R415P7223
13546C2467940K41471M19547N19021N02355L91245K22668J7124k01037l83298
13537C4197036m84379m88749m09923k90235j85239j25564j00394p5842k4680N8034
13527C2070065J65571K86853L88627M15801L37946J93354P1229M5889J26448K56065
13517C4357848L59723L97749L63677K43416K6074k48756n00293o51979o64357
13508C3683102n57816l94888k18663k8714J79296L78394N25051O06250O66793
$$ y = [36595023, 36128377, 35423116, 34516295, 33550882, 32708477, 32124072, 31845034, 31835081, 32001425, 32237697, 32463643, 32639798, 32749071, 32764285, 32655573, 32450346, 32254332, 32170941, 32212876, 32309340, 32375068, 32360788, 32270455, 32159234, 32101656, 32137836, 32241270, 32340050, 32381302, 32390717, 32467940, 32709411, 33128958, 33647979, 34150334, 34541579, 34764247, 34781371, 34580334, 34197036, 33712657, 33223908, 32813985, 32523750, 32338511, 32212947, 32112553, 32036711, 32012031, 32070065, 32235636, 32522489, 32911116, 33326917, 33664863, 33858217, 33929446, 33975335, 34101783, 34357848, 34717571, 35115320, 35478997, 35722413, 35748487, 35499731, 34999438, 34347459, 33683102, 33125286, 32730398, 32511735, 32483021, 32662317, 33040711, 33565762, 34172012, 34838805]
13499C4838805P69330R15052J035178J076386J053985J007076R34421P90864N44512
13490D2965609K33434m8084k24241k87266k81491k58616k36915j90026q7111O1089
13480D1646382K15672L55431M94425O64979Q82094J118419J312503J400700J359161
13471D9449766J221995J061535R52348R28361R64861J009056J007493R10392O90631
13462E8196438L74615L9794k45097m63824o15757o75088o23445m92030l37283
13453E5158323j93194p0271K5236J03143K04287L79203O48034R77479J298460
13444E8530700J550757J698426J717308J613011J449644J324001J302865J385093
13436G0571805J504619J561307J464675J171820P04258J44658l88049p91132j031670
$$ y = [34838805, 35608135, 36523187, 37558365, 38634751, 39688736, 40695812, 41630233, 42421097, 42965609, 43199043, 43150959, 42926718, 42639452, 42357961, 42099345, 41862430, 41672404, 41585293, 41646382, 41862054, 42217485, 42711910, 43376889, 44258983, 45377402, 46689905, 48090605, 49449766, 50671761, 51733296, 52685644, 53614005, 54578866, 55587922, 56595415, 57505807, 58196438, 58571053, 58610847, 58365750, 57901926, 57286169, 56611081, 55987636, 55495606, 55158323, 54965129, 54894858, 54920094, 55023237, 55227524, 55606727, 56254761, 57232240, 58530700, 60081457, 61779883, 63497191, 65110202, 66559846, 67883847, 69186712, 70571805, 72076424, 73637731, 75102406, 76274226, 76978484, 77123142, 76735093, 75943961, 74912291]
13427G4912291j149084j194401j180272j103676r92095q98783q58764q74797r45187
13418F5715232j074877j251846j428324j537016j535806j438108j297617j168662
13410E4982976j069869r71785q26599o12376l54041j12613M6934R2003M7478k0603
13400E1201505o5312r4029j30800j66922j73736j39556p3987k348M0151M4762
13390E0439728M9227Q6722J35583J39530O4015p2177k13886l16361l76471m17744
13380D9518166m51736m60932m16022l00361j15312J16360L42624N02305N62450
13371D9297542N34923M67893M25946M52531N27345N89536O15775O28212O29072
13362E4168775N93167N19306M21591K84712P8891k00379n19827p99303r35223
$$ y = [74912291, 73763207, 72568806, 71388534, 70284858, 69292763, 68393980, 67535216, 66660419, 65715232, 64640355, 63388509, 61960185, 60423169, 58887363, 57449255, 56151638, 54982976, 53913107, 52941322, 52114723, 51502347, 51148306, 51035693, 51082627, 51174630, 51222108, 51201505, 51136193, 51042164, 50911364, 50744442, 50570706, 50431150, 50357163, 50354815, 50394966, 50439728, 50488955, 50575677, 50711260, 50850790, 50914805, 50842628, 50628742, 50312381, 49935910, 49518166, 49066430, 48605498, 48189476, 47889115, 47773803, 47890163, 48232787, 48735092, 49297542, 49832465, 50300358, 50726304, 51178835, 51706180, 52295716, 52911491, 53539703, 54168775, 54761942, 55281248, 55702839, 55987551, 56066442, 55866063, 55346236, 54546933, 53611710]
13353E3611710q97159p73540o69901o07610n54727m93056m16037l04843j41470
13344D8753367O1789K53363L65756L60630K56546J06701n2839k21195l95569n41590
13334D8946959o22078o41422o28212n81798m75768l04511j04724O2263J51389
13325D5802098J51747P1942o0969j91773k55853k18269r5079N5263J62250J74673
13315D5596030P2803j29221l83114o24513q00210q72130q12667o26051l75259
13306D1045668j56585k6966K9266N9609R3680J36349J77265J95670J83740J65017
13296D1902713J57189J35107O5015n2636j97188l48085m73418n29440m92668l93273
13286C9773316l06372k93608l58778m69204n96862p33048q86084j055331j190544
$$ y = [53611710, 52714551, 51941011, 51271110, 50663500, 50108773, 49615717, 49199680, 48894837, 48753367, 48815156, 49068519, 49434275, 49794905, 50051451, 50158152, 50105313, 49884118, 49488549, 48946959, 48324881, 47683459, 47055247, 46473449, 45997681, 45693170, 45588446, 45650709, 45802098, 45953845, 46025787, 45964818, 45773045, 45517192, 45298923, 45203844, 45259107, 45421357, 45596030, 45668833, 45539612, 45156498, 44531985, 43731775, 42859645, 42046978, 41420927, 41045668, 40889083, 40862117, 40891383, 40950992, 41044672, 41181021, 41358286, 41553956, 41737696, 41902713, 42059902, 42195009, 42260024, 42207388, 42010200, 41662115, 41188697, 40659257, 40166589, 39773316, 39466944, 39173336, 38814558, 38345354, 37748492, 37015444, 36129360, 35074029, 33883485]
13277C3883485j206483j060600p97616n04384k32579K1010K69790M98277O66070
13268C1536970P39291P11059N88626L87030J49348n4673j75315k21622k33481
13259C3427233k23913j64395k8407J59230L36902M58403N17503N34544N23375
13250C5540475M85190M26105L44926K18036L2567j76416l45792m29257l99567
13241C5696267k29018Q2769M66779Q09803J024791J080589R76154P21867L56258
13232D0986259n3959m46820p77678j005282j088248j012185q20938n94660l93366
13223C4793123k31073r2214L4427J45148K43025L44077M53679N51812O08906O07168
13213C7458078N41912M15318K40413M9088j14888k17074k45955k06908j12375
$$ y = [33883485, 32677002, 31616402, 30818786, 30314402, 30081823, 30102833, 30372623, 30870900, 31536970, 32276261, 32987320, 33575946, 33962976, 34112324, 34057651, 33882336, 33660714, 33427233, 33203320, 33038925, 33010518, 33169748, 33506650, 33965053, 34482556, 35017100, 35540475, 36025665, 36451770, 36796696, 37014732, 37047299, 36870883, 36525091, 36095834, 35696267, 35467249, 35550018, 36016797, 36826600, 37851391, 38931980, 39908134, 40630001, 40986259, 40932300, 40485480, 39707802, 38702520, 37614272, 36602087, 35781149, 35186489, 34793123, 34562050, 34469836, 34504263, 34649411, 34892436, 35236513, 35690192, 36242004, 36850910, 37458078, 37999990, 38415308, 38655721, 38704809, 38589921, 38372847, 38126892, 37919984, 37807609]
13204C7807609J3963J26356J65128R1000q5633l13520n36257p12037q09361q12146
13194C4935102p38127o41961n88973o04510o44001o23535m83812k32621O5600
13185C0443162L31574M97301N23446M35787L25839K75195K89747L24682L49393
13176C3796126L64158L75645L88057M09621M39560M52698M16171L10020J34104
13167C7086160q7325l21121n42039p22312q29912q50921p88386o34028l78993
13158C1931123n2110K86995N83211P89395Q64736Q04513O51676M62066K68346
13149C6589951Q0438q8803k08667k55213k49269k41194k53750k61329k13745p1086
13139C4827333J51615L65070M62029M00229K31024N4554n2959p1011j9575N8183
$$ y = [37807609, 37821572, 37947928, 38113056, 38204056, 38118423, 37804903, 37268646, 36556609, 35747248, 34935102, 34196975, 33555014, 32966041, 32361531, 31717530, 31093995, 30610183, 30377562, 30443162, 30774736, 31272037, 31795483, 32231270, 32557109, 32832304, 33122051, 33446733, 33796126, 34160284, 34535929, 34923986, 35333607, 35773167, 36225865, 36642036, 36952056, 37086160, 36998835, 36677714, 36135675, 35413363, 34583451, 33732530, 32944144, 32310116, 31931123, 31879013, 32166008, 32749219, 33538614, 34403350, 35207863, 35859539, 36321605, 36589951, 36670389, 36581586, 36372919, 36117706, 35868437, 35627243, 35373493, 35112164, 34898419, 34827333, 34978948, 35344018, 35806047, 36206276, 36437300, 36491854, 36438895, 36367884, 36348309, 36406492]
13129C6406492J04880P0793n3796k22943l72114m82307n80918o83008p61495p78232
13119C2647352p39054p04201p25264p82210q03612p36717n84497l85003j79027
13110B7007767j0329P7412Q0460M8763K7177k301r6163k77318n01009o88815p93519
13099B4872125q18264p75019o57970m58796j86719J16897L73375N02382M79289
13090B3447300L40124J45588m3415j81101k44412k40690k09738j91803j88420
13081B2633433j68187j10983k8822O1170J63891K96933M46760N40349M93343K95554
13071B4623441K6909k08640l49364l87236l35188k04591j5648J86346L25904L26869
13061B3988802J87287J5457m3370P4001K99417N00878N86260N37921L79978J56151
$$ y = [36406492, 36511372, 36582165, 36528369, 36305426, 35933312, 35451005, 34870087, 34187079, 33425584, 32647352, 31908298, 31204097, 30478833, 29696623, 28893011, 28156294, 27571797, 27186794, 27007767, 26997438, 27074850, 27155310, 27204073, 27231250, 27228949, 27132786, 26855468, 26354459, 25665644, 24872125, 24053861, 23278842, 22620872, 22162076, 21975357, 22092254, 22465629, 22968011, 23447300, 23787424, 23933012, 23889597, 23708496, 23464084, 23223394, 23013656, 22821853, 22633433, 22465246, 22354263, 22325441, 22386611, 22550502, 22847435, 23294195, 23834544, 24327887, 24623441, 24650350, 24441710, 24092346, 23705110, 23369922, 23165331, 23149683, 23336029, 23661933, 23988802, 24176089, 24191546, 24148176, 24222177, 24521594, 25022472, 25608732, 26146653, 26526631, 26682782]
13051B6682782o9055k39073l36786l64244l19270k13815q3260L7762J28378J67156
13041B5390575J38263O4212j0125p5426j50675k21180k29630j26579Q5204L44812
13031B5209451N71296P16487P81176P79896P00830N22608K65928N849j69731k15746
13021B9168044j54668n5606R248J2545j2892k8624m7910j14461k37911l75929
13011B8161836m86093n66255o29058o78110p21590p73085q43458r48246j100943
13002B1414998j281278j425577j461629j351680j112310p98605m61563j28052
12994A3394304J72874L85996M66375M50931M46492N04057N58384N26989M05479
12985A7311881K41428P0819r0242k28756l39847m31801n11461n72264o07489o34427
$$ y = [26682782, 26613727, 26374654, 26037868, 25673624, 25354354, 25140539, 25057279, 25095041, 25223419, 25390575, 25528838, 25593050, 25582925, 25507499, 25356824, 25135644, 24906014, 24779435, 24864639, 25209451, 25780747, 26497234, 27278410, 28058306, 28759136, 29281744, 29547672, 29553521, 29383790, 29168044, 29013376, 28957770, 28967018, 28979563, 28966671, 28938047, 28890137, 28775676, 28537765, 28161836, 27675743, 27109488, 26480430, 25802320, 25080730, 24307645, 23464187, 22515941, 21414998, 20133720, 18708143, 17246514, 15894834, 14782524, 13983919, 13522356, 13394304, 13567178, 13953174, 14419549, 14870480, 15316972, 15821029, 16379413, 16906402, 17311881, 17553309, 17624128, 17533886, 17305130, 16965283, 16533482, 16022021, 15449757, 14842268, 14207841]
12975A4207841o81569p40902p54909o71064n06375l37527k20658j41500n1156
12966A0102181O9249J94517K91271L33069K81344J14960r6699k17716j74301k0708
12956A0877167J30732K13762K36802K32003K14990K08059K46906L36192M36326
12947A3132939N07810N52926O07367O99412Q22443R38211R90548R23383P24248
12938A9899287M52701J87942n0023k93758n57067q02942r60345r56600p63614
12929A6155581m23700k7603L31337N86104O95850O40028M25013J00811k41366
12920A8242055n08529o59532p16490p14183o57686n38490l75090k29677j74825
12911A3667553k33069l64765n11232o22639o60451o21092n49713m96816m76001
$$ y = [14207841, 13526272, 12785370, 12030461, 11359397, 10853022, 10515495, 10294837, 10153337, 10102181, 10171430, 10365947, 10657218, 10990287, 11271631, 11386591, 11289892, 11072176, 10897875, 10877167, 11007899, 11221661, 11458463, 11690466, 11905456, 12113515, 12360421, 12696613, 13132939, 13640749, 14193675, 14801042, 15500454, 16322897, 17261108, 18251656, 19175039, 19899287, 20351988, 20539930, 20489907, 20196149, 19639082, 18836140, 17875795, 16919195, 16155581, 15731881, 15704278, 16035615, 16621719, 17317569, 17957597, 18382610, 18483421, 18242055, 17733526, 17073994, 16357504, 15643321, 14985635, 14447145, 14072055, 13842378, 13667553, 13434484, 13069719, 12558487, 11935848, 11275397, 10654305, 10104592, 9607776, 9131775]
12902I131775m69262m48971m11395m03913m80311o17310p05651o29956l56475
12893D608531L6055L96488N92431N93317M74615L42689K52885J90014J26927Q4428
12883G698380J05578J94815L03108L63017L51335L16460L16195L43998L35832
12874A0328718K31694L0871j95693l48993l80312l38325l19550l66839m40131
12865H201440m80410m62873l87594k64205j19091J5971J34959K56137L90644N23235
12855G808213O07396N76929L92381Q9459k38370n06415o74085p37114p10600o15675
12845E992119m80044l47928k66539k58718l13854l94063m46799m26811l32446
12836B724917k20459j56820j56675j87068k16007k40082k53653k10752n3604K17152
$$ y = [9131775, 8662513, 8213542, 7802147, 7398234, 6917923, 6300613, 5594962, 4965006, 4608531, 4644586, 5041074, 5633505, 6226822, 6701437, 7044126, 7297011, 7487025, 7613952, 7698380, 7803958, 7998773, 8301881, 8664898, 9016233, 9332693, 9648888, 9992886, 10328718, 10560412, 10591283, 10395590, 10046597, 9666285, 9327960, 9008410, 8641571, 8201440, 7721030, 7258157, 6870563, 6606358, 6487267, 6503238, 6638197, 6894334, 7284978, 7808213, 8415609, 8992538, 9384919, 9474378, 9236008, 8729593, 8055508, 7318394, 6607794, 5992119, 5512075, 5164147, 4897608, 4638890, 4325036, 3930973, 3484174, 3057363, 2724917, 2504458, 2347638, 2190963, 2003895, 1787888, 1547806, 1294153, 1083401, 1029797, 1246949]
12826A246949N28851P91735R44394R66697Q78029P13881N01274K68831O1270q6908
12816F815003j82026k56069l38582m42687n51339o15563n80577m29258k10025
12807C208877j2524R5113J11023Q9326R5878J64409K70314L44501L26256K14279
12797D907452O2516q1729k15278l47159m60099n12243m68557l39467j81052n0568
12787B313816K1018L0039j129m5224j03511k07483l83288o09485q10928r08450
12777g04625q71240p22350n11997k82961n1156J70806L43653M29732M37968M07616
12767a354554L53904K55964J06013m6906j19461n4279J40311L88221N87017O69978
12757I26208O37516N45208M69280M62782N19492N77804N73438M95265L75624K32802
$$ y = [1246949, 1775800, 2567535, 3511929, 4478626, 5356655, 6070536, 6571810, 6840641, 6901911, 6815003, 6632977, 6376908, 6038326, 5595639, 5044300, 4428737, 3848160, 3418902, 3208877, 3196353, 3291466, 3402489, 3491815, 3587693, 3752102, 4022416, 4366917, 4693173, 4907452, 4969968, 4888239, 4672961, 4325802, 3865703, 3353460, 2884903, 2545436, 2364384, 2313816, 2334834, 2364873, 2363744, 2318520, 2215009, 2007526, 1624238, 1014753, 203825, -704625, -1575865, -2298215, -2810212, -3093173, -3144329, -2973523, -2629870, -2200138, -1762170, -1354554, -1000650, -744686, -638673, -685579, -805040, -859319, -719008, -330787, 256230, 926208, 1563724, 2108932, 2578212, 3040994, 3560486, 4138290, 4711728, 5206993, 5582617, 5815419]
12747E815419N7913j49936l59285n07432n33342m35806k90415j83950j37557j10651
12737C164958o9830k3366J068j7560p6714j48039k06931k55635k97479l12877
12727A757595k83633k14065j15048O176J28865K11362K16557J33752k3651k15678
12717A602232l77311m55329m44793l79375k95444k14271j46070q8602l0232L0487
12707g98708P8015R0998N6017k0876j14357j95566k52411k91910l18426l16613
12697b083837k54852j06523J08017L11548M25740M22129L26155J95292P8541j6684
12687e94474j04535j78379j98356j15503P9214L30002N56482P13147P98292Q11461
12677B097351P30863N52210L30943J70633J60828K96770M61062N21251M40527
$$ y = [5815419, 5873332, 5723396, 5364111, 4856679, 4323337, 3887531, 3597116, 3413166, 3275609, 3164958, 3095128, 3071762, 3072830, 3055270, 2978556, 2830517, 2623586, 2367951, 2070472, 1757595, 1473962, 1259897, 1144849, 1151025, 1279890, 1491252, 1707809, 1841561, 1817910, 1602232, 1224921, 769592, 324799, -54576, -350020, -564291, -710361, -798963, -829195, -798708, -720693, -629695, -573678, -594554, -708911, -904477, -1156888, -1448798, -1767224, -2083837, -2338689, -2445212, -2337195, -2025647, -1599907, -1177778, -851623, -656331, -577790, -594474, -699009, -877388, -1075744, -1191247, -1112033, -782031, -225549, 487598, 1285890, 2097351, 2828214, 3380424, 3711367, 3882000, 4042828, 4339598, 4800660, 5321911, 5762438]
12668E762438K76087J01465m4242j55299k36943k89442l06366k85365k40553k03672
12658D378108k11822k83389m00603n13668n56141m83128l22075j62062q0233r4822
12648A270165j78226k88345l80930m16219l72708k45509m3999J84910L59095M29877
12638C18111M35802M54302M99467M88257L29717M5506k25554l43427k66560n8261
12628A677360J63523K90726K77259J50080k8688k14830m04378o13786q35983j017012
12618e55729j090105j037688r05425p55373o15731m75756l27479j97241j19983
12609f080510r6875r2650o1336K6287J68413L36218M85590N72560N67063M66777
12599c708463L17301J93984J41483J43608J48842J19177O2605K4104L6086P0212
$$ y = [5762438, 6038525, 6139990, 6095748, 5940449, 5703506, 5414064, 5107698, 4822333, 4581780, 4378108, 4166286, 3882897, 3482294, 2968626, 2412485, 1929357, 1607282, 1445220, 1364987, 1270165, 1091939, 803594, 422664, 6445, -366263, -611772, -655771, -470861, -111766, 318111, 753913, 1208215, 1707682, 2195939, 2525656, 2571162, 2345608, 2002181, 1735621, 1677360, 1840883, 2131609, 2408868, 2558948, 2530260, 2315430, 1911052, 1297266, 461283, -555729, -1645834, -2683522, -3588947, -4344320, -4960051, -5435807, -5763286, -5960527, -6080510, -6177385, -6270035, -6331371, -6305084, -6136671, -5800453, -5314863, -4742303, -4175240, -3708463, -3391162, -3197178, -3055695, -2912087, -2763245, -2644068, -2581463, -2557359, -2521273, -2451061]
12589b451061N7027l3959j48995j97641j36979J4230K31267N03179P93913J036344
12579c32675J177098J194107J088506Q95149O79983M99237L59191K21728N5395
12570E837719j23539k66259l46446l90064m32472m74702m99774m85625m05376
12561B413462k51741n2405J48041L28166N06697O99932Q82209J008850J057574
12552F740785J032424R43166P97195O06247L89061J71543p386j03576q8544K8228
12542A0509143J79279K66671K38117J16563m8242k28009m13759n86639p17708
12533I315416q07680q94506r99586j092327j119154j057893r48707q72266q87645
12524F35652r83624j082661j100282j010980q47354o40278l88467q7150K36090
$$ y = [-2451061, -2394034, -2427993, -2576988, -2774629, -2911608, -2897378, -2666111, -2162932, -1369019, -332675, 844423, 2038530, 3127036, 4022185, 4702168, 5201405, 5560596, 5782324, 5837719, 5714180, 5447921, 5101475, 4711411, 4278939, 3804237, 3304463, 2818838, 2413462, 2161721, 2109316, 2257357, 2585523, 3092220, 3792152, 4674361, 5683211, 6740785, 7773209, 8716375, 9513570, 10119817, 10508878, 10680421, 10673035, 10569459, 10480915, 10509143, 10688422, 10955093, 11193210, 11309773, 11261531, 11033522, 10619763, 10033124, 9315416, 8507736, 7613230, 6613644, 5521317, 4402163, 3344270, 2395563, 1523297, 635652, -347972, -1430633, -2530915, -3541895, -4389249, -5029527, -5417994, -5505144, -5269054]
12515e269054N14354O67703O64320N70276N09157N55026O73334P71627P97036
12506D53779P73670P50238P32872O95435O40903O04284N99301O00080N64467M61480
12496F876509K94321J02242o5182j73135k05648j55190j9099J88123M21738O05901
12486G870580O63889N73708L91108K14411J34354J96537L66206N34132N93649
12477A1538574N13788L38897J35235n1419j92655k70083k95588l15803l71964
12468A1028982m59226n32003n47208n01546m32786l84829l63388l21958j96144
12459G289894L8213L37696O22681Q30859R39185R43897Q45290O65938M59790K74428
12449A3247871J12198n8937k66176m93973o76093p48819p17215o44996n85463
$$ y = [-5269054, -4754700, -4086997, -3422677, -2852401, -2343244, -1788218, -1114884, -343257, 453779, 1227449, 1977687, 2710559, 3405994, 4046897, 4651181, 5250482, 5850562, 6415029, 6876509, 7170830, 7273072, 7207890, 7034755, 6829107, 6673917, 6654818, 6842941, 7264679, 7870580, 8534469, 9108177, 9499285, 9713696, 9848050, 10044587, 10410793, 10944925, 11538574, 12052362, 12391259, 12526494, 12475075, 12282420, 12012337, 11716749, 11400946, 11028982, 10569756, 10037753, 9490545, 8988999, 8556213, 8171384, 7807996, 7486038, 7289894, 7328107, 7665803, 8288484, 9119343, 10058528, 11002425, 11847715, 12513653, 12973443, 13247871, 13360069, 13301132, 13034956, 12540983, 11864890, 11116071, 10398856, 9753860, 9168397]
12440I168397n43925m97396m30586l61498l42442m14094n50110o79018p54997
12431D594331p74895p51837o95304n99839m57280k82628j09282L7772J47327K04834
12421A313199J80634M9668j62411l70870m86329m67542l25304r3588K00736N46055
12411C84248R23134J278787J534509J624629J525650J263112R18267O14725M45375
12402A0512436M01672L91168L22893J72329k4018k15867l74404m81766m96236
12393A0208207l71033j23606J46659L18064L24945J98971L3254j01740k01857
12384A0431864k98974m08374n10582n67430n48619m55848l27017k15454j57353
12375F942213j43044j19556l3730J22771L10944M73709N59204N34027L87883J40825
$$ y = [9168397, 8624472, 8127076, 7696490, 7334992, 6992550, 6578456, 6028346, 5349328, 4594331, 3819436, 3067599, 2372295, 1772456, 1315176, 1032548, 923266, 961038, 1108365, 1313199, 1493833, 1543501, 1381090, 1010220, 523891, 56349, -268955, -362543, -161807, 384248, 1307382, 2586169, 4120678, 5745307, 7270957, 8534069, 9452336, 10067061, 10512436, 10914108, 11305276, 11628169, 11800498, 11776480, 11560613, 11186209, 10704443, 10208207, 9837174, 9713568, 9860227, 10178291, 10503236, 10702207, 10735461, 10633721, 10431864, 10132890, 9724516, 9213934, 8646504, 8097885, 7642037, 7315020, 7099566, 6942213, 6799169, 6679613, 6645883, 6768654, 7079598, 7553307, 8112511, 8646538, 9034421, 9175246]
12365I175246j36375l46003m39976m39611l80118k86423k01997j95690l18376
12356F430677n48904p81628q84815p96062n59222k62890K9121K81952M73979O00933
12346C983141O79908P35532P78268Q02142Q06090Q09721Q38955R01310R75080
12337A1310147J010444R57093P97870N41478K09086j51038m64283o65399p37430
12328A2807968p20545o82233o70823o96109p55824q60552j014827j184926j303716
12319D918413j311061j179205r14564n66793k26761J1633J04406Q7308M9890O4245
$$ y = [9175246, 9038871, 8692868, 8252892, 7813281, 7433163, 7146740, 6944743, 6749053, 6430677, 5881773, 5100145, 4215330, 3419268, 2860046, 2597156, 2626277, 2908229, 3382208, 3983141, 4663049, 5398581, 6176849, 6978991, 7785081, 8594802, 9433757, 10335067, 11310147, 12320591, 13277684, 14075554, 14617032, 14826118, 14675080, 14210797, 13545398, 12807968, 12087423, 11405190, 10734367, 10038258, 9282434, 8421882, 7407055, 6222129, 4918413, 3607352, 2428147, 1513583, 946790, 720029, 731662, 836068, 923376, 973266, 1037511]
$$ [...]
##END NTUPLES=NMR SPECTRUM
##END=
