##TITLE=dept_IPACAT-34D CH-,CH3- -up, CH2- -down
 CDCl3, 2100 sc
 2.11.2023
##JCAMPDX= 6.0         $$ Bruker NMR JCAMP-DX V2.0
##DATA TYPE= NMR SPECTRUM
##DATA CLASS= NTUPLES
##ORIGIN= UXNMR, Bruker Analytische Messtechnik GmbH
##OWNER= root
$$ XWIN-NMR		Version 3.5
$$ Thu Nov  2 16:50:42 2023 Russian Standard Time (UT+4h)  she@DPX200
##.OBSERVE FREQUENCY= 50.327992884445
##.OBSERVE NUCLEUS= ^13C
##.ACQUISITION MODE= SIMULTANEOUS
##.ACQUISITION SCHEME= undefined
##.AVERAGES= 3102
##.DIGITISER RES= 17
##SPECTROMETER/DATA SYSTEM= spect
##.PULSE SEQUENCE= dept135
##.SOLVENT NAME= CDCl3
##.SHIFT REFERENCE= (INTERNAL, CDCl3, 0, 214.665)
##AUDIT TRAIL= $$ (NUMBER, WHEN, WHO, WHERE, WHAT)
$$ ##TITLE= Audit trail, XWIN-NMR		Version 3.5
$$ ##JCAMPDX= 5.01
$$ ##ORIGIN= Bruker BioSpin GmbH
$$ ##OWNER= she
$$ F:/spectra/data/she/nmr/depta/1/pdata/1/auditp.txt
$$ ##AUDIT TRAIL=  $$ (NUMBER, WHEN, WHO, WHERE, WHAT)
(   1,<2023-11-02 16:48:12.48 +0400>,<she>,<DPX200>,
      <created by zg, POWCHK disabled, PULCHK disabled
       terminated by command 'halt'
       configuration hash MD5:
       00 E9 B6 7A A2 85 ED C7 34 08 36 98 17 FE 4E 26
       data hash MD5: 16K
       65 9D 58 CB 35 43 E0 54 D0 47 12 A5 93 3B 26 0C>)
(   2,<2023-11-02 16:49:07.56 +0400>,<she>,<DPX200>,
      <Start of raw data processing
       efp BC_mod = 2 LB = 3.5 FT_mod = 6 PKNL = 1 PHC0 = -3701.435 PHC1 = -1046.4 SI = 16K 
       data hash MD5: 16K
       B5 2D 10 AA 40 B2 4F 1A DB CA BC B8 75 5B D0 88>)
(   3,<2023-11-02 16:49:41.62 +0400>,<she>,<DPX200>,
      <pk PHC0 = 177.7573 PHC1 = -442.1999 
       data hash MD5: 16K
       45 F0 6B 89 0E 5E 01 1F 22 72 8B 35 D8 9F F2 AF>)
$$ ##END=
$$ 
$$ hash MD5
$$ FA 73 5A 65 D0 A0 61 F0 F3 58 24 64 61 7E 0B 26
##$RELAX= 
##$RELAX= 
##$RELAX= 
##$RELAX= 
##$RELAX= 
##$RELAX= 
##$RELAX= 
##$RELAX= 
$$ Bruker specific parameters
$$ --------------------------
##$DU= <F:/spectra>
##$EXPNO= 1
##$NAME= <depta>
##$PROCNO= 1
##$TYPE= <nmr>
##$USER= <she>
##$AMP= (0..31)
100 100 100 100 100 100 100 100 100 100 100 100 100 100 100 100 100 100 
100 100 100 100 100 100 100 100 100 100 100 100 100 100 
##$AQSEQ= 0
##$AQ_mod= 1
##$AUNM= <au_zg>
##$AUTOPOS= <>
##$BF1= 50.322709
##$BF2= 200.13
##$BF3= 200.13
##$BF4= 200.13
##$BF5= 200.13
##$BF6= 200.13
##$BF7= 200.13
##$BF8= 200.13
##$BYTORDA= 1
##$CFDGTYP= 0
##$CFRGTYP= 5
##$CHEMSTR= <none>
##$CNST= (0..31)
1 1 145 1 1 1 1 1 1 1 1 1 1 1 1 1 1 1 1 1 1 1 1 1 1 1 1 1 1 1 1 1 
##$CPDPRG= <>
##$CPDPRG1= <waltz16>
##$CPDPRG2= <waltz16>
##$CPDPRG3= <>
##$CPDPRG4= <mlev>
##$CPDPRG5= <mlev>
##$CPDPRG6= <mlev>
##$CPDPRG7= <mlev>
##$CPDPRG8= <mlev>
##$CPDPRGB= <>
##$CPDPRGT= <>
##$D= (0..31)
0 2 0.003448276 0 0 0 0 0 0 0 0 0 2e-05 0 0 0 0 0 0 0 0 0 0 0 0 0 0 0 
0 0 0 0 
##$DATE= 1698929225
##$DBL= (0..7)
120 120 120 120 120 120 120 120 
##$DBP= (0..7)
150 150 150 150 150 150 150 150 
##$DBP07= 0
##$DBPNAM0= <>
##$DBPNAM1= <>
##$DBPNAM2= <>
##$DBPNAM3= <>
##$DBPNAM4= <>
##$DBPNAM5= <>
##$DBPNAM6= <>
$$ [...]
##$SUBNAM1= <"">
##$SUBNAM2= <"">
##$SUBNAM3= <"">
##$SUBNAM4= <"">
##$SUBNAM5= <"">
##$SUBNAM6= <"">
##$SUBNAM7= <"">
##$SUBNAM8= <"">
##$SUBNAM9= <"">
##$SW= 219.3118970423
##$SWIBOX= (0..15)
0 1 3 0 0 0 0 0 0 0 0 0 0 0 0 0 
##$SW_h= 11037.527593819
##$TD= 16384
##$TD0= 1
##$TE= 0
##$TE2= 300
##$TE3= 300
##$TEG= 300
##$TL= (0..7)
120 120 120 120 120 120 120 120 
##$TP= (0..7)
150 150 150 150 150 150 150 150 
##$TP07= 0
##$TPNAME0= <>
##$TPNAME1= <>
##$TPNAME2= <>
##$TPNAME3= <>
##$TPNAME4= <>
##$TPNAME5= <>
##$TPNAME6= <>
##$TPNAME7= <>
##$TPOAL= (0..7)
0.5 0.5 0.5 0.5 0.5 0.5 0.5 0.5 
##$TPOFFS= (0..7)
0 0 0 0 0 0 0 0 
##$TUNHIN= 0
##$TUNHOUT= 0
##$TUNXOUT= 0
##$USERA1= <user>
##$USERA2= <user>
##$USERA3= <user>
##$USERA4= <user>
##$USERA5= <user>
##$V9= 5
##$VALIST= <valist>
##$VCLIST= <CCCCCCCCCCCCCCC>
##$VD= 0
##$VDLIST= <DDDDDDDDDDDDDDD>
##$VPLIST= <PPPPPPPPPPPPPPP>
##$VTLIST= <TTTTTTTTTTTTTTT>
##$WBST= 1024
##$WBSW= 2
##$XGAIN= (0..3)
0 0 0 0 
##$XL= 0
##$YL= 0
##$YMAX_a= 713059
##$YMIN_a= -686824
##$ZGOPTNS= <>
##$ZL1= 120
##$ZL2= 120
##$ZL3= 120
##$ZL4= 120
##$ABSF1= 0
##$ABSF2= 0
##$ABSG= 0
##$ABSL= 0
##$ALPHA= 0
##$AQORDER= 0
##$ASSFAC= 0
##$ASSFACI= 0
##$ASSFACX= 0
##$ASSWID= 0
##$AUNMP= <proc_1d>
##$AZFE= 0.1
##$AZFW= 0.1
##$BCFW= 0
##$BC_mod= 2
##$BYTORDP= 0
##$COROFFS= 0
##$CY= -3
##$DATMOD= 1
##$DC= 0
##$DFILT= <>
##$DTYPP= 0
##$F1P= 0
##$F2P= 0
##$FCOR= 0.5
##$FTSIZE= 16384
##$FT_mod= 6
##$GAMMA= 0
##$GB= 0
##$INTBC= 1
##$INTSCL= 0
##$ISEN= 128
##$LB= 3.5
##$LEV0= 0
##$LPBIN= 0
##$MAXI= 10000
##$MC2= 0
##$MEAN= 0
##$ME_mod= 0
##$MI= 0.4000791
##$NCOEF= 0
##$NC_proc= -3
##$NLEV= 6
##$NOISF1= 120.0001
##$NOISF2= 80.00006
##$NSP= 0
##$NTH_PI= 0
##$NZP= 0
##$OFFSET= 214.6655
##$PC= 4
##$PHC0= -3523.678
##$PHC1= -1488.6
##$PH_mod= 1
##$PKNL= yes
##$PPARMOD= 0
##$PSCAL= 0
##$PSIGN= 0
##$REVERSE= no
##$SF= 50.3227091
##$SI= 16384
##$SIGF1= 140
##$SIGF2= 120
##$SINO= 80
##$SIOLD= 32768
##$SREGLST= <13C.CDCl3>
##$SSB= 0
##$STSI= 16384
##$STSR= 0
##$SW_p= 11037.527593819
##$SYMM= 0
##$S_DEV= 0
##$TDeff= 16384
##$TDoff= 0
##$TI= <>
##$TILT= no
##$TM1= 0
##$TM2= 0
##$TOPLEV= 0
##$USERP1= <user>
##$USERP2= <user>
##$USERP3= <user>
##$USERP4= <user>
##$USERP5= <user>
##$WDW= 1
##$XDIM= 16384
##$YMAX_p= 354922895
##$YMIN_p= -51627310
$$ End of Bruker specific parameters
$$ ---------------------------------
##NTUPLES= NMR SPECTRUM
##VAR_NAME=  FREQUENCY,     SPECTRUM/REAL,   SPECTRUM/IMAG
##SYMBOL=    X,             R,               I
##VAR_TYPE=  INDEPENDENT,   DEPENDENT,       DEPENDENT
##VAR_FORM=  AFFN,          ASDF,            ASDF
##VAR_DIM=   16384,         16384,           16384
##UNITS=     HZ,            ARBITRARY UNITS, ARBITRARY UNITS
##FACTOR=    0.67371834180669, 1,            1
##FIRST=     10802.5493505904, 0,            0
##LAST=      -234.978243228581, 0,           0
##MIN=       -234.978243228581, -51627310,   0
##MAX=       10802.5493505904, 354922895,    0
$$ Real data points
##PAGE= N=1
##DATA TABLE= (X++(R..R)), XYDATA
$$ [...]
$$ plain form
12064 4174401 1648574 -795066 -2378677 -5996603 -11317190 -13825839 -12055968 -7763294
12056 -7763294 -4049383 -2103681 -721173 1378134 4502616 7469673 8887907 9493155
12048 9493155 10073599 9539690 7940631 6850656 5115519 978692 -5443734 -11769278
12040 -11769278 -15399667 -16966036 -18864965 -20837860 -20286512 -17329256 -14997797 -15828757
12032 -15828757 -18491328 -19814260 -18567706 -15165713 -10889818 -7736371 -6263964 -5746819
12024 -5746819 -4039745 549282 6045651 9524747 10912804 12080873 13237666 12785886
12016 12785886 8638421 746162 -5869765 -6016202 -782436 3160719 2506406 -470058
12008 -470058 -2336861 -2077960 -572483 1146216 1540549 757385 307900 1622168 6427865
$$ packed form
12064D174401k525827k443640j583611l617926n320587k508649J769871M292674
12056g763294L713911J945702J382508K099307L124482K967057J418234O05248
12048I493155N80444n33909j599059j089975j735137m136827o422426o325544
12040a1769278l630389j566369j898929j972895N51348K957256K331459q30960
12032a5828757k662571j322932J246554L401993M275895L153447J472407N17145
12024e746819J707074M589027N496369L479096J388057J168069J156793m51780
12016A2785886m147465p892259o615927j46437N233766L943155o54313k976464
12008d70058j866803K58901J505477J718699L94333p83164m49485J314268M805697
$$ plain form
11999 6427865 13512002 19971299 25121918 28455717 28967326 27247867 24697439 22925918
11991 22925918 21675160 18608212 12145853 4207396 -3633675 -11540444 -17845092 -20442699
11983 -20442699 -20434904 -21453485 -23860583 -25325467 -23265670 -18129295 -12790967 -8789141
11975 -8789141 -6630026 -5600247 -6364344 -8660840 -10590339 -11647142 -12459858 -13321499 -12780132
11966 -12780132 -10382946 -8955606 -10348239 -12922727 -15227781 -16556461 -16462606 -15044103
11958 -15044103 -12182858 -8193941 -2658090 2293046 4723446 5696425 5492551 2813946
11950 2813946 -782931 -2848532 -3749857 -2266288 2382594 7688954 10885338 11046411
11942 11046411 6972169 1967171 660476 1126317 -1126666 -6085035 -10581348 -12126273
$$ packed form
11999F427865P084137O459297N150619L333799N11609j719459k550428j771521
11991B2925918j250758l066948o462359p938457p841071p906769o304648k597607
11983b0442699P795j018581k407098j464884K059797N136375N338328M001826
11975h789141K159115J029779p64097k296496j929499j056803q12716q61641N41367
11966a2780132K397186J427340j392633k574488k305054j328680R3855J418503
11958a5044103K861245L988917N535851M951136K430400R72979k03874k678605
11950B813946l596877k065601r01325J483569M648882N306360L196384J61073
11942A1046411m074242n004998j306695M65841k252983m958369m496313j544925
$$ plain form
11934 -12126273 -10338832 -7143402 -4889728 -4036510 -3597091 -2752428 -121079 3603916
11926 3603916 7744525 11895739 15016908 16774943 16303043 13970991 10976453 6623233
11918 6623233 713170 -3458417 -3967928 -1998309 195991 1247514 2182549 3740220
11910 3740220 3878234 1683581 391563 1565795 3642419 6361205 9315274 10419336
11902 10419336 8519589 3713385 -1365293 -5130502 -8894872 -12679458 -16840073 -20656684
11894 -20656684 -22174009 -21664185 -22313066 -25516416 -29068658 -31175211 -30717822 -27509758
11886 -27509758 -23358311 -18522699 -12656564 -7561666 -4611509 -3130169 -2542351 -3202627
11878 -3202627 -4097656 -4515181 -4189090 -2862526 -2807003 -6087189 -10742765 -11982152 -8829936
$$ packed form
11934a2126273J787441L195430K253674Q53218M39419Q44663K631349L724995
11926C603916M140609M151214L121169J758035m71900k332052k994538m353220
11918F623233n910063m171587n09511J969619K194300J051523R35035J557671
11910C740220J38014k194653j292018J174232K076624K718786K954069J104062
11902A0419336j899747m806204n078678l765209l764370l784586m160615l816611
11894b0656684j517325N09824o48881l203350l552242k106553M57389L208064
11886b7509758M151447M835612N866135N094898K950157J481340N87818o60276
11878c202627q95029m17525L26091J326564N5523l280186m655576j239387L152216
$$ plain form
11869 -8829936 -4089669 -177492 2800078 5616767 7218290 6757029 3601495 -887261
11861 -887261 -2966191 -1608705 1732436 6978756 13067096 16917784 18711104 19538523
11853 19538523 18853980 16055883 12160956 7486654 2074487 -2467428 -5920850 -9304658
11845 -9304658 -12496871 -14235463 -13556339 -10258950 -5885391 -2433693 -2930627 -7172058
11837 -7172058 -10122270 -8553361 -4656077 -2741315 -4506460 -7992512 -11478202 -13678961
11829 -13678961 -12932694 -9843615 -5078424 1170020 7475009 13162013 17245183 17277938
11821 17277938 14311476 12541840 12231212 11410898 9821598 8376108 8013143 8666294 7887099
11812 7887099 4353187 460295 -2345790 -4791655 -7649725 -10390793 -10611014 -7615526
$$ packed form
11869h829936M740267L912177K977570K816689J601523m61261l155534m488756
11861h87261k078930J357486L341141N246320O088340L850688J793320Q27419
11853A9538523o84543k798097l894927m674302n412167m541915l453422l383808
11845i304658l192213j738592O79124L297389M373559L451698m96934m241431
11837g172058k950212J568909L897284J914762j765145l486052l485690k200759
11829a3678961P46267L089079M765191O248444O304989N687004M083170L2755
11821A7277938k966462j769636l10628q20314j589300j445490l62965O53151p79195
11812G887099l533912l892892k806085k445865k858070k741068k20221K995488
$$ plain form
11804 -7615526 -3542609 -15916 1843456 2205041 1217198 -483675 -841771 -247641 -1117631
11795 -1117631 -2953983 -2603555 65977 3102583 5747287 8124337 10143425 10132079 7833651
11786 7833651 4457732 1185111 -1091810 -3231697 -6795598 -8706642 -5270860 2067622
11778 2067622 8995677 13171616 16699922 19572028 20773919 21022427 21612964 24298743
11770 24298743 29453932 35238794 39252766 41177007 40459853 37275110 33444469 29965877
11762 29965877 26794788 24379030 23844789 23956393 22077050 18585011 15047449 11302388
11754 11302388 8084124 5439411 1239865 -6594716 -16182291 -21314740 -19041222 -14244904
11746 -14244904 -10855074 -7764000 -3872129 -1052889 -511613 -1150383 -2723571 -4667994
$$ packed form
11804g615526M072917L526693J859372L61585r87843j700873l58096N94130q69990
11795a117631j836352L50428K669532L036606K644704K377050K019088j1346k298428
11786G833651l375919l272621k276921k139887l563901j911044L435782P338482
11778B067622O928055M175939L528306K872106J201891K48508N90537K685779
11770B4298743N155189N784862M013972J924241p17154l184743l830641l478592
11762B9965877l171089k415758n34241J11604j879343l492039l537562l745061
11754A1302388l218264k644713m199546p834581r587575n132449K273518M796318
11746a4244904L389830L091074L891871K819240N41276o38770j573188j944423
$$ plain form
11738 -4667994 -6699697 -9131781 -8639523 -3985118 164062 96142 -3663399 -8190377 -10368473
11729 -10368473 -9539306 -9065760 -10055557 -10544462 -7904552 -1703409 4209345 7721434 9709568
11720 9709568 8997500 4298769 -1204880 -3229435 -2403053 -1141231 -525819 413089 1533302
11711 1533302 641707 -202666 1578311 5145161 7520643 5502307 -106503 -6488547
11703 -6488547 -10520341 -10676691 -10698927 -12715469 -14910598 -15479230 -14136652 -11811272 -9516151
11694 -9516151 -8927414 -10392315 -12429209 -14240489 -16935832 -18786895 -16490582 -12861123
11686 -12861123 -12220057 -15334678 -21623772 -30681831 -38639364 -42176242 -42554941 -39450429
11678 -39450429 -31946773 -22603424 -15534076 -12444044 -11045603 -9059919 -6632688 -3679947
$$ packed form
11738d667994k031703k432084M92258M654405M149180o7920l759541m526978k178096
11729a0368473Q29167M73546r89797m88905K639910O201143N912754L512089J988134
11720I709568p12068m698731n503649k024555Q26382J261822O15412R38908J120213
11711A533302q91595q44373J780977L566850K375482k018336n608810o382044
11703f488547m031794j56350k2236k016542k195129n68632J342578K325380K295121
11694i516151N88737j464901k036894j811280k695343j851063K296313L629459
11686a2861123O41066l114621o289094r058059p957533l536878l78699L104512
11678c9450429P503656R343349P069348L090032J398441J985684K427231K952741
$$ plain form
11670 -3679947 -909168 -369773 -2816717 -6113704 -8205560 -7839426 -5345348 -2780315
11662 -2780315 -2175907 -3086700 -3666123 -2686558 -1268488 -1983487 -3680605 -3122016 -43246
11653 -43246 4023961 8014745 11263668 13511571 12744960 7312017 -1351950 -10042326 -14562503
11644 -14562503 -13652140 -10250141 -6712535 -2322043 3066095 6891423 7928545 5676508
11636 5676508 862598 -3488303 -5051691 -5212856 -5917780 -7991894 -11166100 -14107528
11628 -14107528 -15006213 -12868072 -9285150 -6731930 -5048236 -1268639 4085787 7897906
11620 7897906 8073839 5197591 1691561 -401560 -294232 -200314 -1301004 -2136749 -571879
11611 -571879 3567342 8706976 13766762 19165640 23644547 24467627 22427883 19464263
$$ packed form
11670c679947K770779N39395k446944l296987k091856L66134K494078K565033
11662b780315O04408r10793n79423R79565J418070p14999j697118N58589L078770
11653d3246M067207L990784L248923K247903p66611n432943q663967q690376m520177
11644a4562503R10363L401999L537606M390492N388138L825328J037122k252037
11636E676508m813910m350901j563388j61165p04924k074114l174206k941428
11628a4107528q98685K138141L582922K553220J683694L779597N354426L812119
11620G897906J75933k876248l506030k093121J07328R3918j100690q35745J564870
11611e71879M139221N139634N059786N398878M478907Q23080k039744k963620
$$ plain form
11603 19464263 16536917 14269561 12042978 9471537 8456159 10505549 13918111 16989046
11595 16989046 20483588 23544512 24271831 21323688 15809669 10441407 5263175 -373894
11587 -373894 -4524351 -5022890 -3825273 -2876135 -3023572 -5327347 -8498731 -10820014 -11233662
11578 -11233662 -8599468 -2612405 3991971 8907303 10332454 7466316 3415183 360308
11570 360308 -4169491 -10966846 -16451874 -19191651 -18889265 -15688253 -10972823 -4867887
11562 -4867887 3250605 12679895 22622770 31767142 39312661 45141125 48868391 49125512
11554 49125512 44869760 37635549 30402119 24823335 20407246 16920579 14406075 12335725
11546 12335725 9797984 6484149 2152453 -2843030 -6897623 -7771524 -6206939 -4996229
$$ packed form
11603A9464263k927346k267356k226583k571441j015378K049390L412562L070935
11595A6989046L494542L060924P27319k948143n514019n368262n178232n637069
11587c73894m150457m98539J197617R49138j47437k303775l171384k321283m13648
11578a1233662K634194N987063O604376M915332J425151k866138m051133l054875
11570C60308m529799o797355n485028k739777L02386L201012M715430O104936
11562d867887Q118492R429290R942875R144372P545519N828464L727266K57121
11554D9125512m255752p234211p233430n578784m416089l486667k514504k070350
11546A2335725k537741l313835m331696m995483m054593q73901J564585J210710
$$ plain form
11538 -4996229 -4842785 -4177711 -1728751 -261300 -876358 -1159114 34874 3566797 8907144
11529 8907144 12382376 13946632 15301137 13912071 7485794 -2115379 -8862150 -11766153
11521 -11766153 -13276124 -13011293 -11015035 -8846942 -8468843 -10036650 -10196330 -7412426
11513 -7412426 -4153196 -2732875 -3268578 -4212121 -5817401 -9040373 -13817544 -17366015
11505 -17366015 -16958583 -15208182 -15351435 -16177083 -14828589 -9758875 -2065227 6080352
11497 6080352 12271216 13346843 11223199 10586087 12275582 14654253 15796971 15167844
11489 15167844 15346582 18401344 22660386 24466523 21991967 17754564 14968725 12567385
11481 12567385 9562754 5891188 972458 -3965865 -5413359 -2403638 931938 1780726
$$ packed form
11538d996229J53444O65074K448960J467451o15058k82756J193988L531923N340347
11529H907144L475232J564256J354505j389066o426277r601173o746771k904003
11521a1766153j509971K64831J996258K168093L78099j567807j59680K783904
11513g412426L259230J420321n35703r43543j605280l222972m777171l548471
11505a7366015M07432J750401j43253q25648J348494N069714P693648Q145579
11497F080352O190864J075627k123644o37112J689495K378671J142718o29127
11489A5167844J78738L054762M259042J806137k474556m237403k785839k401340
11481A2567385l004631l671566m918730m938323j447494L009721L335576Q48788
$$ plain form
11473 1780726 784633 64137 976419 1422998 -422592 -4214762 -9421730 -15273598 -20177627
11464 -20177627 -22211822 -21002161 -17501991 -14329634 -12780582 -11966316 -11270222 -11943684
11456 -11943684 -12804626 -12255053 -12371711 -13464911 -12245398 -7816436 -232834 6917734
11448 6917734 8264597 5854660 4418986 4591475 4704207 4884988 5504275 3999003 457784
11439 457784 -1038079 477955 2686080 4165001 5272386 6763031 8591962 9209114
11431 9209114 7942068 4314870 -390618 -3111397 -2332897 738116 4369047 5739294
11423 5739294 2770737 -3333738 -8626199 -9894241 -8312153 -5666094 -2641795 -1326117
11415 -1326117 -2393923 -2988640 -1341290 2202503 5552362 8616629 12553638 15291054
$$ packed form
11473A780726r96093p20496R12282M46579j845590l792170n206968n851868m904029
11464b0177627k034195J209661L500170L172357J549052Q14266O96094o73462
11456a1943684q60942N49573j16658j093200J219513M428962P583602P150568
11448F917734J346863k409937j435674J72489J12732J80781O19287j505272l541219
11439D57784j495863J516034K208125J478921J107385J490645J828931O17152
11431I209114j267046l627198m705488k720779P78500L071013L630931J370247
11423E739294k968557o104475n292461j268042J582088K646059L024299J315678
11415a326117j067806n94717J647350L543793L349859L064267L937009K737416
$$ plain form
11407 15291054 15666964 16119419 18862143 24591593 32863549 40195050 44308124 45337726
11399 45337726 42240074 35631188 29709159 28162315 29341809 30718099 31427465 30325662
11391 30325662 26522904 21317316 16281363 11685000 7844739 5097122 2680669 596831
11383 596831 -55784 -426903 -841772 -138785 2732394 6507168 9470747 11072092 10920162
11374 10920162 8947163 4426844 -1845089 -6268769 -6779375 -4370849 -1930135 -972232
11366 -972232 -369203 1233615 3342062 4766733 7096638 11557053 15746927 17865136
11358 17865136 19137918 19933876 19510793 17956023 16188984 15717954 17323135 18649863
11350 18649863 15895484 8822442 2151357 -2096063 -4816916 -5951451 -6566446 -7057241
$$ packed form
11407A5291054L75910M52455K742724N729450Q271956P331501M113074J029602
11399D5337726l097652o608886n922029j546844J179494J376290P09366j101803
11391C0325662l802758n205588n035953m596363l840261k747617k416453k083838
11383E96831o52615l71119m14869P02987K871179L774774K963579J601345j51930
11374A0920162j972999m520319o271933m423680n10606K408526K440714R57903
11366i72232O03029J602818K108447J424671K329905M460415M189874K118209
11358A7865136J272782P95958m23083j554770j767039m71030J605181J326728
11350A8649863k754379p073042o671085m247420k720853j134535o14995m90795
$$ plain form
11342 -7057241 -7731853 -8510756 -8504025 -6758606 -4236449 -2931516 -3865273 -5137541 -4170032
11333 -4170032 -3751721 -6151197 -8869883 -9802464 -8443962 -4340046 489049 4437262
11325 4437262 7695804 8055612 3891751 -1755882 -4321606 -2887246 824276 4703834
11317 4703834 6458910 5496193 1912946 -2698960 -6206368 -6799260 -5134288 -3364199
11309 -3364199 -1276386 2017630 5367976 7077960 6974491 5729680 3193591 -1498921
11301 -1498921 -6022797 -7292329 -5445181 -1322189 4775199 11623385 17585403 23080929
11293 23080929 28653042 32377000 31034288 25103908 17880715 10720977 4157179 -714412
11285 -714412 -2896552 -5360237 -9488887 -12831185 -12931392 -10534578 -8467269 -7469186 -7044214
$$ packed form
11342g057241o74612p78903O731J745419K522157J304933r33757j272268R67509
11333d170032M18311k399476k718686r32581J358502M103916M829095L948213
11325D437262L258542L59808m163861n647633k565724J434360L711522L879558
11317D703834J755076r62717l583247m611906l507408n92892J664972J770089
11309c364199K087813L294016L350346J709984j03469j244811k536089m692512
11301a498921m523876j269532J847148M122992O097388O848186N962018N495526
11293B3080929N572113L723958j342712n930380p223193p159738o563798m871591
11285g14412k182140k463685m128650l342298j00207K396814K067309R98083M24972
$$ plain form
11276 -7044214 -4698024 1005768 8181355 13464657 15734598 15454299 14022656 12212618
11268 12212618 7335239 -493324 -6569638 -6832361 -3137574 773302 2640816 513912
11260 513912 -4752465 -10235666 -13081770 -12582020 -10836066 -7969131 -2875978 2265479
11252 2265479 4667276 4270276 3430758 3662259 3886930 2973326 74975 -3476871 -6307511
11243 -6307511 -8994432 -11873313 -14313812 -15394477 -15707897 -14464534 -11442233 -9557697
11235 -9557697 -9297698 -8334613 -5966486 -2999607 -167006 1833099 2820646 2260661 -610964
11226 -610964 -5858199 -11339013 -13687185 -13816670 -15399416 -17393407 -17788144 -16934232 -14376868
11217 -14376868 -10267136 -6293475 -2600386 1505902 6044269 10469724 14413493 17947246
$$ packed form
11276g044214K346190N703792P175587N283302K269941k80299j431643j810038
11268A2212618m877379p828563o076314k62723L694787L910876J867514k126904
11260E13912n266377n483201k846104M99750J745954K866935N093153N141457
11252B265479K401797l97000q39518K31501K24671r13604k898351l551846k830640
11243f307511k686921k878881k440499j080665l13420J243363L022301J884536
11235i557697K59999R63085K368127K966879K832601K000105R87547n59985k871625
11226f10964n247235n480814k348172j29485j582746j993991l94737Q53912K557364
11217a4376868M109732L973661L693089M106288M538367M425455L943769L533753
$$ plain form
11209 17947246 19335550 17451942 12990121 7071675 2690849 2571035 7291940 14171230
11201 14171230 18970022 20920639 21554554 21895234 22402825 23412427 25983324 28608031
11193 28608031 28891334 27405906 23446730 16189324 7007319 -1604580 -7079864 -10022906
11185 -10022906 -12684314 -14140146 -11985746 -5679710 2577926 10155617 16799635 24513646
11177 24513646 30583163 30520579 25520458 18909358 12837647 9599214 9504789 9005787 6065013
11168 6065013 2703848 2169782 6253363 13632495 20528787 22861289 20741425 17678642
11160 17678642 15593469 14733410 16193399 18761662 20102739 20433442 21760328 24177140
11152 24177140 24384114 22550571 23040553 26350876 30137375 32681573 31803264 26667106
$$ packed form
11209A7947246J388304j883608m461821n918446m380826j19814M720905O879290
11201A4171230M798792J950617O33915L40680N07591J009602K570897K624707
11193B8608031K83303j485428l959176p257406r182005q611899n475284k943042
11185a0022906k661408j455832K154400O306036Q257636P577691O644018P714011
11177B4513646O069517o2584n000121o611100o071711l238433r4425m99002k940774
11168F065013l361165n34066M083581P379132O896292K332502k119864l062783
11160A7678642k085173q60059J459989K568263J341077L30703J326886K416812
11152B4177140K06974j833543M89982L310323L786499K544198q78309n136158
$$ plain form
11144 26667106 20159718 16723556 18195972 22812965 28093140 30618258 27268081 19012696
11136 19012696 9436432 1838815 -1683704 -2958223 -6172539 -11191941 -15115143 -16550357
11128 -16550357 -16418383 -17103119 -18865033 -20850206 -21906077 -19964483 -14940906 -10264784
11120 -10264784 -9189946 -11499714 -14406078 -14466953 -10535229 -3796248 1731592 2710147
11112 2710147 -255465 -4376509 -6415617 -3883368 1006737 5298835 8882223 12160859
11104 12160859 14439730 16168178 16115082 11763175 4447795 -2180189 -6273347 -7993598
11096 -7993598 -7610705 -7828780 -10978255 -14992769 -16055170 -13139785 -10644329 -12263634
11088 -12263634 -14644982 -13741467 -9288942 -2839101 3730330 8955776 11822163 12142235
$$ packed form
11144B6667106o507388l436162J472416M616993N280175K525118l350177q255385
11136A9012696r576264p597617l522519j274519l214316n019402l923202j435214
11128a6550357J31974o84736j761914j985173j055871J941594N023577M676122
11120a0264784J074838k309768k906364o0875L931724O738981N527840R78555
11112B710147k965612m121044k039108K532249M890105M292098L583388L278636
11104A2160859K278871J728448n3096m351907p315380o627984m093158j720251
11096g993598L82893k18075l149475m014514j062401K915385K495456j619305
11088a2263634k381348R03515M452525O449841O569431N225446K866387L20072
$$ plain form
11080 12142235 11652379 11142892 11335913 10856371 9298318 9491206 9937384 8540463 5339748
11071 5339748 1471317 -1645397 -3355610 -5287794 -7380450 -6811821 -4320409 -2741258
11063 -2741258 -1268976 1333912 2368337 -765531 -7264873 -12817356 -14441819 -13152659
11055 -13152659 -10783200 -6278030 -800128 930511 -990180 -1039448 1947282 5520463
11047 5520463 9784022 15279977 20287653 19871430 14214267 10127986 10969658 13777730
11039 13777730 14307771 14236507 16479355 18507463 18029091 14996835 12618776 12121256 11367993
11030 11367993 10298003 8125874 4093981 -645390 -5764829 -11149801 -14347471 -14510711
11022 -14510711 -15378159 -20471353 -28639845 -34886474 -36205116 -34732031 -32257626 -28524980
$$ packed form
11080A2142235m89856n09487J93021m79542j558053J92888M46178j396921l200715
11071E339748l868431l116714j710213j932184k092656N68629K491412J579151
11063b741258J472282K602888J034425l133868o499342n552483j624463J289160
11055a3152659K369459M505170N477902J730639j920691m9268K986730L573181
11047E520463M263559N495955N007676m16223n657163m086281Q41672K808072
11039A3777730N30041p1264K242848K028108m78372l032256k378059m97520p53263
11030A1367993j069990k172129m031893m739371n119439n384972l197670j63240
11022a4510711q67448n093194q168492o246629j318642J473085K474405L732646
$$ plain form
11014 -28524980 -22512287 -14057856 -5977105 613760 6941505 13128789 19550710 24212502
11006 24212502 23636693 19786886 16305724 14097628 12096247 11562601 13738546 15631867
10998 15631867 14305070 7996788 -2617947 -12782404 -17758575 -19818071 -21408524 -21936473
10990 -21936473 -21244295 -18453939 -15341607 -14925153 -16123732 -16562743 -15239877 -10789858
10982 -10789858 -3980237 2001662 4507042 4146152 3956927 5758845 7934690 8276795
10974 8276795 7743567 9048551 13154788 16970911 17059068 14657550 11480623 7174163 2257773
10965 2257773 -1177255 -2074760 -1112605 444297 2256762 4110954 4818935 3548397 270136
10956 270136 -3112278 -3446951 691722 7312919 11238482 9817941 6656124 5702528 7277904
$$ packed form
11014b8524980O012693Q454431Q080751O590865O327745O187284O421921M661792
11006B4212502n75809l849807l481162k208096k001381n33646K175945J893321
10998A5631867j326797o308282j0614735j0164457m976171k059496j590453n27949
10990b1936473O92178K790356L112332M16454j198579m39011J322866M450019
10982a0789858O809621N981899K505380l60890j89225J801918K175845L42105
10974H276795n33228J304984M106237L816123Q8157k401518l176927m306460m916390
10965B257773l435028q97505R62155J556902J812465J854192P07981j270538l278261
10956B70136l382414l34673M138673O621197L925563j420541l161817r53596J575376
$$ plain form
10947 7277904 10282757 13985146 18107766 22542878 26034984 24947847 19134830 11946265
10939 11946265 6902989 7366721 12169808 16594984 16279371 12099084 8389635 7662345
10931 7662345 8299185 8736919 9598385 9261167 6086773 2738567 1064356 -466614 -2833590
10922 -2833590 -4146914 -4696464 -6394394 -9196882 -10547163 -8392881 -3578116 451570
10914 451570 1440652 1459558 3637368 9962130 18303157 24891698 28020277 28073068 26032131
10905 26032131 21665691 14470715 7103883 1848517 -1580966 -2851085 -535111 4745678
10897 4745678 11158992 15587306 14590897 9249183 3477099 -2170329 -7983455 -12711108
10889 -12711108 -16023535 -16669738 -14643038 -12058058 -10380281 -9611713 -8987421 -8042135 -6412277
$$ packed form
10947G277904L004853L702389M122620M435112L492106j087137n813017p188565
10939A1946265n043276M63732M803087M425176l15613m180287l709449p27290
10931G662345O36840M37734Q61466l37218l174394l348206j674211j530970k366976
10922b833590j313324n49550j697930k802488j350281K154282M814765M029686
10914D51570R89082J8906K177810O324762Q341027O588541L128579N2791k040937
10905B6032131m366440p194976p366832n255366l429483j270119K315974N280789
10897D745678O413314M428314r96409n341714n772084n647428n813126m727653
10889a2711108l312427o46203K026700K584980J677777P68568O24292R45286J629858
$$ plain form
10880 -6412277 -3998871 -931305 2176637 4350021 4502798 2478638 -758959 -4254346
10872 -4254346 -6378079 -7085391 -7377374 -7656643 -7930411 -7796484 -7310622 -5830654 -1768841
10863 -1768841 4185017 9135629 11321672 10987644 10379410 9056828 6066823 3918817
10855 3918817 4719062 7813585 13598214 20767588 26125300 29939222 31599692 29807041
10847 29807041 24469961 16930318 10025414 6185453 4461220 2503873 575532 1584869
10839 1584869 7346930 14401801 19279389 21436283 20265810 16967232 14084397 9975430
10831 9975430 4061548 953716 2439990 4935587 4008234 -1502533 -9712172 -17615053
10823 -17615053 -24112618 -28795561 -30988158 -29874347 -25329485 -19196269 -14804721 -12080509
$$ packed form
10880f412277K413406L067566L107942K173384J52777k024160l237597l495387
10872d254346k123733p07312k91983k79269k73768J33927M85862J479968M061813
10863a768841N953858M950612K186043l34028o08234j322582k990005k148006
10855C918817Q00245L094523N784629P169374N357712L813922J660470j792651
10847B9807041n337080p539643o904904l839961j724233j957347j928341J009337
10839A584869N762061P054871M877588K156894j170473l298578k882835m108967
10831I975430n913882l107832J486274K495597r27353n510767q209639p902881
10823a7615053o497565m682943k192597J113811M544862O133216M391548K724212
$$ plain form
10815 -12080509 -9674245 -9587734 -11856205 -13888518 -12242590 -7655006 -5093803 -5804359
10807 -5804359 -6907401 -6623885 -6154768 -7145712 -9571680 -13151507 -18992192 -25213547 -28008383
10798 -28008383 -26357077 -21256575 -14918352 -10135552 -7808430 -6828396 -5903166 -5503315
10790 -5503315 -6940154 -11214384 -18218594 -23321366 -22521518 -17822917 -13187531 -11196582
10782 -11196582 -12569322 -15127427 -15680876 -13225809 -9387612 -5517561 -1988099 1311923
10774 1311923 4306968 6902845 10095544 12474761 11386233 6064013 -152679 -2421226
10766 -2421226 61315 4176443 8108678 11136457 12010983 11466473 11255586 11648449 11188760
10757 11188760 8881507 6132539 6072049 8755886 11880152 14261034 15593637 16781730
$$ packed form
10815a2080509K406264Q6511k268471k032313J645928M587584K561203p10556
10807e804359j103042K83516M69117r90944k425968l579827n840685o221355k794836
10798b8008383J651306N100502O338223M782800K327122R80034R25230L99851
10790e503315j436839m274230p004210n102772P99848M698601M635386J990949
10782a1196582j372740k558105n53449K455067L838197L870051L529462L300022
10774A311923K995045K595877L192699K379217j088528n322220o216692k268547
10766b421226K482541M115128L932235L027779Q74526n44510k10887L92863m59689
10757A1188760k307253k748968o0490K683837L124266K380882J332603J188093
$$ plain form
10749 16781730 19508231 21906040 22752157 21309115 15488249 7841214 2462355 -905053
10741 -905053 -3621169 -5210770 -5037178 -2684543 683773 1861013 133069 -2022400
10733 -2022400 -3383843 -4552770 -5453776 -6036591 -7538423 -12315986 -19373645 -24767553
10725 -24767553 -26122988 -24102685 -21226094 -18122246 -14896695 -12510566 -11338001 -10377924
10717 -10377924 -8993623 -8174687 -8458934 -8707343 -7348925 -4815207 -3014288 -3946475 -7282366
10708 -7282366 -8973671 -8146426 -8206983 -9010485 -7248707 -2687297 -228839 -1845748 -3905975
10699 -3905975 -3724847 -1662468 1948932 6984060 10932217 11017983 9422677 8873286 9402501
10690 9402501 11980715 15384147 15329922 11199447 6952133 4583713 3016027 1050933
$$ packed form
10749A6781730K726501K397809Q46117j443042n820866p647035n378859l367408
10741i05053k716116j589601J73592K352635L368316J177240j727944k155469
10733b022400j361443j168927r01006n82815j501832m777563p057659n393908
10725b4767553j355435K020303K876591L103848L225551K386129J172565R60077
10717a0377924J384301Q18936k84247k48409J358418K533718J800919r32187l335891
10708g282366j691305Q27245o0557q03502J761778M561410K458458j616909k060227
10699c905975J81128K062379L611400N035128L948157Q5766j595306n49391N29215
10690I402501K578214L403432n4225m130475m247314k368420j567686j965094
$$ plain form
10682 1050933 -1841085 -6534431 -12147251 -16649202 -19397268 -20238915 -17971881 -12049268
10674 -12049268 -6049393 -2540429 -849210 -294938 -849100 -2883941 -5321230 -7508887
10666 -7508887 -9603904 -11478892 -12046975 -9561626 -4256572 1652536 5634147 5892303
10658 5892303 4144490 2851321 2290950 1577528 -1150520 -6324857 -11480691 -14324048
10650 -14324048 -13834316 -9213680 -2530011 1632756 1406996 -2705531 -7889552 -10238822
10642 -10238822 -11706448 -14550159 -15720736 -13562693 -10300554 -7384478 -3832857 1449462
10634 1449462 8852768 17111525 24203801 27561077 24795576 16532081 6748120 -1564738
10626 -1564738 -7528756 -9851333 -7920922 -3767964 1790069 7838142 10226293 7662088
$$ packed form
10682A050933k892018m693346n612820m501951k748066q41647K267034N922613
10674a2049268N999875L508964J691219N54272n54162k034841k437289k187657
10666g508887k095017j874988n68083K485349N305054N909108L981611K58156
10658E892303j747813j293169n60371p13422k728048n174337n155834k843357
10650a4324048M89732M620636O683669M162767k25760m112527n184021k349270
10642a0238822j467626k843711j170577K158043L262139K916076L551621N282319
10634A449462P403306Q258757P092276L357276k765501q263495r783961q312858
10626a564738n964018k322577J930411M152958N558033O048073K388151k564205
$$ plain form
10618 7662088 3003877 314205 2550151 7094530 8722812 5845414 965280 -2352055
10610 -2352055 -2197382 180806 1477149 -280332 -4608269 -9902684 -13669366 -14593595
10602 -14593595 -15280587 -18061231 -22017091 -26512657 -30712127 -34221657 -37417578 -38518871
10594 -38518871 -34524892 -27436206 -22188138 -18760093 -14211391 -9518157 -6609727 -4433067
10586 -4433067 -3533627 -5706302 -10036286 -15876209 -22081832 -26337906 -28377489 -30492664
10578 -30492664 -32197708 -31266441 -27771441 -21571213 -16358503 -16882379 -21458820 -25732771
10570 -25732771 -26934530 -23713581 -16885426 -8436588 -1297267 1592791 692954 -2532401
10562 -2532401 -8183074 -16125396 -25225950 -31637452 -33017534 -31253258 -28800889 -28814244
$$ packed form
10618G662088m658211k689672K235946M544379J628282k877398m880134l317335
10610b352055J54673K378188J296343j757481m327937n294415l766682r24229
10602a4593595o86992k780644l955860m495566m199470l509530l195921j101293
10594c8518871L993979P088686N248068L428045M548702M693234K908430K176660
10586d433067Q99440k172675m329984n839923o205623m256074k039583k115175
10578c0492664j705044R31267L495000O200228N212710n23876m576441m273951
10570b5732771j201759L220949O828155Q448838P139321K890058q99837l225355
10562b532401n650673p942322r100554o411502j380082J764276K452369j3355
$$ plain form
10554 -28814244 -32044854 -35814301 -38256250 -39035110 -39634961 -40175798 -38681978 -34202828
10546 -34202828 -27274469 -20131817 -16026789 -15950869 -17221737 -15239277 -10196630 -6419922
10538 -6419922 -5689023 -6010310 -6192035 -6249190 -6571310 -7965973 -11222022 -15310867 -17454875
10529 -17454875 -16173785 -13532060 -11861639 -11980250 -13865928 -16793311 -19790380 -21862242
10521 -21862242 -23475089 -25497933 -27382663 -29241622 -29148556 -24349824 -17822852 -13114864
10513 -13114864 -8464327 -3153312 -174897 1165708 3385697 6518157 8484923 7900202
10505 7900202 5413750 1438790 -3883831 -9630913 -13429857 -13416873 -9689087 -2587597
10497 -2587597 6379327 13807056 17326495 15437921 9622944 2162779 -5880047 -11187897
$$ packed form
10554b8814244l230610l769447k441949p78860n99851n40837J493820M479150
10546c4202828O928359P142652M105028P5920j270868J982460N042647L776708
10538f419922P30899l21287j81725n7155l22120j394663l256049m088845k144008
10529a7454875J281090K641725J670421j18611j885678k927383k997069k071862
10521b1862242j612847k022844j884730j858959R3066M798732O526972M707988
10513a3114864M650537N311015K978415J340605K219989L132460J966766n84721
10505G900202k486452l974960n322621n747082l798944J2984L727786P101490
10497b587597Q966924P427729L519439j888574n814977p460165q042826n307850
$$ plain form
10489 -11187897 -11167624 -6106026 1584703 7362165 8457541 4520840 -765857 -2724969
10481 -2724969 -2374348 -174338 4400742 9346102 12360744 11759017 9354195 8486331 10105704
10472 10105704 12620559 14312555 16249101 18278001 19739350 22020106 25253780 28351340
10464 28351340 29909945 29501913 27713783 24156887 18408889 11090093 4338380 -1413170
10456 -1413170 -7078054 -12094256 -15534061 -17001996 -16128952 -14089546 -12972659 -13167627
10448 -13167627 -12465222 -9540263 -5532207 -1636548 1450124 3476476 4848031 5393109
10440 5393109 5363017 3931716 369340 -5127522 -11815184 -18681141 -23965124 -25357857
10432 -25357857 -23885924 -21786559 -20474831 -21069713 -21886079 -20055979 -16226456 -12111038
$$ packed form
10489a1187897K0273N061598P690729N777462J095376l936701n286697j959112
10481b724969L50621K200010M575080M945360L014642o01727k404822q67864J619373
10472A0105704K514855J691996J936546K028900J461349K280756L233674L097560
10464B8351340J558605m08032j788130l556896n747998p318796o751713n751550
10456a413170n664884n016202l439805j467935Q73044K039406J116887j94968
10448a3167627P02405K924959M008056L895659L086672K026352J371555N45078
10440E393109l0092j431301l562376n496862o687662o865957n283983j392733
10432b5357857J471933K099365J311728n94882q16366J830100L829523M115418
$$ plain form
10424 -12111038 -8181992 -5591982 -4846354 -6083076 -9462073 -12411601 -13895540 -13801374
10416 -13801374 -13102791 -12901463 -13020652 -12903859 -12383969 -12420931 -14165211 -17183970 -19325606
10407 -19325606 -17752817 -11648857 -4597987 911906 4751410 7629234 10164545 12690734
10399 12690734 14187342 14353039 12414304 7130160 -1010708 -9291067 -13268003 -11664491
10391 -11664491 -9201043 -10483084 -14375134 -17609152 -17678932 -15657008 -15741399 -17655367 -17997108
10382 -17997108 -16129940 -12692649 -8385252 -4829329 -3310468 -2981192 -2690862 -2908487
10374 -2908487 -3693249 -4678555 -6207582 -10070671 -16107993 -21770411 -25049117 -25939761 -24029768
10365 -24029768 -17838506 -9077620 -1466095 2426486 3924481 4073202 2229584 596961
$$ packed form
10424a2111038L929046K590010P45628j236722l378997k949528j483939R4166
10416a3801374O98583K01328j19189J16793N19890l6962j744280l018759k141636
10407a9325606J572789O103960P050870N509893L839504K877824K535311K526189
10399A2690734J496608J65697j938735n284144q140868q280359l976936J603512
10391a1664491K463448j282041l892050l234018o9780K021924q4391j913968l41741
10382a7997108J867168L437291M307397L555923J518861L29276K90330k17625
10374b908487p84762r85306j529027l863089o037322n662418l278706q90644J909993
10365b4029768O191262Q760886P611525L892581J497995J48721j843618j632623
$$ plain form
10357 596961 1314139 3027551 3221641 1591039 -543025 -766276 1275798 3184706 3471534
10348 3471534 1541154 -1804600 -4357529 -6489635 -9342073 -10284649 -7986293 -4880442
10340 -4880442 -2278400 868855 3113497 1923462 -689166 -2047619 -2330381 -2999683
10332 -2999683 -4202045 -4127317 -1010314 4448746 8651554 9607247 9594588 10711377 11217865
10323 11217865 9011945 4475287 -2154217 -9725332 -15144001 -16565086 -14989365 -12802562
10315 -12802562 -10559329 -8963491 -10008661 -12592704 -14688672 -15674101 -14875176 -12896517
10307 -12896517 -11868129 -12074642 -10938393 -7244898 -3701426 -2896746 -4037308 -4044061 -216655
10298 -216655 7546840 17333858 26468277 31767890 30910958 25131539 17460987 11772686
$$ packed form
10357E96961P17178J713412J94090j630602k134064k23251K042074J908908K86828
10348C471534j930380l345754k552929k132106k852438r42576K298356L105851
10340d880442K602042L147255K244642j190035k612628j358453k82762o69302
10332b999683j202362P4728L117003N459060M202808R55693j2659J116789N06488
10323A1217865k205920m536658o629504p571115n418669j421085J575721K186803
10315a2802562K243233J595838j045170k584043k095968r85429P98925J978659
10307a2896517J028388k06513J136249L693495L543472Q04680j140562o753L827406
10298b16655P763495R787018R134419N299613q56932n779419p670552n688301
$$ plain form
10290 11772686 8755342 5828190 674543 -4577370 -7461385 -8136848 -7671469 -7175130
10282 -7175130 -5870713 -4084783 -3803030 -4912478 -5299199 -3552567 -2517710 -5239060
10274 -5239060 -9583088 -12208749 -13577476 -15079138 -15678549 -14009155 -10334365 -6556096
10266 -6556096 -5314881 -8476139 -12912486 -13488321 -10000457 -3712157 2907547 6391979
10258 6391979 7506552 7944459 6632388 3676503 941325 -1540650 -5486336 -10045543
10250 -10045543 -12733902 -13904493 -15860973 -19446184 -23681885 -28090235 -31155183 -29913603
10242 -29913603 -22949784 -12378893 -2551532 5002718 11029003 15063098 17465649 18876641
10234 18876641 17978981 12487228 3807556 -5155749 -13561301 -18750609 -19417804 -18469154
$$ packed form
10290A1772686l017344k927152n153647n251913k884015o75463M65379M96339
10282g175130J304417J785930K81753j109448l86721J746632J034857k721350
10274e239060m344028k625661j368727j501662n99411J669394L674790L778269
10266f556096J241215l161258m436347n75835L487864O288300O619704L484432
10258F391979J114573M37907j312071k955885k735178k481975l945686m559207
10250a0045543k688359j170591j956480l585211m235701m408350l064948J241580
10242b9913603O963819J0570891R827361P554250O026285M034095K402551J410992
10234A8876641q97660n491753q679672q963305q405552n189308o67195R48650
$$ plain form
10226 -18469154 -20113481 -24491819 -27782844 -28550842 -27187980 -23950938 -19261341 -13312322
10218 -13312322 -8618492 -7446776 -9192660 -11765791 -13374511 -14298803 -15078223 -15550244
10210 -15550244 -14184150 -11614141 -9402251 -6151992 -2437533 -250172 473731 1277691
10202 1277691 1976487 64071 -4769353 -10223312 -15139903 -18314738 -17774273 -14361572
10194 -14361572 -11512284 -10966370 -10944587 -11836886 -14916327 -19167224 -23438502 -26414381 -26217733
10185 -26217733 -23159464 -19409939 -16626982 -14190572 -10962268 -7144837 -4982964 -4270524
10177 -4270524 -2939152 -1562481 -1608948 -3419904 -5145167 -5443109 -6478633 -8348724 -8732887
10168 -8732887 -7209203 -4403373 -568278 2555587 3009458 533108 -2809850 -3874791
$$ packed form
10226a8469154j644327m378338l291025p67998J362862L237042M689597N949019
10218a3312322M693830J171716j745884k573131j608720r24292p79420m72021
10210a5550244J366094K570009K211890L250259L714459K187361P23903Q03960
10202A277691O98796j912416m833424n453959m916591l174835N40465L412701
10194a4361572K849288N45914K1783q92299l079441m250897m271278k975879J96648
10185b6217733L058269L749525K782957K436410L228304L817431K161873P12440
10177d270524J331372J376671m6467j810956j725263k97942j035524j870091l84163
10168h732887J523684K805830L835095L123865M53871k476350l342958j064941
$$ plain form
10160 -3874791 -2672037 -1342839 -644121 -1932406 -4123544 -5662638 -7434937 -7433085 -6032107
10151 -6032107 -6938737 -10489800 -12479137 -11228419 -7650157 -2924410 1675924 5859614
10143 5859614 7551491 7338710 9497798 15189263 20533471 21873110 21836674 23458800 23842756
10134 23842756 21770983 19400989 17861940 15241042 11870677 9452448 6409591 1666709
10126 1666709 -3366489 -7564168 -10581235 -12735888 -14322726 -14378454 -12377847 -9371100
10118 -9371100 -7364723 -5432775 -2662183 935207 5748032 9110411 8732099 5635714
10110 5635714 1592279 -1039706 -392535 1852043 3835575 5907912 7804804 9066303
10102 9066303 8836424 8011130 7778946 7957410 9999865 14598973 19075996 21001037 19434211
$$ packed form
10160c874791J202754J329198O98718j288285k191138j539094j772299J852J400978
10151f032107r06630l551063j989337J250718L578262M725747M600334M183690
10143E859614J691877k12781K159088N691465N344208J339639l6436J622126L83956
10134B3842756k071773k369994j539049k620898l370365k418229l042857m742882
10126A666709n033198m197679l017067k154653j586838n5728K000607L006747
10118i371100K006377J931948K770592L597390M812825L362379l78312l096385
10110E635714m043435k631985O47171K244578J983532K072337J896892J261499
10102I066303k29879q25294k32184J78464K042455M599108M477023J925041j566826
$$ plain form
10093 19434211 14599450 8002550 3116685 3716485 8627499 12741777 13520849 10938466
10085 10938466 6425432 3367072 4072785 7139518 9439748 10093136 9080974 7779975
10077 7779975 8476507 10904007 13305747 13715746 11644555 7282430 2430074 87084
10069 87084 -272757 1053893 6359597 15286365 25406478 32907516 33370731 27546250 21205378
10060 21205378 17709093 17186392 18264604 17308834 12405325 7070532 4294136 1691720
10052 1691720 -3032565 -6830278 -6600155 -4137693 -1571665 967173 3563838 6328356
10044 6328356 8182921 9226596 10198713 9928656 7431140 2569257 -3788511 -10244007
10036 -10244007 -16153710 -20504779 -21755163 -19947820 -15601769 -8306577 338094 7566443
$$ packed form
10093A9434211m834761o596900m885865N99800M911014M114278P79072k582383
10085A0938466m513034l058360P05713L066733K300230O53388j012162j300999
10077G779975O96532K427500K401740M09999k071191m362125m852356k342990
10069H7084l59841J326650N305704Q926768J0120113P501038M63215n824481o340872
10060B1205378l496285n22701J078212r55770m903509n334793k776396k602416
10052A691720m724285l797713K30123K462462K566028K538838K596665K764518
10044F328356J854565J043675R72117k70057k497516m861883o357768o455496
10036a0244007n909703m351069j250384J807343M346051P295192Q644671P228349
$$ plain form
10028 7566443 13343759 18571848 22914977 25639838 25204751 20678961 13781426 9658201
10020 9658201 10213926 12184908 13589691 15274394 18251621 24260061 32016018 36420614
10012 36420614 34575074 29412985 24258352 18425257 12228743 7927205 7620791 9956842
10004 9956842 12083087 12578418 12035744 12269419 13624066 14693984 15079363 14792031 13244904
9995 13244904 8839402 2244719 -3220341 -7180115 -9010985 -7485991 -3094431 3173334
9987 3173334 8952458 12351943 13442924 13326668 13409812 14010101 14443553 14818485 14540407
9978 14540407 13357314 11367220 8981437 7132552 6007977 3038537 -3021426 -9814829
9970 -9814829 -15009235 -18373491 -20064964 -20254313 -19344083 -16959487 -14759633 -14235916 -15106520
$$ packed form
10028G566443N777316N228089M343129K724861m35087m525790o897535m123225
10020I658201N55725J970982J404783J684703K977227O008440P755957M404596
10012C6420614j845540n162089n154633n833095o196514m301538l06414K336051
10004I956842K126245M95331n42674K33675J354647J069918L85379k87332j547127
9995A3244904m405502o594683n465060l959774j830870J524994M391560O267765
9987C173334N779124L399485J090981j16256Q3144O00289M33452L74932k78078
9978A4540407j183093j990094k385783j848885j124575k969440o059963o793403
9970i814829n194406l364256j691473j89349R10230K384596K199854N23717q70604
$$ plain form
9961 -15106520 -15539977 -14264332 -13694266 -16012369 -19824760 -20791399 -17985409 -15098080 -14037135
9952 -14037135 -14030138 -13862367 -13064077 -11880696 -10720288 -7761539 -3009548 717721 1424213
9943 1424213 -1936848 -7323479 -11484719 -14478963 -16975934 -18549754 -18275642 -14515708
9935 -14515708 -7162504 35205 3256500 2408929 -1674158 -7226225 -11184660 -10815647
9927 -10815647 -8588248 -8287090 -10488017 -14100917 -18697284 -22141377 -21414502 -17713255
9919 -17713255 -15314587 -15087864 -15705251 -16487401 -14168613 -7973662 -2408018 -621 1105489
9910 1105489 1331370 64874 -1865888 -2926690 -665902 5504060 13040695 20404103
9902 20404103 26788333 30122621 29319834 25919182 20555154 14183185 8968753 5380724
$$ packed form
9961a5106520m33457J275645N70066k318103l812391r66639K805990K887329J060945
9952a4037135O997J67771P98290J183381J160408K958749M751991L727269P06492
9943A424213l361061n386631m161240k994244k496971j573820K74112L759934
9935a4515708P353204P197709L221295q47571m083087n552067l958435L69013
9927a0815647K227399L01158k200927l612900m596367l444093P26875L701247
9919a7713255K398668K26723o17387p82150K318788O194951N565644K407397J106110
9910A105489K25881j266496j930762j060802K260788O169962P536635P363408
9902B0404103O384230L334288q02787l400652n364028o371969n214432l588029
$$ plain form
9894 5380724 2752840 -1205545 -10600319 -24621021 -34958325 -36569598 -32842742 -28436905
9886 -28436905 -24142924 -21020784 -20682570 -23486514 -28672578 -33182845 -34307456 -31695617
9878 -31695617 -26942377 -21637067 -18555478 -18559402 -19031073 -18557923 -17413976 -16224964 -17474190
9869 -17474190 -22403625 -28102869 -30504016 -28942255 -25898084 -22011195 -15845818 -7681761
9861 -7681761 1273087 11197112 20185627 24692564 23558649 19168464 14897876 10801837
9853 10801837 5357102 -1638975 -9039811 -14800734 -17440233 -17539691 -16839439 -16838696 -19630662
9844 -19630662 -24904133 -28780352 -27627610 -22010441 -15026149 -7912940 -606198 5565415
9836 5565415 9418168 12102378 13615444 12415194 9844385 9826787 13876269 18888329 21925063
$$ packed form
9894E380724k627884l958385r394774j4020702j0337304j611273L726856M405837
9886b8436905M293981L122140L38214k803944n186064m510267j124611K611839
9878c1695617M753240N305310L081589l924m71671M73150J143947J189012j249226
9869a7474190m929435n699244k401147J561761L044171L886889O165377Q164057
9861g681761Q954848R924025Q988515M506937j133915m390185m270588m096039
9853A0801837n444735o996077p400836n760923k639499r9458P00252P43k791966
9844a9630662n273471l876219J152742N617169O984292P113209P306742O171613
9836E565415L852753K684210J513066j200250k570809j7598M049482N012060L036734
$$ plain form
9827 21925063 21918336 19945972 18046743 15749682 11933076 6735845 2706824 5711 -4972444
9818 -4972444 -12303106 -19816932 -25376649 -29927119 -34883455 -37215330 -36317705 -36444326 -39029656
9809 -39029656 -41880081 -42256280 -38823744 -34260297 -30609170 -27660819 -25499487 -24069735
9801 -24069735 -22220790 -18655131 -13297627 -5852633 2921729 10466707 15495963 18536800
9793 18536800 19817615 17787310 12419296 5499042 -1377846 -6309886 -9351932 -10607584
9785 -10607584 -10468373 -11736920 -15887367 -21031932 -25067192 -27692351 -29703054 -32954380
9777 -32954380 -36108550 -38231986 -40459701 -42036459 -41762456 -38951304 -31356952 -19758060
9769 -19758060 -9578432 -4149234 -3409047 -6038766 -10907266 -15337932 -17006978 -15115430
$$ packed form
9827B1925063o727j972364j899229k297061l816606n197231m029021k701113m978155
9818d972444p330662p513826n559717m550470m956336k331875Q97625j26621k585330
9809c9029656k850425l76199L432536M563447L651127K948351K161332J429752
9801b4069735J848945L565659N357504P444994Q774362P544978N029256L040837
9793A8536800J280815k030305n368014o920254o876888m932040l042046j255652
9785a0607584J39211j268547m150447n144565m035260k625159k010703l251326
9777c2954380l154170k123436k227715j576758K74003K811152P594352J1598892
9769a9758060J0179628N429198P40187k629719m868500m430666j669046J891548
$$ plain form
9761 -15115430 -9636491 -3328499 646515 412121 -1686403 -2809798 -3407742 -6759266
9753 -6759266 -13004347 -17208432 -17327212 -14977304 -11375946 -6616014 -922529 5353390
9745 5353390 11913528 16563583 15635421 8455311 -872458 -7799763 -12242131 -15647754
9737 -15647754 -16802731 -14484362 -10248047 -7447648 -7812878 -9460763 -10366210 -9320180
9729 -9320180 -6886163 -5682916 -8282336 -13085946 -16498815 -18259081 -18764996 -17199653
9721 -17199653 -13442208 -9859596 -8983119 -10775774 -12741889 -12253371 -11334530 -10899685 -8542372
9712 -8542372 -4926500 -2908764 -3149561 -4356916 -5106169 -4195296 -2097974 201950 2033914
9703 2033914 2532324 2590212 4087980 7743004 11179595 10913449 7456332 3415440 -301423
$$ packed form
9761a5115430N478939O307992L975014k34394k098524j123395n97944l351524
9753f759266o245081m204085j18780K349908L601358M759932N693485O275919
9745E353390O560138M650055r28162p180110r327769o927305m442368l405623
9737a5647754j154977K318369M236315K800399l65230j647885r05447J046030
9729i320180K434017J203247k599420m803610l412869j760266n05915J565343
9721a7199653L757445L582612Q76477j792655j966115M88518R18841M34845K357313
9712h542372L615872K017736k40797j207355p49253R10873K097322K299924J831964
9703B033914M98410N7888J497768L655024L436591k66146l457117m040892l716863
$$ plain form
9694 -301423 -4787702 -9533321 -12223419 -13304004 -13222441 -11725383 -9502583 -5303757 892528
9685 892528 5235311 5612544 3167400 -415421 -3848996 -7561472 -11865668 -14991576 -16447282
9676 -16447282 -17588683 -16626208 -12359437 -6910649 -2545805 374841 1430403 -127438
9668 -127438 -1870124 -2157270 -3087940 -5034127 -5733435 -3539539 707858 2860011 1811510
9659 1811510 2072235 4642484 7659581 9370106 7847091 3302568 -2163489 -6147622
9651 -6147622 -7049492 -5260360 -3417940 -3126744 -5541670 -8564323 -8118413 -3531480 2512163
9642 2512163 6518689 7059731 5483685 4984852 8196244 14142908 19805617 24281366 29690127
9633 29690127 39146154 55375972 78481445 110876267 157480244 220902992 293703302
$$ packed form
9694c01423m486279m745619k690098j080585Q1563J497058K222800M198826O196285
9685H92528M342783L77233k445144l582821l433575l712476m304196l125908j455706
9676a6447282j141401R62475M266771N448788M364844K920646J055562j557841
9668a27438j742686k87146r30670j946187o99308K193896M247397K152153j048501
9659A811510K60725K570249L017097J710525j523015m544523n466057l984133
9651f147622r01870J789132J842420K91196k414926l022653M45910M586933O043643
9642B512163M006526N41042j576046m98833L211392N946664N662709M475749N408761
9633B9690127R456027J6229818K3105473L2394822M6603977O3422748P2800310
$$ plain form
9626 293703302 348742381 354922895 316311663 263722191 214159199 169677583 131336042
9619 131336042 101033568 78497446 62292842 50298444 41478047 33003867 23577108
9612 23577108 15746141 10491644 6516033 3667147 4997546 10372523 15963204 19047088
9604 19047088 18255887 14325098 10289104 8517931 9282512 10410206 9174028 6646128
9596 6646128 5004367 1987784 -2830649 -6455682 -6982181 -4282863 -224079 4133364
9588 4133364 6860580 7071840 6595143 5438650 2876231 -1224888 -5233599 -6605582 -5490402
9579 -5490402 -2381931 1173504 2285075 167834 -3088198 -6482267 -10388120 -11869063
9571 -11869063 -8467003 -3925584 -2701690 -2635241 -492391 3807384 8100089 10042996
$$ packed form
9626B93703302N5039079O180514l8611232n2589472m9562992m4481616l8341541
9619A31336042l0302474k2536122j6204604j1994398q820397q474180r426759
9612B3577108p830967n254497l975611k848886J330399N374977N590681L083884
9604A9047088p91201l930789m035994j771173P64581J127694j236178k527900
9596F646128j641761l016583m818433l625033n26499K699318M058784M357443
9588D133364K727216K11260m76697j156493k562419m101119m008711j371983J115180
9579e490402L108471L555435J111571k117241l256032l394069l905853j480943
9571a1869063L402060M541419J223894O6449K142850M299775M292705J942907
$$ plain form
9563 10042996 9650207 7276173 2794847 -2895538 -8945795 -13852537 -15677540 -14500427
9555 -14500427 -12267907 -9103901 -3975608 793795 4327988 7688993 9756178 10083139
9547 10083139 9736551 9550972 9163348 8080838 7485307 8815479 12022746 14699050 15217853
9538 15217853 16156293 19858166 25296363 28457912 27280557 23377613 17920462 11984452
9530 11984452 6482390 1476751 -2451588 -5147214 -6777331 -6945868 -5011021 -1085780
9522 -1085780 2979009 5819793 7344828 7003974 3317744 -1886107 -3940032 -3844453 -5876247
9513 -5876247 -9453671 -13533405 -18162232 -20639787 -18727519 -13961351 -9835727 -9705920
9505 -9705920 -13861296 -19754414 -24421931 -25963469 -24989692 -23281240 -21488977 -19414569
$$ packed form
9563A0042996l92789k374034m481326n690385o050257m906742j825003J177113
9555a4500427K232520L164006N128293M769403L534193L361005K067185L26961
9547A0083139l46588j85579l87624j082510n95531J330172L207267K676304N18803
9538A5217853R38440L701873N438197L161549j177355l902944n457151n936010
9530A1984452n502062n005639l928339k695626j630117j68537J934847L925241
9522a085780M064789K840784J525035l40854l686230n203851k053925R5579k031794
9513e876247l577424m079734m628827k477555J912268M766168M125624J29807
9505i705920m155376n893118m667517j541538R73777J708452J792263K074408
$$ plain form
9497 -19414569 -18025127 -18736638 -19601959 -17710973 -13585457 -10457439 -9161828 -7630484
9489 -7630484 -5954151 -5348755 -4735259 -1982138 2936048 7192545 8836010 7978796 6412799
9480 6412799 5633763 5659794 6893203 8735989 9858031 10195708 9531913 8945256 10199299
9471 10199299 12035776 11479896 7970046 4189946 3151143 4982451 7013180 6667990
9463 6667990 3149168 -2806185 -10079013 -17490213 -22910055 -25331110 -26366904 -26459231 -25797799
9454 -25797799 -26153074 -26778077 -25216699 -20278289 -13393986 -7731845 -4602726 -3801705 -4487210
9445 -4487210 -5965880 -7342547 -7588629 -7681861 -9554323 -12333455 -13547273 -13153069 -11873414
9436 -11873414 -8883442 -4797111 -650603 3377984 7324042 11095486 13877380 17733631
$$ packed form
9497a9414569J389442p11511q65321J890986M125516L128018J295611J531344
9489g630484J676333O05396O13496K753121M918186M256497J643465q57214j565997
9480F412799p79036K6031J233409J842786J122042L37677o63795n86657J254043
9471A0199299J836477n55880l509850l780100j038803J831308K030729l45190
9463F667990l518822n955353p272828p411200n419842k421055j035794r2327O61432
9454b5797799l55275o25003J561378M938410O884303N662141L129119Q01021o85505
9445d487210j478670j376667k46082r3232j872462k779132j213818L94204J279655
9436a1873414K989972M086331M146508M028587L946058L771444K781894L856251
$$ plain form
9428 17733631 23716730 28170293 28423687 25780771 23984549 24436477 24103951 21095545 16764001
9419 16764001 12982317 9605323 6041287 3456341 1377627 220707 3109412 8688906
9411 8688906 13016243 13997478 12858812 9735158 2887420 -4936307 -8960872 -8326910 -4704257
9402 -4704257 -1149679 1575199 5860720 10337155 13122747 14056617 15201073 18644943
9394 18644943 21632231 19621717 14873839 12425096 11410608 9540832 6742866 2012206
9386 2012206 -4069626 -9269748 -13729504 -17617620 -20319739 -21168572 -19302179 -16054748
9378 -16054748 -15747337 -19743033 -23497098 -23965592 -22780322 -20879668 -19158297 -17300164
9370 -17300164 -13111637 -6660463 -1114065 1201761 250817 -4129414 -9042598 -10201321
$$ packed form
9428A7733631N983099M453563K53394k642916j796222M51928l32526l008406m331544
9419A6764001l781684l376994l564036k584946k078714j156920K888705N579494
9411H688906M327337R81235j138666l123654o847738p823727m024565O33962L622653
9402d704257L554578K724878M285521M476435K785592R33870J144456L443870
9394A8644943K987288k010514m747878k448743j014488j869776k797966m730660
9386B012206o081832n200122m459756l888116k702119q48833J866393L247431
9378a6054748L07411l995696l754065m68494J185270J900654J721371J858133
9370a7300164M188527O451174N546398K315826r50944m380231m913184j158723
$$ plain form
9362 -10201321 -5873199 -97703 3531301 5420972 5501953 2449965 -3032437 -8410740
9354 -8410740 -11375812 -13429350 -16062834 -17781130 -18336122 -19679702 -20567935 -17931550 -11759104
9345 -11759104 -6634267 -5433591 -5695260 -3537526 584927 2558743 1987165 1238689 36042
9336 36042 -3504469 -8650128 -11583865 -10430008 -7813749 -5835788 -4912976 -4035432 -978764
9327 -978764 4809682 11277597 17823738 23672727 26336518 23935460 18619686 12095501
9319 12095501 5830691 2172635 1374606 2982396 6681280 11134040 14138440 13572680
9311 13572680 10398785 7331770 4652508 2067104 -1016280 -5895114 -11191775 -14872650
9303 -14872650 -17406030 -19748331 -20597932 -19593608 -18140021 -17695484 -17404313 -16493974 -16121698
$$ packed form
9362a0201321M328122N775496L629004J889671Q0981l051988n482402n378303
9354h410740k965072k053538k633484j718296n54992j343580q88233K636385O172446
9345a1759104N124837J200676k61669K157734M122453J973816n71578p48476j202647
9336C6042l540511n145659k933737J153857K616259J977961R22812Q77544L056668
9327i78764N788446O467915O546141N848989K663791k401058n315774o524185
9319A2095501o264810l658056p98029J607790L698884M452760L004400n65760
9311A3572680l173895l067015k679262k585404l083384m878834n296661l680875
9303a4872650k533380k342301q49601J004324J453587M44537K91171R10339L72276
$$ plain form
9294 -16121698 -16439599 -15952105 -14535185 -14014118 -15992036 -19303112 -20625211 -19909074 -19115862
9285 -19115862 -18288946 -16350602 -12604982 -8262732 -4773865 -3226569 -2676982 -1884409 -1349564
9276 -1349564 -246718 1532036 1946517 672891 -64188 -121010 -224068 -582457 -874128
9267 -874128 -1411591 -3315430 -6731671 -9062441 -7737052 -4728282 -1815551 2392499 7107650
9258 7107650 11334622 15193181 16248622 13076735 7525338 1560559 -1063368 1607192
9250 1607192 7911905 15133633 21136403 25099679 27016540 27380005 27293476 28210961 30764253
9241 30764253 34852189 38601265 39902138 38504896 35501351 32043790 28451429 26132107
9233 26132107 26526594 28181114 28178333 25507987 22133088 19051341 16609617 15423434 15612670
$$ packed form
9294a6121698l17901M87494J416920N21067j977918l311076j322099P16137P93212
9285a9115862Q26916J938344L745620M342250L488867J547296N49587P92573N34845
9276a349564J102846J778754M14481j273626p37079n6822j03058l58389k91671
9267h74128n37463j903839l416241k330770J325389L008770K912731M208050M715151
9258G107650M226972L858559J055441l171887n551397n964779k623927K670560
9250A607192O304713P221728O002770L963276J916861L63465q6529R17485K553292
9241C0764253M087936L749076J300873j397242l003545l457561l592361k319322
9233B6132107L94487J654520k781k670346l374899l081747k441724j186183J89236
$$ plain form
9224 15612670 16044196 14951551 12463657 8496529 2237780 -2875302 -1417145 5471612
9216 5471612 11489664 14017742 13432646 9129758 2792532 -2968398 -7434718 -8755350
9208 -8755350 -6594696 -3401870 -18437 3449417 4864825 3626361 598348 -3616828
9200 -3616828 -9462154 -16325143 -21195413 -22130253 -20867085 -19954217 -19327599 -18062030 -16326050
9191 -16326050 -13713200 -10181885 -7289291 -4935781 -2139133 2482830 8500728 15158879
9183 15158879 21376365 23046763 19769532 15897935 13376636 9761264 2247044 -7024652
9175 -7024652 -13104774 -14432049 -11896768 -7315195 -2871611 3383 2304223 4588695
9167 4588695 5939303 6460172 7713014 9609543 10238427 8404253 4030536 -655422 -2540417
$$ packed form
9224A5612670M31526j092645k487894l967128o258749n113082J458157O888757
9216E471612O018052K528078n85096m302888o337226n760930m466320j320632
9208h755350K160654L192826L383433L467854J415408j238464l028013m215176
9200c616828n845326o862989m870270r34840J263168R12868O26618J265569J735980
9191a6326050K612850L531315K892594K353510K796648M621963O017898O658151
9183A5158879O217486J670398l277231l871597k521299l615372p514220r271696
9175g024652o080122j327275K535281M581573M443584K874994K300840K284472
9167D588695J350608N20869J252842J896529O28884j834174m373717m685958j884995
$$ plain form
9158 -2540417 -850457 2527286 7083101 12178166 15220046 15616885 15234004 14918636 14564359
9149 14564359 15095780 17004001 19194268 20051427 18808637 16123297 13622097 13710910 16545251
9140 16545251 18955543 20356956 22506580 22229513 16677087 7820045 -1444250 -9086613
9132 -9086613 -13283142 -13323817 -10160738 -5099360 469701 6791695 12860477 15498449 14373444
9123 14373444 11227155 6838821 2126940 -2354637 -6569444 -10869496 -14349009 -14771165
9115 -14771165 -12726608 -9833858 -6523849 -2723673 -1047950 -3527092 -9004156 -13531713
9107 -13531713 -14151250 -13012997 -12636967 -12838420 -12807994 -12382574 -11156823 -9053599 -6420140
9098 -6420140 -3257340 -1340985 -1605536 -2378562 -1769516 709920 2970853 2776852 1014901
$$ packed form
9158b540417J689960L377743M555815N095065L041880L96839l82881l15368l54277
9149A4564359N31421J908221K190267Q57159j242790k685340k501200Q8813K834341
9140A6545251K410292J401413K149624k77067n552426q857042r264295p642363
9132i086613m196529m0675L163079N061378N569061O321994O068782K637972j125005
9123A4373444l146289m388334m711881m481577m214807m300052l479513m22156
9115a4771165K044557K892750L310009L800176J675723k479142n477064m527557
9107a3531713o19537J138253L76030k01453L0426M25420J225751K103224K633459
9098f420140L162800J916355k64551p73026O09046K479436K260933j94001j761951
$$ plain form
9089 1014901 -559464 288000 4624756 9974262 14629751 19075296 21001884 16623863
9081 16623863 7527441 -1158853 -6299223 -8118337 -9147040 -10116321 -9792024 -8009836
9073 -8009836 -6989225 -8544599 -12841257 -20002167 -27346325 -31618581 -32249422 -29492089
9065 -29492089 -24195320 -18849718 -14869255 -12173962 -10224492 -7319564 -3684408 -27886
9057 -27886 2785604 4727844 6505625 7709156 9052794 10948208 12983619 15118529 16693284
9048 16693284 16802431 14534885 10772870 7268241 3271839 -2188194 -8805480 -14158854
9040 -14158854 -16441199 -16616378 -16234854 -16338218 -16216016 -15239825 -14201210 -11944284 -7721303
9031 -7721303 -2911526 -431853 -1076720 -2345730 -2129934 -1498634 -672954 1701608 4744286
$$ packed form
9089A014901j574365Q47464M336756N349506M655489M445545J926588m378021
9081A6623863r096422q686294n140370j819114j028703r69281L24297J782188
9073h009836J020611j555374m296658p160910p344158m272256o30841K757333
9065b9492089N296769N345602L980463K695293J949470K904928L635156L656522
9057b7886K813490J942240J777781J203531J343638J895414K035411K134910J574755
9048A6693284J09147k267546l762015l504629l996402n460033o617286n353374
9040a4158854k282345j75179L81524j03364J22202R76191J038615K256926M222981
9031g721303M809777K479673o44867j269010K15796O31300Q25680K374562L042678
$$ plain form
9022 4744286 6087504 6468347 8540806 12252432 14811745 15391769 15008868 13692108 11452234
9013 11452234 9023607 6673018 3246432 -708358 -3932392 -4212916 -454762 5637287
9005 5637287 11119423 13347749 12416379 10487517 11022323 14964128 18908071 19829897 18133645
8996 18133645 14881630 9659067 3313637 -1831345 -4044843 -3611685 -1897824 1975247
8988 1975247 7120006 10764521 13965062 17363093 17093204 14100327 12929569 12370142 9202767
8979 9202767 5918342 4934061 4972741 4183703 3856387 6370888 9915198 11760505 12160646
8970 12160646 13832748 18561314 23511332 23949215 19353596 13263033 8368214 2800653
8962 2800653 -4186515 -11370307 -17401512 -19581867 -16551826 -10686292 -5683721 -3602213
$$ packed form
9022D744286J343218L80843K072459L711626K559313N80024l82901j316760k239874
9013A1452234k428627k350589l426586l954790l224034k80524L758154O092049
9005E637287N482136K228326r31370j928862N34806L941805L943943R21826j696252
8996A8133645l252015n222563o345430n144982k213498M33158J713861L873071
8988A975247N144759L644515L200541L398031k69889k992877j170758n59427l167375
8979I202767l284425r84281L8680p89038l27316K514501L544310J845307M00141
8970A2160646J672102M728566M950018M37883m595619o090563m894819n567561
8962B800653o987168p183792o031205k180355L030041N865534N002571K081508
$$ plain form
8954 -3602213 -3885744 -3717907 160575 5844401 9276960 10797382 11079690 8933390 4676945
8945 4676945 357047 -3808729 -8298619 -11606066 -12320179 -11723140 -10773198 -8192921 -2824231
8936 -2824231 4183385 10461826 13482038 11624963 7397897 4405068 5767826 12612725
8928 12612725 21075286 26303351 27679749 26112172 21458762 15313817 10488173 7008413
8920 7008413 4577633 3587833 2408925 1062468 1122605 2042217 2765185 3154758 4142643
8911 4142643 5295126 4969577 3277186 376851 -5228298 -12808120 -19409078 -23076405
8903 -23076405 -24288808 -24187642 -22084532 -18242873 -14640514 -10250974 -4311239 282253
8895 282253 2150152 3312495 4718900 5312591 3824181 -358367 -4905128 -7373281 -8097250
$$ packed form
8954c602213k83531J67837L878482N683826L432559J520422K82308k146300m256445
8945D676945m319898m165776m489890l307447p14113N97039R49942K580277N368690
8936b824231P007616O278441L020212j857075m227066k992829J362758O844899
8928A2612725Q462561N228065J376398j567577m653410o144945m825644l479760
8920G008413k430780r89800j178908j346457O0137R19612P22968L89573R87885
8911D142643J152483l25549j692391k900335n605149p579822o600958l667327
8903b3076405j212403J01166K103110L841659L602359M389540N939735M593492
8895B82253J867899J162343J406405N93691j488410m182548m546761k468153p23969
$$ plain form
8886 -8097250 -8606182 -10451927 -13624152 -16248202 -16416984 -14032817 -10489598 -6717188 -3149126
8877 -3149126 -1214342 -1329589 -2589954 -3883633 -4359259 -2991358 1265032 7659232 12258789
8868 12258789 12499877 9531418 5872457 3284632 541489 -1598989 -918201 1365241
8860 1365241 3348219 5852140 8305143 8796849 7120585 4939285 5884624 10209727 11944728
8851 11944728 7598809 -232814 -6466433 -8092512 -7457869 -8867710 -13083565 -17030414
8843 -17030414 -19492519 -22114806 -23171481 -21045354 -17111193 -13467294 -12516721 -13675158
8835 -13675158 -14486404 -14927952 -15733265 -15828754 -12753166 -7873569 -5161303 -4699841 -4827791
8826 -4827791 -4511736 -1279636 3706661 6694065 8819667 12870785 18355830 22752425
$$ packed form
8886h097250n08932j845745l172225k624050j68782K384167L543219L772410L568062
8877c149126J934784j15247j260365j293679m75626J367901M256390O394200M599557
8868A2258789K41088k968459l658961k587825k743143k140478O80788K283442
8860A365241J982978K503921K453003M91706j676264k181300R45339M325103J735001
8851A1944728m345919p831623o233619j626079O34643j409841m215855l946849
8843a7030414k462105k622287j056675K126127L934161L643899R50573j158437
8835a3675158q11246m41548q05313r5489L075588M879597K712266M61462j27950
8826d827791L16055L232100M986297K987404K125602M051118N485045M396595
$$ plain form
8818 22752425 24908976 25836592 27393324 29900481 32050446 33320844 33385053 31995990 31824639
8809 31824639 33280514 33600770 31278744 27108874 23644194 22915951 26416668 33774420
8801 33774420 42501516 50837963 58974347 66176238 72532759 81141482 95020342 113986162
8793 113986162 131347979 136724027 129427783 119900374 117303680 122626466 130932157 136343684
8785 136343684 134371483 128545514 124748167 123737203 126055357 131553781 133773400 127742255
8777 127742255 116692953 105895429 99528662 100852676 107086461 106571249 90731490 65051563
8769 65051563 40963912 24441275 13554977 3407145 -5924463 -10878171 -12560314 -12671219
8761 -12671219 -11072611 -8100511 -3691878 1166072 4867408 7066408 7197965 4288898
$$ packed form
8818B2752425K156551R27616J556732K507157K149965J270398O4209j389063j71351
8809C1824639J455875L20256k322026m169870l464680p28243L500717P357752
8801C3774420Q727096Q336447Q136384P201891O356521Q608723J3878860J8965820
8793A13986162J7361817N376048p296244r527409k596694N322786Q305691N411527
8785A36343684j972201n825969l797347j010964K318154N498424K219619o031145
8777A27742255j1049302j0797524o366767J324014O233785n15212j5839759k5679927
8769F5051563k4087651j6522637j0886298j0147832r331608m953708j682143j10905
8761a2671219J598608K972100M408633M857950L701336K199000J31557k909067
$$ plain form
8753 4288898 -1703831 -8864745 -12868903 -12948604 -13321919 -16033900 -19199755 -19980418 -17333861
8744 -17333861 -14683968 -14060796 -13684609 -13402103 -13453642 -12586312 -11112735 -10362371 -11172153
8735 -11172153 -11668994 -9380863 -4351783 446536 1871585 826628 -1745261 -7517029
8727 -7517029 -15215797 -21608510 -25865055 -29187996 -33271401 -38242575 -40473516 -36720973
8719 -36720973 -28263243 -18431908 -11574549 -10349264 -11207138 -12095698 -13485085 -13941592 -12760961
8710 -12760961 -11401846 -11567502 -13585981 -15347368 -14475797 -11230788 -7468409 -4583817
8702 -4583817 -1643231 848996 1657559 2327711 3592577 4689164 7906704 11795504 11330712
8693 11330712 6195560 -381550 -5797857 -7714184 -4896121 -362868 1943076 -372264
$$ packed form
8753D288898n992729p160914m004158p9701l73315k711981l165855p80663K646557
8744a7333861K649893O23172L76187K82506n1539Q67330J473577P50364q09782
8735a1172153m96841K288131N029080M798319J425049j044957k571889n771768
8727g517029p698768o392713m256545l322941m083405m971174k230941L752543
8719c6720973Q457730R831335O857359J225285q57874q88560j389387m56507J180631
8710a2760961J359115j65656k018479j761387Q71571L245009L762379K884592
8702d583817K940586K492227Q08563O70152J264866J096587L217540L888800m64792
8693A1330712n135152o577110n416307j916327K818063M533253K305944k315340
$$ plain form
8685 -372264 -6259503 -12852205 -17432307 -17775626 -14145926 -10641003 -9510424 -8110353 -6097187
8676 -6097187 -5344508 -5318031 -5761501 -7062292 -7851752 -8011546 -5895745 -2287480 -732089
8667 -732089 -1670294 -4147866 -7517611 -10233178 -10442238 -9672857 -10697160 -11748934 -11272015
8658 -11272015 -8765746 -3529792 3281985 7800153 8088450 5669709 2073024 -1418577
8650 -1418577 -4711808 -8880946 -13108524 -16532815 -19664021 -21631031 -21559295 -20985045 -21510715
8641 -21510715 -20969358 -18268539 -15342265 -13540666 -11898194 -9123296 -6318308 -5460324
8633 -5460324 -6778960 -7577177 -5374243 -629968 2103032 -279721 -4065075 -6901587
8625 -6901587 -10024269 -11845214 -12418539 -15177508 -20230685 -25544798 -29455554 -30719883
$$ packed form
8685c72264n887239o592702m580102l43319L629700L504923J130579J400071K013166
8676f097187P52679K6477m43470j300791p89460j59794K115801L608265J555391
8667g32089r38205k477572l369745k715567k09060P69381j024303j051774M76919
8658a1272015K506269N235954O811777M518168K88297k418741l596685l491601
8650a418577l293231m169138m227578l424291l131206j967010P1736N74250n25670
8641b1510715N41357K700819K926274J801599J642472K774898K804988Q57984
8633e460324j318636p98217K202934M744275K733000k382753l785354k836512
8625f901587l122682j820945n73325k758969n053177n314113l910756j264329
$$ plain form
8617 -30719883 -28200554 -22218975 -13804134 -4753473 1258710 1095449 -3863153 -9299011
8609 -9299011 -11989361 -13324444 -15609379 -18843326 -21558746 -22327351 -20570782 -17504331
8601 -17504331 -14821635 -11460240 -7491256 -4745187 -3907986 -5339021 -9785280 -16768925
8593 -16768925 -22815551 -25478666 -25189482 -23889493 -21838821 -18480112 -14993699 -13762378
8585 -13762378 -13902289 -13677369 -14209398 -17626561 -22329628 -24709303 -25029954 -25481142 -27814306
8576 -27814306 -30173274 -28330479 -22113982 -14424931 -8672911 -6732302 -7712193 -10593436
8568 -10593436 -12648924 -12701510 -11897694 -10963295 -9647372 -7606995 -5224687 -2908400 1189
8559 1189 5259122 10693809 14345612 15818354 13247847 7691140 2547035 146304 -546996
$$ packed form
8617c0719883K519329N981579Q414841R050661O012183j63261m958602n435858
8609i299011k690350j335083k284935l233947k715420p68605J756569L066451
8601a7504331K682696L361395L968984K746069Q37201j431035m446259o983645
8593a6768925o046626k663115K89184J299989K050672L358709L486413J231321
8585a3762378j39911K24920n32029l417163m703067k379675l20651m51188k333164
8576b7814306k358968J842795O216497P689051N752020J940609r79891k881243
8568a0593436k055488n2586Q03816R34399J315923K040377K382308K316287K909589
8559A189N257933N434687L651803J472742k570507n556707n144105k400731o93300
$$ plain form
8550 -546996 -3047691 -8137316 -12886106 -15359882 -15461653 -13666174 -11613342 -11810463 -13357729
8541 -13357729 -14188583 -15050083 -16895597 -17710197 -17403365 -18228213 -20392545 -21043357 -18828916
8532 -18828916 -15503168 -12378399 -10764473 -11362995 -13247521 -15015028 -16455987 -17615724
8524 -17615724 -16088509 -11892469 -7656176 -4689939 -3267478 -2813851 -2432868 -3537178
8516 -3537178 -7305126 -11389791 -14168034 -16148535 -17438764 -17893780 -17887866 -18990369 -22396515
8507 -22396515 -24860437 -24238344 -22818363 -22001141 -21604339 -20993270 -21329068 -23276850 -23807145
8498 -23807145 -20494018 -15671282 -12041088 -9895617 -9378368 -10327995 -10370437 -6525657 1345613
8489 1345613 8909064 11811250 10539768 8233632 7396523 7710830 7291967 5217943 2754009
$$ packed form
8550e46996k500695n089625m748790k473776j01771J795479K052832j97121j547266
8541a3357729q30854q61500j845514q14600L06832q24848k164332o50812K214441
8532a8828916L325748L124769J613926n98522j884526j767507j440959j159737
8524a7615724J527215M196040M236293K966237J422461M53627L80983j104310
8516c537178l767948m084665k778243j980501j290229m55016N914j102503l406146
8507b2396515k463922O22093J419981Q17222L96802O11069l35798j947782n30295
8498b3807145L313127M822736L630194K145471N17249r49627m2442L844780P871270
8489A345613P563451K902186j271482k306136q37109L14307m18863k074024k463934
$$ plain form
8480 2754009 1541607 1409084 259991 -3409295 -8348285 -10590919 -9999434 -7959897 -4877826
8471 -4877826 -1456527 1182561 1193168 -1406146 -3166933 -2888556 -294430 5639817 11668573
8462 11668573 15821270 19866202 24055983 27410233 29558599 31263682 34084716 38874079
8454 38874079 42988076 41907783 35007483 24547899 13646030 5692710 2001740 2283994
8446 2283994 5354820 9547553 13054118 15451062 18304608 21556975 24025708 24117997 21157940
8437 21157940 15815060 10400864 7899447 9454046 12161223 11658590 8203869 4586094
8429 4586094 1712437 -439839 -2849066 -5914555 -8868241 -9793293 -6651079 -1088754
8421 -1088754 3043231 3842678 2342600 1163095 140565 -2393610 -6958729 -11420669
$$ packed form
8480B754009j212402j32523j149093l669286m938990k242634N91485K039537L082071
8471d877826L421299K639088J0607k599314j760787K78377K594126N934247O028756
8462A1668573M152697M044932M189781L354250K148366J705083K821034M789363
8454C8874079M113997j080293o900300j0459584j0901869p953320l690970K82254
8446B283994L070826M192733L506565K396944K853546L252367K468733R2289k960057
8437B1157940n342880n414196k501417J554599K707177n02633l454721l617775
8429D586094k873657k152276k409227l065489k953686r25052L142214N562325
8421a088754M131985P99447j500078j179505j022530k534175m565119m461940
$$ plain form
8413 -11420669 -14176992 -15685060 -13878613 -6537035 3765984 11967101 15517164 13703320
8405 13703320 8635349 3489236 -1150949 -5488428 -9993870 -13723738 -15086415 -15805392
8397 -15805392 -16726360 -15816196 -13012669 -10121226 -7191429 -4103326 -2423534 -3283366 -4936927
8388 -4936927 -4641865 -3507219 -4631470 -10046052 -18628997 -25684683 -28654324 -28401324 -26312986
8379 -26312986 -23029048 -17886891 -11248345 -6125824 -2126448 2391258 6230442 9208968
8371 9208968 11218902 11740245 10480025 7693881 5255102 3893626 2700144 2779157 4987239
8362 4987239 7296155 7636142 6770073 6035356 4831186 4664813 7642115 11446188 13811151
8353 13811151 14705570 13994736 11782182 8773396 6074766 4678746 4839396 4893319 3523163
$$ packed form
8413a1420669k756323j508068J806447P341578J0303019Q201117L550063j813844
8405A3703320n067971n146113m640185m337479m505442l729868j362677p18977
8397a5805392r20968R10164K803527K891443K929797L088103J679792q59832j653561
8388d936927K95062J134646j124251n414582q582945p055686k969641K53000K088338
8379b6312986L283938N142157O638546N122521L999376M517706L839184K978526
8371I208968K009934N21343j260220k786144k438779j361476j193482P9013K208082
8362D987239K308916L39987q66069p34717j204170j66373K977302L804073K364963
8353A3811151Q94419p10834k212554l008786k698630j396020J60650N3923j370156
$$ plain form
8344 3523163 1691141 1486055 3918286 7979352 11742646 13222132 11101892 7891796
8336 7891796 5478731 1616768 -4094058 -8511443 -10419036 -13135783 -18603979 -24850801
8328 -24850801 -28955767 -29752488 -26916784 -21102039 -14317889 -9291838 -9120952 -14149875
8320 -14149875 -21408898 -26343652 -27041668 -24481568 -20786137 -16640582 -10848091 -4177694
8312 -4177694 -79904 -62883 -1964350 -2980565 -2833915 -2592010 -3114803 -3222207 -922499
8303 -922499 2800220 3730505 -370687 -6993520 -13312628 -16482790 -13354902 -5180100 3319461
8294 3319461 9171218 12614830 13752083 10859679 4432999 -3757688 -12936473 -20410518
8286 -20410518 -22637081 -20008624 -15393296 -13486665 -18007829 -26484433 -34331243 -38534089
$$ packed form
8344C523163j832022k05086K432231M061066L763294J479486k120240l210096
8336G891796k413065l861963n710826m417385j907593k716747n468196o246822
8328b4850801m104966p96721K835704N814745O784150N026051J70886n028923
8320a4149875p259023m934754o98016K560100L695431M145555N792491O670397
8312d177694M097790J7021j901467j016215J46650K41905n22793j07404K299708
8303i22499L722719R30285m101192o622833o319108l170162L127888Q174802Q499561
8294C319461N851757L443612J137253k892404o426680q190687r178785p474045
8286b0410518k226563K628457M615328J906631m521164q476604p846810m202846
$$ plain form
8278 -38534089 -38251786 -36121148 -33483090 -28919844 -22579300 -15878861 -9537846 -4997154
8270 -4997154 -2808097 -1628787 156617 3188661 7260514 10289575 11082849 10740429 9172255
8261 9172255 6492223 2839949 -522985 -1158868 1326000 5639645 10542011 14911252
8253 14911252 16072509 11837739 2661672 -6198471 -10359670 -11156857 -11296111 -12736145
8245 -12736145 -14423211 -13164601 -9464152 -5535905 -3155689 -2231823 -1316933 52864
8237 52864 1670421 3058572 4550402 5794154 5675186 4960835 4815622 3991481 1907292
8228 1907292 234874 -1382978 -4351628 -7549446 -9033840 -7692070 -4957847 -2331976
8220 -2331976 186503 3214590 5659189 4438314 -699910 -7580123 -13054651 -14381065
$$ packed form
8278c8534089K82303K130638K638058M563246O340544O700439O341015M540692
8270d997154K189057J179310J785404L032044M071853L029061P93274l42420j568174
8261I172255k680032l652274l362934o35883K484868M313645M902366M369241
8253A4911252J161257m234770r176067q860143m161199p97187j39254j440034
8245a2736145j687066J258610L700449L928247K380216R23866R14890J369797
8237E2864J617557J388151J491830J243752j18968p14351j45213q24141k084189
8228A907292j672418j617852k968650l197818j484394J341770K734223K625871
8220b331976K518479L028087K444599j220875n138224o880213n474528j326414
$$ plain form
8212 -14381065 -12032428 -7341562 -1342254 2940104 3609321 1145235 -1588308 -1707219
8204 -1707219 -1762237 -4293804 -7302145 -8781616 -7993365 -6050540 -4898241 -3767043 -1778988
8195 -1778988 1506787 6367420 10351454 10270600 6669651 2568491 746498 2522999 6423362
8186 6423362 9379839 10452875 11775881 14398263 15833668 16044647 16078068 14519383 12377474
8177 12377474 11837283 11375582 9297821 5990818 1845433 -689372 -587081 1098494 3577495
8168 3577495 5819897 7814386 9929961 11658209 11940644 10333015 9666816 10970171 10589954
8159 10589954 5358078 -3080725 -11389107 -17236204 -18754667 -16878633 -12730968 -8050305
8151 -8050305 -7635599 -13096314 -19793341 -24079213 -26181334 -27331375 -28293458 -28075937 -26877323
$$ packed form
8212a4381065K348637M690866N999308M282358O69217k464086k733543j18911
8204a707219n5018k531567l008341j479471P88251J942825J152299J131198J988055
8195a778988L285775M860633L984034q0854l600949m101160j821993J776501L900363
8186F423362K956477J073036J323006K622382J435405K10979L3421j558685k141909
8177A2377474n40191m61701k077761l307003m145385k534805J02291J685575K479001
8168C577495K242402J994489K115575J728248K82435j607629o66199J303355l80217
8159A0589954n231876q438803q308382n847097j518463J876034M147665M680663
8151h050305M14706n460715o697027m285872k102121j150041r62083K17521J198614
$$ plain form
8142 -26877323 -24744933 -21966018 -20426842 -19927359 -18707357 -18312378 -20806056 -23728178
8134 -23728178 -25478235 -25990493 -24715376 -22596603 -21263734 -19275927 -14029305 -7481770
8126 -7481770 -3382561 -1938938 -1811726 -2329200 -1882230 -1278273 -1239493 515435 4167336
8117 4167336 8689226 12942532 14898400 12188391 7428775 4236928 1702985 -2801481
8109 -2801481 -8924800 -13092903 -13443881 -11354463 -10154394 -10774516 -11447818 -9463989 -5398371
8100 -5398371 -2420162 -592674 2039528 5023459 5821096 4577214 3321162 1948595
8092 1948595 1819811 4114921 6673156 6215270 721818 -7284961 -14950257 -19636487 -19685468
8083 -19685468 -15102449 -10358280 -9856881 -12074140 -14936653 -17425557 -15878475 -9757191
$$ packed form
8142b6877323K132390K778915J539176M99483J220002L94979k493678k922122
8134b3728178j750057n12258J275117K118773J332869J987807N246622O547535
8126g481770M099209J443623J27212n17474M46970O03957L8780J754928L651901
8117D167336M521890M253306J955868k710009m759616l191847k533943m504466
8109b801481o123319m168103l50978K089418J200069o20122o73302J983829M065618
8100e398371K978209J827488K632202K983931P97637j243882j256052j372567
8092A948595j28784K295110K558235m57886n493452q006779p665296m686230m8981
8083a9685468M583019M744169N01399k217259k862513k488904J547082O121284
$$ plain form
8075 -9757191 -3677456 -663337 -1002421 -2256596 -1536961 -464873 -2531810 -7997241 -15240265
8066 -15240265 -22716806 -27458120 -27510550 -24757738 -20031321 -12637877 -3909231 3697504
8058 3697504 7317617 5890067 -220603 -9241595 -19186045 -30698065 -41970891 -47820878
8050 -47820878 -45761537 -37787781 -27883317 -20020936 -14721047 -9984646 -6000930 -4209635
8042 -4209635 -3962876 -3289842 -2027592 -2748000 -5305801 -7492327 -7268792 -5940442 -5397281
8033 -5397281 -5485909 -8165683 -12576944 -15158616 -15641308 -17179242 -22580927 -29273684 -33167800
8024 -33167800 -33224920 -29568960 -24010920 -18033933 -12418971 -8930527 -7857470 -7245910 -6921547
8015 -6921547 -7059998 -6036543 -3454398 -162983 3230374 3664191 1551355 1521614 3563078
$$ packed form
8075i757191O079735L014119l39084j254175P19635J072088k066937n465431p243024
8066a5240265p476541m741314n2430K752812M726417P393444Q728646P606735
8058C697504L620113j427550o110670r020992r944450j1512020j1272826n849987
8050d7820878K059341P973756R904464P862381N299889M736401L983716J791295
8042d209635K46759O73034J262250p20408k557801k186526K23535J328350N43161
8033e397281q8628k679774m411261k581672m82692j537934n401685o692757l894116
8024c3167800n7120L655960N558040N976987N614962L488444J073057O11560L24363
8015f921547j38451J023455K582145L291415L393357M33817k112836k9741K041464
$$ plain form
8006 3563078 4843006 4627343 3287537 528009 -5357428 -13397790 -19128140 -22019967
7998 -22019967 -24662429 -26700421 -26501308 -24181820 -19538477 -15057458 -13680572 -13846665
7990 -13846665 -13157168 -12290056 -11917815 -11650638 -11136130 -9554204 -7337690 -6527145 -7513888
7981 -7513888 -8425046 -9709369 -10768771 -9056885 -6203977 -5276975 -6215792 -7848959 -10375487
7972 -10375487 -12232940 -11363190 -8808024 -6512576 -4591989 -3665250 -4738258 -7553618
7964 -7553618 -10287046 -10961650 -10026015 -7944569 -3898506 2415692 8995088 11773698 10448014
7955 10448014 8299744 5642091 1205951 -5721788 -12911953 -18071960 -23064998 -27654749
7947 -27654749 -29808058 -28440648 -23977491 -19180029 -16400189 -17659181 -22278352 -26135885
$$ packed form
8006C563078J279928k15663j339806k759528n885437q040362n730350k891827
7998b2019967k642462k037992J99113K319488M643343M481019J376886j66093
7990a3846665O89497Q67112L72241K67177N14508J581926K216514Q10545r86743
7981g513888r11158j284323j059402J711886K852908R27002r38817j633167k526528
7972a0375487j857453Q69750K555166K295448J920587R26739j073008k815360
7964g553618k733428o74604R35635K081446M046063O314198O579396K778610j325684
7955A0448014k148270k657653m436140o927739p190165n160007m993038m589751
7947b7654749k153309J367410M463157M797462K779840j258992m619171l857533
$$ plain form
7939 -26135885 -26669469 -22484998 -15942744 -11613903 -9432756 -7502895 -6827494 -9012880
7931 -9012880 -12919311 -16397539 -18639023 -19054205 -16907128 -12311469 -7290218 -4065672
7923 -4065672 -4463376 -8550887 -11808604 -10400238 -6059871 -1420225 1722870 2997981
7915 2997981 2555342 192521 -2878131 -6186651 -9703809 -12044209 -12601470 -12365079 -11751188
7906 -11751188 -11100101 -11778897 -13502282 -14494773 -14377848 -13418742 -11471741 -7413652 -2179533
7897 -2179533 1291327 1633888 -1143095 -3601827 -3280780 -848206 2139454 5721414 10181250
7888 10181250 11591031 8115019 1658212 -4344021 -8461760 -11232782 -12832312 -13383451
7880 -13383451 -13304206 -14173993 -16530136 -18621117 -18329716 -13481529 -5195714 2622605 9048810
$$ packed form
7939b6135885n33584M184471O542254M328841K181147J929861O75401k185386
7931i012880l906431l478228k241484m15182K147077M595659N021251L224546
7923d065672l97704m087511l257717J408366M340367M639646L143095J275111
7915B997981m42639k362821l070652l308520l517158k340400n57261K36391O13891
7906a1751188O51087o78796j723385r92491J16925R59106J947001M058089N234119
7897b179533L470860L42561k776983k458732L21047K432574K987660L581960M459836
7888A0181250J409781l476012o456807o002233m117739k771022j599530n51139
7880a3383451P9245q69787k356143k090981K91401M848187Q285815P818319O426205
$$ plain form
7871 9048810 14077822 16147931 14890089 12664754 11467459 8921057 3571892 -1480977
7863 -1480977 -3330759 -1947195 396601 1920791 1139821 -2682358 -7926104 -12888733
7855 -12888733 -16866382 -20182859 -23582653 -27387592 -30613135 -31693186 -29975807 -26861227
7847 -26861227 -22827094 -17025527 -10752004 -6220463 -4848698 -5500746 -6282987 -7704551
7839 -7704551 -9926584 -11993408 -12591798 -11801589 -12947273 -18057226 -23332877 -26078156 -27304948
7830 -27304948 -26137040 -21864914 -15932106 -10741920 -8393982 -8655166 -8529456 -6458248
7822 -6458248 -2836450 2359458 8725516 14881215 18384155 17582537 12300918 5804883
7814 5804883 1611883 123466 337452 1064187 -28546 -4006105 -7947445 -9350521 -9293896
$$ packed form
7871I048810N029012K070109j257842k225335j197295k546402n349165n052869
7863a480977j849782J383564K343796J524190p80970l822179n243746m962629
7855a2888733l977649l316477l399794l804939l225543j080051J717379L114580
7847b6861227M034133N801567O273523M531541J371765o52048p82241j421564
7839g704551k222033k066824n98390P90209j145684n109953n275651k745279j226792
7830b7304948J167908M272126N932808N190186K347938k61184J25710K071208
7822f458248L621798N195908O366058O155699L502940q01618n281619o496035
7814E804883m193000j488417K13986P26735j092733l977559l941340j403076N6625
$$ plain form
7805 -9293896 -9259542 -8496688 -7213548 -7770805 -11116585 -15255021 -15812912 -13029230 -9314002
7796 -9314002 -4171041 3259170 12417808 19686395 22933796 25077718 28970764 34478246
7788 34478246 38872030 39911642 39361741 39783920 41209002 42571737 41762725 36422795 28092685
7779 28092685 22774924 22708519 24479542 24779437 23196139 21368948 19837791 20604088 25054922
7770 25054922 31850724 38396511 41656412 40866214 37254274 31538882 23066598 12421742
7762 12421742 4631147 592866 -1730651 -3254356 -5372437 -8761228 -11764290 -12256802
7754 -12256802 -9744016 -6814599 -7288037 -11102277 -14365008 -15497470 -15301415 -13361135
7746 -13361135 -9278191 -4448727 -384646 3686403 7278402 9437799 10480353 9476829
$$ packed form
7805i293896L4354P62854J283140n57257l345780m138436n57891K783682L715228
7796i314002N142961P430211R158638P268587L247401K143922L893046N507482
7788C4478246M393784J039612n49901M22179J425082J362735q09012n339930q330110
7779B8092685n317761o6405J771023K99895j583298j827191j531157P66297M450834
7770B5054922O795802O545787L259901p90198l611940n715392q472284j0644856
7762A2421742p790595m038281k323517j523705k118081l388791l003062m92512
7754a2256802K512786K929417m73438l814240l262731j132462J96055J940280
7746a3361135M082944M829464M064081M071049L591999K159397J042554j003524
$$ plain form
7738 9476829 6640802 5177748 6551645 9838678 12225573 10744729 6515970 1398414
7730 1398414 -3458424 -6561107 -7407547 -7141949 -6290718 -4811299 -2714021 -217223 3045852
7721 3045852 8050426 13387455 15086526 11893793 5771259 -912098 -4535155 -3617767
7713 -3617767 326317 5059296 9664748 14059443 18324495 20269046 18766620 16381460
7705 16381460 14353439 11832390 8000772 4753618 4711786 6953597 9045175 11071948
7697 11071948 13414653 14380132 13290584 10470550 6829096 3281639 705702 586210
7689 586210 3498266 8759189 14645574 19362812 20172582 16648417 12853059 11314747 10970777
7680 10970777 10572418 9726600 9685905 10427121 10394676 10615694 10084203 6544731 2429177
$$ packed form
7738I476829k836027j463054J373897L287033K386895j480844m228759n117556
7730A398414m856838l102683q46440K65598Q51231J479419K097278K496798L263075
7721C045852N004574N337029J699071l192733o122534o683357l623057R17388
7713c617767L944084M732979M605452M394695M265052J944551j502426k385160
7705A6381460k028021k521049l831618l247154m1832K241811K091578K026773
7697A1071948K342705R65479j089548k820034l641454l547457k575937j19492
7689E86210K912056N260923N886385M717238Q09770l524165l795358j538312l43970
7680A0970777l98359q45818m0695P41216l2445K21018n31491l539472m115554
$$ plain form
7671 2429177 1817341 3386708 3205451 1261301 -686195 -756471 460008 1550609 1352871
7662 1352871 -437006 -1585859 224056 5231265 11877653 17300643 20480958 22882518
7654 22882518 25798628 28148254 27318075 21902306 13713635 6094567 1069261 640547
7646 640547 3835909 8323456 13674110 17998362 19296298 18406952 16292400 13483249 11248420
7637 11248420 10154999 8311104 4868081 1719601 754588 531588 -1838497 -7193565
7629 -7193565 -12949045 -16106359 -16802263 -16775469 -16983087 -18715510 -20614635 -19640473 -16769374
7620 -16769374 -13808738 -11653408 -11117275 -11933403 -11649826 -9533804 -8301855 -8787941 -9503204
7611 -9503204 -10522722 -10809994 -7466324 -1357451 3878441 6039582 5697307 4900168 4255685
$$ packed form
7671B429177o11836J569367j81257j944150j947496p0276J216479J090601j97738
7662A352871j789877j148853J809915N007209O646388N422990L180315K401560
7654B2882518K916110K349626q30179n415769q188671p619068n025306m28714
7646F40547L195362M487547N350654M324252J297936q89346k114552k809151k234829
7637A1248420j093421j843895l443023l148480r65013k23000k370085n355068
7629g193565n755480l157314o95904K6794k07618j732423j899125R74162K871099
7620a6769374K960636K155330N36133q16128K83577K116022J231949m86086p15263
7611i503204j019518k87272L343670O108873N235892K161141l42275p97139o44483
$$ plain form
7602 4255685 3557028 2439125 435367 -2394294 -5915019 -7521628 -5959954 -3565441
7594 -3565441 -1881874 -731419 125930 1912912 4219776 5271272 4326621 2378175 640415
7585 640415 -1371299 -3739875 -4488770 -1310096 5106581 10361259 11028772 9414771 8906558
7576 8906558 9972533 12631441 15410391 17565968 20330778 22685241 22608001 19823308 16262866
7567 16262866 13153758 8690643 2808425 -533041 978876 5096997 8045105 7420764
7559 7420764 2653236 -3558547 -8287035 -9520130 -8000476 -7202144 -8256135 -9484475
7551 -9484475 -7903275 -2737621 1237502 2095262 2516737 4097719 5999338 7684318 10350557
7542 10350557 13480244 16288875 17540387 15604694 11215549 5978535 -170335 -5239142
$$ packed form
7602D255685o98657j117903k003758k829661l520725j606609J561674K394513
7594c565441J683567J150455Q57349J786982K306864J051496r44651j948446j737760
7585F40415k011714k368576p48895L178674O416677N254678O67513j614001n08213
7576H906558J065975K658908K778950K155577K764810K354463p7240k784693l560442
7567A6262866l109108m463115n882218l341466J511917M118121K948108o24341
7559G420764m767528o211783m728488j233095J519654P98332j053991j228340
7551i484475J581200N165654L975123Q57760M21475J580982J901619J684980K666239
7542A0350557L129687K808631J251512j935693m389145n237014o148870n068807
$$ plain form
7534 -5239142 -5640593 -1561828 3819696 6968308 6213089 1642851 -3547328 -5629127 -3496792
7525 -3496792 406459 2431283 2062197 360594 -205042 1166065 1808285 547221 -1091040
7516 -1091040 -3404055 -7807684 -13372251 -18104853 -21856775 -26193145 -31302158 -34732734
7508 -34732734 -34419977 -31537625 -27736851 -23800968 -19452504 -16413725 -16860632 -17672486 -15890173
7499 -15890173 -14621640 -17537783 -22535102 -25901616 -28301324 -30993264 -33080707 -34404198
7491 -34404198 -33096342 -28855280 -24838031 -20994554 -14497275 -5791097 994647 3657812
7483 3657812 3499052 2531201 668035 -3665689 -8554035 -11562949 -12228477 -10004794 -4709043
7474 -4709043 342429 873392 -2334037 -5316250 -6254694 -7022839 -9337315 -11911214 -12254305
$$ packed form
7534e239142m01451M078765N381524L148612p55219m570238n190179k081799K132335
7525c496792L903251K024824l69086j701603n65636J371107O42220j261064j638261
7516a091040k313015m403629n564567m732602l751922m336370n109013l430576
7508c4732734L12757K882352L800774L935883M348464L038779m46907q11854J782313
7499a5890173J268533k916143m997319l366514k399708k691940k087443j323491
7491c4404198J307856M241062M017249L843477O497279Q706178O785744K663165
7483C657812j58760r67851j863166m333724m888346l008914o65528K223683N295751
7474d709043N051472N30963l207429k982213r38444p68145k314476k573899l43091
$$ plain form
7465 -12254305 -8501977 -1081601 8037997 15627025 19965882 22636456 24690473 26641925
7457 26641925 28363557 28468422 25574653 19495289 11803159 4563312 143299 -1029507
7449 -1029507 -1327234 -3704556 -7057308 -8054598 -6835944 -6707167 -7373397 -5843991 -4506543
7440 -4506543 -6729156 -11336401 -14838586 -15146656 -11978416 -8492165 -7329785 -8485167
7432 -8485167 -10946258 -13904776 -14978329 -13532234 -12289116 -11326047 -8127271 -2890350
7424 -2890350 693537 915944 -1674451 -4473088 -4604965 -2661816 -1210539 -1599130 -1773605
7415 -1773605 -2378243 -4664891 -6472470 -5274623 -1121310 2919131 3940715 1548201
7407 1548201 -1765195 -5494061 -10277014 -12837069 -11679792 -8448361 -4732191 -1355836
$$ packed form
7465a2254305L752328P420376R119598P589028M338857K670574K054017J951452
7457B6641925J721632J04865k893769o079364p692130p239847m420013j172806
7449a029507k97727k377322l352752r97290J218654J28777o66230J529406J337448
7440d506543k222613m607245l502185l08070L168240L486251J162380j155382
7432h485167k461091k958518j073553J446095J243118R63069L198776N236921
7424b890350L583887K22407k590395k798637j31877J943149J451277l88591j74475
7415a773605o04638k286648j807579J197847M153313M040441J021584k392514
7407A548201l313396l728866m782953k560055J157277L231431L716170L376355
$$ plain form
7399 -1355836 2867093 8480678 12150700 11430122 7105081 2032847 601229 2413828
7391 2413828 4221711 5159281 4012959 -110652 -5774972 -10939145 -13683967 -14141054 -13355893
7382 -13355893 -12405916 -11999816 -11825811 -10645689 -9863359 -11763767 -15787872 -19390873 -20905596
7373 -20905596 -21577219 -22096280 -21311669 -19167960 -17192573 -13713258 -5660701 3077383 8095556
7364 8095556 8956873 5709203 930257 -4068173 -9917920 -15740161 -18314439 -15706599
7356 -15706599 -10581431 -6986413 -5652033 -5889051 -7066143 -7696288 -7805125 -8199413 -8178606
7347 -8178606 -8061665 -8634205 -9727369 -10402248 -9416610 -6871726 -4045004 -2884386 -3807946
7338 -3807946 -7060107 -10656977 -13152862 -15935110 -19067280 -20892448 -21328114 -21039419 -21381484
$$ packed form
7399a355836M222929N613585L670022p20578m325041n072234j431618J812599
7391B413828J807883R37570j146322m123611n664320n164173k744822m57087P85161
7382a3355893R49977M06100J74005J180122P82330j900408m024105l603001j514723
7373b0905596o71623n19061P84611K143709J975387L479315Q052557Q738084N018173
7364H095556Q61317l247670m778946m998430n849747n822241k574278K607840
7356a5706599N125168L595018J334380k37018j177092o30145j08837l94288K0807
7347h178606J16941n72540j093164o74879R85638K544884K826722J160618r23560
7338c807946l252161l596870k495885k782248l132170j825168m35666K88695l42065
$$ plain form
7329 -21381484 -23486398 -24578386 -22960201 -20763509 -18566426 -16284889 -14194452 -10505099
7321 -10505099 -5502480 -1597816 525393 1056472 950306 2067603 6301254 10629618
7313 10629618 11327650 8263483 4280980 2094757 778599 -1032571 -1736656 -929766 -2334977
7304 -2334977 -7763748 -14168607 -18510718 -20082957 -19268015 -18571249 -18469888 -17822636 -15675973
7295 -15675973 -11759871 -9871551 -12413007 -15147705 -15388170 -14831180 -16142243 -19231987
7287 -19231987 -21355577 -21648603 -20692291 -19727087 -19032053 -18057537 -16968567 -15126999 -11779249
7278 -11779249 -7362387 -2661075 1856011 5213739 8281281 10545257 8536086 2854222
7270 2854222 -1672446 -3075261 -2954139 -2515884 -1664171 -66559 1827785 2372858 1671733
$$ packed form
7329b1381484k104914j091988J618185K196692K197083K281537K090437L689353
7321a0505099N002619L904664K123209N31079j06166J117297M233651M328364
7313A0629618O98032l064167l982503k186223j316158j811170p04085Q06890j405211
7304b334977n428771o404859m342111j572239Q14942O96766J01361O47252K146663
7295a5675973L916102J888320k541456k734698k40465N56990j311063l089744
7287a9231987k123590k93026R56312R65204O95034R74516J088970J841568L347750
7278a1779249M416862M701312M517086L357728L067542K263976k009171n681864
7270B854222m526668j402815J21122M38255Q51713J597612J894344N45073p01125
$$ plain form
7261 1671733 436801 -1963190 -5554988 -8661315 -9049263 -7017334 -4303432 -1719175
7253 -1719175 -448452 579693 4208624 10588160 17473074 21510308 20503769 15505391
7245 15505391 9819383 5000856 359668 -2620994 -2001545 1390886 5683606 9948106
7237 9948106 12148961 10712023 7848941 6284804 5829448 5505369 5736203 7223486 10497358
7228 10497358 15675928 21404582 26024057 28874754 29974904 29699935 29630194 30028112 28542614
7219 28542614 25051991 20762579 16003383 11786852 8452180 6460512 6833726 8170066
7211 8170066 7711689 3787593 406558 194533 1008081 3858015 10016315 17072622 23045025
7202 23045025 26709907 25991398 21809194 16315147 11571461 9051896 7871745 6660338
$$ packed form
7261A671733j234932k399991l591798l106327l87948K031929K713902K584257
7253a719175J270723J028145L628931O379536O884914M037234j006539m998378
7245A5505391n686008m818527m641188k980662O19449L392431M292720M264500
7237I948106K200855j436938k863082j564137m55356l24079K30834J487283L273872
7228A0497358N178570N728654M619475K850697J100150k74969o9741L97918j485498
7219B8542614l490623m289412m759196m216531l334672j991668L73214J336340
7211H170066m58377l924096l381035k12025Q13548K849934O158300P056307N972403
7202B3045025L664882p18509m182204n494047m743686k519565j180151j211407
$$ plain form
7194 6660338 6168598 6298813 6118894 7089986 10793854 16225963 20761630 23079994 22728974
7185 22728974 19466322 12673982 2807058 -5606142 -8718395 -7682877 -4504281 -522630
7177 -522630 1115254 877846 3510588 7778702 10136783 10593114 11048398 11485356 10753908
7168 10753908 8555160 5459301 2564679 2753223 8178281 17043351 25986783 31016209
7160 31016209 31002991 28606117 26691333 26710908 29424959 33350392 33886339 29456988 23021318
7151 23021318 16600253 10647292 7213804 7934699 10700453 13255931 16030183 18936298
7143 18936298 21007150 22740960 24012692 20474138 10132364 -1757089 -9877593 -14048840
7135 -14048840 -14959636 -14168955 -14222494 -13693946 -10237731 -4584159 1301583 6312953 9430321
$$ packed form
7194F660338m91740J30215j79919R71092L703868N432109M535667K318364l51020
7185B2728974l262652o792340r866924q413200l112253J035518L178596L981651
7177e22630J637884k37408K632742M268114K358081M56331M55284M36958p31448
7168A0753908k198748l095859k894622J88544N425058Q865070Q943432N029426
7160C1016209j3218k396874j914784J9575K714051L925433N35947m429351o435670
7151B3021318o421065n952961l433488P20895K765754K555478K774252K906115
7143A8936298K070852J733810J271732l538554j0341774j1889453q120504m171247
7135a4048840r10796P90681n3539N28548L456215N653572N885742N011370L117368
$$ plain form
7126 9430321 11457845 14114240 16522974 17746937 16905799 13519332 9254969 5913664
$$ packed form
7126I430321K027524K656395K408734J223963q41138l386467m264363l341305
$$ [...]
##END NTUPLES=NMR SPECTRUM
##END=
