##TITLE=abcd
##JCAMPDX= 6.0         $$ Bruker NMR JCAMP-DX V2.0
##DATA TYPE= NMR SPECTRUM
##DATA CLASS= NTUPLES
##ORIGIN= UXNMR, Bruker Analytische Messtechnik GmbH
##OWNER= root
$$ XWIN-NMR		Version 3.5
$$ Mon Sep 15 17:30:35 2025 Russian Standard Time (UT+4h)  servis@DPX200
##.OBSERVE FREQUENCY= 200.131235884673
##.OBSERVE NUCLEUS= ^1H
##.ACQUISITION MODE= SIMULTANEOUS
##.ACQUISITION SCHEME= undefined
##.AVERAGES= 16
##.DIGITISER RES= 18
##SPECTROMETER/DATA SYSTEM= spect
##.PULSE SEQUENCE= zg
##.SOLVENT NAME= CDCl3
##.SHIFT REFERENCE= (INTERNAL, CDCl3, 0, 16.4885)
##AUDIT TRAIL= $$ (NUMBER, WHEN, WHO, WHERE, WHAT)
$$ ##TITLE= Audit trail, XWIN-NMR		Version 3.5
$$ ##JCAMPDX= 5.01
$$ ##ORIGIN= Bruker BioSpin GmbH
$$ ##OWNER= servis
$$ F:\spectra/data/av/nmr/H1/1/pdata/1/auditp.txt
$$ ##AUDIT TRAIL=  $$ (NUMBER, WHEN, WHO, WHERE, WHAT)
(   1,<2025-09-15 17:29:47.00 +0400>,<servis>,<DPX200>,
      <created by zg, POWCHK disabled, PULCHK disabled
       terminated by command 'halt'
       configuration hash MD5:
       00 E9 B6 7A A2 85 ED C7 34 08 36 98 17 FE 4E 26
       data hash MD5: 32K
       28 44 C3 9F 9A EE 51 52 26 30 77 4E 37 7D E0 55>)
(   2,<2025-09-15 17:30:03.31 +0400>,<servis>,<DPX200>,
      <Start of raw data processing
       efp BC_mod = 2 LB = 0.05 FT_mod = 6 PKNL = 1 PHC0 = -195.3045 PHC1 = 2.101565 SI = 16K 
       data hash MD5: 16K
       A2 A8 F8 8F 4C 9F 78 C2 5A 61 F7 C7 DB A8 91 5B>)
(   3,<2025-09-15 17:30:14.00 +0400>,<servis>,<DPX200>,
      <pk PHC0 = -1.4 PHC1 = 0 
       data hash MD5: 16K
       B2 45 88 36 64 78 CE 44 A2 A0 0E A5 85 8F 68 A5>)
$$ ##END=
$$ 
$$ hash MD5
$$ E3 96 59 A3 F9 15 48 EA A2 D6 D0 76 B4 A4 B5 2B
##$RELAX= 
##$RELAX= 
##$RELAX= 
##$RELAX= 
##$RELAX= 
##$RELAX= 
##$RELAX= 
##$RELAX= 
$$ Bruker specific parameters
$$ --------------------------
##$DU= <F:\spectra>
##$EXPNO= 1
##$NAME= <H1>
##$PROCNO= 1
##$TYPE= <nmr>
##$USER= <av>
##$AMP= (0..31)
100 100 100 100 100 100 100 100 100 100 100 100 100 100 100 100 100 100 
100 100 100 100 100 100 100 100 100 100 100 100 100 100 
##$AQSEQ= 0
##$AQ_mod= 1
##$AUNM= <au_zg>
##$AUTOPOS= <>
##$BF1= 200.13
##$BF2= 200.13
##$BF3= 200.13
##$BF4= 200.13
##$BF5= 500.13
##$BF6= 500.13
##$BF7= 500.13
##$BF8= 500.13
##$BYTORDA= 1
##$CFDGTYP= 0
##$CFRGTYP= 5
##$CHEMSTR= <none>
##$CNST= (0..31)
1 1 145 1 1 1 1 1 1 1 1 1 1 1 1 1 1 1 1 1 1 1 1 1 1 1 1 1 1 1 1 1 
##$CPDPRG= <>
##$CPDPRG1= <>
##$CPDPRG2= <>
##$CPDPRG3= <>
##$CPDPRG4= <mlev>
##$CPDPRG5= <mlev>
##$CPDPRG6= <mlev>
##$CPDPRG7= <mlev>
##$CPDPRG8= <mlev>
##$CPDPRGB= <>
##$CPDPRGT= <>
##$D= (0..31)
0 2 0 0 0 0 0 0 0 0.06 0 0 0 0 0 0 0.0002 0 0 0 0 0 0 0 0 0 0 0 0 0 0 
0 
##$DATE= 1757942986
##$DBL= (0..7)
120 120 120 120 120 120 120 120 
##$DBP= (0..7)
150 150 150 150 150 150 150 150 
##$DBP07= 0
##$DBPNAM0= <>
##$DBPNAM1= <>
##$DBPNAM2= <>
##$DBPNAM3= <>
##$DBPNAM4= <>
##$DBPNAM5= <>
##$DBPNAM6= <>
##$DBPNAM7= <>
##$DBPOAL= (0..7)
0.5 0.5 0.5 0.5 0.5 0.5 0.5 0.5 
##$DBPOFFS= (0..7)
0 0 0 0 0 0 0 0 
$$ [...]
##$SUBNAM4= <"">
##$SUBNAM5= <"">
##$SUBNAM6= <"">
##$SUBNAM7= <"">
##$SUBNAM8= <"">
##$SUBNAM9= <"">
##$SW= 20.6817932712277
##$SWIBOX= (0..15)
0 0 3 0 0 0 0 0 0 0 0 0 0 0 0 0 
##$SW_h= 4139.07284768212
##$TD= 32768
##$TD0= 1
##$TE= 0
##$TE2= 300
##$TE3= 300
##$TEG= 300
##$TL= (0..7)
0 120 120 120 120 120 120 120 
##$TP= (0..7)
150 150 150 150 150 150 150 150 
##$TP07= 0
##$TPNAME0= <>
##$TPNAME1= <>
##$TPNAME2= <>
##$TPNAME3= <>
##$TPNAME4= <>
##$TPNAME5= <>
##$TPNAME6= <>
##$TPNAME7= <>
##$TPOAL= (0..7)
0.5 0.5 0.5 0.5 0.5 0.5 0.5 0.5 
##$TPOFFS= (0..7)
0 0 0 0 0 0 0 0 
##$TUNHIN= 0
##$TUNHOUT= 0
##$TUNXOUT= 0
##$USERA1= <user>
##$USERA2= <user>
##$USERA3= <user>
##$USERA4= <user>
##$USERA5= <user>
##$V9= 5
##$VALIST= <valist>
##$VCLIST= <CCCCCCCCCCCCCCC>
##$VD= 0
##$VDLIST= <DDDDDDDDDDDDDDD>
##$VPLIST= <PPPPPPPPPPPPPPP>
##$VTLIST= <TTTTTTTTTTTTTTT>
##$WBST= 1024
##$WBSW= 30
##$XGAIN= (0..3)
0 0 0 0 
##$XL= 0
##$YL= 0
##$YMAX_a= 1261420
##$YMIN_a= -1315868
##$ZGOPTNS= <>
##$ZL1= 120
##$ZL2= 120
##$ZL3= 120
##$ZL4= 120
##$ABSF1= 0
##$ABSF2= 0
##$ABSG= 0
##$ABSL= 0
##$ALPHA= 0
##$AQORDER= 0
##$ASSFAC= 0
##$ASSFACI= 0
##$ASSFACX= 0
##$ASSWID= 0
##$AUNMP= <proc_1d>
##$AZFE= 0.1
##$AZFW= 0.1
##$BCFW= 0
##$BC_mod= 2
##$BYTORDP= 0
##$COROFFS= 0
##$CY= 18.4799938201904
##$DATMOD= 1
##$DC= 0
##$DFILT= <>
##$DTYPP= 0
##$F1P= 9.9274215381318
##$F2P= -0.165520771350173
##$FCOR= 1
##$FTSIZE= 16384
##$FT_mod= 6
##$GAMMA= 0
##$GB= 0
##$INTBC= 1
##$INTSCL= 4.127829e-11
##$ISEN= 128
##$LB= 0.05
##$LEV0= 0
##$LPBIN= 0
##$MAXI= 10000
##$MC2= 0
##$MEAN= 0
##$ME_mod= 0
##$MI= 50
##$NCOEF= 0
##$NC_proc= -3
##$NLEV= 6
##$NOISF1= 3.799351
##$NOISF2= 2.8
##$NSP= 0
##$NTH_PI= 0
##$NZP= 0
##$OFFSET= 16.48848
##$PC= 4
##$PHC0= -196.7045
##$PHC1= 2.101565
##$PH_mod= 1
##$PKNL= yes
##$PPARMOD= 0
##$PSCAL= 4
##$PSIGN= 0
##$REVERSE= no
##$SF= 200.130005582386
##$SI= 16384
##$SIGF1= 3
##$SIGF2= 2
##$SINO= 400
##$SIOLD= 16384
##$SREGLST= <1H.CDCl3>
##$SSB= 0
##$STSI= 16384
##$STSR= 0
##$SW_p= 4139.07284768211
##$SYMM= 0
##$S_DEV= 0
##$TDeff= 32768
##$TDoff= 0
##$TI= <>
##$TILT= no
##$TM1= 0
##$TM2= 0
##$TOPLEV= 0
##$USERP1= <user>
##$USERP2= <user>
##$USERP3= <user>
##$USERP4= <user>
##$USERP5= <user>
##$WDW= 1
##$XDIM= 16384
##$YMAX_p= 306146688
##$YMIN_p= -289542
$$ End of Bruker specific parameters
$$ ---------------------------------
##NTUPLES= NMR SPECTRUM
##VAR_NAME=  FREQUENCY,     SPECTRUM/REAL,   SPECTRUM/IMAG
##SYMBOL=    X,             R,               I
##VAR_TYPE=  INDEPENDENT,   DEPENDENT,       DEPENDENT
##VAR_FORM=  AFFN,          ASDF,            ASDF
##VAR_DIM=   16384,         16384,           16384
##UNITS=     HZ,            ARBITRARY UNITS, ARBITRARY UNITS
##FACTOR=    0.252644378177508, 1,           1
##FIRST=     3299.83951724647, 0,            0
##LAST=      -839.233330435636, 0,           0
##MIN=       -839.233330435636, -289542,     0
##MAX=       3299.83951724647, 306146688,    0
$$ Real data points
##PAGE= N=1
##DATA TABLE= (X++(R..R)), XYDATA
$$ [...]
6194A2600321J337324J571896J872965K268166K794367L458084M166757M739079
6186C4808959N194679N279857M343598K532624N28325j321564k268864k184448
6178D6913166j645801j001771l76049K40798Q73219J549260K372027L446953M890996
6169E7262798O661886Q194943R127140J0008889R268950N231202J49017m752004
6161A01152821q697677r270353p996477o513039n184632m057842l153259k447358
6153E3832184j811502j042961j59446P52954J613718K211583K546126K496360
6145F0439016J418989n52689k627800m435860n312210n102732m497004l856721
6137C5472989l282882k819961k472202k200631j964576j738650j531911j362883
$$ plain form
6194 12600321 13937645 15509541 17382506 19650672 22445039 25903123 30069880 34808959
6186 34808959 40003638 45283495 49627093 52159717 52688042 51366478 49097614 46913166
6178 46913166 45267365 44265594 43889545 44130343 45003562 46552822 48924849 52371802 57262798
6169 57262798 63924684 72119627 81246767 91255656 100524606 105755808 105904825 101152821
6161 101152821 92455144 83184791 75188314 68675275 63490643 59432801 56279542 53832184
6153 53832184 52020682 50977721 50818275 51571229 53184947 55396530 57942656 60439016
6145 60439016 61858005 61305316 58677516 54241656 48929446 43826714 39329710 35472989
6137 35472989 32190107 29370146 26897944 24697313 22732737 20994087 19462176 18099293
6129A8099293j215354j107237j004237r23103q51791p88193p05523o27019n66406
6120A0310430n14816m69738m34189m03331l70924l44010l19068k95684k72915
6111F885755k54015k37015k21310k17326k07047k05161k00534j94012j82012j64160
6101D803163j50106j37004j33197j26256j20367j21174j18000j07348j06135r4217
6091C589359q6742q1239p7258p9305p3336p5385o9404p0154o4171o2350n3757
6080B796258n4060n9962n0762n0453m8276m6854m2556n0355m8522m3812m8187
6069B252459m9599l9173m2125l9425m1996l5433l9084l8534l6205l0394l1138
6058A829353l5523k6725k8347k8515l0190k8975k9892k8560l6143l0498l4532
$$ plain form
6129 18099293 16883939 15776702 14772465 13849362 12997571 12209378 11503855 10876836 10310430
6120 10310430 9795614 9325876 8891687 8488356 8117432 7773422 7454354 7158670 6885755
6111 6885755 6631740 6394725 6173415 5956089 5749042 5543881 5343347 5149335 4967323 4803163
6101 4803163 4653057 4516053 4382856 4256600 4136233 4015059 3897059 3789711 3683576 3589359
6091 3589359 3502617 3421378 3344120 3264815 3191479 3116094 3046690 2976536 2912365 2850015 2796258
6080 2796258 2742198 2682236 2631474 2581021 2532745 2485891 2443335 2392980 2344458 2300646 2252459
6069 2252459 2202860 2163687 2121562 2082137 2040141 2004708 1965624 1927090 1890885 1860491 1829353
6058 1829353 1793830 1767105 1738758 1710243 1680053 1651078 1621186 1592626 1556483 1525985 1491453
6047A491453l2136l0329k6231l1468k6934k9042k4652k6552j9534k5801j8982
6036A199792k0208k3793k0262k3309k5085k0724k4360j8594k0474j3253j9822
6025I69908j6426j7359k4142j7156k1954k0390j7117j6366j4734j5099j8841j0815
6013G59509j4008j2458q937r567p731l495n069j917m796o673q529j6808j8091
6000F41430k1844k1567j5955j4340j1264q465q850o856q678p814n268n033r87
5987E04509q362p309n953j2325p378j0369j0416j1576j3454j2672r976j6465n641
5974C72613j0339o110l407p358n100n945n075m373r424m703r992j340p614r064
5960B82769n393l228k781j2658o01p519m491R61r086k59o063k227m392l146m223
$$ plain form
6047 1491453 1459317 1428988 1402757 1371289 1344355 1315313 1290661 1264109 1244575 1218774 1199792
6036 1199792 1179584 1155791 1135529 1112220 1087135 1066411 1042051 1023457 1002983 989730 969908
6025 969908 953482 936123 911981 894825 872871 852481 835364 818998 804264 789165 770324 759509
6013 759509 745501 733043 724106 714539 706808 703313 698244 696327 691531 684858 676329 659521 641430
6000 641430 619586 598019 582064 567724 556460 547995 539145 532289 523611 515797 510529 505496 504509
5987 504509 496147 488838 482885 470560 463182 452813 442397 430821 417367 404695 394719 378254 372613
5974 372613 362274 356164 352757 345399 340299 334354 329279 324906 315482 310779 300787 299447 291833 282769
5960 282769 277376 274148 271367 258709 258108 250589 246098 247059 237973 237714 231651 229424 225032 221886 217663
5945B17663j060p166j136k017k432p820l924k271m535j778k236m880l941j476
5931A70991o138q33m512j571m044k618k028l511m240m175K070j356l736n368j247
5916A27684l574k869j269m396j59n114L653q097k33k27m827q08k097l797J36m224
5900H9782P56j228L62n848M108q134m2m109J408n735J064l489j908k519n81k369
5884F1518j008l646J588o334l43j294j779n290j18n5l111p22o22m158R22k696
5868C2852k577j130m656P0k498J978m417J056r95P2k340r59j188k160j020r42
5852A1146k294kk300J311m239K317j448M06o492R88j061p12j362Q40l053K108
5836c847l639K536l976r12j268p02P19N84l633J549q16r90n6l17l36l206J58n930
$$ plain form
5945 217663 216603 209437 208301 206284 203852 196032 192108 189837 185302 183524 181288 176408 172467 170991
5931 170991 164853 164020 159508 157937 153893 151275 149247 145736 141496 137321 139391 138035 134299 128931 127684
5916 127684 124110 121241 119972 115576 115417 110303 113956 105859 105626 105399 100572 99764 97667 93870 94006 89782
5900 89782 90538 89310 89672 83824 87932 79798 79756 75647 77055 71320 72384 68895 66987 64468 63887 61518
5884 61518 60510 56864 58452 52118 51775 50481 48702 43412 43294 43239 40128 39406 38784 34626 35548 32852
5868 32852 30275 29145 24489 24559 22061 24039 19622 20678 19683 19755 17415 16456 15268 13108 12088 11146
5852 11146 8852 8850 6550 7861 3622 5939 4491 4897 -1595 -607 -1668 -2380 -3742 -2902 -5955 -3847
5836 -3847 -7486 -4950 -8926 -9838 -11106 -11808 -11089 -10505 -14138 -12589 -13405 -14395 -14451 -14768 -15104 -18310 -18152 -24082
5818b4082M931k417k160L685k559P38l027K54o06J188l353N1n05j399K37j976
5802c1000n6K673j707J856j321l934j009j189K524O76j724J665j254J040j514
5787c4274k55m124J627K77m315K064K472k610J468o026L719j385k580K442j088
5772d2588J001l94l695q01Q86O391p299L3J648m085L98K780J286q19j126l478
5756d9862L549j733J295L99k436L956l494m40k56o19K99L59j546J242j993N59
5740e0721P56j393J148q56Q07o93K499k713K52l527M040J209l530M704n183L177
5724e0024q37N24k103M15K07l247l40j46K545j979m26K528R94j690q53j257R51
5707e4738J000j851K992k564j712L880k687N64K163K110l889L449m254J340l93
$$ plain form
5818 -24082 -19151 -21568 -23728 -20043 -22602 -21864 -24891 -24637 -25243 -24055 -27408 -27357 -27862 -29261 -29024 -31000
5802 -31000 -31056 -28383 -30090 -28234 -29555 -33489 -34498 -35687 -33163 -32487 -34211 -32546 -33800 -32760 -34274
5787 -34274 -34529 -38653 -37026 -36749 -41064 -39000 -36528 -39138 -37670 -43696 -39977 -41362 -43942 -41500 -42588
5772 -42588 -41587 -41981 -45676 -46477 -45591 -39200 -46499 -46466 -44818 -48903 -48505 -45725 -44439 -45258 -46384 -49862
5756 -49862 -46313 -48046 -46751 -46352 -48788 -44832 -48326 -48766 -49022 -49641 -49342 -48983 -50529 -49287 -51280 -50721
5740 -50721 -49965 -51358 -50210 -51066 -50259 -50952 -48453 -51166 -50914 -54441 -50401 -49192 -52722 -48018 -53201 -50024
5724 -50024 -50861 -50337 -52440 -52025 -51818 -55065 -55405 -55551 -53006 -54985 -55411 -52883 -51889 -53579 -54432 -55689 -54738
5707 -54738 -53738 -55589 -52597 -55161 -56873 -52993 -55680 -55116 -52953 -50843 -54732 -51283 -55537 -54197 -54590
5692e4590q1J915q1p38k106M497o40J62j492K290j258j544L625l603K732L858
5676d7054l850k504J451K618j288r82L88L98o76L926o479J437k26K469j404K007
5660d9769l300K753q10K891k975l83l30L087k254J066k434J157L481j576l73J556
5644d8213l113K507M237k616j001l88Q82J801j303Q78j79j806o32L029r3K043
5628d3967n70J2j106J8K377j918M370n214M834l897J864r26M03K673l716J714
5612d3049L866k460K914l608O136l592K085K53r57L718O05j950K061j598J763
5597c3813L179J75R50j050K026K720J423K132M007j475K629N448o37N048M256
5582b982R28N204M180J964J1034M350P101O803P391Q999J5868J2969J5457J7880
$$ plain form
5692 -54590 -54671 -52756 -52837 -53575 -55681 -51184 -51824 -51662 -53154 -50864 -52122 -53666 -50041 -53644 -50912 -47054
5676 -47054 -50904 -53408 -51957 -49339 -50627 -51609 -51221 -50823 -51499 -47573 -54052 -52615 -52841 -50372 -51776 -49769
5660 -49769 -53069 -50316 -51126 -48235 -51210 -51593 -51923 -48836 -51090 -50024 -52458 -51301 -47820 -49396 -49769 -48213
5644 -48213 -51326 -48819 -44582 -47198 -48199 -48587 -47705 -45904 -47207 -46329 -46508 -48314 -48946 -45917 -46010 -43967
5628 -43967 -44537 -44525 -45631 -45613 -43236 -45154 -40784 -45998 -41164 -45061 -43197 -44123 -43720 -41047 -44763 -43049
5612 -43049 -39183 -41643 -38729 -42337 -36201 -39793 -37708 -37455 -38412 -34694 -34089 -36039 -33978 -35576 -33813
5597 -33813 -30634 -30459 -29509 -30559 -28533 -25813 -24390 -22258 -18251 -19726 -17097 -11649 -12286 -7238 -2982
5582 -2982 -2054 3150 7330 9294 20328 24678 31779 38582 45973 54972 70840 83809 99266 117146
5568A17146K5397K1300L1570L9152M6156N3154N7461O0029N0420L2064K667k3918
5556E12598m8414m9164m9190m2921l8817l5618k9598k3529k1561k1481j7928j7587
5544A16790j3394r168q350j4030q476q546j499j1840m273l599m900n215l241k040
5530A8219m392l259J753o654j738l851J208m325J118m083k364r18O38k758l113
5515a4519J429k834l181K256k910p71j651j550J109J793k849L25j486K155k279
5500b4963j417M85J048N50k193O83n2m94l962L890l09m618J722k421P124m661
5484b9588J398J459k365j772J309K28j201Q07L005k605L37j852J026M44K13j304
5468c0461n99K519j935J554k699M30k55j978L386P46k981K265P64k733R41Q32
$$ plain form
5568 117146 142543 163843 195413 234565 280721 333875 391336 451365 501785 533849 536516 512598
5556 512598 464184 415020 365830 322909 284092 248474 218876 195347 173786 152305 134377 116790
5544 116790 103396 94228 85878 71848 63372 54826 53327 41487 37214 33615 28715 23500 20259 18219
5530 18219 13827 10568 12321 5667 3929 78 1286 -3039 -1921 -6004 -8368 -9286 -8648 -11406 -14519
5515 -14519 -13090 -15924 -19105 -16849 -19759 -20530 -22181 -23731 -22622 -20829 -23678 -23353 -24839 -22684 -24963
5500 -24963 -26380 -25895 -24847 -24297 -26490 -25807 -25859 -26353 -30315 -26425 -26734 -31352 -29630 -32051 -24927 -29588
5484 -29588 -28190 -26731 -29096 -30868 -29559 -29331 -30532 -29725 -26720 -29325 -28988 -30840 -29814 -29370 -29157 -30461
5468 -30461 -31060 -28541 -30476 -28922 -31621 -31191 -31446 -33424 -30038 -29292 -32273 -30008 -29244 -31977 -31036 -30204
5452c0204O6l080K658J02j414L870j645j764n80L557l153L50n86J833j790J103
5436c0677K626l186K822J826k812p58P87j399m8L253j384J947k808K11j182J115
5420b9667K742j758k377J85J353J715J112k642M00J506J140k569l848L851K988
5405b5869j347j066j332K644l879K713J78Q52q09J520Q02l085K495l508m50M421
5389b5720j177j11J890J611o83j113Q01J113o49j946j176J414J472J163M88j904
5373b4527K595j095o94j897K136Q28M38J007k013K800j071K430k228O40J279o937
5357b6309N863J92L30r46n1L230n198Q023l280j507L454o41j498J070j585Q6J445
5340a7322n14N61M08J394m069N449k832k653L900K656j290k30J068K819j890K7
$$ plain form
5452 -30204 -30138 -33218 -30560 -30458 -31872 -28002 -29647 -31411 -31991 -28434 -31587 -31237 -31823 -29990 -31780 -30677
5436 -30677 -28051 -31237 -28415 -26589 -29401 -30159 -29372 -30771 -30819 -27566 -28950 -27003 -29811 -29600 -30782 -29667
5420 -29667 -26925 -28683 -31060 -30875 -29522 -27807 -26695 -29337 -28937 -27431 -26291 -28860 -32708 -28857 -25869
5405 -25869 -27216 -28282 -29614 -26970 -30849 -28136 -27958 -27106 -27915 -26395 -25593 -28678 -26183 -29691 -30141 -25720
5389 -25720 -26897 -27008 -25118 -23507 -24190 -25303 -24502 -23389 -24038 -25984 -27160 -25746 -24274 -23111 -22623 -24527
5373 -24527 -21932 -23027 -23721 -25618 -23482 -22654 -22216 -21209 -23222 -20422 -21493 -19063 -21291 -20651 -19372 -26309
5357 -26309 -20446 -20254 -19924 -20870 -20921 -17691 -22889 -14866 -18146 -19653 -16199 -16840 -18338 -17268 -18853 -18767 -17322
5340 -17322 -17836 -17275 -16867 -15473 -19542 -14093 -16925 -19578 -15678 -13022 -14312 -14542 -13474 -10655 -12545 -12518
5324a2518J539K612k839p60J236m031J294K872j349n94J050P24k77J821k529K321
5308i428k494R09N57M310k261k084K174j67O9j390K337r1j358K997K003k032L76
5291e573q61J918k527K481P8J202k375J259j550J30K329k144K322m44q08L543
5275a020j975l74L274l068J163j480K151j392L772J271K137k655Q4R39l228K411
5259B010l01j308J015K566m03l982J74O56J75J606j7J506q67J489j011Q06P08
5242D822R84k979L037K133k340j81J069n94q03L553l930N619Q35k152J339K857
5226A3269l284m60J641K721l337L214J992l243J390K2k338m3J259L253o97M27
5210A5786j461K220J383n156L381J964k039j74L299p19N455k556k410M168j329
$$ plain form
5324 -12518 -10979 -8367 -11206 -11966 -10730 -14761 -13467 -10595 -11944 -12538 -11488 -10764 -11041 -9220 -11749 -9428
5308 -9428 -11922 -11013 -10456 -6146 -8407 -10491 -8317 -8484 -8415 -9805 -7468 -7559 -8917 -5920 -3917 -5949 -5573
5291 -5573 -6434 -4516 -7043 -4562 -4484 -3282 -5657 -4398 -5948 -5818 -3489 -5633 -3311 -3755 -4563 -1020
5275 -1020 -2995 -3369 -95 -3163 -2000 -3480 -1329 -2721 1051 2322 4459 1804 1888 2827 -401 2010
5259 2010 1709 401 1416 3982 3579 -403 -229 427 602 2208 2191 3697 2830 4319 3308 4114 4822
5242 4822 5806 2827 5864 7997 5657 5476 6545 5951 5148 8701 4771 10390 11225 9073 10412 13269
5226 13269 9985 9525 11166 13887 10550 13764 15756 12513 13903 13925 11587 11544 12803 16056 15359 15786
5210 15786 14325 16545 17928 12772 16153 18117 16078 15904 19203 18484 23939 21383 18973 23141 21812
5195B1812j42J854L56r41O72M55J352N51j022K079k639J450J20K683r53R02J389
5178B9978K382q66K47k86J790J917j512k320M619m318K113l4r89J633P49J84J787
5161C7074l532L992K650m078M100K549J249r06j052k777K443R64L544N60J80J91
5145D7151l568K441q92L046k722L026N131r57k99k72K896N47r14J013K276k796
5129E5107K273j648M407R29l95M992n819P701k833J752j177J182L395j314j506
5114F7046J108J761n06L619K901j496r93L932n93N18J893J295P54J56N74K528
5098H4497o64M579n80P66J892j37L013k3J828R25K39L980K144j54M307j605P66
5081A05773N644k689L345J653L651K135J935m5N378J108M270L188K312M152J353
$$ plain form
5195 21812 21670 23524 23880 22939 23611 24066 25418 25969 24947 27026 24387 25837 25957 28640 27687 28589 29978
5178 29978 32360 31494 31741 31455 33245 35162 33650 31330 35949 31631 33744 33710 32721 34354 35103 35287 37074
5161 37074 33542 37534 40184 36106 40206 42755 44004 43098 42046 39269 41712 42676 46220 46780 46960 47151
5145 47151 43583 46024 45132 48178 45456 48482 53613 52656 52357 52085 54981 55528 54614 55627 57903 55107
5129 55107 57380 55732 60139 61068 60673 65665 59846 67547 64714 66466 65289 66471 69866 68552 67046
5114 67046 68154 69915 69409 73028 75929 74433 73440 77372 76779 77297 79190 80485 81239 81395 81969 84497
5098 84497 83833 88412 87832 88598 90490 90353 93366 93343 95171 96096 96335 100315 102459 102305 106612 105007 105773
5081 105773 111417 108728 112073 113726 117377 119512 121447 121402 126780 127888 132158 135346 137658 141810 143163
5066A43163N300O055L373N164P565J0063R865J1544J5073J3909J6689J7095J2128
5053B76986P875m596j316n010m514l778M00j627K411O657L739O389J4426J2906
5039C10948J5479K0084J6815K5781J8490K1195J3283K0085J8381K9770L2798L8494
5027E81603L2275K5708P044j4235k7419k5402k4695j8047j2610n352j569J820
5015E19121N252R957J4369K0951L4603L4132M2972M1181L0859J6988K384o157
5003G66612m064R64J3804K1386K1620Q124o926k8021l6717l4868k9648k5429j5843
4990F50994j2460j1649j327k760Q085J3826J8980K9625K7530L3559K9354K2614
4978H06371L115j2990k7494k8262j9126j3789q283n401o987j0938j5526k0500
$$ plain form
5066 143163 148463 154518 157891 163055 170620 180683 190548 202092 217165 231074 247763 264858 276986
5053 276986 284861 280265 278949 273939 269425 265647 266047 264420 266831 273488 277227 283616 298042 310948
5039 310948 326427 346511 363326 389107 407597 428792 442075 462160 480541 510311 543109 581603
5027 581603 613878 639586 646630 632395 604976 579574 554879 536832 524222 518870 517301 519121
5015 519121 524373 534330 548699 569650 604253 638385 681357 722538 753397 770385 772769 766612
5003 766612 762548 763512 777316 798702 820322 828446 821520 793499 756782 721914 692266 666837 650994
4990 650994 638534 626885 625558 622798 630883 644709 663689 693314 720844 754403 783757 806371
4978 806371 809486 796496 769002 740740 721614 707825 699542 694141 687154 676216 660690 640190
4966F40190j7475j6661n103j1840l678o115L47k180L626O259L777R387J1053J2474
4952F24061J2553O837K963q563r521o001q821l081n016j393j55n252M8l79J068
4937E99348J434M187N301J504Q577Q280L533P624N430P449N761K832R727O283
4923F77270J0484M759M270N996O886P676J1723M385P635M634L649M787P976L045
4909G65175Q029J3796J1784J4920J2684J5987J2177J7150J7880J2375J3303R509
4897I24769P537J2217M861Q658J1699L392J4432N593R872J5454J1175J1804J2464
4884A053927R509J3124R859J5504J7412J6324J7032K3625K0734K2212K4788J7812
4872A261862J7868J2953J4484P384J5696J2657R889J2884J1439J3102J3564J5298
$$ plain form
4966 640190 622715 606054 600951 589111 585433 579318 579665 577485 581111 587370 591147 600534 611587 624061
4952 624061 636614 643451 646414 637851 628330 622329 613508 610427 605411 604018 603863 598611 598659 598280 599348
4937 599348 600782 604969 610270 611774 620351 628631 632164 639788 645218 652667 658428 661260 670987 677270
4923 677270 687754 692513 696783 702779 709665 717341 729064 733449 741084 745718 749367 754154 762130 765175
4909 765175 773204 787000 798784 813704 826388 842375 854552 871702 889582 901957 915260 924769
4897 924769 932306 944523 949384 958042 969741 973133 987565 993158 1003030 1018484 1029659 1041463 1053927
4884 1053927 1063436 1076560 1086419 1101923 1119335 1135659 1152691 1176316 1197050 1219262 1244050 1261862
4872 1261862 1279730 1292683 1307167 1314551 1330247 1342904 1352793 1365677 1377116 1390218 1403782 1419080
4860A419080J9961K0603K4888K4620K5220K1374K0458J4728K3454K3146K4268
4849A661800K6804K4713K8107K7438K2703K0429K1594K4586K5472K9311K4198
4838A937155K7642K8388K4706K8558K8672L1343L7201M3824M3236M1560M5527
4827B317812M0569M1914M3967M3302M6219N2249M7667O0009N7485N7546O1162
4816B869901O3510O5898P1381P8037Q0172Q7372R7791R4674J03844J07082J16089
4805C835751J27075J42186J50828J56239J68508J83177J96253K16748K40898K62228
4795E679891K92990L24078L77720M25355M83807N44485O13036P06340Q13987R60084
4785A1221773J160041J441841J821343K242818K549071K817352K868588K274411
$$ plain form
4860 1419080 1439041 1459644 1484532 1509152 1534372 1555746 1576204 1590932 1614386 1637532 1661800
4849 1661800 1688604 1713317 1741424 1768862 1791565 1811994 1833588 1858174 1883646 1912957 1937155
4838 1937155 1964797 1993185 2017891 2046449 2075121 2106464 2143665 2187489 2230725 2272285 2317812
4827 2317812 2358381 2400295 2444262 2487564 2533783 2586032 2633699 2693708 2751193 2808739 2869901
4816 2869901 2933411 2999309 3070690 3148727 3228899 3316271 3414062 3508736 3612580 3719662 3835751
4805 3835751 3962826 4105012 4255840 4412079 4580587 4763764 4960017 5176765 5417663 5679891
4795 5679891 5972881 6296959 6674679 7100034 7583841 8128326 8741362 9447702 10261689 11221773
4785 11221773 12381814 13823655 15644998 17887816 20436887 23254239 26122827 28397238
4777B8397238J233195J34076q93822j310790j168789q51909n17917k02388J08514
4768B4927408L89106O82071J039532J472789J991975K563624L044126L429513
4760C9540144L746311L678253L171415K697626K575459L131060M357583N476911
4752F8374762O392062O507224M609473J445780j721281m602965n581560m941915
4744G0481580l910432k906538j982683j140538l84623L73700J272185K374456
4736F4177107L665709N027927O048618O679238O999280N952904L354996P73210
4728A02678989j235763j797030l64879J391598K897633L352727J667489j217405
4720A07373359m182638o764304p320416o430082n268342m176565l201432k320526
$$ plain form
4777 28397238 29630433 29764509 28870687 27559897 26391108 25539199 25021282 24818894 24927408
4768 24927408 25316514 25998585 27038117 28510906 30502881 33066505 36110631 39540144
4760 39540144 43286455 46964708 50136123 52833749 55409208 58540268 62897851 68374762
4752 68374762 74766824 81274048 85883521 87329301 85608020 81005055 75423495 70481580
4744 70481580 66571148 63664610 61681927 60541389 60156766 60530466 61802651 64177107
4736 64177107 67842816 72870743 78919361 85598599 92597879 98550783 101905779 102678989
4728 102678989 101443226 99646196 99281317 100672915 103570548 106923275 108590764 107373359
4720 107373359 103190721 96426417 89106001 82675919 77407577 73231012 70029580 67709054
4712F7709054j528813p55221J59744J282216K571156L892918M808384N332373
4704H3471811N440754L943318Q74522k173917m823787n965046n114592l772349
4696G1880714k589921j990253k212157k907171l742274m314815m164394l635834
4688D6323895l079290k579894k151213j764026j409857j076705p02913k40247
4680C3319750K60688P57890J067386J267052J217976N15469o51583j776915k730333
4671C3247380l050372k780539k383008k025473j723846j487220j320931j202938
4663A7273053j091895r80198q70087p73992p00739o46690n85480n44312n02621
4654A0577039m66901m25319l89610l54979l21083k98667k81333k59418k42806
$$ plain form
4712 67709054 66180241 65425020 65584764 66866980 69438136 73331054 78139438 83471811
4704 83471811 88912565 92855883 93730405 91556488 86732701 80767655 75653063 71880714
4696 71880714 69290793 67300540 65088383 62181212 58438938 54124123 49959729 46323895
4688 46323895 43244605 40664711 38513498 36749472 35339615 34262910 33559997 33319750
4680 33319750 33580438 34338328 35405714 36672766 37890742 38406211 37754628 35977713 33247380
4671 33247380 30197008 27416469 25033461 23007988 21284142 19796922 18475991 17273053
4663 17273053 16181158 15200960 14330873 13556881 12856142 12209452 11623972 11079660 10577039
4654 10577039 10110138 9684819 9295209 8940230 8619147 8320480 8039147 7779729 7536923
4645G536923k34037k16280k04869j93302j81947j77010j64215j61546j57820j52844
4635E693053j60053j51992j41918j34674j21745j20575j15296j12192j05877j03119
4625D425612j00220r6695r0464q3144q1302p7458p8190p1392p8673p1458p1231
4614C525385p4827o8505o5914o3953o7454o6216o5327o1156n9031n7708n5023
4603B820271n1983m8888m8231m9263m3039n2402m2958m1468m6723l4641m2054
4592B318621l5826l3497m0859l7462m1261m6868m8038m4716m1253m1631l7842
4581A869368m1061l0797m1502l3564k7289k6484k7175j3280k9428k5508k3558
4570A549722k6086k8219k8627k3129k9470k1771j9983k6139k2018k6742k1489
$$ plain form
4645 7536923 7302886 7086606 6881737 6688435 6506488 6329478 6165263 6003717 5845897 5693053
4635 5693053 5533000 5381008 5239090 5104416 4982671 4862096 4746800 4634608 4528731 4425612
4625 4425612 4325392 4228697 4138233 4055089 3973787 3896329 3818139 3746747 3668074 3596616 3525385
4614 3525385 3450558 3382053 3316139 3252186 3184732 3118516 3053189 2992033 2933002 2875294 2820271
4603 2820271 2768288 2719400 2671169 2621906 2578867 2526465 2483507 2442039 2395316 2360675 2318621
4592 2318621 2282795 2249298 2208439 2170977 2129716 2082848 2034810 1990094 1948841 1907210 1869368
4581 1869368 1828307 1797510 1756008 1722444 1695155 1668671 1641496 1628216 1598788 1573280 1549722
4570 1549722 1523636 1495417 1466790 1443661 1414191 1392420 1372437 1346298 1324280 1297538 1276049
4559A276049l2820l0943k6059k5607k3334k3436k2024k0213k3434j7396j4025
4548A016758j2164j2695j0797j0461j1213j5800j3083j7513j8716j9156j9724
4537H55436k0059j4697j4100j6260j1819j6017j3798r874j4968j4631j1310j4088
4525F83815j1774r631j1383j1064r740p391j0613p833n956q210q429j0145q908
4512E62738n945j3368n067q048l933o299j931j831N83P006j774L153Q423O512
4498E40219L821L05o845r799j8349j5554p904j3289n207q314l690k686j934k11
4484D50563L430J1883R716J1037J7045J5339J1994R266Q920J0058J4246K3842
4472E97339K9837L1709K3287Q946j2032k7099l5835l0829k7030k1190j3319r111
$$ plain form
4559 1276049 1243229 1212286 1186227 1160620 1137286 1113850 1091826 1071613 1048179 1030783 1016758
4548 1016758 1004594 991899 981102 970641 959428 943628 930545 913032 894316 875160 855436
4537 855436 835377 820680 806580 790320 778501 762484 748686 738812 723844 709213 697903 683815
4525 683815 672041 662410 651027 639963 630223 622832 612219 604386 598430 590220 581791 571646 562738
4512 562738 556793 543425 538358 530310 526377 520078 518147 516316 516899 523905 522131 525284 533707 540219
4498 540219 544040 544345 537500 527701 509352 493798 485894 472605 467398 459084 455394 452708 450774 450563
4484 450563 453993 465876 475592 486629 503674 519013 531007 540273 549193 559251 573497 597339
4472 597339 627176 658885 682172 691118 679086 651987 616152 585323 558293 537103 523784 514673
4460E14673p596m469L081R134J0467K4474K4017L2859L5527L2329J7204L697p321
4447F88076j5231r958M758J2051J5093P164l856k4549l7801m4285m1782l2057
4435E17623k4531k3410j7203j0947l845j0725P444J1150J5978K1102K3766L0055
4423E36457J8657O901j5466k5682l3267l2672k4294j8092j6133j2042j6771k1572
4411C46024k4374k4918k1420k0402j8467j3845j3998r773q718o203m709O204k353
4398A83048K559P139K998K761p493q972j5810j9768j6515j4088j3854j3978m438
4385H3589j2097n588p780j0562m740p030o077o064m202k87l234m955o600n277
4371i04l055k204j592o236L074k677k204n429K0m851J52o367j521j558j935k98
$$ plain form
4460 514673 507077 502608 505689 514823 525290 549764 573781 606640 642167 674496 691700 695397 688076
4447 688076 672845 662887 667645 679696 694789 701953 698097 673548 635747 591462 549680 517623
4435 517623 493092 469682 452479 441532 437687 426962 434406 445556 461534 482636 506402 536457
4423 536457 555114 562015 546549 520867 487600 454928 430634 412542 396409 384367 367596 346024
4411 346024 321650 296732 275312 254910 236443 222598 208600 198827 190109 183906 179197 185401 183048
4398 183048 185607 192746 195744 198505 191012 182040 166230 146462 129947 115859 102005 88027 83589
4385 83589 71492 65904 58124 47562 42822 35792 29715 23651 19449 19162 15928 10973 4373 -904
4371 -904 -3959 -6163 -7755 -13991 -10917 -13594 -15798 -21227 -21207 -26058 -25906 -32273 -33794 -35352 -37287 -37585
4355c7585n200N22m362j516p04l37j313r95j025k428l395O18n965M01j604n83
4339f5471k084Q19k556l186o35K842J085m529o69k387P6k238K678k950j11k247
4323h1563o53k194j943l903j65l29j610J262J332k595M31J265l311k573j223j144
4307i8916j174J883p25l675M886j725p99j995J88j538j320n1k756l89Q25k336
4291a09617k132N01j253k01o95j42K594m212p87J257L276j384k911L76j427k380
4275a19137k533K749j073J853j548k92j590j348J754J905J56P9L970k939N27j109
4259a18576j305J529m017r43J58j160l79L468q39k230L677k144J834J011j759
4244a21675J602L335m916k558J839J220J430m93P7o14N73J246m685L996k649l493
$$ plain form
4355 -37585 -42785 -42263 -46625 -48141 -48845 -49182 -50495 -51490 -52515 -54943 -58338 -57720 -63685 -63284 -64888 -65471
4339 -65471 -67555 -66736 -69292 -72478 -73113 -70271 -69186 -73715 -74384 -76771 -76695 -78933 -76255 -79205 -79316 -81563
4323 -81563 -82216 -84410 -86353 -90256 -90421 -90750 -92360 -91098 -89766 -92361 -91930 -90665 -93976 -96549 -97772 -98916
4307 -98916 -100090 -98207 -98932 -102607 -97721 -99446 -100245 -102240 -102052 -103590 -104910 -104961 -107717 -108106 -107281 -109617
4291 -109617 -111749 -111248 -112501 -112702 -113397 -113539 -110945 -115157 -115944 -114687 -111411 -112795 -115706 -115330 -116757 -119137
4275 -119137 -121670 -118921 -119994 -118141 -119689 -119981 -121571 -122919 -121165 -119260 -119104 -119025 -115055 -117994 -117467 -118576
4259 -118576 -119881 -118352 -122369 -123312 -123154 -124314 -124693 -121225 -122064 -124294 -120617 -122761 -120927 -119916 -121675
4244 -121675 -120073 -116738 -121654 -124212 -122373 -121153 -119723 -120216 -120139 -120753 -120180 -118934 -123619 -119623 -122272 -125765
4228a25765J057K000K320L54J022r15l075k502K656Q68J766O79M65j014O54K594
4212a16836k311l952o7J815r83M460n125Q45k828M147k581J190K265j500L332
4197a18129j17J363m06j687P8l465M253k673q34L522K572n774L090J637p79K224
4181a15125j454j89J70N78k055Q4K906j906K699r68k645K393k589n07L154k831
4165a18285L824k413L415m118K667l679J940K57K937p70K243l630K931K79j458
4150a13860o92j392K578l031K457K83M07n9k804L52l460J348N25O117j962m372
4134a17565L464k048J924Q33k811K096o1l515r54L374L53J45n92K713j624j717
4118a15985J875k209L01J147K597K28j139j632J948k896p98O89O41j396J303L852
$$ plain form
4228 -125765 -124708 -122708 -120388 -120034 -119012 -119927 -123002 -125504 -122848 -121980 -120214 -119535 -119070 -120084 -119430 -116836
4212 -116836 -119147 -123099 -123166 -121351 -122334 -117874 -122999 -122154 -124982 -120835 -123416 -122226 -119961 -121461 -118129
4197 -118129 -118246 -116883 -117289 -118976 -118898 -122363 -118110 -120783 -121617 -118095 -115523 -121297 -118207 -116570 -117349 -115125
4181 -115125 -116579 -116768 -116598 -116020 -118075 -117991 -115085 -116991 -114292 -115260 -117905 -115512 -118101 -118608 -115454 -118285
4165 -118285 -114461 -116874 -113459 -117577 -114910 -118589 -116649 -116392 -113455 -114225 -111982 -115612 -112681 -112402 -113860
4150 -113860 -114552 -115944 -113366 -116397 -113940 -113657 -113250 -113309 -116113 -115761 -119221 -117873 -117348 -111231 -113193 -117565
4134 -117565 -114101 -116149 -114225 -113392 -116203 -114107 -114168 -117683 -118637 -115263 -114910 -114765 -115357 -112644 -114268 -115985
4118 -115985 -114110 -116319 -116018 -114871 -112274 -112046 -113185 -114817 -112869 -115765 -116563 -115874 -115233 -116629 -115326 -111474
4102a11474Q36j25o162L731r99j888J121L394l3l497K06L856Q2r4k164J461l208
4085a14957J126J500n26J155n5O13k722m9K680k488l87J762j7j82K716k214p62
4068a12807L038l57m845J431L98K503R75j255m755J634K629L528m687L521r53
4053a10002k951L947k214K886l781K216n3K52j637J126P48Q07j340j419O93K24
4037a10498j748r97O059M54l077N74J734P07k987J08J596j668k330J409L131l118
4021a10651L914l02j711j17l63K686M12p19l62J316K15j508j537mJ065O81k926
4004a09911L028k687J488J334J699k82N46k320J261k249Q54J304l26J649O64j040
3988a04988K463l800l2J123n11K806p64m95j115J43k300N715m825M340l403M77
$$ plain form
4102 -111474 -110638 -110763 -116925 -113194 -114193 -116081 -114960 -111566 -111599 -115096 -114890 -111034 -110952 -111046 -113210 -111749 -114957
4085 -114957 -113831 -112331 -112857 -111702 -111757 -111144 -113866 -113915 -111235 -113723 -114110 -112348 -112365 -112547 -109831 -112045 -112807
4068 -112807 -109769 -110126 -114971 -113540 -113142 -110639 -109664 -110919 -115674 -114040 -111411 -107883 -112570 -109049 -110002
4053 -110002 -112953 -109006 -111220 -108334 -112115 -109899 -109952 -109700 -111337 -110211 -109463 -108656 -109996 -111415 -110722 -110498
4037 -110498 -112246 -113243 -107184 -106730 -109807 -109233 -107499 -106792 -109779 -109671 -108075 -109743 -112073 -110664 -107533 -110651
4021 -110651 -106737 -107039 -108750 -108867 -109230 -106544 -106132 -106851 -107213 -105897 -105682 -107190 -108727 -108731 -107666 -106985 -109911
4004 -109911 -106883 -109570 -108082 -106748 -105049 -105331 -104785 -107105 -105844 -108093 -107239 -105935 -106261 -104612 -103948 -104988
3988 -104988 -102525 -106325 -106357 -105234 -105745 -102939 -103703 -104198 -105313 -105170 -107470 -101755 -106580 -102240 -105643 -105166
3972a05166J071j217n2K463Q22M63k920J694N40j992L140m010L112j235K068J326
3956i9893j245n23J453j445m34K680j06J46j246j447J75K004m06k77K38k197L459
3939i9064j323Q51r68K433J078k045P34m72J295o81j065R89k598K444L58O06j551
3922i8979k71M680m765K403K056q6K091l384j400L264j642K979l556M514l647
3907i5743L823L1j703r41J351R24j224p93O52J45j343L102j129L565j447K72o73
3890i1131J142j185m97J143P56k269J922J129m00k404P49r9K477j966l568O112
3874h8089j071j161N07j37K10J30j291N366j131k341L458m297K813k12k181L224
3858h6203k629n78J938M04Q54k684K476j587L928m173k35K006M53k016L593N5
$$ plain form
3972 -105166 -104095 -105312 -105364 -102901 -102079 -101616 -104536 -102842 -102302 -104294 -101154 -105164 -102052 -103287 -101219 -99893
3956 -99893 -101138 -101661 -100208 -101653 -102087 -99407 -99513 -99367 -100613 -102060 -101885 -99881 -100287 -100564 -100326 -102523 -99064
3939 -99064 -100387 -99536 -100504 -98071 -96993 -99038 -98304 -98776 -97481 -98162 -99227 -98238 -100836 -98392 -98034 -97428 -98979
3922 -98979 -99250 -94570 -99335 -96932 -94876 -94962 -92871 -96255 -97655 -94391 -96033 -93054 -96610 -92096 -95743
3907 -95743 -91920 -91889 -93592 -94533 -93182 -92258 -93482 -94275 -93623 -93478 -94821 -91719 -92848 -89283 -90730 -90458 -91131
3890 -91131 -89989 -91174 -91671 -90528 -89772 -92041 -90119 -88990 -89390 -91794 -91045 -91144 -88667 -90633 -94201 -88089
3874 -88089 -89160 -90321 -89814 -89951 -89741 -89611 -90902 -85536 -86667 -89008 -85550 -89847 -87034 -87246 -89427 -86203
3858 -86203 -88832 -89410 -87472 -87068 -86214 -88898 -86422 -88009 -84081 -88254 -88489 -86483 -86030 -88046 -84453 -84398
3842h4398l649n65N434j455j596K101k95J353K154o900J369K92M041j895J084
3827h2925K052j818j074j122K238K85O87k67q11l467R53K923M37K73k43K40m94
3810h2133m44K675m75K914l943K432J98j79m0M717o477J800k39K258m328J194
3794h0070K281O8k339J392l600K574k75P58k43J118J975K045l070K387k255K533
3778g4721m022M808l761p54N402k067O90J57K606q41k730P67J007j036j769K488
3762g3776j066j213J568J695l81K386j449j156K819N74M37k170J097l061L491
3747g0205Q68j412Q38n31J026R97l81J187j140m707O343q24j354K521k159J685
3731f7248L85Q09Q04j478k557K991p1M92P16l20J636J139l05j223j706K185J1
$$ plain form
3842 -84398 -88047 -88612 -83178 -84633 -86229 -84128 -84423 -83070 -80916 -87816 -86447 -86155 -82114 -84009 -82925
3827 -82925 -80873 -82691 -83765 -84887 -82649 -82364 -81677 -81944 -82755 -86222 -85269 -82346 -81909 -81636 -81879 -81639 -82133
3810 -82133 -82577 -79902 -80377 -77463 -81406 -78974 -78776 -78955 -78995 -74278 -80755 -78955 -79194 -76936 -81264 -80070
3794 -80070 -77789 -77721 -80060 -78668 -82268 -79694 -79969 -79211 -79454 -78336 -76361 -74316 -77386 -74999 -77254 -74721
3778 -74721 -78743 -73935 -77696 -78450 -73048 -75115 -74425 -74268 -71662 -72503 -75233 -74466 -73459 -74495 -76264 -73776
3762 -73776 -74842 -76055 -74487 -72792 -73173 -70787 -72236 -73392 -70573 -69999 -69562 -71732 -70635 -73696 -70205
3747 -70205 -69337 -70749 -69911 -70442 -69416 -68419 -68800 -67613 -68753 -73460 -67117 -67941 -69295 -66774 -68933 -67248
3731 -67248 -66863 -66054 -65250 -66728 -69285 -66294 -66365 -65873 -65157 -65477 -63841 -62702 -63007 -64230 -65936 -63751 -63740
3714f3740K211j024j641K631j787O0M1J661j193m70J942o24k004M827r97m92j142
3697f1741M90j417L72P94J559j33j545J497l51r4M26L61k373O174k874j218J634
3680e8439k012j32K264m98pk13K373o11k012L27L429k02l024J877K408k587K268
3663e4791k013J225K04OJ36l654L925J350L026m008O17j633p86K102K881j870
3647e3283m91K901L13j905m04L67J429j288o33Q65J896q23j446n02J947j459K060
3630e0456j255P6r54j868M120N1k03L36M76j322P68J516q64L953l38j303Q49k975
3612d9393L194k529j215J079M004j682R03J077l501L631j813L70J80j438Q80J682
3596d4571J745m877K541J848n72J180J764j754J51q65K508j956M011l207K067
$$ plain form
3714 -63740 -61529 -62553 -64194 -61563 -63350 -63290 -63249 -61588 -62781 -63251 -61309 -61933 -63937 -59110 -60107 -60599 -61741
3697 -61741 -61251 -62668 -62296 -61502 -59943 -60076 -61621 -60124 -60475 -60569 -60143 -59782 -62155 -55981 -58855 -60073 -58439
3680 -58439 -60451 -60583 -58319 -58817 -58824 -59037 -56664 -57275 -59287 -58960 -55531 -55733 -58757 -56880 -54472 -57059 -54791
3663 -54791 -56804 -55579 -55375 -55369 -55233 -58887 -54962 -53612 -50586 -54594 -53977 -55610 -56396 -54294 -51413 -53283
3647 -53283 -53774 -50873 -50560 -52465 -52869 -52502 -51073 -52361 -52994 -52129 -50233 -51056 -52502 -53004 -51057 -52516 -50456
3630 -50456 -51711 -51635 -52589 -54457 -50337 -50286 -50489 -50153 -49677 -50999 -50231 -48715 -49579 -45626 -45964 -47267 -46418 -49393
3612 -49393 -46199 -48728 -49943 -48864 -44860 -46542 -45639 -44562 -48063 -44432 -46245 -45875 -45695 -47133 -46253 -44571
3596 -44571 -42826 -47703 -45162 -43314 -43886 -42706 -40942 -42696 -42545 -43410 -40902 -42858 -38847 -42054 -39987
3581c9987q62K649j629o3k79j87K169M51r19L165n458M437k764K932j445K020
3565c5770j013L261k249K28j447n98K849J189O59k650L041j813J740L07l631J407
3549c4490J197k258O99Q61j072N465k953O43o05k633L285P8R27j29q80k204K513
3532c1556q5j718J715J708J795l154K015J211m21n64r00R70J737k664N33J788
3516b7590l436N217j741J098p86J593K138p6m795J483K190K27k018M441l980J181
3500b4854M44K029k03J363J084l351Q93J328j390J012N73p26K403J03N4j10k189
3483b1537O349l045J252k447J984k48q92L267l693K737J130k152K194J703k047
3468a5445M12R39p45r75K812j06k186J093K317j183J11J913l474M246k023K396
$$ plain form
3581 -39987 -40849 -38200 -39829 -39892 -40171 -40358 -38189 -37738 -38657 -35492 -40950 -36513 -39277 -36345 -37790 -35770
3565 -35770 -36783 -33522 -35771 -35543 -36990 -37588 -34739 -33550 -32891 -35541 -32500 -34313 -32573 -32266 -35897 -34490
3549 -34490 -33293 -35551 -34852 -33991 -35063 -29598 -32551 -31908 -32513 -35146 -31861 -31783 -30856 -30985 -31865 -34069 -31556
3532 -31556 -31641 -33359 -31644 -29936 -28141 -31295 -29280 -28069 -28490 -29054 -29954 -28984 -27247 -29911 -29378 -27590
3516 -27590 -31026 -25809 -27550 -26452 -27238 -25645 -23507 -23583 -28378 -26895 -24705 -24478 -26496 -22055 -26035 -24854
3500 -24854 -24410 -22381 -22584 -21221 -20137 -23488 -22595 -21267 -22657 -21645 -21072 -21798 -19395 -19292 -19238 -19348 -21537
3483 -21537 -15188 -18233 -16981 -19428 -17444 -17692 -18584 -15317 -19010 -16273 -15143 -17295 -15101 -13398 -15445
3468 -15445 -15033 -14094 -14839 -15814 -13002 -13108 -15294 -14201 -11884 -13067 -12956 -11043 -14517 -10271 -12294 -9898
3452i898m391J954J478J193m142K532j498K929l969L993K036l654L392l256L420
3437g881j283k41M135J705l536J339k66M447n261J662J349L017l614O44j683n80
3421f047M409R47j009K638l519q14O62L372o27J138l60Q40l559L749r87J315m83
3404A665Q27K151k648j620L252j856J97J658j394l62N043m412N404p39R97m965
3388C198M220J062j850N88m9K275M39l501J128j40K626p4l068J194K235R59j758
3371I484L999j106j345J44K319k95J382J00j643J317k154K847l80m34K734m00
3355A6569N74J116j065P16K96j480J889k478K889j59q10J589K659m270J956m08
3339A9583J962J004L51l23J057m209L410K214M87J147k736L634k686L88O0J82
$$ plain form
3452 -9898 -14289 -12335 -10857 -9664 -13806 -11274 -12772 -9843 -13812 -9819 -7783 -11437 -8045 -11301 -7881
3437 -7881 -9164 -9405 -5270 -3565 -7101 -5762 -6028 -1581 -6842 -5180 -3831 -814 -4428 -3784 -5467 -6047
3421 -6047 -1638 -691 -1700 938 -2581 -3395 -2733 639 12 1150 790 1630 -1929 1820 833 2148 1665
3404 1665 2492 4643 1995 375 3627 1771 1968 3626 2232 1870 6913 2501 7905 7166 8163 3198
3388 3198 7418 8480 6630 7218 7169 9444 9883 6382 7510 7370 9996 9922 6854 8048 10283 11242 9484
3371 9484 13483 12377 11032 11176 13495 13200 14582 14682 13039 14356 12202 15049 14669 14235 16969 16569
3355 16569 17143 18259 17194 17910 18206 16726 18615 16137 19026 18867 18057 19646 22305 18035 19991 19583
3339 19583 21545 22549 22900 22577 23634 19425 22835 25049 25536 26683 23947 27581 24895 25283 25343 25525
3323B5525J291M670p60l847K713O6n84M243j736q38J64q1R81P37k69K370n02j608
3305C2535K489J554N10J195k466K001J016l4l1K714J131j422O70l2M00Q96K205
3288D5331J247o267P929l817j29J689N925l343j055K145J314L006j285K39O90
3273E3619O45J39K261M17J08j68K777j79o34j991N947j983J451M3j139K028j048
3256F2293L819k988K011k12L164Q64K110j00K066J677j666K151j783J864K525
3241G7795K31J731q01O09j759K389J915K259P75j584l04J192K060K814q89J521
3225H9954p6M108r93J506k622l58K406J960J526K472Q43P01q26J482N234k861
3209A04456N601k872J147R81J427K809M13J764j170K277K091n24J768R8QJ960
$$ plain form
3323 25525 26816 31486 30726 26879 29592 29658 29074 33317 31581 30743 30907 30826 31807 32544 32275 34645 34143 32535
3305 32535 35024 36578 37088 38283 35817 37818 38834 38800 38769 41483 42614 41192 41862 41830 42230 43126 45331
3288 45331 46578 40311 48240 44423 44294 45983 51908 48565 47510 49655 50969 53975 52690 52929 53619
3273 53619 54264 54403 56664 57081 57189 57021 59798 59619 58985 56994 62941 60958 62409 62452 61313 63341 62293
3256 62293 66112 63124 65135 64923 68087 68951 71061 70961 73027 74704 73038 75189 73406 75270 77795
3241 77795 78026 79757 78956 79565 77806 80195 82110 84369 85144 83560 83256 84448 86508 89322 88433 89954
3225 89954 89878 93986 92993 94499 91877 91519 93925 95885 97411 99883 100726 101427 100601 102083 107317 104456
3209 104456 110057 107185 108332 109313 110740 113549 113962 115726 114556 116833 118924 118400 120168 120266 120274 122234
3193A22234r67L479K135o72k79K392J739Q63l691N757K98J511J722J05P78P69
3177A38173K965M254k493O470j952J634L695j347j243L009L480J961K564p91N37
3162A60916m3L638Q17L542J97J538r17O533K715K119L63n52N580m36K555Q18k464
3145A86919N808M376N10M02L309K254L099J44J997M781K529J469k76N048J963
3130B24332K55O71L641l93P547M204J347O446K193j29L174J841M567L410J350
3115B64456N540M54O434M252K155N179K729M196P496N624M571N385L752M387Q223
3100C34833N125M767J0512M649R725Q434O774O120J1596J1040J4994J9236J7044
3087D64849K1236K1159K4441K8967L6473M0730N7364P9798R4097J03569J21431
$$ plain form
3193 122234 121267 124746 126881 126209 125930 128322 130061 130924 127233 132990 133288 134799 136521 136626 137404 138173
3177 138173 141138 145392 142899 149369 147417 149051 152746 151399 150156 153165 156645 158606 161170 160379 160916
3162 160916 160873 164511 165328 168870 169067 170605 169688 176221 178936 181055 181418 180866 186446 186010 188565 189383 186919
3145 186919 192727 197103 197613 198015 201324 203578 206677 206821 208818 213599 216128 217597 217321 222369 224332
3130 224332 224587 225258 228899 228506 236053 240257 241604 248050 250243 250114 253288 255129 259696 263106 264456
3115 264456 269996 270450 276884 281136 283291 288470 291199 295395 302891 308515 313086 318471 322223 326610 334833
3100 334833 339958 344725 355237 359886 369611 378045 384819 390939 402535 413575 428569 447805 464849
3087 464849 486085 507244 531685 560652 597125 637855 695219 775017 869114 972683 1094114
3076A094114J24694N4884k124n6745j08817q7252o9680m5809l2724k6094j6643
3065H27804j0722p714l069P071J1441J7560K1758K2794L3826M2258N5598P1736
3053A090341J02940J55053J78224J89743K42521K10065P1327k2229j66717k30150
3043A821118j76104j32519j02948p5761n9516m7797m1238m1941l1685k1344j8093
3032A072172o718n768K547K184J5634K3480L1127N2276P5696R1907R2090J18237
3020A564864R0114K6967j6648p9552j07369q3108o1859m3919l7122k7465k1084
3009A203819k6290k0670j7079j6407j0475k388q882j269r08j930O133N715P640
2996A117009J1407J1366N057j92n644j0904n325N256J2745K1511K8223K9199K1075
$$ plain form
3076 1094114 1218808 1273692 1271568 1214823 1106006 1018754 949074 903265 870541 844447 827804
3065 827804 817082 809368 806299 813370 824811 842371 864129 886923 920749 963007 1018605 1090341
3053 1090341 1193281 1348334 1526558 1716301 1958822 2168887 2240214 2217985 2051268 1821118
3043 1821118 1645014 1512495 1409547 1333786 1274270 1226473 1185235 1143294 1111609 1090265 1072172
3032 1072172 1065454 1059686 1062233 1064417 1080051 1103531 1134658 1186934 1262630 1354537 1446627 1564864
3020 1564864 1654978 1681945 1665297 1585745 1478376 1395268 1333409 1289490 1252368 1224903 1203819
3009 1203819 1177529 1156859 1139780 1123373 1112898 1110510 1101628 1100359 1099451 1097521 1103654 1109369 1117009
2996 1117009 1128416 1139782 1144839 1144647 1139003 1128099 1122774 1128030 1140775 1162286 1190509 1219708 1240783
2983A240783K6684K6457K3812K1868K0900Q455K056Q827Q948J6301K1446K1595
2971A448132K2586J8616J3313J0236j406n660n483j7341k4079n477k362J1165
2959A462240L8109M9795M7782N6396N7221N0319M1922L8213K9805J2841J5696
2948A900339K1135K8151L3633L9845L0682K8423J9738J1067J2923M633N481P291
2936B143341J45N93N663J3203J9074L0983M4823M4770N1779M9495L8773K7614
2924B470256L0450K4863K3456K8655M1772M2899M5058L5468L0048K5686K9483
2913B828094K8332L5049M3327M5021N7197M4431M2420L9037M1703L9170M7354
2902C291135M9313N2533N6229N2719N3466N2818N7318N1490N5032O3652O4692
$$ plain form
2983 1240783 1267467 1293924 1317736 1339604 1360504 1368959 1371015 1379842 1388790 1405091 1426537 1448132
2971 1448132 1470718 1489334 1502647 1512883 1511477 1505817 1500334 1482993 1458914 1453437 1451075 1462240
2959 1462240 1500349 1550144 1597926 1654322 1711543 1761862 1803784 1841997 1871802 1884643 1900339
2948 1900339 1921474 1949625 1983258 2023103 2053785 2082208 2101946 2113013 2125936 2130569 2136050 2143341
2936 2143341 2143486 2144079 2149742 2162945 2182019 2213002 2257825 2302595 2354374 2403869 2442642 2470256
2924 2470256 2500706 2525569 2549025 2577680 2619452 2662351 2707409 2742877 2772925 2798611 2828094
2913 2828094 2856426 2891475 2934802 2979823 3037020 3081451 3123871 3162908 3204611 3243781 3291135
2902 3291135 3340448 3392981 3449210 3501929 3555395 3608213 3665531 3717021 3772053 3835705 3900397
2891C900397O8015P5549P1253P9244Q5574Q5289R1695R4695J00387J04096J11578
2880D867772J23819J18752J21055J35487J38634J39362J44136J52519J63399J75999
2870F280934J86891K02982K05359K15749K24301K42277K67067K94947L28984L69208
2860H818699L92071L82046M21032M76680N26563O03513O37387O54280O95107P57153
2850A4364531Q40645R44455J053254J209205J388793J613311J892656K259811
2842B5566661K657155K930583L317474L891185M553912N375540O620941Q690749
2834F3604200J2532620J7184442J7330868K0750173K3014455J3061036J420430
2827A68898224o852043k0183460j9374815j4440110j0768025q102511n853450
$$ plain form
2891 3900397 3968412 4043961 4115214 4194458 4280032 4365321 4457016 4551711 4652098 4756194 4867772
2880 4867772 4991591 5110343 5231398 5366885 5505519 5644881 5789017 5941536 6104935 6280934
2870 6280934 6467825 6670807 6876166 7091915 7316216 7558493 7825560 8120507 8449491 8818699
2860 8818699 9210770 9592816 10013848 10490528 11017091 11620604 12257991 12912271 13607378 14364531
2850 14364531 15205176 16149631 17202885 18412090 19800883 21414194 23306850 25566661
2842 25566661 28223816 31154399 34471873 38363058 42916970 48292510 54913451 63604200
2834 63604200 76136820 93321262 110652130 131402303 154416758 167477794 168898224
2827 168898224 162046181 141862721 122487906 108047796 97279771 89177260 83323810
2820H3323810m236482l295638k775300j491303j97960J064746K171158K940270
2812G7503301L842557N318395O836777Q626028J1425853J5808932K3962548L1225799
2804A84550190K9921818L7132722L7885010J6656948j416622j5414002l7992902
2797B51323162l5041655k7692760k1945872j7557095j3711591j1027075r851517
2790A14495597r407561p591440n919406m533209l372151k640328j970536p67285
2782G8293681K76464J426320L163015N648581R866487J3757532J4057425J8086122
2774A44575627J8761893Q115275j780529j0539774k1548078j9124605j4836257
2767A03623552j1733432r427790p514157o249129n750797n618586m918829m155791
$$ plain form
2820 83323810 79087328 75791690 73016390 71525087 71327127 72391873 74563031 77503301
2812 77503301 81345858 86664253 93501030 102127058 113552911 129361843 153324391 184550190
2804 184550190 214472008 251604730 289489740 306146688 304730066 289316064 251323162
2797 251323162 216281507 188588747 166642875 149085780 135374189 124347114 114495597
2790 114495597 105088036 97496596 91577190 87043981 83671830 81031502 79060966 78293681
2782 78293681 78570145 79996465 83159480 88808061 98674548 112432080 126489505 144575627
2774 144575627 163337520 171452795 169672266 159132492 137584414 118459809 103623552
2767 103623552 91890120 82462330 74948173 68699044 62948247 57329661 52410832 48255041
2759D8255041l591228l144995k863609k682942k341523k115699j913473j661574
2751B7939998j454289j304903j180687j089361j023502r29146q47623p83860p13482
2742A8613145o70598o58143o16925n81106n34936m91044m68330m44047n07202
2733A3640814n49616m99669m48071m00172l61873l27787l08480k99195k88824
2724A0157127k83018k72218k52665k29017k08727j88216j92005j91290j89712
2715H150259j89227j86069j65372j59306j52506j43436j46295j45036j47511j49424
2705F566077j52014j44742j37368j26664j10095j04486j01241j05255j06700r9521
2695E377991j08037j02793r5805r1054q7435q4034r0243q9900r3355q4133q2709
$$ plain form
2759 48255041 44663813 41518818 38655209 35972267 33630744 31515045 29601572 27939998
2751 27939998 26485709 25180806 24000119 22910758 21887256 20958110 20110487 19326627 18613145
2742 18613145 17942547 17284404 16667479 16086373 15551437 15060393 14592063 14148016 13640814
2733 13640814 13091198 12591529 12143458 11743286 11381413 11053626 10745146 10445951 10157127
2724 10157127 9874109 9601891 9349226 9120209 8911482 8723266 8531261 8339971 8150259
2715 8150259 7961032 7774963 7609591 7450285 7297779 7154343 7008048 6863012 6715501 6566077
2705 6566077 6414063 6269321 6131953 6005289 5895194 5790708 5689467 5584212 5477512 5377991
2695 5377991 5269954 5167161 5071356 4980302 4892867 4808833 4718590 4628690 4535335 4451202 4368493
2684D368493p9273p4798p7832p5496p8706p8062p9027p5506o8294n6056n5407
2673C570036m5204m2187l8109m3369n2368o6472p3263p8564p9539p7769p2829
2662B900363p2278o6711o5480o2109n3642n7568n0505m3640l8656m2827n0710
2651B296237m4060m2973l3126k8150j1826j7439m024L158K689K66r497l7419n0726
2638B023110o2841o9064o3831o1669m6463m5615l8985l5679l4552k8562k8525
2627A507324k4980k0638l1819l8444l3839l2223l2732j7814q728o482k935j918
2615A254772l173k070o724j8562k2443l1299l2430l0298k1951j9232j3131j4653
2603A038806r498j5877j5827j1398j2578j3111j6655q648j1354q504n532o520
$$ plain form
2684 4368493 4289220 4214422 4136590 4061094 3982388 3904326 3825299 3749793 3681499 3625443 3570036
2673 3570036 3524832 3482645 3444536 3401167 3348799 3282327 3209064 3130500 3050961 2973192 2900363
2662 2900363 2828085 2761374 2695894 2633785 2580143 2522575 2472070 2428430 2389774 2346947 2296237
2651 2296237 2252177 2209204 2176078 2147928 2136102 2118663 2114639 2117797 2120486 2120752 2111255 2073836 2023110
2638 2023110 1960269 1891205 1827374 1765705 1719242 1673627 1634642 1598963 1564411 1535849 1507324
2627 1507324 1482344 1461706 1429887 1391443 1357604 1325381 1292649 1274835 1266107 1259625 1256690 1254772
2615 1254772 1251599 1249529 1242805 1224243 1201800 1170501 1138071 1107773 1085822 1066590 1053459 1038806
2603 1038806 1029308 1013431 997604 986206 973628 960517 943862 935214 923860 915356 909824 903304
2591I03304O871L87Q599J3338K1425K5284M5367P0526Q0162R4773J21934Q2838
2579A474808J4885l3599j06566j13658r5361p1139n8545m2212l7011k6841k8743
2568H76018j9817j3679j0001N801L769P596J2945K4942K9590N2144O7694J04770
2556A141772J64070J66011J92368K37080J37313O803p1219k39523k19941j70328
2546A344406j31447j04171q1393o8159o1784n6407m9840m1653l0070k9076k0568
2535F69838j3609j2825m245p51J1377J8817M7321O6108O7898Q3093J01558N0548
2523A085128j1703n3150j22558j11798r1233o6539n7020m9908l7938l5002l2148
2512D16131l5884k5585k5656k3151j5236k3132j8837j4161j5580j4759r808j1832
$$ plain form
2591 903304 910175 910562 919161 932499 953924 979208 1024575 1095101 1175263 1270036 1391970 1474808
2579 1474808 1489693 1456094 1349528 1235870 1140509 1069370 1010825 968613 931602 904761 876018
2568 876018 856201 842522 832521 838322 842091 849687 862632 887574 917164 969308 1037002 1141772
2556 1141772 1305842 1471853 1664221 1901301 2038614 2045417 1974198 1734675 1514734 1344406
2546 1344406 1212959 1108788 1027395 959236 897452 841045 791205 749552 719482 690406 669838
2535 669838 656229 643404 639159 638408 649785 668602 715923 782031 849929 933022 1034580 1085128
2523 1085128 1073425 1020275 897717 785919 694686 628147 571127 521219 483281 448279 416131
2512 416131 380247 354662 329006 305855 290619 267487 248650 234489 218909 204150 194342 182510
2500A82510j0916j1997j0234q672p653j0248o779r371l805p383q721l450q362
2487G4919m844q499m561o909n958m562l792n531o288j915q700n196n142n276l238
2472e492j013n344k568j713q416K146q723n90p463o89m445J55m531k443l373m317
2456e8819n019l064k263j398k743j464m579j42o149j956k227n124q21r36k924
2441i9628k367r98j156j885m1m298k547l770m33l698k270k18p115L048m768n26
2425a32670J045k929l670j906k456k730P45j661k543O90r89l873k486k635n32
2410a58600O28l285J712o979j822J250Q98j243k626l625K844l630j255j387j058
2395a78178j824J830j695k238lL35j699k440j802J392j188j442m906K142M77k585
$$ plain form
2500 182510 171594 159597 149363 140691 133038 122790 116011 106640 102835 95452 86731 83281 74919
2487 74919 70075 61576 57015 50106 44148 39586 35794 30263 23975 22060 13360 8164 3022 -2254 -5492
2472 -5492 -6505 -11849 -14417 -16130 -24546 -22400 -31123 -31713 -39176 -39865 -44310 -44155 -48686 -51129 -54502 -58819
2456 -58819 -63838 -66902 -69165 -70563 -73306 -74770 -79349 -79491 -85640 -87596 -89823 -94947 -95768 -96704 -99628
2441 -99628 -101995 -102993 -104149 -106034 -106075 -110373 -112920 -116690 -117123 -120821 -123091 -123309 -130424 -127376 -132144 -132670
2425 -132670 -131625 -134554 -138224 -140130 -142586 -145316 -144571 -146232 -148775 -148085 -149074 -152947 -155433 -158068 -158600
2410 -158600 -157972 -161257 -159545 -166524 -168346 -167096 -166198 -167441 -170067 -173692 -170848 -174478 -175733 -177120 -178178
2395 -178178 -180002 -178172 -179867 -182105 -182108 -181773 -183472 -185912 -187714 -186322 -187510 -188952 -193858 -191716 -191239 -193824
2379a93824n09M71r0j230k796p36n62J018k453P07l110K194k183j476k52O9N9
2362b04703k788j406m202L335o37k70n80K155m389L605k147l559j96L6K893j889
2346b14742J054l384o03J739j989m55Q90k691j02M14j815K177m74m191P98j472
2330b24846k627K939k458J648k3l833j06K056l63Q14k453J936p05m329J664K664
2314b28022m778J725J716j643K96M4o03J164l307L818l482r74j976L630j203j357
2298b34952R73N27k683J757N06l2l427J839k728L173r7l57k821K802N00k291J502
2281b35809k68n53n43K783m102j196K117k493L283r76K932l766k278O42Q74k157
2265b41510J233Q83j064K31j194j92o24k35K293k204j442j83L401j335J77j291
$$ plain form
2379 -193824 -194333 -193862 -193952 -195182 -197978 -198714 -199276 -198258 -200711 -200004 -203114 -200920 -203103 -204579 -204831 -204762 -204703
2362 -204703 -207491 -208897 -213099 -209764 -210401 -210671 -211251 -209096 -213485 -209880 -212027 -215586 -215782 -215746 -212853 -214742
2346 -214742 -213688 -217072 -217675 -215936 -217925 -218380 -217490 -220181 -220283 -219869 -221684 -219507 -219981 -224172 -223374 -224846
2330 -224846 -227473 -224534 -226992 -225344 -225367 -229200 -229306 -227250 -227613 -226799 -229252 -227316 -228021 -232350 -230686 -228022
2314 -228022 -232800 -231075 -229359 -231002 -230706 -230662 -231265 -230101 -233408 -229590 -233072 -234046 -236022 -232392 -233595 -234952
2298 -234952 -233979 -233452 -236135 -234378 -233872 -233904 -237331 -235492 -238220 -235047 -235144 -235501 -238322 -235520 -235020 -237311 -235809
2281 -235809 -236077 -236630 -237173 -234390 -238492 -239688 -237571 -240064 -236781 -237757 -234825 -238591 -240869 -240227 -239353 -241510
2265 -241510 -240277 -239394 -240458 -240227 -241421 -241613 -242237 -242472 -240179 -242383 -243825 -244008 -240607 -241942 -241765 -243056
2249b43056k65L33k186R5k77K328k549L436l456O90j055K124M713n991K844p58
2233b43030m470J695M74O40k083M660j039n526L262j714N20K013q48K00k408p9
2217b47733L338k328J844r95K80M83Q44l234L322m744K636k449J938J754k805
2202b47849K18r73O57N43J870o17j757J034K552j98k64k53r07m89j11p89q53J872
2184b46314p75M82L58K709k644k643K835m786M892j071n61K3j02N152n022J143
2168b46324J137M50k503K959l554P04J022P88j045J46l1J800k043M43J049j883
2152b46885q5Q2L111l373K562k466o33L825K15j593p32q06J708p43R81L72K30
2135b44230N1k507Q00N39k656J321Q33J67o26K13J292m61j126L125m224R64J679
$$ plain form
2249 -243056 -243321 -242988 -245174 -245079 -245356 -243028 -245577 -242141 -245597 -244907 -245962 -243838 -239125 -245116 -242272 -243030
2233 -243030 -247500 -245805 -245331 -244691 -246774 -242114 -243153 -248679 -245417 -247131 -246611 -244598 -245446 -245246 -247654 -247733
2217 -247733 -244395 -246723 -244879 -245874 -245594 -245111 -244267 -247501 -244179 -248923 -246287 -248736 -246798 -245044 -247849
2202 -247849 -247631 -248604 -247947 -247404 -245534 -246151 -247908 -246874 -244322 -244520 -244784 -245037 -245944 -246433 -246544 -247333 -248186 -246314
2184 -246314 -247089 -246607 -246249 -243540 -246184 -248827 -245992 -250778 -245886 -246957 -247518 -247495 -247597 -242445 -247467 -246324
2168 -246324 -245187 -244737 -247240 -244281 -247835 -247131 -246109 -245321 -246366 -246220 -246251 -244451 -246494 -246051 -245002 -246885
2152 -246885 -246970 -246888 -243777 -247150 -244588 -247054 -247687 -243862 -243647 -245240 -245972 -246778 -245070 -245813 -244832 -244460 -244230
2135 -244230 -244179 -246686 -245886 -245347 -248003 -246682 -245849 -245682 -246308 -246095 -244803 -245264 -246390 -243265 -247489 -246525 -244846
2118b44846j156K419j659J137l069L872Q40k776K381l69j429J814j508p84j895
2103b47028j69J033j128K991K316J70m661O01J662n95J654j650J889k614K383
2088b43146J429l577J018N70J38k313M818k488m80K36N30j569L965l71j678j905
2072b44823L315m033R63O17l33R34j3Q43l523N843n736Q90J152k23P23J913j458
2055b42949l249M032j831J508j204j652J458k2P45K508n006J538m33L637N36n390
2039b45774J941L961k324J064K98k357J701k649K440m57P67k683R18K985k887
2024b43056J010r70J522r68L38n72j784J460K604k169Q85j566J110K42J935o2
2008b40041J833n21k509J771J749j862P38j266k806L220J386l251P11j638K354
$$ plain form
2118 -244846 -246002 -243583 -245242 -244105 -247174 -243302 -242462 -245238 -242857 -243226 -244655 -242841 -244349 -245133 -247028
2103 -247028 -247197 -246164 -247292 -244301 -241985 -241815 -246476 -245875 -244213 -244808 -243154 -244804 -242915 -245529 -243146
2088 -243146 -241717 -245294 -244276 -243706 -243568 -245881 -241063 -243551 -244031 -243795 -243265 -244834 -240869 -241240 -242918 -244823
2072 -244823 -241508 -245541 -244578 -243961 -244294 -243360 -243373 -242530 -246053 -240210 -245946 -245056 -243904 -244127 -243404 -241491 -242949
2055 -242949 -246198 -242166 -243997 -242489 -243693 -245345 -243887 -243909 -243164 -240656 -245662 -244124 -244557 -240920 -240384 -245774
2039 -245774 -243833 -239872 -242196 -241132 -240834 -243191 -241490 -244139 -241699 -242156 -241389 -244072 -243154 -240169 -243056
2024 -243056 -242046 -243016 -241494 -242462 -242124 -242696 -244480 -243020 -240416 -242585 -241700 -243266 -242156 -241914 -239979 -240041
2008 -240041 -238208 -238729 -241238 -239467 -237718 -239580 -238842 -240108 -242914 -239694 -238308 -241559 -240848 -242486 -240132
1993b40132J95J427J610l702P1O46J67L014k339L10k61l40o81j519L659k048K286
1976b37637j052j463J31L87P6j769K844O97j057J318j233k842J890L670j291J844
1960b35487k454k632J74K042k21L16J408o38j254J634J911m198L330k750J232
1945b37587K387p6k008p9K319j999M08j481j314M888J84K101k405J39l74k743
1929b37640L104j071J387l892L544j281K49K455j241k352J553K79j83k716K793
1914b35012L96j114j642J873M62J799J197l991M09L588J179l064O79k376L029
1899b32588M16k462Q58q71O1J829j148j5O1K18J453r14n93J745J781l437L861
1882b29745k990K56j793L080m556K544J126J829j285l457l4O47L951q22j983J835
$$ plain form
1993 -240132 -239937 -238510 -236900 -240602 -240531 -239885 -239718 -236704 -239043 -238733 -238994 -239334 -240015 -241534 -237875 -239923 -237637
1976 -237637 -238689 -240152 -240021 -239634 -239558 -241327 -238483 -237786 -238843 -237525 -238758 -241600 -239710 -236040 -237331 -235487
1960 -235487 -237941 -240573 -240399 -238357 -238578 -238262 -236854 -237492 -238746 -237112 -235201 -239399 -236069 -238819 -237587
1945 -237587 -235200 -235276 -237284 -237363 -235044 -237043 -236635 -238116 -239430 -234542 -234358 -232257 -234662 -234523 -234897 -237640
1929 -237640 -234536 -235607 -234220 -238112 -234568 -235849 -235600 -233145 -234386 -236738 -235185 -234906 -235089 -237805 -235012
1914 -235012 -234616 -235730 -237372 -235499 -235037 -233238 -232041 -236032 -235623 -232035 -230856 -233920 -233241 -235617 -232588
1899 -232588 -232172 -234634 -233776 -234647 -234586 -232757 -233905 -233920 -233859 -233641 -232188 -233102 -233695 -231950 -230169 -233606 -229745
1882 -229745 -232735 -232479 -234272 -231192 -235748 -233204 -232078 -230249 -231534 -234991 -235025 -234378 -230427 -231249 -233232 -231397
1866b31397j33J126j32k09q33J02N77Q3j164K492j332O25R95K02l261K969LK4
1848b29263J471j569n18K620p92p67L658l138J764R98k916L81J814j322n96Q06
1832b27369J09r10k121K944k642k537N318k281L191k707k646K872Q85K085r17
1817b26726K804j737j43j325L846m028O543l946O6m23Q69j314q62j672r70L315
1801b25703j745Q32L19k848M967l254m91Q54j065L644m357M306k172J484J461
1786b23768j331q91Q92J270j02q42J57l47j644N53k68l104J820J680J451n55l90
1769b25419l624J71L661K18k588K932k148l98j638L983l586J390J285J449l252
1754b27564M37K138j01R53k153j740J683j949M115p13j261K780m349O982l702
$$ plain form
1866 -231397 -231530 -230404 -230536 -230745 -231578 -231476 -230899 -230816 -231980 -229488 -230820 -230195 -229200 -228998 -232259 -229290 -229287 -229263
1848 -229263 -227792 -229361 -229879 -227259 -228051 -228818 -225160 -228298 -226534 -225536 -228452 -228071 -226257 -227579 -228175 -227369
1832 -227369 -227260 -228170 -230291 -227347 -229989 -232526 -227208 -229489 -226298 -229005 -231651 -228779 -227894 -225809 -226726
1817 -226726 -223922 -225659 -225802 -227127 -223281 -227309 -220766 -224712 -224646 -225069 -224200 -225514 -226376 -228048 -229018 -225703
1801 -225703 -227448 -226616 -226297 -229145 -224178 -227432 -227923 -227069 -228134 -224490 -228847 -224541 -226713 -225229 -223768
1786 -223768 -225099 -225990 -225098 -223828 -223930 -224772 -224615 -224962 -226606 -226053 -226321 -229425 -227605 -225925 -224474 -225029 -225419
1769 -225419 -229043 -228872 -225211 -224993 -227581 -224649 -226797 -227195 -228833 -224850 -228436 -227046 -225761 -224312 -227564
1754 -227564 -227127 -224989 -225090 -224137 -226290 -228030 -226347 -228296 -224181 -224894 -226155 -223375 -227724 -220742 -224444
1739b24444j788m28L18K350k719J717j298M75J248k412J320j99K009r10K91j755
1723b26225L3n64L870k242J215k883p82K886j8m64J502K03n68j547L067M14l113
1706b25216K43j912K622j570L611j933M32J613r25N90K213n369K435l19j593j282
1690b26360N75K088K345J35k162K786j98j903J470l586j962M874n97j210O68o72
1674b23709K722l253J199k63J681L47l29k220J808J76L513j766l309K747P35k654
1658b22575k06J545p45K529k123J140j637K49Q61j321N340j303k294M016j523
1643b18047N7k018j014M02j945K637J758M95m427K863r9M66J047o49k072M329
1627b16217l494K827k848M77j486M84n69O4P63O29M73J649j604l29Q16R33r5j223
$$ plain form
1739 -224444 -226232 -226660 -226342 -223992 -226711 -224994 -226292 -225817 -224569 -226981 -225661 -225860 -223851 -224761 -224470 -226225
1723 -226225 -226192 -226756 -222886 -225128 -223913 -226796 -227578 -224692 -224710 -225174 -223672 -223469 -224037 -225584 -222517 -222103 -225216
1706 -225216 -224973 -226885 -224263 -225833 -222222 -224155 -223723 -222110 -223035 -222445 -220232 -225601 -223166 -223485 -225078 -226360
1690 -226360 -225785 -223697 -221352 -221217 -223379 -220593 -220791 -222694 -221224 -224810 -226772 -221898 -222495 -223705 -223037 -223709
1674 -223709 -220987 -224240 -223041 -223304 -221623 -221276 -221605 -223825 -222017 -221841 -218328 -220094 -223403 -220656 -219921 -222575
1658 -222575 -222781 -221236 -221981 -219452 -221575 -220435 -222072 -221823 -220962 -222283 -216943 -218246 -220540 -216524 -218047
1643 -218047 -217990 -220008 -221022 -220620 -222565 -219928 -218170 -217675 -222102 -219239 -219338 -218872 -217825 -218474 -220546 -216217
1627 -216217 -219711 -216884 -219732 -219255 -220741 -220257 -220826 -220762 -219999 -219370 -218897 -217248 -218852 -219181 -218365 -217432 -217527 -218750
1609b18750J613m244K624p69J605k171k831K998O87O25K39m63K888j329l57J597
1593b16038k126K611j330j427l083L649j410K933q47j365p16K927L09M77l634
1578b19070M341k037J385j825J13K191l557N92l45J378Q09k431j084K916k330
1563b18954J834O53p06l37K365k86l69l591K818k16j381J5K134o05m647L294J138
1546b16841K553m00k090L540j602L59j771J85O3L7n50j416L046L490k767J71q5
1529b14078k500m87J955j687K229j052m09J845L173l858N61o93J62M50j826J511
1513b14704Q90p54n23J079J661j289J92j332j760N97Q79N70k037o71K07K670l904
1496b18229O30K711k958R30K853j736K570M25l897L81k05l28L618l683l82M781
$$ plain form
1609 -218750 -217137 -221381 -218757 -219526 -217921 -220092 -222923 -219925 -219238 -218613 -218374 -218837 -215949 -217278 -217635 -216038
1593 -216038 -218164 -215553 -216883 -218310 -221393 -217744 -219154 -216221 -217068 -218433 -219149 -216222 -215913 -215436 -219070
1578 -219070 -214729 -216766 -215381 -217206 -217093 -214902 -218459 -217867 -218212 -216834 -216025 -218456 -219540 -216624 -218954
1563 -218954 -217120 -216467 -217173 -217510 -215145 -215431 -215800 -219391 -216573 -216789 -218170 -218155 -216021 -216626 -221273 -217979 -216841
1546 -216841 -214288 -214688 -216778 -213238 -214840 -214481 -216252 -216067 -216004 -215967 -216517 -217933 -214887 -211397 -214164 -213993 -214078
1529 -214078 -216578 -217065 -215110 -216797 -214568 -215620 -216029 -214184 -211011 -214869 -214308 -215001 -214839 -214389 -216215 -214704
1513 -214704 -213814 -214568 -215091 -214012 -212351 -213640 -213448 -214780 -216540 -215943 -215064 -214494 -216531 -217202 -216995 -214325 -218229
1496 -218229 -217599 -214888 -217846 -216916 -214063 -215799 -213229 -212804 -216701 -216320 -216525 -216853 -213235 -216918 -217300 -212519
1480b12519k749K918m893J181l135J699J214K738j870J15o42K492l16j775k337
1465b17879L056l287J467K147m420o74N607m080J487r30K503j038j119K472N55
1450b14133J73l415K991k477M624j109j060o80k219K467K326j511K474j264o68
1435b13481n124O27J58P64K665j21P80m51J122m214J05j100L274k508k958N031
1419b15431N05q17r53j040k533j007M856j076J875o62J47Q17l97J629K211k63
1403b12139l495J432l762j44J436q6J564n211K101j429K342L36O30K017j070O017
1387b09461l360K108M9O64n476K706k38q54J227K03j116Q15j22k011J784j436
1371b14518N171j284K301j532j35n72j087J451K77K092L31k765L132J340J836
$$ plain form
1480 -212519 -215268 -212350 -217243 -216062 -219197 -217498 -216284 -213546 -215416 -215301 -215943 -213451 -213767 -215542 -217879
1465 -217879 -214823 -218110 -216643 -214496 -218916 -219590 -213983 -218063 -216576 -217506 -215003 -216041 -217160 -214688 -214133
1450 -214133 -213960 -217375 -214384 -216861 -212237 -213346 -214406 -215086 -217305 -214838 -212512 -214023 -211549 -212813 -213481
1435 -213481 -218605 -217978 -217820 -217056 -214391 -214512 -213732 -214183 -213061 -217275 -217170 -218270 -214996 -217504 -220462 -215431
1419 -215431 -214926 -215743 -216696 -217736 -220269 -221276 -216420 -217496 -215621 -216283 -216136 -215319 -215716 -214087 -211876 -212139
1403 -212139 -215634 -214202 -217964 -218108 -216672 -216758 -215194 -220405 -218304 -219733 -217391 -217055 -216425 -214408 -215478 -209461
1387 -209461 -212821 -210713 -210664 -210000 -215476 -212770 -213008 -213862 -212635 -212432 -213548 -212733 -212855 -214866 -213082 -214518
1371 -214518 -209347 -210631 -208330 -209862 -209997 -210569 -211656 -210205 -209928 -207836 -207505 -210270 -207138 -205798 -203962
1356b03962j727k704k142L206j518j216M278p70j84K03J701l230M242J8N95m12
1340b03622J918m18L9j637j136J997k72j388q92L78j099M225j484J333m78k551
1324b05087K838q82L463l52j090O31r47l53M766l293K237n828J851R73k09o99
1308b01981M261m97m26L85k245J231R40l2Q47l6J115n24k61l399K148j729K185
1291a98018K325l175M95K410nM0m602L265j330L659n128l46M527L304j795k80
1275a94654o66N16j612K27K275m446M405K001m287J63k791J439K441k416K602
1260a94803L212m184L51K61j442L44K640j196j285r84k697L111O22j701K81N90
1244a96880k373M054j716P5J561r84r9K178k59j296k968J404k508M058k799K124
$$ plain form
1356 -203962 -205689 -208393 -210535 -207329 -208847 -210063 -205785 -206555 -206739 -206536 -204835 -208065 -203823 -203805 -203210 -203622
1340 -203622 -201704 -202122 -202083 -203720 -204856 -202859 -203131 -204519 -205411 -205033 -206132 -201907 -203391 -202058 -202536 -205087
1324 -205087 -202249 -203131 -199668 -200020 -201110 -200479 -201426 -201779 -197013 -200306 -198069 -203897 -202046 -201073 -201282 -201981
1308 -201981 -197720 -198217 -198643 -198258 -200503 -199272 -198332 -198364 -197517 -197553 -196438 -196962 -197223 -200622 -198474 -200203 -198018
1291 -198018 -195693 -198868 -198373 -195963 -195968 -195928 -200530 -197265 -198595 -194936 -200064 -200410 -195883 -192579 -194374 -194654
1275 -194654 -195320 -194804 -196416 -196189 -193914 -198360 -193955 -191954 -196241 -196078 -198869 -197430 -194989 -197405 -194803
1260 -194803 -191591 -195775 -195424 -195163 -196605 -196261 -193621 -194817 -196102 -197086 -199783 -196672 -196050 -197751 -197470 -196880
1244 -196880 -199253 -195199 -196915 -196840 -195279 -196263 -196362 -194184 -194443 -195739 -198707 -197303 -199811 -195753 -198552 -196428
1228a96428J690m42j259j613J897j841M09l324L071J331J654j679K402j171j641
1213a96944L1q61n51L879l422J036J575j291K112O87k690M28j729j815L287o09
1197a96877k02J762R42K24J524j307K169n909K534K45j008k703K145L35k49J418
1181a94957J018m323j648L855l38l08l76Q87J993o71n74l54j221N72P6j581K330
1164a95620m03j622M609k386K624l221j099J196L026l845K002l048J101Q05J915
1149a93966k380k82j978L693j112J027o39K957l560K076N29J020l893L321k961
1134a96148K263L85n43J852j942Q39r22P0J7J575j914k02j495J652Q5J988k681
1117a95121j073L260j779J080k467K936J684m134N287n857K919j836J611k927
$$ plain form
1228 -196428 -194738 -195180 -196439 -198052 -196155 -197996 -197587 -200911 -197840 -196509 -194855 -196534 -194132 -195303 -196944
1213 -196944 -196913 -197774 -198325 -194446 -197868 -196832 -195257 -196548 -194436 -193749 -196439 -196011 -197740 -199555 -196268 -196877
1197 -196877 -197079 -195317 -194375 -194151 -192627 -193934 -191765 -197674 -195140 -194895 -195903 -198606 -196461 -196126 -196375 -194957
1181 -194957 -193939 -198262 -199910 -196055 -196393 -196701 -197077 -196190 -194197 -194868 -195442 -195796 -197017 -196445 -196369 -197950 -195620
1164 -195620 -196023 -197645 -193036 -195422 -192798 -196019 -197118 -195922 -192896 -196741 -194739 -197787 -196686 -195881 -193966
1149 -193966 -196346 -196628 -198606 -194913 -196025 -194998 -195637 -192680 -196240 -194164 -193635 -192615 -196508 -193187 -196148
1134 -196148 -193885 -193500 -194043 -192191 -194133 -193294 -194216 -194146 -194129 -192554 -194468 -194670 -196165 -194513 -194428 -192440 -195121
1117 -195121 -196194 -192934 -194713 -193633 -196100 -193164 -191480 -195614 -190327 -196184 -193265 -195101 -193490 -196417
1103a96417J372j194M777m467M681k068K63l009N03J59j266K646k797L584l682
1088a96915L865k01j199k436J613j708L076J035n34j691r23M364j838K691q06
1073a91607m4k02l954M09J080j432K386J059n0J91m44k259K263k018K998m55L21
1056a91758O86o31l140J452j11k3k081K34K915k571j37p8k66r05J358J098J938
1039a92020j295l43M64m45m40o53j45k53K282P86m239L332n47K610m784L378j557
1022a93869j67O15O49O32m004j050L769k179P394l408O28l518J303k857R02K745
1006a92415m59m05j189k024M46K89l21M198m896L345o35k347J804J057J411j858
990a93999L742l936M28J586l44n391J737P96m265R97M917L908k111j697j959l642
$$ plain form
1103 -196417 -195045 -196239 -191462 -195929 -191248 -193316 -193053 -196062 -195559 -195400 -196666 -194020 -196817 -193233 -196915
1088 -196915 -193050 -193251 -194450 -196886 -195273 -196981 -193905 -192870 -193404 -195095 -196018 -191654 -193492 -190801 -191607
1073 -191607 -191651 -191853 -195807 -195398 -194318 -195750 -193364 -192305 -192355 -192164 -192608 -194867 -192604 -194622 -191624 -192079 -191758
1056 -191758 -191072 -191703 -194843 -193391 -193502 -193525 -195606 -195372 -192457 -195028 -195165 -195243 -195509 -196414 -195056 -193958 -192020
1039 -192020 -193315 -193658 -193194 -193639 -194079 -194732 -194877 -195130 -192848 -192062 -196301 -192969 -193516 -190906 -195690 -192312 -193869
1022 -193869 -194036 -193421 -192772 -192140 -196144 -197194 -193425 -195604 -188210 -191618 -190990 -194508 -193205 -196062 -195160 -192415
1006 -192415 -192874 -193279 -194468 -196492 -196046 -195757 -196078 -191880 -196776 -193431 -194066 -196413 -194609 -193552 -192141 -193999
990 -193999 -190257 -194193 -193765 -192179 -192523 -197914 -196177 -195381 -199646 -198649 -193732 -189824 -191935 -193632 -195591 -199233
974a99233K076J685K489m29R82k333l520J035j823j030L804j22M63J304j442k391
958a98485N02k744j311J170L792j323o31L81P31n250L194o51N133Q04n026O3k764
941b02415o69K297K264j749L259l512M64m149N82J129M233K443j209Q56p95K921
925a94050M48l215j888o623k947M522O721K049j119o965k666l573L782N752K624
910a97148K943k685l940k225j556L263M137K804K578m173J731J560O107K555m813
895a88862q655o379n74K18Q101M574l109k850n887m660K475J0540J1290J293m515
880a87000l233r61r95J037L719J356k088m344J318N300P926J252n078q981o356
865a97128L71k48P249K530K730m473l895n849J726J1033O712K861K61k745k759
$$ plain form
974 -199233 -197157 -195472 -192983 -193412 -192430 -194763 -198283 -197248 -199071 -200101 -196297 -196419 -195956 -194652 -196094 -198485
958 -198485 -197983 -200727 -202038 -200868 -197076 -198399 -199030 -198649 -197918 -203168 -199974 -200625 -195492 -194688 -199714 -199651 -202415
941 -202415 -203084 -200787 -198523 -200272 -197013 -200525 -200061 -204210 -203628 -202499 -198266 -195823 -197032 -196176 -196971 -194050
925 -194050 -193602 -196817 -198705 -205328 -208275 -203753 -197032 -194983 -196102 -203067 -205733 -209306 -205524 -199772 -197148
910 -197148 -194205 -196890 -200830 -203055 -204611 -201348 -197211 -194407 -191829 -196002 -194271 -192711 -186604 -184049 -188862
895 -188862 -197517 -203896 -204470 -204252 -196151 -191577 -194686 -197536 -203423 -208083 -205608 -195068 -183778 -182485 -187000
880 -187000 -190233 -191194 -192189 -191152 -187433 -186077 -188165 -192509 -191191 -185891 -177965 -176713 -181791 -190772 -197128
865 -197128 -196757 -197005 -189756 -187226 -184496 -188969 -192864 -198713 -196987 -185954 -179242 -176381 -176120 -178865 -181624
850a81624J038m85R19l687l601j295L833k228P223J685j578m808p263N028l4L234
834a83643L352K901n981k844k573K96K715P360L140j029J623l892p97k76j416
819a81064L08k77J825j969J326p37L15K287j080k760J528J883J753K443m603r79
803a79801L108k638j724N490j371j156j083r48L35j61j864L630J62Q16r22R8p36
786a78765J373K150o02o82J984J8l125K105l356j813K974J653K73J287m97k344
770a77367J270k967r71L725n83P86J424j903J218J254l370P56J097L175N18n514
754a77452K835k28p33q59k116L5J025J082J027j705M71Q52k619r60L338N03m15
737a75919j063Q19k900K561l307L403K665l103J796j178j588N39L076J514m204
$$ plain form
850 -181624 -180586 -181071 -180152 -183839 -187440 -188735 -184902 -187130 -179907 -178222 -179800 -184608 -191871 -186843 -186877 -183643
834 -183643 -180291 -177390 -183371 -186215 -188788 -188492 -185777 -178417 -175277 -176306 -174683 -178575 -179372 -179648 -181064
819 -181064 -180756 -181033 -179208 -181177 -179851 -180588 -180273 -177986 -179066 -181826 -180298 -178415 -176662 -174219 -178822 -179801
803 -179801 -176693 -179331 -181055 -175565 -176936 -178092 -179175 -180123 -179788 -179949 -181813 -178183 -178021 -177205 -178127 -178029 -178765
786 -178765 -177392 -175242 -175844 -176526 -174542 -174524 -177649 -175544 -178900 -180713 -177739 -176086 -175813 -174526 -175023 -177367
770 -177367 -176097 -179064 -180035 -176310 -176893 -176107 -174683 -176586 -175368 -174114 -177484 -176728 -175631 -172456 -171938 -177452
754 -177452 -174617 -174845 -175578 -176437 -178553 -178518 -177493 -176411 -175384 -177089 -176618 -175766 -178385 -179345 -176007 -175504 -175919
737 -175919 -176982 -176163 -179063 -176502 -179809 -176406 -173741 -176844 -175048 -176226 -177814 -177275 -174199 -172685 -176889
722a76889J753M64l364O00K707K45j273r11P05j102J645R40k826L145N51k235
706a75845j131M431j774n30n42J197l309K404o64j50L535m187P47J285j810j9
690a76362J12j255L795l009J744l253M978l061J608q91L697k758q91j139L712
675a72973k095r09o61L369o36l804K124N05L76n29j205M21L0R87j190J674L74
658a74142j449J406k582K600j838m41J740M77J728m337K80O16R71J02o45j17K889
641a72742l615J306l608N50J85N83K099R55j243n70J847J496k828L36P19n03N35
624a74498J084l415K071J87J236l752K697J779m980K601k208J88K087j450L056
609a73317q87j750J222j788M22O25k996J411Q79K323k181r5j854J999M3k249K714
$$ plain form
722 -176889 -175136 -174672 -178036 -177436 -174729 -174484 -175757 -176668 -175963 -177065 -175420 -174480 -177306 -174161 -173610 -175845
706 -175845 -176976 -172545 -174319 -174849 -175391 -174194 -177503 -175099 -175763 -175913 -172378 -176565 -175818 -174533 -176343 -176362
690 -176362 -176250 -177505 -173710 -176719 -174975 -178228 -173250 -176311 -174703 -175594 -171897 -174655 -175546 -176685 -172973
675 -172973 -175068 -175977 -176638 -173269 -173905 -177709 -175585 -175080 -174704 -175233 -176438 -176017 -175987 -175000 -176190 -174516 -174142
658 -174142 -175591 -174185 -176767 -174167 -176005 -176446 -174706 -174229 -172501 -176838 -176558 -175942 -174971 -174869 -175514 -175631 -172742
641 -172742 -176357 -175051 -178659 -178109 -177924 -177341 -175242 -174287 -175530 -176100 -174253 -172757 -175585 -175249 -174530 -175033 -174498
624 -174498 -173414 -176829 -174758 -174571 -173335 -177087 -174390 -172611 -177591 -174990 -177198 -177010 -174923 -176373 -173317
609 -173317 -174204 -175954 -174732 -176520 -176098 -175473 -178469 -177058 -176179 -173856 -176037 -176132 -177986 -175987 -175944 -178193 -175479
592a75479j465L142m922K444k645K759K745k238N56J71l307J160j328K812K239
577a73356K227k258k476O38O91j776J647N27L98j477J175k028P54J932J864j947
561a73465o37k97r10J803L8J48l441L849l739o67M458j280j959l83K880o74p74
544a75050J746j597J93l26l462L647j9K145j645k876M502j37l465R23K922k338
528a74837O76M671j991m319J246Q67j65J327q6j500o20J120R14k65j505M17o78
511a74728Q66m53K668L11k720q23J177j294J629l986J327L421Q14Qo8j496L22
494a73025K972l044K90N6j71j886k75J817L086j996N79l435K004J466k017o2q43
477a74484j903K612J495k709J356l15m51K338j511K547j562n49J056j406J889
$$ plain form
592 -175479 -176944 -173802 -178724 -176280 -178925 -176166 -173421 -175659 -175103 -174932 -178239 -177079 -178407 -175595 -173356
577 -173356 -171129 -173387 -175863 -175225 -174534 -176310 -174663 -174136 -173738 -175215 -174040 -176068 -175314 -173382 -171518 -173465
561 -173465 -174102 -174399 -175309 -173506 -173468 -173320 -176761 -172912 -176651 -177318 -172860 -174140 -176099 -176482 -173602 -174276 -175050
544 -175050 -173304 -174901 -174708 -175034 -178496 -174849 -174868 -172723 -174368 -177244 -172742 -172879 -176344 -175421 -172499 -174837
528 -174837 -174161 -169490 -171481 -175800 -174554 -173687 -173852 -172525 -172611 -174111 -174731 -173611 -172697 -172962 -174467 -174050 -174728
511 -174728 -173862 -174315 -171647 -171336 -174056 -174879 -173702 -174996 -173367 -177353 -176026 -172605 -171791 -171783 -171851 -173347 -173025
494 -173025 -170053 -173097 -172807 -172751 -172922 -174808 -175083 -173266 -170180 -172176 -171597 -175032 -173028 -171562 -173579 -173641 -174484
477 -174484 -176387 -173775 -172280 -174989 -173633 -173948 -174399 -172061 -173572 -171025 -172587 -173136 -172080 -173486 -171597
462a71597Q76p57m37l014K058J371m090L250l87R56j212K25K5j172J766p74j991
445a74904M254m13r91j225J396k70J42j224P15P83N86l46j732K135j484J61L02
428a72115J348j778R66J713k661L33k78l25N27P76N38j842o48K097k72o023N658
411a71986J621O13k560l094K718J245m35K943j890L673n862M75M44k131q92L338
395a71780p49L449j842j540K67l177L864J013k890N028m781J880p30l31K350l752
379a73721k287L650K861j251m88n40J041j716M60J51j735J888j352O53k417N071
363a69732l351J493K533m880J292k201K291J180N01j836K039j755J039q82q75
348a73144J993P27m03J435M98j621l105M122O58k280k007O018n074k02J354k533
$$ plain form
462 -171597 -170721 -171478 -171915 -174929 -172871 -171500 -175590 -172340 -172727 -171771 -172983 -172758 -172733 -173905 -172139 -172913 -174904
445 -174904 -170650 -171063 -172054 -173279 -171883 -172153 -172011 -173235 -172520 -171737 -171151 -171497 -173229 -171094 -172578 -172417 -172115
428 -172115 -170767 -172545 -171579 -169866 -172527 -172194 -172472 -172797 -172270 -171494 -170956 -172798 -173446 -171349 -171621 -177644 -171986
411 -171986 -170365 -169752 -172312 -175406 -172688 -171443 -171878 -168935 -170825 -167152 -173014 -172539 -172095 -174226 -175118 -171780
395 -171780 -172529 -169080 -170922 -172462 -172195 -175372 -171508 -170495 -173385 -168357 -173138 -171258 -171988 -172319 -169969 -173721
379 -173721 -176008 -172358 -169497 -170748 -171236 -171776 -170735 -172451 -171991 -171840 -173575 -171687 -173039 -172386 -174803 -169732
363 -169732 -173083 -171590 -169057 -173937 -172645 -174846 -172555 -171375 -170874 -172710 -170671 -172426 -171387 -172269 -173144
348 -173144 -171151 -170424 -170827 -169392 -168894 -170515 -173620 -169498 -168840 -171120 -173127 -167109 -172183 -172385 -171031 -173564
332a73564K771j548O91P8Q83J133j139J403J554j544J347M85k395k741J393P46
316a70447o45J114j452j480K80m249M985L213m519j2L65M541k102k485J910k055
300a73038P71K741r37K054n754P186l860m43j569K428j25n05P16k82J786j761
284a70592k606J011J480l132M788k364K87j616M411l292K348l902K729j779j188
269a73417J663J545q79J666o83n02K551k888J128j613j369R77o28J83q96J392
253a71770j630L367k744J012O87k039J102r1J216k898k543M483J317j361k063
238a73955Q42J631k947L191R30m53J56j499Q90K927k265n40J995l665M23J203
222a71136L415l639j714R91r39M635m467J003m9l2j610M49j042K913j800L565
$$ plain form
332 -173564 -170793 -172341 -171650 -171572 -170689 -169556 -170695 -169292 -167738 -169282 -167935 -167450 -169845 -172586 -171193 -170447
316 -170447 -171092 -169978 -171430 -172910 -172630 -176879 -171894 -168681 -173200 -173212 -172847 -168306 -170408 -172893 -170983 -173038
300 -173038 -172267 -169526 -170463 -168409 -174163 -166977 -170837 -171280 -172849 -170421 -170546 -171051 -170335 -170617 -168831 -170592
284 -170592 -173198 -172187 -170707 -173839 -169051 -171415 -171128 -172744 -168333 -171625 -169277 -173179 -170450 -172229 -173417
269 -173417 -171754 -170209 -171088 -169422 -170105 -170607 -168056 -170944 -169816 -171429 -172798 -171821 -172449 -172266 -173162 -171770
253 -171770 -173400 -170033 -172777 -171765 -171078 -173117 -172015 -172106 -170890 -173788 -176331 -171848 -170531 -171892 -173955
238 -173955 -173113 -171482 -174429 -171238 -170308 -170761 -170605 -172104 -171214 -168287 -170552 -171092 -169097 -172762 -172339 -171136
222 -171136 -167721 -171360 -173074 -172083 -173022 -168387 -172854 -171851 -171900 -171932 -173542 -173093 -174135 -171222 -173022 -169457
206a69457l93M3j347j363p43J339L379l490n45l65M25n86J520J395j775J004p84
189a71743J012M82p53l71R73k711P05p46J702l157L608l808J936j541J457Q6l0
172a72899J858k338J255M14k526K52J562o44M3K165l30k448J761k683K508j305
156a73355N09j508k438L820p68k775L291j048J980j048K75j030k344K393k505
141a76551L222j297j677K685m24r56L64j10r48J102j345J840j016k08J640m53
125a74132l545J211r43L811l288j151R21M47p88K138k109r46K81J8j15N20M48
108a77222m56J525k228n96M42O0M92j096K325k824L29n50k587J760k75L853j906
91a78954j749k20J967l261M685j614j853K682j333L01l626K173K11n53j76q90
$$ plain form
206 -169457 -169850 -169807 -171154 -172517 -173260 -171921 -168542 -172032 -172577 -172942 -172517 -173103 -171583 -170188 -171963 -170959 -171743
189 -171743 -170731 -170249 -171002 -171373 -170400 -173111 -172406 -173152 -171450 -174607 -170999 -174807 -172871 -174412 -172955 -172869 -172899
172 -172899 -171041 -173379 -172124 -171710 -174236 -173984 -172422 -173066 -173023 -170858 -171188 -173636 -171875 -174558 -172050 -173355
156 -173355 -172846 -174354 -176792 -172972 -173740 -176515 -173224 -174272 -172292 -173340 -173065 -174095 -176439 -174046 -176551
141 -176551 -173329 -174626 -176303 -173618 -174042 -174998 -174634 -174744 -175692 -174590 -175935 -174095 -175111 -175319 -173679 -174132
125 -174132 -177677 -176466 -177409 -173598 -176886 -178037 -177116 -176669 -177457 -175319 -177428 -178374 -178093 -178075 -178190 -177670 -177222
108 -177222 -177678 -176153 -178381 -178977 -178535 -178475 -177983 -179079 -176754 -179578 -179249 -179799 -182386 -180626 -180901 -177048 -178954
91 -178954 -180703 -180923 -178956 -182217 -177532 -179146 -180999 -178317 -179650 -179349 -182975 -180802 -180591 -181144 -181320 -182210
75a82210K224j380p79j081m06K542l04o55L25p15l34j984P53K147j580R97o74
58a83114k652K096J313J167k147p98q91r17K00pR77p04O56j009R82j552K80P23
40a85397K0m8Q76k172J692j491l31Q16J295k044M02j946K358j15m21j449k55P51
22a87459M31P74l830M45J708P36p83p21p46Q83j068j007K67J47j573J772o14N70
4a90068j091J654j016l61
0a90882
$$ plain form
75 -182210 -179986 -181366 -182145 -183226 -183632 -181090 -181394 -182049 -181724 -182439 -182773 -184757 -184004 -181857 -183437 -182440 -183114
58 -183114 -185766 -183670 -182357 -181190 -183337 -184135 -185026 -185943 -185743 -185750 -184773 -185477 -184821 -185830 -184848 -186400 -186120 -185397
40 -185397 -185377 -185425 -184549 -186721 -185029 -186520 -186851 -186035 -184740 -186784 -186382 -188328 -185970 -186085 -186506 -187955 -188210 -187459
22 -187459 -187028 -186254 -190084 -189639 -187931 -187195 -187978 -188699 -189445 -188562 -189630 -190637 -190370 -190223 -191796 -190024 -190638 -190068
4 -190068 -191159 -189505 -190521 -190882
0 -190882
$$ Imaginary data points
##PAGE= N=2
##DATA TABLE= (X++(I..I)), XYDATA
16383g18850J0740P963Q225P402R566R347J0711N094J1617N225Q743R702Q689
16370f05826P317R808R628R235O465Q655Q123P490R963R210R998Q800N807R629
16356d85698Q419R116P491Q562O117J1361N808Q670J0723Q122M761Q398R623R744
16342c68783R305N192Q393J0529N846Q274P814O490P325J0657M876J0553P646
16329b65883R682L121J1398N969R039P335Q898O800P197O010Q763O872P316Q179
16315a59304P866O652P838P193Q040O272Q612N045P524Q236N048P611P730N561
16301f0076P198P071R609M207P694P338O409N959O901P102O629M031R193O165
16287C5430O996N257P885M849Q998J592Q683M844Q270N217N916O716M678O017
$$ plain form
16383 -718850 -708110 -700147 -691922 -684520 -674954 -665607 -654896 -649802 -638185 -632960 -624217 -614515 -605826
16370 -605826 -598509 -588701 -579073 -569838 -563373 -554718 -546595 -539105 -529142 -519932 -509934 -501134 -495327 -485698
16356 -485698 -477279 -468163 -460672 -452110 -445993 -434632 -428824 -420154 -409431 -401309 -396548 -388150 -378527 -368783
16342 -368783 -359478 -354286 -345893 -335364 -329518 -321244 -313430 -306940 -299615 -288958 -284082 -273529 -265883
16329 -265883 -256201 -253080 -241682 -235713 -226674 -219339 -210441 -203641 -196444 -190434 -181671 -174799 -167483 -159304
16315 -159304 -151438 -144786 -136948 -129755 -121715 -115443 -106831 -101786 -94262 -86026 -80978 -73367 -65637 -60076
16301 -60076 -52878 -45807 -36198 -31991 -24297 -16959 -10550 -4591 2310 9412 16041 20072 29265 35430
16287 35430 42426 47683 55568 60417 69415 71007 79690 84534 92804 98021 103937 110653 115331 121348
16273A21348N157P442P556N108K434P048Q735M345N951O662L821O663M915M157
16259B01342N544M444M778N684N378P932K024O398J666P500O778L091M791M308
16245B71658O188M186N789J084M694N700P282K879N053M138N223J988M799P443
16231C38104N625J371L956K160O010J934L057O559M435J084O520J900K383L040
16217C88138O278L313M388J642N572L124M570K945K266N941J237J75M719K276
16203D36584M595O349J952J654O053j40K137M746K589K882M135N95L274K393J798
16188D81596O240j462M935M298j469N873J079J915K294L368J496J732K444M905
16174E19244j982J756L861J817L652J690J296J427L650L585j641J92L206K421
$$ plain form
16273 121348 126505 133947 141503 146611 149045 156093 164828 169173 175124 181786 185607 192270 197185 201342
16259 201342 206886 211330 216108 221792 227170 235102 237126 243524 245190 252690 259468 262559 267350 271658
16245 271658 277846 282032 287821 288905 293599 299299 306581 309460 314513 318651 323874 325862 330661 338104
16231 338104 343729 345100 349056 351216 357226 359160 362217 368776 373211 374295 380815 382715 385098 388138
16217 388138 394416 397729 402117 403759 409331 412455 417025 419970 422236 428177 429414 429589 434308 436584
16203 436584 441179 447528 449480 451134 457187 457047 459184 463930 466519 469401 473536 474131 477405 479798 481596
16188 481596 487836 486374 491309 495607 494138 500011 501090 503005 505299 508667 510163 511895 514339 519244
16174 519244 517262 519018 522879 524696 528348 530038 531334 532761 536411 539996 538355 538547 541753 544174
16160E44174L222K878r65J429L316K457k33L101m275O794K912J586l68K405J666
16145E70099K077L832l99P69j68K286j375L594J202k72J200N093j026O30M77K998
16129E91017R88L800j320Q77l23L877r81p36L609J3M05M493j636M89L937k874
16113F05635l18L400J276m095L10K761l33M308j176K484j31J472K278m777M609
16098F17703j874K912J330m08R08r74R46J108j65j803K362J647L206l160J078
16083F24816n27L94Q92J038K184k533L985l844M396j320m02j085R11L505m577
16068F27833K341k57K137o21L229k48j601K392Q64k258j313j172N666k0k560M9
16052F34461Q67N77K547k497N1r9J568k178K856J533j192j596J519J530j57j962
$$ plain form
16160 544174 547396 550274 549309 550738 554054 556511 556278 559379 555104 561898 564810 566396 566028 568433 570099
16145 570099 572176 576008 575609 576378 576210 578496 577121 580715 581917 581645 582845 587938 586912 587542 588019 591017
16129 591017 592005 595805 594485 595362 595039 598916 597935 597199 600808 600821 601226 605719 604083 604572 608509 605635
16113 605635 605317 608717 609993 605898 606208 608969 608636 612944 611768 614252 614121 615593 617871 613094 617703
16098 617703 615829 618741 620071 619663 620571 619597 620543 621651 621486 619683 622045 623692 626898 623738 624816
16083 624816 624289 624683 625575 626613 628797 626264 630249 626405 630801 629481 629079 627994 628905 632410 627833
16068 627833 630174 629917 632054 631433 634662 634414 632813 635205 636069 633811 632498 631326 636992 636972 634412 634461
16052 634461 635328 635905 638452 635955 636006 635907 637475 635297 638153 639686 638494 636898 638417 639947 639790 637828
16036F37828k53l43K473L327k959J199k565K270j974J025R22R36j682l109M216
16021F41311J117j597K522l691J801L24M41J500j153o30p15k60M188l417K660
16006F44401l024J379j490L023q98k953J471L85o77N00j101L444j272L366l468
15991F43086K649j651M03o68J027k638n02L195j893J668k498N443k628l34P73
15976F45432m497J648L724K329p106L492j552M599j359j403J293q0K31J594k983
15961F45362J208q97p20k838K131j08K992k051j196K377P59r68j229q8L114R71
15945F48819m03k099o83J256l804L407r47r88K449j384L19O25K171k719K000k092
15929F45927M084l600L191k220J18KJ57O35Q70j142J203l121j049L85L377m5n47
$$ plain form
16036 637828 637575 637232 639705 643032 640073 641272 638707 640977 639003 640028 640950 641886 640204 637095 641311
16021 641311 642428 640831 643353 639662 641463 641787 642228 643728 642575 641945 641230 640970 645158 641741 644401
16006 644401 641377 642756 641266 644289 643391 640438 641909 642294 641617 642117 641016 644460 643188 646554 643086
15991 643086 645735 644084 644487 643819 644846 642208 641706 644901 643008 644676 642178 647621 644993 644659 645432
15976 645432 640935 642583 646307 648636 641530 645022 643470 648069 646710 645307 646600 646520 646751 648345 645362
15961 645362 646570 645673 644953 642115 644246 644138 647130 645079 643883 646260 647019 646051 644822 644734 647848 648819
15945 648819 648416 646317 645634 646890 643086 646493 645546 644558 647007 645623 645942 646567 648738 646019 648019 645927
15929 645927 650011 646411 649602 647382 647500 647502 647659 648294 649164 648022 649225 646104 645055 645440 648817 648772 648225
15912F48225J055M34J535k313J463j538q7k92P23J905j230j994J610k359o65K942
15896F49414j989M7L548j678k23j70J061j683O51J980j910j00J502j583N51N93
15880F50011j606J807l75R8Q96l351L658r9J01m86J631j75l639K041K36N83l19
15863F51012J719k781Q27J669k39k588J043j197M164o16o27M96P3l248K869l473
15847F49103K838j98K118l139K111l19k669L270N09J284P05O7k419r58k453J721
15831F51571n25J53J701J640j418L030M29J684l973j800K231q31J245K73J075
15816F56485l00j647q64Q39j708K215J158L78j624J253k157P80j117j710K911
15801F54892k76P48Q02q90j063m84J162J907j483M45K078l165L34j450L933q55
$$ plain form
15912 648225 649280 649714 651249 648936 650399 648861 648774 648482 649205 651110 649880 647886 649496 647137 646472 649414
15896 649414 647425 647472 651020 649342 649119 648949 650010 648327 648978 650958 649048 648948 650450 648867 649418 650011
15880 650011 648405 650212 649837 649935 650831 647480 651138 651039 651140 650654 652285 652110 648471 650512 650748 651331 651012
15863 651012 652731 649950 650777 652446 652207 649619 650662 649465 653629 653013 652386 652882 652955 649707 652576 649103
15847 649103 651941 651743 653861 650722 652833 652514 649845 653115 653624 654908 655613 655680 653261 652303 649850 651571
15831 651571 651046 651199 652900 654540 653122 656152 656581 658265 654292 652492 654723 653892 655137 655410 656485
15816 656485 656185 654538 653674 654513 652805 655020 656178 656556 654932 656185 654028 654808 653691 651981 654892
15801 654892 654616 655364 656166 655276 654213 653729 654891 656798 655315 655760 657838 654673 655007 653557 657490 656635
15785F56635n2K281j515m240J513J879R44R27r47j565o14N51O13j46K114R16m076
15768F55218J725L6q33q39J147j997K256k28J404l73l28J164K110k175Q69q87
15752F58269j238n80J677p2j430J400q03L422l472o84M588k674R35k667J615j628
15736F56658q78L736k34j465K859j701m8K2k133K036J669j371p95j64P23K488
15720F61402l45k313R44Q26K31l65j764L158j397o14O71J50O03j390j17p42Q85
15703F59823J798L010m368J455l03J022m319J780j558J302L340l391J830j104
15689F60317J136L88L40j513J551n07M69k641K553K310m174r12L940l998J690
15674F60949J027l99L890j856j860k4j328M821m355K236k418q7l57R8J955J818
$$ plain form
15785 656635 656583 658864 657349 653109 654622 656501 657445 658372 657425 655860 655246 655797 656410 656264 658378 659294 655218
15768 655218 656943 656979 656146 655307 656454 654457 656713 656485 657889 657516 657188 658352 660462 658287 659156 658269
15752 658269 657031 656451 658128 658056 656626 658026 657223 660645 657173 656489 661077 658403 659338 656671 658286 656658
15736 656658 655780 659516 659282 657817 660676 658975 658927 658949 656816 658852 660521 659150 658355 658191 658914 661402
15720 661402 661057 658744 659688 660514 660745 660380 658616 661774 660377 659763 660434 660584 661187 659797 659680 658938 659823
15703 659823 661621 664631 660263 661718 661415 662437 658118 659898 658340 659642 662982 659591 661421 660317
15689 660317 661453 661841 662181 660668 662219 661712 662181 659540 662093 664403 660229 659317 663257 659259 660949
15674 660949 661976 661577 665467 663611 661751 661727 660399 665220 660865 663101 660683 660596 660239 660337 662292 664110
15658F64110j50k079J892j917R42Q06J86k472K502J792j318l431K956K13J922
15643F65954o79j737K770j313l18k148M92K167J788j826l113J910L05K042j358
15628F64936K631j839J220j238R04j241k1N83K623k316j797K130K499l961J582
15613F66695j039J381L40j597K460l279K121J006j002L71j352J261J600k192p05
15598F66069N89p25L112k68k452K132j354j101J236J101q38k444N94K933j234
15583F67350J241o41L6Q94J557l381l95J941l086n46K667J75j510L16J700q79
15567F67439P44K915k720J426J591j166K470m125L229m318M401k537J629n485
15553F65493L437k229K374J395m65q91j610M509R87k719K273l582L540k303K360
$$ plain form
15658 664110 663960 661881 663773 661856 662798 663604 663790 661318 663820 665612 664294 660863 663819 664032 665954
15643 665954 665275 663538 666308 664995 664677 662529 663021 665188 666976 665150 662037 663947 664252 666294 664936
15628 664936 667567 665728 666948 665710 666614 665373 665352 665935 668558 666242 664445 666575 669074 665113 666695
15613 666695 665656 667037 667377 665780 668240 664961 667082 668088 667086 667457 666105 667366 668966 666774 666069
15598 666069 666658 665933 669045 668777 666325 668457 667103 666002 667238 668339 667501 665057 665651 668584 667350
15583 667350 668591 667950 667986 668880 670437 667056 666661 668602 665516 664970 667637 667812 666302 666618 668318 667439
15567 667439 668183 671098 668378 669804 671395 670229 672699 668574 671803 667485 671886 669349 670978 665493
15553 665493 668930 666701 669075 670470 670005 669114 667504 672013 673000 670281 672554 668972 672512 670209 672569
15538F72569L7j709p13m52R6k956L372m97M0J283j609L11K895J608k438k10j00
15521F71527K18j371K028R81k051N85j859M410l444L763l680L476M41j731k940
15506F70353M632m35k462K22J160l12j489L126k397K142M72Q63l275J291l249
15491F70642L888L68k810R07l206j204L754J107J113k364M346l891j089L267k025
15476F72803K731M15p54J86k357K413J42M118m602K267k655j005K528M55k597
15461F74088L043j613Q5p49O22r01N49j3J693j870j431J648Q18p93L20K053j662
15444F75887o0J915J75l398M379n61r86k710J502J597k366J62k773N286O39k452
$$ plain form
15538 672569 672606 670897 670184 669732 669828 666872 670244 669747 669787 671070 669461 669772 672667 674275 671837 671627 671527
15521 671527 671745 670374 672402 673383 671332 671917 670058 674468 671024 674787 671107 674583 675024 673293 670353
15506 670353 674985 674550 672088 672310 673470 673158 671669 674795 672398 674540 675012 675875 672600 673891 670642
15491 670642 674530 674898 672088 672995 669789 668585 672339 673446 674559 672195 676541 672650 671561 674828 672803
15476 672803 675534 675949 675195 675381 673024 675437 675579 679697 675095 677362 674707 673702 676230 676685 674088
15461 674088 677131 675518 675603 674854 675476 674575 675124 675111 676804 674934 673503 675151 675969 675176 675496 677549 675887
15444 675887 675827 677742 677917 674519 678898 678337 677351 674641 676143 677740 675374 675536 672763 678049 678688 676236
$$ [...]
##END NTUPLES=NMR SPECTRUM
##END=
