##TITLE=C13_SA_slBFeOH
 CDCl3, 21200 sc

 26.11.2020
##JCAMPDX= 6.0         $$ Bruker NMR JCAMP-DX V2.0
##DATA TYPE= NMR SPECTRUM
##DATA CLASS= NTUPLES
##ORIGIN= UXNMR, Bruker Analytische Messtechnik GmbH
##OWNER= root
$$ XWIN-NMR		Version 3.5
$$ Fri Nov 27 09:57:04 2020 Russian Standard Time (UT+4h)  she@DPX200
##.OBSERVE FREQUENCY= 50.327896
##.OBSERVE NUCLEUS= ^13C
##.ACQUISITION MODE= SIMULTANEOUS
##.ACQUISITION SCHEME= undefined
##.AVERAGES= 21200
##.DIGITISER RES= 17
##SPECTROMETER/DATA SYSTEM= spect
##.PULSE SEQUENCE= zgpg30
##.SOLVENT NAME= CDCl3
##.SHIFT REFERENCE= (INTERNAL, CDCl3, 0, 222.661)
##AUDIT TRAIL= $$ (NUMBER, WHEN, WHO, WHERE, WHAT)
$$ ##TITLE= Audit trail, XWIN-NMR		Version 3.5
$$ ##JCAMPDX= 5.01
$$ ##ORIGIN= Bruker BioSpin GmbH
$$ ##OWNER= she
$$ F:/spectra/data/she/nmr/c13/1/pdata/1/auditp.txt
$$ ##AUDIT TRAIL=  $$ (NUMBER, WHEN, WHO, WHERE, WHAT)
(   1,<2020-11-27 09:55:16.60 +0400>,<she>,<DPX200>,
      <created by zg, POWCHK disabled, PULCHK disabled
       terminated by command 'halt'
       configuration hash MD5:
       00 E9 B6 7A A2 85 ED C7 34 08 36 98 17 FE 4E 26
       data hash MD5: 32K
       F5 3A 0E 50 D0 A7 C5 A3 7E 23 52 76 3C 91 BF A4>)
(   2,<2020-11-27 09:55:20.28 +0400>,<she>,<DPX200>,
      <Start of raw data processing
       efp BC_mod = 2 LB = 1 FT_mod = 6 PKNL = 1 PHC0 = -205.436 PHC1 = 21.36242 SI = 32K 
       data hash MD5: 32K
       26 FE 7C 66 A4 AB 1A B8 E3 A8 0F 37 0A A3 B0 84>)
(   3,<2020-11-27 09:55:23.23 +0400>,<she>,<DPX200>,
      <abs ABSG = 5 
       data hash MD5: 32K
       B2 05 AB 0F 80 94 1E F1 F3 4C C7 45 4F 75 64 55>)
(   4,<2020-11-27 09:55:59.29 +0400>,<she>,<DPX200>,
      <pk PHC0 = -4.431971 PHC1 = 7.599999 
       data hash MD5: 32K
       40 A4 80 2D BE 20 71 BD D3 8F FA C7 8E 43 6A AD>)
(   5,<2020-11-27 09:56:02.53 +0400>,<she>,<DPX200>,
      <abs ABSG = 5 
       data hash MD5: 32K
       4B 2B 38 AE A7 66 1A 9C F9 6D 39 BF 4D 34 32 55>)
(   6,<2020-11-27 09:56:33.20 +0400>,<she>,<DPX200>,
      <pk PHC0 = 1.201247 PHC1 = 0 
       data hash MD5: 32K
       15 C2 90 06 94 01 79 34 A4 22 63 FC 13 64 9B 00>)
$$ ##END=
$$ 
$$ hash MD5
$$ 6B 9F 35 3C F6 91 82 98 17 B2 D6 B2 63 03 B3 C7
##$RELAX= 
##$RELAX= 
##$RELAX= 
##$RELAX= 
##$RELAX= 
##$RELAX= 
##$RELAX= 
##$RELAX= 
$$ Bruker specific parameters
$$ --------------------------
##$DU= <F:/spectra>
##$EXPNO= 1
##$NAME= <c13>
##$PROCNO= 1
##$TYPE= <nmr>
##$USER= <she>
##$AMP= (0..31)
100 100 100 100 100 100 100 100 100 100 100 100 100 100 100 100 100 100 
100 100 100 100 100 100 100 100 100 100 100 100 100 100 
##$AQSEQ= 0
##$AQ_mod= 1
##$AUNM= <au_zg>
##$AUTOPOS= <>
##$BF1= 50.322709
##$BF2= 200.13
##$BF3= 50.322709
##$BF4= 500.13
##$BF5= 500.13
##$BF6= 500.13
##$BF7= 500.13
##$BF8= 500.13
##$BYTORDA= 1
##$CFDGTYP= 0
##$CFRGTYP= 5
##$CHEMSTR= <none>
##$CNST= (0..31)
1 1 145 1 1 1 1 1 1 1 1 1 1 1 1 1 1 1 1 1 1 1 1 1 1 1 1 1 1 1 1 1 
##$CPDPRG= <waltz16>
##$CPDPRG1= <>
##$CPDPRG2= <waltz16>
##$CPDPRG3= <>
$$ [...]
##$SUBNAM4= <"">
##$SUBNAM5= <"">
##$SUBNAM6= <"">
##$SUBNAM7= <"">
##$SUBNAM8= <"">
##$SUBNAM9= <"">
##$SW= 239.972175391363
##$SWIBOX= (0..15)
0 1 3 0 0 0 0 0 0 0 0 0 0 0 0 0 
##$SW_h= 12077.2946859903
##$TD= 32768
##$TD0= 1
##$TE= 0
##$TE2= 300
##$TE3= 300
##$TEG= 300
##$TL= (0..7)
120 120 120 120 120 120 120 120 
##$TP= (0..7)
150 150 150 150 150 150 150 150 
##$TP07= 0
##$TPNAME0= <>
##$TPNAME1= <>
##$TPNAME2= <>
##$TPNAME3= <>
##$TPNAME4= <>
##$TPNAME5= <>
##$TPNAME6= <>
##$TPNAME7= <>
##$TPOAL= (0..7)
0.5 0.5 0.5 0.5 0.5 0.5 0.5 0.5 
##$TPOFFS= (0..7)
0 0 0 0 0 0 0 0 
##$TUNHIN= 0
##$TUNHOUT= 0
##$TUNXOUT= 0
##$USERA1= <user>
##$USERA2= <user>
##$USERA3= <user>
##$USERA4= <user>
##$USERA5= <user>
##$V9= 5
##$VALIST= <valist>
##$VCLIST= <CCCCCCCCCCCCCCC>
##$VD= 0
##$VDLIST= <DDDDDDDDDDDDDDD>
##$VPLIST= <PPPPPPPPPPPPPPP>
##$VTLIST= <TTTTTTTTTTTTTTT>
##$WBST= 1024
##$WBSW= 4
##$XGAIN= (0..3)
0 0 0 0 
##$XL= 0
##$YL= 0
##$YMAX_a= 54179030
##$YMIN_a= -128652801
##$ZGOPTNS= <>
##$ZL1= 120
##$ZL2= 120
##$ZL3= 120
##$ZL4= 120
##$ABSF1= 222.6606
##$ABSF2= -17.33621
##$ABSG= 5
##$ABSL= 3
##$ALPHA= 0
##$AQORDER= 0
##$ASSFAC= 0
##$ASSFACI= 0
##$ASSFACX= 0
##$ASSWID= 0
##$AUNMP= <proc_1d>
##$AZFE= 0.1
##$AZFW= 0.5
##$BCFW= 0
##$BC_mod= 2
##$BYTORDP= 0
##$COROFFS= 0
##$CY= -3
##$DATMOD= 1
##$DC= 0
##$DFILT= <>
##$DTYPP= 0
##$F1P= 0
##$F2P= 0
##$FCOR= 0.5
##$FTSIZE= 32768
##$FT_mod= 6
##$GAMMA= 0
##$GB= 0
##$INTBC= 1
##$INTSCL= 4.134877e-10
##$ISEN= 128
##$LB= 1
##$LEV0= 0
##$LPBIN= 0
##$MAXI= 10000
##$MC2= 0
##$MEAN= 0
##$ME_mod= 0
##$MI= 0.1934396
##$NCOEF= 0
##$NC_proc= 2
##$NLEV= 6
##$NOISF1= 120.0001
##$NOISF2= 80.00006
##$NSP= 0
##$NTH_PI= 0
##$NZP= 0
##$OFFSET= 222.6606
##$PC= 1.4
##$PHC0= -208.6667
##$PHC1= 28.96242
##$PH_mod= 1
##$PKNL= yes
##$PPARMOD= 0
##$PSCAL= 0
##$PSIGN= 0
##$REVERSE= no
##$SF= 50.322729756361
##$SI= 32768
##$SIGF1= 140
##$SIGF2= 120
##$SINO= 11.81781
##$SIOLD= 32768
##$SREGLST= <13C.CDCl3>
##$SSB= 0
##$STSI= 32768
##$STSR= 0
##$SW_p= 12077.2946859903
##$SYMM= 0
##$S_DEV= 0
##$TDeff= 32768
##$TDoff= 0
##$TI= <>
##$TILT= no
##$TM1= 0
##$TM2= 0
##$TOPLEV= 0
##$USERP1= <user>
##$USERP2= <user>
##$USERP3= <user>
##$USERP4= <user>
##$USERP5= <user>
##$WDW= 1
##$XDIM= 32768
##$YMAX_p= 409059586
##$YMIN_p= -3392574
$$ End of Bruker specific parameters
$$ ---------------------------------
##NTUPLES= NMR SPECTRUM
##VAR_NAME=  FREQUENCY,     SPECTRUM/REAL,   SPECTRUM/IMAG
##SYMBOL=    X,             R,               I
##VAR_TYPE=  INDEPENDENT,   DEPENDENT,       DEPENDENT
##VAR_FORM=  AFFN,          ASDF,            ASDF
##VAR_DIM=   32768,         32768,           32768
##UNITS=     HZ,            ARBITRARY UNITS, ARBITRARY UNITS
##FACTOR=    0.368581032318806, 1,           1
##FIRST=     11204.8891385315, 0,            0
##LAST=      -872.405547458802, 0,           0
##MIN=       -872.405547458802, -3392574,    0
##MAX=       11204.8891385315, 409059586,    0
$$ Real data points
##PAGE= N=1
##DATA TABLE= (X++(R..R)), XYDATA
$$ [...]
18027 271445 304248 331207 85032 622305 1082162 1189232 1313544 1101381 812780 1068727
18017 1068727 1469385 1207325 1322742 1854141 2365839 2791906 3321919 3882266 4969598
18008 4969598 6435793 8054650 9726051 11868433 14353000 17262238 21557846 27418222
18000 27418222 34789919 42657212 48518482 48828576 42982483 34657372 26844010 20914743
17992 20914743 16953816 14132941 11794082 10033813 8441601 6921612 5612830 4914623
17984 4914623 4323972 3939024 3537458 2509527 1880066 1753363 1760753 1529393 1285813 935616
17974 935616 344024 -119559 -447086 -113460 -10684 -133001 450 53999 -154107 -124730
17964 -124730 105922 68415 -6820 -5984 -22033 -62070 -373124 -609900 -495503 -151036 482200
17953 482200 782863 919755 613894 69639 47476 471038 869813 764097 547235 544686
17943 544686 663831 501763 117653 -75530 -200520 -48029 298661 503260 431782 -3740
17933 -3740 150589 356254 238201 324166 282202 124896 -208893 -419580 -479755 -317841
17923 -317841 -7680 146491 -34341 26935 -22270 -153876 -344392 -329588 -253932 -371411
17913 -371411 -582650 -372490 14608 108384 128329 250108 247086 69104 -134424 117182
17903 117182 128103 7110 208885 386779 428357 86559 33291 400288 465379 324563
17893 324563 405249 307207 186225 259077 328688 340079 81718 -240721 -800250 -981280
17883 -981280 -635937 -608747 -568235 -609822 -627298 -520886 -717241 -675860 -299512 -448585
17873 -448585 -709119 -656020 -936031 -1140345 -835747 -641763 -187401 398689 349840 -156881
17863 -156881 -542566 -608036 -744838 -626600 -460529 -282909 -415675 -660666 -853864 -954391
17853 -954391 -728602 -628820 -371784 -280251 -262504 -357422 -418000 -567857 -797452 -877375 -550843
17842 -550843 -330494 -257627 -201779 -275596 -271357 -339930 -589148 -822459 -714568 -568396 -780426
17831 -780426 -367390 149470 -83802 -229208 -80895 314031 321251 21564 204087 787185
17821 787185 1049401 763720 363592 -85786 -460167 -447495 -416083 -503702 -474606 -556517
17811 -556517 -435305 -320583 -605109 -716701 -377031 -253459 -219349 136248 484220 119933
17801 119933 -213855 124250 280166 422323 546296 553032 285543 -125045 -264550 178852
17791 178852 159591 -146402 -579946 -939059 -1014495 -921402 -703904 -291511 -17157 24616
17781 24616 -122284 -200371 -439426 -468705 -556636 -827198 -652908 -657567 -1093807 -1315638 -1368303
17770 -1368303 -1084176 -1017217 -1061309 -1268382 -1240267 -1238293 -1529138 -1604591 -1689644 -1469193 -832846
17759 -832846 -529928 -635668 -280842 -164913 -163532 165036 191063 -228254 -448526 -862340
17749 -862340 -1203119 -832099 -407362 11237 432460 385300 -22429 -255876 -244108 -115461
17739 -115461 -188768 -302406 -31069 27713 156983 265603 -113753 -321518 -59569 -108255
17729 -108255 -428539 -687707 -532264 -51995 -370942 -959887 -824000 -368907 -399570 -884790
17719 -884790 -1223248 -1416057 -1328508 -1559816 -1695750 -1251564 -852967 -846912 -448136 -108171
17709 -108171 -231131 -406638 -281973 -336198 -402749 -188207 198659 333349 -114443 -635383
17699 -635383 -1023848 -927740 -595411 -334816 -366156 -588138 -807187 -929102 -660616 -586413
17689 -586413 -999269 -1202455 -1379412 -1206741 -947047 -1039354 -1367489 -1562680 -1466815 -974063
17679 -974063 -448343 -392060 -751462 -807259 -867979 -654712 -76650 250286 393090 507905
17669 507905 514116 528529 526183 612975 722733 570655 185203 -245324 -233204 119742 298516
17658 298516 189919 -32734 -85718 -468156 -608108 -296357 -264248 53367 473993 690079
17648 690079 286817 -320472 -764917 -796409 -56178 533073 412515 -269735 -913868 -1101066
17638 -1101066 -1078072 -364090 183565 194375 105200 -143475 -570649 -808759 -399495 238911
17628 238911 378435 122722 -255950 -190327 -369297 -326373 -40379 88371 289344 414293
17618 414293 194712 -123023 -56027 -17435 -319672 -519761 -190755 94798 -89972 -178767
17608 -178767 -36969 55516 137295 569726 1015806 1226537 1889203 3222109 4574394 6048153
17598 6048153 8290842 12547610 19055969 24893858 22428965 15299765 10172759 6970763
17590 6970763 4921192 3691016 3258460 2870449 2450312 2237105 2175776 1875710 1662074
17581 1662074 1575984 1191862 627781 602157 442492 52317 -23119 -6459 -242513 -469001
17571 -469001 -302627 139165 313507 90923 -302614 -301264 -60342 83640 375637 870857
17561 870857 1176303 1244034 985221 292367 -191549 -122341 8050 186045 -5389 -199446
17551 -199446 -279498 -228750 109003 557284 758427 709588 307633 213988 131748 -417406
17541 -417406 -1003964 -1405811 -1051699 -357378 -215691 -307875 -337170 -283350 -359589 -656195
17531 -656195 -937968 -1143944 -1266661 -1021076 -557430 -823905 -1264270 -1365734 -1523993 -1225934
17521 -1225934 -984145 -972948 -747040 -552310 -350043 -438066 -665905 -948650 -1191193 -1018714
17511 -1018714 -752656 -841257 -722363 -740332 -652457 -394185 -587594 -811166 -625771 -262102
17501 -262102 137821 332008 341067 192871 -144714 -595869 -1096866 -1226475 -1152381 -1051693
17491 -1051693 -1032463 -1300873 -1060933 -615717 -503768 -627343 -638754 -801224 -853176 -428435
17481 -428435 -117429 76335 66414 -364355 -757093 -538940 -390704 -607532 -772275 -388229
17471 -388229 -19878 -86017 -327637 -180774 -80210 -128135 -91592 136739 -66902 -349735
17461 -349735 -532621 -740087 -571884 -414567 -222532 282114 400987 -178471 -375154 -446044
17451 -446044 -873657 -1322000 -1437720 -1269480 -1360356 -1412356 -1198650 -866731 -792588 -968056
17441 -968056 -963985 -784728 -587487 -588386 -1159641 -1419806 -1156394 -681072 -450067 -358644 -67738
17430 -67738 -82794 -643962 -938944 -909337 -1072280 -1364073 -1472590 -1136319 -335029 119762
17420 119762 -18065 -308943 -455535 -332573 -226886 -566592 -894796 -935926 -873882 -963702
17410 -963702 -930367 -885451 -738235 -578247 -491520 -447702 -267076 138110 177923 228342 588793
17399 588793 575992 668016 1180627 1509030 1769211 1420726 796352 570953 373397 252761
17389 252761 37134 -111248 -56930 -174121 -218663 -489653 -473023 -365854 -379440 -133869
17379 -133869 521085 587175 116342 -419710 -840811 -555630 -320429 -400248 -613967 -1010879
17369 -1010879 -776729 -550256 -525321 -516446 -677222 -456800 -6366 -22519 -486482 -886930
17359 -886930 -1006725 -785065 -631800 -96003 188167 -179889 51575 348424 438358 258622
17349 258622 175104 208043 244152 204830 166276 343353 268172 265099 301183 332694 -62314
17338 -62314 -532465 -744409 -669445 -639349 -869977 -682370 -365670 -484661 -683132 -321048
17328 -321048 211369 160885 -502530 -1104378 -1132126 -949040 -897477 -759251 -352204 53454
17318 53454 46374 -165667 82731 445160 594207 432086 219768 20951 -262384 -467694
17308 -467694 -712522 -1004316 -1297822 -1379259 -1369529 -1504901 -1122607 -824661 -1024959 -1446679
17298 -1446679 -1818332 -1915925 -1724888 -1580227 -1404139 -1538881 -1556717 -896545 -534119 -395596
17288 -395596 -150629 -200305 -417406 -492232 -585650 -590292 -478515 -501696 -360647 -383932 -335582
17277 -335582 -106762 76526 -143917 -611334 -883430 -929598 -946076 -722126 -503568 -452286
17267 -452286 -324601 -428639 -569564 -518021 -414459 -189991 63567 138119 113664 119461
17257 119461 -56240 -431205 -385552 -178701 424434 504115 43389 -376286 -662159 -988073
17247 -988073 -1025079 -842095 -520993 -518973 -479682 -423428 -347996 -441933 -288591 -304990 -330662
17236 -330662 -441075 -520534 -297153 118731 465087 569216 431684 44727 -212947 -530328
17226 -530328 -651243 -491325 -168522 -115898 -772760 -938638 -478165 -142112 -321733 -385502
17216 -385502 -136550 206762 422610 117569 -149760 -106982 -11525 5800 -17436 -356589
17206 -356589 -558034 -316169 -136004 -253132 -452265 -934932 -1262298 -1406588 -1307886 -1640313
17196 -1640313 -2001548 -1920823 -1315768 -1034578 -903047 -601563 -122805 -103541 -272479 -413971
17186 -413971 -719135 -732323 -441124 -186199 -746107 -1561669 -1918452 -1994181 -1677694 -1385497
17176 -1385497 -801461 -296091 131567 457194 319508 487945 747897 674042 374882 273793
17166 273793 463441 604177 697372 568833 273712 165935 125616 -38813 30450 -158005
17156 -158005 -589642 -960092 -1330894 -1211600 -723067 -228197 252925 630745 765904 947707
17146 947707 806032 524320 418371 550563 591627 750678 322792 57540 -17738 -69054
17136 -69054 43815 -161216 -703922 -1133830 -1171298 -980947 -977111 -932733 -503184 -544972 -433143
17125 -433143 -120506 47654 -203680 -638458 -284202 449303 806886 470575 -40218 -254843
17115 -254843 -96842 70730 35766 -25107 -280975 -823306 -1302429 -1724828 -1507921 -1358735
17105 -1358735 -1297831 -1254035 -1550240 -1370093 -839533 -585691 -367543 -82650 -205071 -663294
17095 -663294 -727433 -357689 -166923 -227375 -203599 -246287 -799895 -1403696 -1412215 -1312753 -1124115
17084 -1124115 -604053 -630665 -1172647 -1482901 -1180765 -854388 -450535 -227086 -163865 -126902
17074 -126902 -100030 55397 -93998 -164036 -49515 167201 122904 -349250 -208612 213810
17064 213810 573769 614041 335705 19972 -277020 -393687 -246260 -235950 -506453 -770929
17054 -770929 -1078124 -1026748 -964893 -942057 -961459 -1033639 -792011 -101106 510460 531876 421659
17043 421659 651171 883998 782793 190996 -114575 8624 -230874 -292385 -276793 -748198
17033 -748198 -1109118 -1186690 -500832 361455 591556 882297 930956 745224 620070 414179
17023 414179 102859 -177997 -240297 -164859 -302741 -652749 -766103 -710528 -708666 -791826 -1365224
17012 -1365224 -1489715 -1323425 -1633249 -2299577 -2523938 -2203275 -2144686 -1755101 -1325306 -908659
17002 -908659 -459126 -279277 -565096 -1107223 -967568 -630700 -654392 -887756 -820550 -501819
16992 -501819 -3640 429594 296711 354221 152433 -126771 -207292 -204923 -132938 -135420 -38354
16981 -38354 -123230 -247209 -78886 12730 13967 -443898 -596601 -430817 -835139 -873085 -481530
16970 -481530 -605857 -800256 -997939 -1142229 -1293365 -1558759 -1346275 -952252 -963657 -1306266
16960 -1306266 -1364189 -1310837 -1018489 -705912 -879243 -1291876 -1316913 -1242556 -1043107 -658506
16950 -658506 -301202 -204003 -309829 -547164 -654983 -589375 -550276 -537371 -223998 -75663
16940 -75663 -257763 -731629 -1137489 -1444941 -1485106 -1276662 -1218611 -1276720 -1029042 -656275
16930 -656275 -535372 -447220 102438 497011 283376 -127343 -293069 -466997 -623277 -814695
16920 -814695 -1113838 -1234184 -1000412 -318462 -145729 -339430 -502211 -882648 -1269088 -1702218
16910 -1702218 -1624297 -1252089 -1314128 -1391734 -1232889 -862278 -470511 -278674 -360379 -743791
16900 -743791 -1156845 -1501614 -1863823 -1670569 -1419174 -1358386 -1201367 -1032929 -819085 -642026
16890 -642026 -363676 -117186 -360805 -688910 -709702 -758110 -921688 -1103307 -1186581 -1305898
16880 -1305898 -1188452 -782925 -531598 -573859 -659848 -829547 -1085499 -1473665 -1893663 -2058618
16870 -2058618 -1881898 -1400272 -789866 -742023 -785506 -1036162 -1301943 -1774937 -1646821 -1067255
16860 -1067255 -711820 -700196 -914052 -1031581 -1153567 -1087247 -732810 -690345 -791642 -511008
16850 -511008 -215236 -92329 -269660 -765691 -1249788 -1322935 -935656 -397969 -331618 -559240
16840 -559240 -696309 -935944 -1390226 -1564958 -1224102 -646986 -184705 -137655 -580015 -848793
16830 -848793 -523502 -73759 -131331 -600880 -789418 -597722 -522757 -496505 -595905 -428409
16820 -428409 79874 597206 450114 154866 7570 134662 29986 73867 208228 34726
16810 34726 -285914 -642468 -1094147 -974630 -833945 -533480 -175499 -303482 -761234 -753875
16800 -753875 -759917 -918366 -908180 -951042 -1122712 -1435350 -1440388 -1031112 -851650 -999159 -1023032
16789 -1023032 -821299 -494535 -261890 -221527 -37989 20745 72433 317421 722207 1000556
16779 1000556 884765 309129 -311251 -278172 100464 -402450 -898231 -830888 -715876 -905129
16769 -905129 -779669 -349283 -190572 -347231 -455869 -390701 -222895 -225333 -643943 -717071
16759 -717071 -649688 -697236 -1108482 -1356795 -1056119 -816148 -568150 -452302 -876900 -1361385
16749 -1361385 -1430785 -919420 -373545 15465 293802 372064 74477 230160 599460 695768
16739 695768 209613 35084 -103093 -193393 -163906 -180603 -147876 -582097 -1072058 -1330610
16729 -1330610 -1369705 -1201252 -896080 -633930 -611173 -476250 -83105 149210 228159 63964
16719 63964 -193723 -466409 -1064713 -1361561 -914859 -449238 -595180 -1163090 -1244553 -768909
16709 -768909 -464871 -127154 -274866 -728679 -678385 -68359 554460 826307 447927 -237224
16699 -237224 -941748 -1244510 -931285 -806895 -1013490 -1105118 -1098279 -902479 -762845 -1129407
16689 -1129407 -1346816 -806676 -697440 -630504 -610309 -618941 -744822 -943252 -1043910 -778430
16679 -778430 -327883 -76532 288278 247825 8447 -374087 -730167 -826086 -814156 -1138473
16669 -1138473 -1005702 -587702 -298714 -290551 -614515 -794788 -796493 -213330 461213 636202
16659 636202 552118 149175 -157994 -45080 281875 222225 52813 -667847 -1326886 -1478013
16649 -1478013 -1151851 -691064 -622492 -508320 -332841 -595342 -1219394 -1502340 -1479271 -1334464
16639 -1334464 -818841 -260132 -231391 -640371 -1005283 -1001549 -518721 -252827 -426892 -864121
16629 -864121 -1234202 -1288616 -1073021 -506750 -111433 33550 104313 -63750 -277176 -286950
16619 -286950 46813 222040 -184079 -203457 -39197 -638552 -1584489 -2033749 -1893772 -1794813
16609 -1794813 -1841509 -1764862 -1540686 -1356488 -1355323 -1054557 -694252 -549067 -554994 -1014678
16599 -1014678 -925758 -553478 -400688 -318125 -643039 -851413 -679504 -451760 -397977 -478101
16589 -478101 -681118 -911907 -987339 -856678 -617804 -210743 330307 252250 -385609 -739196
16579 -739196 -721636 -292329 111564 317770 -14552 -689173 -1060292 -893922 -877425 -1412826
16569 -1412826 -1592552 -1257913 -1116880 -1276498 -1237123 -1132864 -1111789 -996235 -999796 -1099734
16559 -1099734 -929679 -1113223 -924270 -540823 -703283 -798812 -965920 -1096620 -1228315 -1116751
16549 -1116751 -1199007 -1072885 -534756 123884 434069 246983 -295950 -537314 -330573 -295709
16539 -295709 -809591 -1349390 -1676708 -1406826 -748847 -152637 192258 114851 214883 107906
16529 107906 -395368 -580456 -824649 -1263213 -1284080 -1269402 -1253998 -1453196 -1306315 -1186643
16519 -1186643 -1357375 -1695840 -1768035 -1269570 -1045530 -1223961 -1323349 -1206071 -1207231 -1039007
16509 -1039007 -647384 -819687 -1138834 -1301020 -1210270 -1280022 -1537737 -1518327 -1392000 -1101195
16499 -1101195 -976959 -976167 -1200879 -1818335 -2647390 -3140000 -2860808 -2318409 -1643879 -1213582
16489 -1213582 -482789 259467 228596 -298134 -991766 -1405117 -1212196 -1176343 -1241718 -838298
16479 -838298 -592681 -570841 -491207 -553569 -520841 -760407 -991106 -420809 -240796 -577769
16469 -577769 -843817 -1070933 -1496383 -1904783 -1820162 -1369902 -1354900 -1253427 -1344377 -1489831
16459 -1489831 -1298975 -1376230 -1366844 -1124626 -657965 -337833 -857941 -1276115 -1197062 -1009247
16449 -1009247 -1023040 -580899 67502 228384 317356 183319 -340988 -633457 -840794 -1153381
16439 -1153381 -1651049 -1901131 -1616619 -1172740 -979940 -1042366 -1095247 -1196709 -1349262 -1501044
16429 -1501044 -1573300 -1466558 -1050134 -685197 -471436 -594528 -1079021 -1216839 -856641 -624098
16419 -624098 -641299 -594183 -652552 -721828 -999797 -1292302 -1265184 -1576673 -2019193 -1937411 -1197086
16408 -1197086 -637723 -198409 87058 27446 -221890 -613415 -903101 -865134 -805033 -788205
16398 -788205 -616434 -272000 -161387 -52466 -161321 -606921 -580252 -291836 -160764 -113047
16388 -113047 -541043 -1216215 -1545878 -1486300 -1131952 -922798 -993940 -764709 -595173 -820204
16378 -820204 -546853 230601 577188 401481 154844 -39727 -102537 -295397 -685290 -1255100
16368 -1255100 -1576017 -1753797 -1716410 -1535896 -1438781 -1443732 -1684910 -1833879 -1706284 -1350098
16358 -1350098 -1028283 -671988 -470558 -345677 -145851 107227 386641 133011 -246198
16349 -246198 189392 549267 25931 -1180785 -1700893 -1498811 -967786 -702583 -496345
16340 -496345 -514625 -643759 -509027 -682325 -861950 -711642 -744713 -508271 -398847 -515690
16330 -515690 -122137 218452 -30522 -344096 -560788 -591268 -688660 -730520 -438362 -355902
16320 -355902 -411579 -384150 -517966 -624207 -584398 -571341 -338484 -342849 -263013 -29545 166334
16309 166334 18546 -396842 -326867 -327146 -675387 -598404 -651549 -628882 532 342384 -121476
16298 -121476 -467351 -424146 -594869 -922779 -715914 -319123 51450 205175 320085 425090
16288 425090 97080 -343497 -556690 -354672 579496 943825 604557 296805 -60619 -441968
16278 -441968 -266965 -249141 -298233 8939 115541 -153635 -338317 -325904 -192767 -24589
16268 -24589 -143070 -566314 -965029 -1363090 -1559062 -1054561 -391224 24770 163634 377774
16258 377774 516390 521224 359103 269249 85370 -265117 -706341 -1010692 -751294 -435294
16248 -435294 -612338 -1167876 -1599312 -1885149 -1787671 -1014590 -560824 -615176 -416586 -258761
16238 -258761 -463960 -930248 -1423476 -1340686 -1023965 -1161067 -1234283 -1099126 -889639 -1020814
16228 -1020814 -1327953 -1279284 -1107862 -974411 -581910 -228993 -168674 -260328 -787033 -1136609
16218 -1136609 -1181049 -709014 -233675 -169907 -318397 -668729 -976888 -1100960 -1186805 -910989
16208 -910989 -611108 -535375 -489683 -439975 -52076 306025 265347 -44126 -362288 -309646
16198 -309646 -9048 299542 52585 -188639 -388134 -406168 -174229 13501 -70734 -409573
16188 -409573 -482794 -602910 -578809 -571965 -646942 -895771 -971970 -981457 -596131 -460931 -843640
16177 -843640 -998246 -1087264 -1215807 -859152 -650379 -677620 -464588 -51588 -61144 -654620
16167 -654620 -696446 -521437 -595328 -486753 -390440 -484136 -413301 -468907 -518355 -662954 -674398
16156 -674398 -670958 -374158 -257421 -316873 -218552 -345710 -791729 -805449 -582904 -343779
16146 -343779 -276259 -601256 -535123 -64669 -41635 -605392 -821248 -696569 -719103 -641302
16136 -641302 -448460 -469718 -878309 -1079956 -1055170 -775387 -86222 454745 846576 1026002
16126 1026002 1153610 901842 582869 463055 746950 351852 -320645 -352584 -384545 -301468
16116 -301468 -194347 -250240 -473831 -872792 -1017391 -867379 -428651 259071 348371 30274
16106 30274 -301247 -358699 -91491 -297398 -542342 -492156 -506523 -821401 -1314348 -1797020
16096 -1797020 -2066744 -2266165 -2031563 -1518130 -1065542 -879267 -641611 -532223 -755367
16087 -755367 -952804 -808551 -308794 9034 -56752 -259535 -314345 -422587 -852272 -1066725
16077 -1066725 -771652 -550938 -620433 -822958 -817595 -932999 -868013 -430744 -89440 -54360
16067 -54360 -32253 -239128 -449417 -406413 -11755 108942 -449739 -701633 -710920 -769899 -651588
16056 -651588 -395722 -368716 -316611 116155 429412 25193 -267141 -289941 -456467 -637231
16046 -637231 -337964 -76626 139468 288034 85271 -115085 -76555 -45297 -157641 -255323
16036 -255323 -760777 -1041683 -638637 -596815 -437260 21790 68287 376131 338862 -493871
16026 -493871 -1547582 -2163313 -1896559 -1023505 -316060 -160326 -341020 -592346 -566330 -424295
16016 -424295 -473654 -1022055 -1358107 -1081818 -845278 -907427 -1126455 -1497160 -1714998 -1558567
16006 -1558567 -1149564 -779137 -430622 -477224 -783597 -697324 -503044 -640479 -1202463 -1816847
15996 -1816847 -1928700 -1611567 -1427767 -1464753 -1156140 -991465 -867760 -588027 -365934 -131483
15986 -131483 -108283 -200130 -623604 -955489 -1331680 -1707396 -1829467 -1387031 -1327038 -1214285
15976 -1214285 -1017696 -712135 -520474 -711000 -1048165 -1026784 -918405 -635619 -272735 355048
15966 355048 1047816 1206991 1211295 938973 752326 566586 -50845 -361004 -481128 -1191900
15956 -1191900 -1525350 -1293245 -1090934 -1332377 -1232044 -870036 -718931 -1007912 -1810037
15947 -1810037 -1984107 -1443222 -891956 -648612 -1016451 -1119361 -825116 -703692 -667971 -731149
15937 -731149 -700855 -773118 -669175 -321050 -197100 -304873 -381311 -401975 -377553 -530309
15927 -530309 -704844 -856946 -1193110 -1358132 -1138005 -953778 -1074969 -1070209 -676113 -272927
15917 -272927 -338250 -697426 -991183 -1044126 -883704 -551209 -422055 -584433 -721404 -451331
15907 -451331 -214919 -111433 -137004 -418246 -707931 -950269 -854685 -535608 -285221 -260779
15897 -260779 -558350 -597678 -483102 -281196 -237929 -286203 -566039 -1091593 -827797 -378090
15887 -378090 -659684 -1382512 -1913327 -1600541 -978770 -580981 -396242 -648994 -1022931 -1076228
15877 -1076228 -1091861 -1522573 -1940298 -2089851 -2071942 -1807206 -1487778 -1272672 -980593 -856166
15867 -856166 -1007652 -670473 -618785 -1026935 -967490 -888935 -954161 -1148074 -1603526 -1679194
15857 -1679194 -1291876 -916112 -702150 -914679 -484848 272725 458821 -127864 -640098
15848 -640098 -662294 -469992 -550816 -555301 -423334 -665807 -937947 -934313 -580668 -409846 -552096
15837 -552096 -852713 -883545 -361882 77985 193923 -170834 -579316 -639356 -513248 -388396
15827 -388396 -429189 -701204 -307848 189444 -14509 -606629 -844439 -136402 245688 -89216
15817 -89216 -705838 -1143925 -889417 -628433 -1137836 -1510200 -1265539 -860725 -1206603 -1684878
15807 -1684878 -1402801 -870345 -1031627 -1420600 -1610628 -1887959 -1749415 -1453275 -1463419 -1394796
15797 -1394796 -1226024 -947670 -303781 -246921 -645377 -929434 -955417 -1153061 -1344167 -1254765
15787 -1254765 -1540618 -1815874 -1249688 -627538 -413481 -11831 -128781 -564781 -302008
15778 -302008 48238 171666 222312 128685 -267205 -353675 -442346 -461413 -513714 -343932 -95819
15767 -95819 -293937 -85597 438997 764706 714323 475030 218885 -6602 -2644 174434
15757 174434 245367 350101 103984 -320470 -811669 -1259411 -1715425 -1551159 -777462 -254771
15747 -254771 -445682 -563931 -734838 -1102086 -1403751 -1576743 -1650112 -1335378 -806395 -544071
15737 -544071 -667631 -783118 -867726 -916695 -757137 -878227 -1120152 -1186620 -1084358 -1201021
15727 -1201021 -1098344 -684647 -249902 -59522 -246378 -241962 175908 560663 242874 -34434
15717 -34434 -117709 -200045 -466649 -1090519 -1283284 -859684 -517638 -497228 -1005585 -1538618
15707 -1538618 -1604709 -1336051 -1107010 -622276 -98744 275770 538371 409553 330270 15867
15697 15867 -565968 -813597 -789582 -831267 -812641 -490577 7867 580314 740747 473182
15687 473182 -61023 -310258 -194927 131972 298218 283449 -84322 -485423 -574191 -673574
15677 -673574 -918715 -971939 -918899 -1155481 -1375549 -1538695 -1510320 -1431675 -962815 -369281
15667 -369281 -88592 40535 -62858 -96972 -339539 -587676 -525550 -385618 -203027 -27429
15657 -27429 134611 62767 -168353 -596869 -733558 -951740 -1430679 -1314256 -991933 -1041895
15647 -1041895 -1415559 -1885745 -2003677 -1830597 -1563504 -1434063 -1418124 -1385139 -869200 -848775
15637 -848775 -1406851 -1570261 -1413137 -988964 -272669 -40621 29782 226422 5123 -412294
15627 -412294 -563651 -299546 165963 214728 -202305 -322912 -200777 -167955 -604029 -1509146
15617 -1509146 -2244870 -2663517 -2604839 -2028754 -1348378 -809000 -439194 -89111 223761 287722
15607 287722 -4262 -120831 -50460 216321 222466 -73609 -455652 -958827 -1112345 -721806
15597 -721806 -286894 -158403 -277368 -225978 -215348 -430706 -612233 -754628 -905425 -962759
15587 -962759 -674491 -507160 -521611 -549955 -771198 -595101 -627368 -785682 -676259 -711104
15577 -711104 -650686 -741667 -748255 -818431 -674535 41085 444644 481488 211827 -406916 -1017650
15566 -1017650 -1088590 -935770 -715182 -517099 -31370 58808 -476027 -678439 -428993 95557
15556 95557 412580 493423 679601 442107 154298 -53176 -451693 -923012 -1036990 -686446
15546 -686446 -652709 -519999 -491064 -559943 -482506 -385177 -304209 10307 307550 54143 -380528
15535 -380528 -749679 -1119863 -1224328 -1023750 -693286 -470515 -232946 -431611 -1177830 -1920180
15525 -1920180 -1934155 -1773845 -1615084 -1184437 -1118567 -1062488 -675782 -223242 158188 -152144
15515 -152144 -164369 131899 369132 -230512 -1007530 -1325755 -1334468 -1397314 -1223533 -1024069
15505 -1024069 -1270789 -1492282 -1285070 -912037 -936615 -1035225 -956128 -743638 -607583 -943979
15495 -943979 -1263154 -1186957 -1220720 -1215688 -1363915 -1560481 -1463254 -1479098 -1737757 -1437292 -886860
15484 -886860 -1205143 -1644253 -1574677 -1201009 -1062085 -1520793 -1801329 -1758072 -1563914 -1381113
15474 -1381113 -1350417 -1275814 -1140058 -983133 -707203 -421941 -999364 -1407114 -1028032 -832035
15464 -832035 -792546 -457342 -362498 -332965 -348147 -329207 -222102 324496 564931 154786
15454 154786 281534 708189 705353 489764 21650 -116639 190628 -36264 -371449 -389350
15444 -389350 -282674 -549586 -871558 -700795 -625517 -578159 -372188 -620546 -654036 -739349
15434 -739349 -621540 -473814 -211772 -239245 -325270 -284331 -405587 -960672 -1470038 -1479173
15424 -1479173 -1474172 -1760451 -1533835 -1071761 -814473 -794839 -769774 -1074288 -1101371 -822498
15414 -822498 -643249 -766190 -1108458 -832723 -557729 -543170 -326360 221920 610337 -64734
15404 -64734 -976541 -1348925 -1295243 -905741 -787330 -924696 -952318 -1002728 -973919 -896162 -610052
15393 -610052 -380514 -117021 -126735 -421697 -363120 -50957 214132 8547 -125507 -191904
15383 -191904 -158132 -210657 -47561 4830 33568 -168876 -555917 -799183 -472182 -286934
15373 -286934 -646887 -995628 -1155956 -1071391 -599036 -697982 -1120224 -1074859 -717298 -426353
15363 -426353 -609104 -452530 147664 466610 382580 245186 327673 304412 439784 40737
15353 40737 -596452 -1010311 -1285040 -1230107 -1139516 -618560 -421956 -300855 -555791 -929601
15343 -929601 -778467 -699540 -1007041 -1279057 -1030819 -1013900 -1363867 -1561579 -1376102 -1129080
15333 -1129080 -1099232 -1306241 -1124492 -745248 -641195 -493797 -839692 -1485711 -1536742 -970665
15323 -970665 -271658 -157803 -200147 -273506 -419387 -305670 -298935 -501777 -667415 -513151
15313 -513151 -287078 -157951 215051 -58431 -812074 -1101894 -1023176 -695097 -255156 -288919
15303 -288919 -567957 -935092 -1017832 -656678 -431012 -307294 -587824 -939003 -810104 -673979
15293 -673979 -771441 -572811 -51247 187377 21859 -70596 -31675 -139369 -399615 -480388
15283 -480388 -295470 -164684 -316877 -425546 -442233 -575049 -584763 -509231 -876923 -1134506
15273 -1134506 -1184114 -952862 -793532 -1226168 -1466157 -1213138 -866999 -755852 -909073 -1011030
15263 -1011030 -880263 -603749 -778293 -874544 -855247 -828679 -1047282 -1449651 -1433206 -1546340
15253 -1546340 -1509445 -1291011 -1066071 -802619 -509872 -58560 204070 152424 -385271 -1033374
15243 -1033374 -1013977 -253278 275146 240813 -159853 -208098 64640 39689 114353 14174
15233 14174 -239858 -68430 218686 436335 542898 521796 -42782 -682100 -988162 -739729
15223 -739729 -318656 -9296 298067 696224 505098 23300 -556183 -932658 -900092 -752654
15213 -752654 -571272 -206764 387222 761311 602956 182216 -120428 -213102 -260211 -67988
15203 -67988 131688 -303082 -680908 -597916 -448212 -228015 -283893 -408549 -96025 -13140
15193 -13140 -195769 -702953 -1357755 -1586910 -1488589 -1190367 -1210556 -1495731 -1798156 -1741052
15183 -1741052 -1598536 -1364576 -1316255 -1563750 -1439500 -921220 -647638 -596543 -535808 -633044
15173 -633044 -938844 -1074362 -1396902 -1971105 -1733028 -1129936 -909747 -1022611 -654904 -75159
15163 -75159 106455 -495868 -1039925 -1180395 -1380301 -1545809 -1661118 -1567247 -1077230 -856781
15153 -856781 -913548 -1023280 -1402267 -1533671 -1007889 -312202 -106141 -365217 -563025 -552501
15143 -552501 -683658 -937395 -1069011 -1035398 -1138717 -1233959 -1203025 -1228264 -1003196 -793789
15133 -793789 -593010 -374031 -227822 -41859 59256 -88721 -652631 -910112 -961693 -899404
15123 -899404 -429597 -97244 -37703 -396713 -631252 -624743 -612168 -361745 -65306 -116234
15113 -116234 -403135 -821957 -682879 -545113 -197852 67748 -20798 -376493 -283131 -137130
15103 -137130 -749740 -1263691 -729037 81076 72692 -63636 -145471 -560490 -1025523 -935370
15093 -935370 -479465 -148673 -5542 406877 751360 403513 150192 -10331 -513034 -650476
15083 -650476 -270095 -199739 -442213 -710741 -840538 -1089821 -1578651 -1746199 -1560806 -1380314
15073 -1380314 -1455548 -1859477 -1862824 -1347785 -794953 -903489 -1369522 -1356455 -950371 -508965
15063 -508965 -457617 -834058 -1108396 -922260 -308410 -205216 -708801 -889174 -619347 -218930
15053 -218930 -349427 -715382 -945600 -1188858 -1299895 -969903 -890057 -1062333 -1001704 -768624
15043 -768624 -853145 -1076042 -1076875 -770837 -636649 -470122 -340859 -396997 -306833 131936 137364
15032 137364 -203547 -20746 135775 59204 -65204 -425341 -931988 -1057946 -1128559 -1356545
15022 -1356545 -1299661 -423069 595616 1019117 766552 425606 -9822 -295589 -570585
15013 -570585 -753453 -657353 -532784 -448222 -646630 -615967 -799129 -897807 -682892 -405381
15003 -405381 -285765 -368049 -544258 -917239 -1032153 -1189540 -1619756 -1747140 -1547496 -1435452
14993 -1435452 -902650 -487467 -901197 -1410823 -1329199 -1069526 -1029207 -888575 -395735 283359
14983 283359 353636 -161736 -462565 -922066 -1316027 -1598489 -1627394 -1381107 -1339113 -1427539
14973 -1427539 -1294493 -999576 -503569 -375841 -829155 -851736 -733982 -715328 -763602 -1160766
14963 -1160766 -1767288 -2113256 -1790827 -1379443 -1193280 -969773 -819100 -820336 -640076 -401846
14953 -401846 -494314 -825962 -1504536 -2025467 -2023662 -1929376 -2079399 -2167194 -2073078 -1942725 -1547674
14942 -1547674 -1131106 -984325 -1170468 -1449621 -1248390 -1053245 -897993 -958449 -1000110 -1137795
14932 -1137795 -1576522 -1547165 -1201354 -910652 -836664 -569047 -426636 -527345 -487208 -385896
14922 -385896 -251209 44067 217976 14999 -110068 -263731 -40976 152093 -2436 -293957
14912 -293957 -346001 -323865 -422835 -288317 -401858 -713022 -1232703 -1156430 -879128 -800363
14902 -800363 -720224 -753932 -819726 -1064482 -1313631 -1540331 -1678131 -1367348 -811451 -751671
14892 -751671 -876595 -1078946 -1202952 -1512897 -2065202 -2428536 -2408189 -1953008 -1389464 -1043505
14882 -1043505 -957808 -1311063 -1562768 -1489215 -1426517 -1370969 -1377561 -1125477 -1112384 -1399842 -1542778
14871 -1542778 -1150686 -576892 -577950 -865932 -754063 -62913 335273 254463 310394 643288
14861 643288 669715 324341 55379 -151991 -769940 -1058134 -532089 -387425 -870624 -1403925
14851 -1403925 -1750726 -1586647 -874912 -449741 -609497 -1010630 -1225298 -1170604 -1085469 -811659
14841 -811659 -625692 -576778 -902619 -1203191 -1348162 -1186841 -628053 -84003 563902 646528
14831 646528 347505 80188 -303908 -519575 -679350 -744748 -839459 -572575 -211144 -226425
14821 -226425 -309453 -543761 -668015 -784712 -783522 -651692 -769611 -478483 -369033 -673336
14811 -673336 -717206 -596802 -613243 -605294 -824226 -1117270 -1274904 -1414939 -1284365 -899690
14801 -899690 -642749 -783772 -1192124 -1102942 -808455 -747452 -573403 -256976 -598185 -744143
14791 -744143 -373636 -173947 -260361 -469951 -797517 -1214033 -1066186 -969310 -1178226 -1243955
14781 -1243955 -1195439 -1410804 -1455328 -1313408 -762003 -590592 -710843 -1130138 -1581992 -1454996
14771 -1454996 -996106 -470720 -123664 -167312 -355655 -559462 -634591 -732248 -701236 -680210
14761 -680210 -793521 -1169387 -1387134 -979058 -750264 -1020387 -1275957 -1145137 -870352 -682428
14751 -682428 -659129 -795275 -790650 -459576 -159321 -274942 -270417 -166816 -37166 -143612
14741 -143612 -283740 -240750 -642349 -1192226 -1145569 -978950 -1162523 -1588488 -1433864 -369397
14731 -369397 197478 253372 302621 -188015 -515581 -518208 -695350 -414671 -605147 -648321
14721 -648321 -769580 -882987 -934560 -1027111 -882497 -535909 -497117 -155910 673133 419180
14711 419180 -346039 -357510 -580986 -1026989 -1216187 -1317493 -1565332 -1435314 -1076673 -1141651
14701 -1141651 -1109372 -1311306 -1300971 -913975 -643836 -735563 -982055 -1007665 -757750 -556090
14691 -556090 -772959 -1002767 -1000644 -1108967 -1408295 -1367057 -1470031 -1736516 -1627166 -1257204
14681 -1257204 -887357 -574855 -387446 25799 249361 296863 284372 257707 345016 202807
14671 202807 235640 443009 893293 1228190 875509 208489 191655 462464 537622 371130
14661 371130 158983 -152457 -158757 337965 520743 185052 74226 -101166 -209215 115954
14651 115954 375381 426914 -39152 -475156 -388559 -462877 -597516 -504815 -842684 -1080512
14641 -1080512 -1215095 -1280569 -1091189 -1126257 -1244704 -1264245 -982838 -947933 -1170479 -1297670
14631 -1297670 -1259173 -920772 -831140 -1174559 -1169345 -1024141 -839634 -424346 -150411 205634
14621 205634 550023 674021 590158 332674 74905 -143606 -508448 -643164 -776978 -978633
14611 -978633 -894867 -443485 -216161 -333037 -559289 -659179 -946617 -917975 -385223 -72287
14601 -72287 -95575 -286653 194409 441589 340892 92357 -75012 -58110 68889 119122
14591 119122 136175 -166422 -487345 -616746 -786282 -740646 -248132 126995 262036 455361
14581 455361 602254 627754 764084 826421 463080 -25406 -490291 -874020 -1268002 -1233421
14571 -1233421 -792816 -613731 -813525 -1104524 -1063245 -886874 -525512 -316496 -212259 -232381
14561 -232381 -172872 -6154 -78114 -454039 -605656 -219980 -12042 300363 369580 344055
14551 344055 494126 395734 250970 43823 -71745 -98965 -327717 -537402 -271598 -79072
14541 -79072 -294212 -345126 -507724 -347542 99205 92680 82516 146979 56062 -425255 -956777
14530 -956777 -1524750 -2091476 -2204230 -1916003 -1486565 -856277 -787729 -1121916 -1260316 -1036385
14520 -1036385 -768995 -903907 -1237855 -1403691 -1067411 -520051 -312912 -93684 -46361 -577878
14510 -577878 -968479 -1071143 -1083566 -1021098 -1304489 -1522807 -1434228 -1306637 -1114935 -1256954
14500 -1256954 -1521874 -1509159 -1315489 -1384528 -1203917 -1063126 -910060 -534275 -166051 101749
14490 101749 397997 598525 264216 -462456 -673532 -837070 -779094 -600163 -859379 -925872
14480 -925872 -884709 -1077746 -1447361 -1558499 -1072806 -477010 -524462 -899410 -1140880 -965129
14470 -965129 -816378 -783161 -816110 -935598 -988483 -1088086 -880490 -675566 -521994 -65069
14460 -65069 -5523 -526278 -900513 -846432 -661120 -623944 -598234 -215420 280506 445483
14450 445483 468997 486522 122737 -91449 -165812 -166600 -726708 -1540037 -1723188 -1511440 -1032083
14439 -1032083 -1047772 -1013355 -535249 -128300 -252883 -558048 -846118 -1050672 -1288492 -1770637
14429 -1770637 -1762471 -1287036 -720232 -537472 -405444 -506938 -466578 -442397 -539898 -753339
14419 -753339 -924503 -833875 -488849 128366 298589 -3742 -239644 -593662 -1067643 -1356472
14409 -1356472 -1489000 -1475661 -1225546 -1065113 -1126125 -872287 -471206 -335563 -771153 -1192996
14399 -1192996 -1221699 -1224088 -1386985 -1381891 -1205095 -1057321 -995000 -595228 -188949 -145933 -189638
14388 -189638 -313690 -421145 -458201 -563841 -377286 131885 642508 918221 657331 319883
14378 319883 1466 -291260 -451033 -806419 -1171806 -1342909 -1282403 -827025 -127148 89882
14368 89882 223990 181171 243726 198871 100070 -134407 -339175 -307774 -447922 -446229 -516336
14357 -516336 -964713 -1102194 -1250846 -1437486 -1361510 -1412397 -1454209 -1393891 -1258110 -991895
14347 -991895 -676737 -610532 -445338 -310854 -531199 -831846 -588616 -193402 -203948 -337191
14337 -337191 -187306 2920 69999 409183 508418 449706 217245 -241474 -647963 -775923
14327 -775923 -763502 -924748 -974794 -886171 -792712 -1133456 -1054693 -678479 -360466 -467137
14317 -467137 -892517 -866587 -767915 -693024 -615662 -481201 -465647 -803965 -1133147 -1366749
14307 -1366749 -1815664 -1778177 -1404463 -1253166 -1419421 -1643236 -1761344 -1643111 -1259167 -1029368
14297 -1029368 -948785 -681458 -252226 -152774 -248288 -107830 -467350 -598982 -585839 -662143
14287 -662143 -742585 -747007 -611137 -708378 -911576 -1080945 -857376 -437944 -159315 -111053
14277 -111053 -168911 -472797 -502788 -395262 -545364 -807798 -1033818 -1045019 -882703 -640594
14267 -640594 -672334 -852172 -1049473 -953301 -646495 -270158 189523 -2733 -756606 -1242288
14257 -1242288 -881775 -629135 -584391 -458948 -800053 -1000896 -806148 -472313 -409087 -272764
14247 -272764 -295657 -36335 103266 -642374 -986619 -922988 -1016203 -1081696 -1216215 -982173
14237 -982173 -597486 -318697 102242 356371 327801 154636 -89358 -46591 -19893 -393784
14227 -393784 -373414 -126133 -35586 -206520 -612741 -401494 -188779 -731772 -1017291 -1160051
14217 -1160051 -1217051 -832576 -627225 -930478 -1056711 -1436264 -1729984 -1547475 -1330802 -1141872
14207 -1141872 -782261 -509272 -424681 -154144 184621 88981 -359423 -810262 -725495 -371256
14197 -371256 -502349 -575691 -738428 -1105657 -1159225 -982396 -1207694 -1469844 -1596954 -1536598
14187 -1536598 -1313841 -922004 -222289 288765 490817 456075 223797 -344218 -466095 -43294
14177 -43294 78337 -80385 -371173 -653034 -876791 -1038756 -1019170 -847359 -813375 -1289482
14167 -1289482 -1615315 -1451412 -1235888 -1121662 -887269 -832232 -804207 -978147 -1214649 -653753
14157 -653753 -189727 -441022 -773938 -982764 -1213851 -1470684 -1426060 -1285395 -1070898 -945435
14147 -945435 -1061474 -844545 -678863 -1055800 -1017209 -443633 -78115 -236285 -573844 -1078982
14137 -1078982 -1297815 -760845 -197183 -299544 -854768 -909172 -707078 -747477 -447450 31024
14127 31024 -200922 -579983 -453660 -617987 -283846 343390 -122066 -638073 -805128 -989166
14117 -989166 -1185003 -1409862 -1562304 -1246190 -453361 -179153 -135934 -198271 -450841 -615181
14107 -615181 -602795 -582588 -1031565 -1722520 -2213989 -2442257 -2342123 -1854196 -1243819 -1046200
14097 -1046200 -769871 -674026 -847079 -640326 -486754 -172408 -190 -151134 -320456 -404769
14087 -404769 -203303 -90270 9846 -103223 -353917 -186671 79394 47739 -189891 -480581
14077 -480581 -414098 -41555 107931 -69952 248601 350491 -2267 -137291 -113951 -540993
14067 -540993 -705079 -923368 -1370872 -1239204 -938430 -580637 -503241 -462563 -277063 46956
14057 46956 -23062 -94819 302010 458754 251928 243230 289725 286269 -5471 -367939 -565515
14046 -565515 -285380 -32129 -222878 -442035 -902877 -1585896 -2337555 -2445369 -2113013 -1714752
14036 -1714752 -1176811 -919102 -607737 -337423 -564451 -759968 -533632 -320212 -444754
14027 -444754 -1071007 -1545824 -1577284 -1567723 -1723152 -1849625 -1536332 -1111688 -1288105 -1293589
14017 -1293589 -947967 -678009 -566709 -644953 -428784 465 -157627 -688964 -715450 -498600
14007 -498600 -188351 201252 -1143 -219447 -117762 -152140 -11790 -50767 -378733 -545918
13997 -545918 -214594 94551 73632 -297002 -303604 2674 -36665 -603835 -900217 -392258
13987 -392258 53436 283177 193469 60486 -35726 -419267 -1009457 -1281768 -1186351 -1437655
13977 -1437655 -2004938 -2214136 -1653675 -679996 -514418 -643635 -632655 -416203 -353464 -451796
13967 -451796 -493429 -579625 -577468 -525189 -860962 -1031508 -999631 -949066 -973417 -1062356 -1216839
13956 -1216839 -1565027 -2088088 -2128233 -1820956 -1760650 -1948820 -1805473 -1373295 -722043 -287450
13946 -287450 -255325 -343991 -496547 -397704 -173783 -377893 -905864 -883341 -924382 -1019848 -1141633
13935 -1141633 -1085977 -873107 -545895 234893 373555 211297 414556 221647 -417738 -889672
13925 -889672 -1092234 -1350273 -1688881 -1630028 -1346750 -1196722 -1577392 -1814141 -1338501 -819292
13915 -819292 -751695 -886097 -560864 -209072 -257057 -580153 -725330 -511163 -212216 -376046
13905 -376046 -766957 -1248636 -1005001 -262886 520742 721475 105166 -812744 -1257535 -900253
13895 -900253 -712203 -320589 -246752 -940567 -1271647 -1162069 -714866 -406595 -525505 -641271
13885 -641271 -440550 -264101 -530144 -831328 -813192 -833263 -1160944 -1199823 -1200875 -1252658 -1254334
13874 -1254334 -1320742 -1399719 -1564628 -1543253 -1650106 -1421205 -995654 -1095253 -1232857 -1203688
13864 -1203688 -988833 -666450 -881791 -1260322 -1277647 -987466 -856138 -688149 -363077 -267644
13854 -267644 -211832 -68795 284109 206086 -390854 -860285 -1293277 -1487921 -1063752 -546956
13844 -546956 -468255 -873576 -1142133 -955946 -949155 -993895 -882095 -663933 -718097 -937679
13834 -937679 -1163265 -916733 -528326 -809781 -906134 -767955 -664091 -610276 -565155 -650210
13824 -650210 -768937 -990423 -915786 -806191 -970030 -1157299 -1269019 -1090095 -675782 -298112
13814 -298112 30414 193092 -203582 -847465 -1513858 -1483446 -900541 -350533 93529 189724
13804 189724 -308035 -641382 -682498 -800326 -1009065 -1078990 -1122780 -862024 -188973 201489
13794 201489 343703 445334 510356 201829 -202121 -473462 -464396 -140182 -117906 -406211
13784 -406211 -783003 -845290 -759189 -690166 -1126144 -1332460 -1405199 -1819795 -2232573 -1959869
13774 -1959869 -1607113 -1492015 -1466888 -1646837 -1707121 -1877142 -1647060 -962166 -496600 -555563
13764 -555563 -892035 -1117042 -1061231 -1061201 -655340 -508826 -786674 -1278531 -1839468 -1845738 -1330784
13753 -1330784 -811578 -476965 -441048 -453279 -226265 -56474 -106045 -556662 -935539 -1094164
13743 -1094164 -1274040 -1080231 -519508 80314 -118898 -461781 -644211 -880760 -1283915
13734 -1283915 -1681431 -1527724 -1471361 -1367305 -1310134 -1417196 -1032536 -736965 -873193 -1223498
13724 -1223498 -1446493 -1480560 -1291333 -1160566 -1300387 -1561756 -1611832 -1167435 -587003 -177393
13714 -177393 -262776 -429665 -472945 -363562 -359731 -903080 -1457157 -1209870 -988059 -1113906
13704 -1113906 -1515268 -1737672 -1704176 -1442149 -1220744 -1213231 -997635 -1093238 -1260356 -1648950
13694 -1648950 -1697049 -1375424 -867733 -808981 -579541 -768194 -1005535 -790178 -709473 -784859
13684 -784859 -1203944 -1822298 -2164715 -2094763 -1731639 -1248446 -640054 -414754 -558673 -963235
13674 -963235 -1200328 -1400109 -1658629 -1432020 -1069108 -649621 -533139 -728435 -617021 -38954
13664 -38954 242753 321667 349594 -15334 -619729 -1090393 -1377573 -1093942 -880494 -1040534
13654 -1040534 -1005239 -1202583 -1939442 -2216153 -2367923 -2367698 -1638343 -1022680 -704511 -880835
13644 -880835 -957608 -415836 -76071 -23694 -20774 -528462 -852478 -576815 -369451 -394769
13634 -394769 -455199 -548135 -905747 -576938 -203080 -591551 -831493 -642600 -807767 -933566
13624 -933566 -868190 -822859 -1059693 -994987 -1190215 -1735257 -1529609 -1182180 -1280864 -1454967
13614 -1454967 -1449474 -1189905 -751770 -564510 -781592 -946936 -847538 -531013 -281167 -339647
13604 -339647 -588575 -895451 -1057604 -1013034 -1007696 -1222386 -1159244 -1011650 -905309 -595616
13594 -595616 -183449 -40827 -403147 -973636 -1151730 -1116581 -681055 12034 158723 15894
13584 15894 289970 505818 455447 256359 -89660 -369180 -276029 -179495 -529987 -1210471
13574 -1210471 -1437099 -990777 -573078 -439894 -655366 -800243 -1015630 -1202585 -1253466 -1552798
13564 -1552798 -1631777 -1033376 -544121 -462723 -662274 -847758 -792010 -990085 -1344649 -1233113
13554 -1233113 -1242113 -1163218 -1043084 -993403 -810936 -542433 -390427 -526807 -791425 -514211
13544 -514211 -100823 -224983 -313332 -81394 -149494 -949371 -1561999 -1749746 -1458700 -1019313
13534 -1019313 -807693 -871440 -1398151 -1658256 -1538506 -1580408 -1588663 -1474438 -1386841 -1240435
13524 -1240435 -1164876 -1042270 -1100068 -712132 -120285 -218782 -447746 -770130 -786838 -481752
13514 -481752 -457564 -607733 -735897 -623034 -584835 -605335 -713249 -921440 -1172897 -1293706
13504 -1293706 -1273172 -1548681 -1958339 -2357438 -2332677 -1517863 -892291 -729983 -997493 -1070515
13494 -1070515 -542729 -386230 -640605 -610070 -308707 -443586 -695521 -681311 -289842 -142379
13484 -142379 -639695 -1185633 -1254239 -855247 -590471 -248606 79799 -262300 -754737 -832012
13474 -832012 -814573 -851477 -1066418 -1395098 -1480468 -1264294 -1147919 -1085504 -1136243 -954834
13464 -954834 -467312 -260384 -263928 -259066 -166790 -212624 -202803 20537 264032 465357 786716
13453 786716 546680 -120214 -485923 -670857 -486270 -164240 179671 386718 258137 -257957
13443 -257957 -541154 -578421 -592235 -437683 -275697 -137063 320357 521254 278479 192726
13433 192726 71900 -82065 -98125 189606 -20408 -417228 -642314 -639190 -929069 -1195825
13423 -1195825 -973466 -1069764 -1316453 -1068407 -860247 -922681 -931856 -1022898 -1274873 -1742452
13413 -1742452 -1604163 -1191768 -1080002 -1083750 -1418977 -1577082 -1079245 -584723 -178981 413626
13403 413626 516161 154887 -267947 -825625 -971294 -894710 -541029 -455682 -445565 7323
13393 7323 158666 -19194 -510855 -938318 -1129067 -1156912 -1657565 -2065253 -2066219 -1454179 -771744
13382 -771744 -384881 -92722 107491 154637 78646 98899 -97347 -457227 -433894 -279178
13372 -279178 -229 586404 604267 176070 -49082 -311217 -708179 -937046 -1296062 -1784770
13362 -1784770 -2010165 -2121213 -1677242 -1180097 -883977 -456381 -2593 -8485 -261169 -114514
13352 -114514 231087 318629 72646 -1085 -77607 -385265 -147336 54969 -255933 -632956
13342 -632956 -819076 -933711 -846995 -386479 122160 193744 101417 -237361 -813797 -1194014
13332 -1194014 -1169053 -957882 -945860 -1116039 -1221134 -978706 -539795 -224243 -185390 -122484
13322 -122484 137628 448263 455410 294638 42004 -424549 -604987 -1034948 -1358800 -1096370
13312 -1096370 -783967 -310567 -362103 -927324 -954248 -817985 -845435 -1098545 -992732 -540416
13302 -540416 -257936 -16365 -295665 -547028 -681609 -634093 -573488 -377193 -308592 -418438
13292 -418438 -202638 163808 277002 35154 -270579 -230006 -167346 -290982 -670667 -780645
13282 -780645 -615675 -478674 -509098 -236701 367021 1033386 1247390 744619 335313 -89983
13272 -89983 -29520 456234 808427 538394 147860 86610 725546 1036717 567746 32164
13262 32164 -110457 94499 51881 -304878 -523608 -799791 -785236 -592785 -620312 -714234
13252 -714234 -571960 -405553 -291852 -156275 209818 507891 708663 991200 884294 616834
13242 616834 450140 112955 -64599 370136 623205 282806 -100408 -191578 232591 359525
13232 359525 44972 36141 -92347 -245748 -421955 -181896 321623 576406 548102 443078
13222 443078 279208 163551 355523 397458 391694 918121 782799 622502 896973 1015851
13212 1015851 529139 314761 337393 393123 511573 42096 -294602 -56826 64483 -209425
13202 -209425 -367008 -312616 -205811 -63037 -605340 -1087886 -1007256 -505539 -74685 -247787
13192 -247787 -381856 -313951 -237582 30564 268362 407710 497536 209799 57693 -25265
13182 -25265 -16345 268477 419723 375438 -76873 162242 806139 1329204 1452748 1126433
13172 1126433 842368 984635 1111386 1152466 1245501 1323723 1185449 921560 828492 743188
13162 743188 729964 791177 776873 865986 702620 573369 609606 671209 430347 112439 34007
13151 34007 -203214 -370125 -305265 -199605 -243998 -542244 -848237 -646787 -104798 152815
13141 152815 191362 249752 551493 926219 1181864 963335 539849 555768 935234 996488
13131 996488 760753 496718 257976 161389 181853 587585 1030057 1295793 932655 278162
13121 278162 -266735 -490325 12947 569630 511825 178898 225959 597141 306678 471243
13111 471243 490432 328327 241135 45038 113064 17356 -66494 79621 -255518 -785948
13101 -785948 -681638 -373851 -75406 456136 1042827 1348203 1556468 1659946 1525319 1378798
13091 1378798 1055123 1215829 1490308 1207794 942795 1115990 1535727 1527068 1138200 879482
13081 879482 558193 148464 256885 829102 1404360 1854460 1383636 1124709 1238439 944476
13071 944476 890076 786242 674096 914898 1206065 1534747 1585881 1387078 903310 1166257
13061 1166257 1766585 1741882 2158546 2681522 2637899 2163593 1994829 2403523 2017438 1378036
13051 1378036 1098859 1105891 1462267 1594780 1747317 1700940 1473049 1023901 691762 876522
13041 876522 1450655 1803040 1463380 1410156 1456575 1623424 1537900 1696627 2075449 1850169
13031 1850169 1725879 1932931 1994213 2164005 2275246 2285995 2396234 2723410 3193643 3419344
13021 3419344 3498418 3373506 3189678 3066428 3113576 3248935 3543112 3778056 4248493 4361242
13011 4361242 4560694 4732613 4814616 4824713 5286411 5766751 5954328 6352404 7008732 7833667
13001 7833667 8280826 8727907 9117086 9580474 10231691 10918799 11955407 13016870 13752161
12992 13752161 14778294 16517680 18555951 20912163 24206935 28303353 32903481 38231343
12984 38231343 44798050 52707600 62184029 74241423 89313256 108171819 132718814
12977 132718814 165609618 209295659 265267318 329837773 386862557 406389192 374143138
12970 374143138 311949206 248422156 196409381 156813210 126898695 104677612 87779463
12963 87779463 74451577 64252105 55862581 48469410 42620735 38029766 34196799 30824172
12955 30824172 27494324 24798524 22981935 21404113 20071205 18744126 17183824 15748424
12947 15748424 14696325 13727150 12901303 12296425 11805082 11529283 11228040 11151526 10615535
12938 10615535 9878385 9350975 9014858 8745866 8373619 7643479 7364887 7574686 8070364
12929 8070364 8044474 7874417 7851054 7918071 7888565 7669202 7846832 8294987 8958116 9879827
12919 9879827 10883349 11766489 12906057 14103948 15632476 17305641 18216728 18072526 17631161
12910 17631161 17178795 16949090 16923896 17254590 18189383 19703662 21725901 23667820 25288413
12901 25288413 27454203 31084977 35733312 40753941 47287987 56085946 66559254 78936635
12893 78936635 94936842 115673698 142858714 178892754 226238448 286520700 353477513
12886 353477513 404770457 409059586 362867298 295686900 233320760 184221597 147560536
12879 147560536 120632445 100129389 84367590 72112187 61940147 53853508 47161539
12872 47161539 41312412 36757812 33196329 29615402 26735633 24696369 22606302 20700641
12864 20700641 19351089 17991545 16341241 15136003 14471671 13807805 13093833 12309669 11734355
12855 11734355 11494264 11361238 11075187 10333660 9793606 9949989 9963212 9625627 9107267
12846 9107267 8905163 9213273 9455462 9113726 8537109 8532790 8759147 9310130 9609960 9692986
12836 9692986 9593386 9550236 9517314 9595100 9746253 9639727 9828784 10292146 10083125 9607788
12826 9607788 9777114 10689154 11983469 13455196 14801090 15647901 16471570 17672744 19288552
12817 19288552 20929717 22929286 25426569 28267100 31797622 36552449 42888647 50287146
12809 50287146 59031791 69910846 83793941 101129917 122725048 151348124 189784928
12802 189784928 240287475 302624890 366458093 405109598 393729332 339577937 273553700
12795 273553700 215900471 171301648 137805925 112262029 92961867 78280443 66536913
12788 66536913 57145299 50011455 44340833 39168400 34637281 31136287 28343001 25919402
12780 25919402 23544465 21269617 19401233 17825710 16567836 15444788 14461968 13470130
12772 13470130 12096755 10853423 10196149 9618055 9068874 8826762 8126388 7493900 7153528
12763 7153528 6664924 6080795 5697299 5454173 5344177 5127988 4594114 4261043 4289332 4769861
12753 4769861 4698134 4505214 4626535 4288378 3710167 3063134 2576507 2471163 2732217 2844225
12743 2844225 2957360 2938592 2758642 2817149 2896557 2468266 1836093 1754285 1767871 1819815
12733 1819815 2013244 2291740 2410545 2345344 2195665 2640900 3114779 2965390 2533694 2383926
12723 2383926 2237052 1825570 1655175 1528914 1208377 995216 1114479 1020372 774619 928595
12713 928595 1007315 711767 565119 248828 39523 -47961 -328235 -188744 165723 115045
12703 115045 322926 547476 475647 347259 293213 138537 370879 975592 1136143 809101
12693 809101 137445 -124008 21340 -161775 5275 145918 302241 498683 430968 384518
12683 384518 734570 718860 421124 496145 634039 805976 882005 687937 662816 286542
12673 286542 -260330 -314848 -112599 -188713 -80129 266917 683589 940071 901339 825729
12663 825729 676024 647587 497746 185526 -75535 22676 140119 -57260 74297 396964
12653 396964 253007 -91660 -504234 -650492 -281661 397001 582756 385386 470917 -174024
12643 -174024 -893224 -960465 -824336 -441321 197766 729353 926322 1219170 1157450 892767
12633 892767 451925 -132233 -545884 -754745 -734911 -486699 -516590 -458234 -53437 489090
12623 489090 683913 377037 -45573 -314450 -656247 -714487 -389306 168695 632357 351143
12613 351143 -403976 -884010 -729898 -210937 285954 113977 -95844 -121844 -152398 46759
12603 46759 238405 250588 293161 337614 427534 336428 404493 393627 99322 -343646 -968842
12592 -968842 -1487293 -1221990 -598804 -95812 141918 414975 568337 641494 777072 946349
12582 946349 900702 636787 652610 716101 957077 1464253 1713013 1447712 887028 878949
12572 878949 1016812 894601 710129 564666 410767 626549 1182504 1431445 1246605 609846
12562 609846 36822 -130878 -215237 -150226 67054 87068 -82676 -283573 -119648 -237237
12552 -237237 -322344 -587580 -530986 -221642 -100294 -52539 279257 524696 130660 -278449
12542 -278449 -282473 -369284 -277590 -200025 333609 1081118 1335322 1333569 1207252 803722 791905
12531 791905 657334 499077 405950 75483 -116998 69994 -204449 -675955 -838318 -778575
12521 -778575 -595965 -686623 -767745 -617562 -216166 158552 278001 281903 90416 -59287
12511 -59287 -38361 -61656 27674 194097 51552 -22781 -96690 -147499 158256 298163 260876
12500 260876 238785 264395 341366 69016 -458857 -523546 -724429 -981179 -733847 -328725
12490 -328725 -224900 -370243 -319600 -137671 239281 430043 411930 126815 -502327 -527094
12480 -527094 31650 466170 580938 398522 341706 831070 892697 638753 724645 615186
12470 615186 561549 489481 378671 478628 731831 937075 655577 491709 623234 438345
12460 438345 287900 421636 540930 89821 -232495 -87692 205284 174987 154463 62060
12450 62060 93850 138059 -44740 -158143 -263032 -111276 -166836 -431170 -469527 -649180
12440 -649180 -1190039 -1293243 -1337727 -1392434 -1089807 -632668 -440922 -509865 -457543 -244289
12430 -244289 -226815 -542181 -768059 -609344 -908878 -865888 -533711 -158892 197707 456298
12420 456298 440936 149888 45990 318332 645240 483945 309662 269330 8153 -355207
12410 -355207 -456591 -390429 -146893 90053 76680 181306 295468 185911 433867 312901
12400 312901 -152019 -546607 -657168 -560368 -536840 -950812 -1037436 -316639 610395 1470314
12390 1470314 1762944 1172230 243091 238778 564728 580256 626733 792315 744775 509721
12380 509721 281334 265743 191283 -91991 -404510 -161572 -114089 -145788 251539 710596
12370 710596 479361 -186816 -367614 -244725 -342300 -531498 -44866 377559 151133 -80385
12360 -80385 -165117 -15678 -93440 -469583 -848991 -972135 -810607 -591360 -622499 -359127
12350 -359127 307836 829640 783692 341512 181902 251742 321507 -15694 -37028 83508
12340 83508 3338 -29621 -216910 -171246 -50762 220710 263257 472766 185115 -255213
12330 -255213 -266076 190353 475851 52995 -197555 -471246 -905087 -1120591 -1014075 -729337
12320 -729337 -767541 -691299 -629580 -647222 -672815 -597829 -349018 -488716 -769807 -820239 -674836
12309 -674836 -579256 -169052 262207 312189 223758 65849 -232303 -555623 -830060 -1122349
12299 -1122349 -1619399 -1318548 -1003513 -984825 -515599 -257765 -590016 -749122 -620138 -342382
12289 -342382 25752 409593 247666 59373 15192 -126265 -266275 -377976 -592058 -636658
12279 -636658 -439816 -267254 -447910 -550938 -87044 501090 593461 289542 179865 5286
12269 5286 -263613 -447934 -289820 -189308 -80846 -28443 -45290 170174 806070 1129900
12259 1129900 861965 257008 -575109 -1086474 -1483873 -1536123 -1638687 -1806687 -1435853 -1148210
12249 -1148210 -662731 -298221 -422038 -607579 -765091 -635210 -330764 -114678 161576
12240 161576 401296 462421 429393 -147358 -892865 -1198542 -880771 -165076 279981 329489
12230 329489 165141 -384394 -791930 -766456 -448425 270406 748444 1139056 1294249 1270933
12220 1270933 961514 675231 504186 388465 75262 -233576 -426300 -592900 -315262
12211 -315262 -368303 -689017 -673241 -693139 -966972 -800818 -570456 -537058 -590136 -856840
12201 -856840 -1145126 -618697 -213912 -460248 -640623 -308514 251664 331221 -466772 -959095
12191 -959095 -705050 -267835 216850 502748 668245 656476 671766 415602 -23405 -339538
12181 -339538 -615892 -481916 -31845 -55101 -464845 -853707 -1005891 -792224 -347030 87076
12171 87076 321527 534778 324502 -128857 -122508 -189651 -428668 -653299 -1005225 -1371131
12161 -1371131 -1508090 -1787283 -1934747 -1571738 -1459206 -1712500 -2083641 -1970859 -1221303
12152 -1221303 -705345 -372332 -5386 77936 122934 -21350 -137232 12638 425734 557511
12142 557511 -168520 -1068214 -1024330 -808833 -869843 -1173001 -1075297 -115928 296236 168925
12132 168925 540269 929714 565312 174582 42276 -79282 -136640 -243554 10689 407704
12122 407704 489636 592149 644694 234438 -171675 -139449 -279056 -447383 -695744 -1039758
12112 -1039758 -1257211 -866366 -331339 -239778 -382112 -475470 -551015 -346424 -284552 -158006
12102 -158006 210395 243148 -196888 -142238 372271 828070 1123879 525132 -243245 -622747
12092 -622747 -635624 -366209 -336955 -353068 -297789 -282220 269517 769537 531100 472985 627588
12081 627588 798217 691383 772533 938935 1148319 1207245 959786 495119 176505 -150350
12071 -150350 -754720 -1064019 -773050 -212433 -113934 -554788 -549733 156373 572296 88746
12061 88746 -143064 140970 440297 480961 178113 -212064 -205687 -238473 -529616 -634858
12051 -634858 -401713 138625 594101 397604 25017 -142195 -197558 -342404 -619703 -779668
12041 -779668 -709860 -499647 -184358 220888 378552 647012 392003 -56786 -443736 -646015
12031 -646015 -637376 -410609 -236144 141899 478516 100601 22482 -68429 63238 514846
12021 514846 311921 -73794 -524178 -999094 -1105058 -1132265 -1083849 -497669 -27261 -150517
12011 -150517 -277693 -276069 -535182 -1193288 -1233602 -873494 -758926 -784721 -1043175 -1214849
12001 -1214849 -1441727 -1714610 -1613993 -946072 -395609 14514 116456 -158112 -323561
11992 -323561 25988 153191 -100054 -529423 -814236 -1279749 -1694757 -1770363 -1107705 -797244
11982 -797244 -1044543 -939595 -362835 200449 368629 -91421 -223866 -276009 -322533 -596483
11972 -596483 -991122 -1187274 -970991 -637676 -233293 -112636 -78973 123818 151462 192031
11962 192031 510969 618176 43064 -315736 -360565 -118340 -39225 -203293 -300835 -667024
11952 -667024 -540215 -247149 -247770 -475768 -678746 -673898 -227495 276204 -234096 -452478
11942 -452478 4652 264609 50865 -97115 374125 481959 148019 -173743 -92997 -102888
11932 -102888 -102995 92279 -90041 -318178 -352969 -404703 -341156 -282233 -724846 -1013541 -827240
11921 -827240 -620743 -684378 -463766 -42298 240775 280277 -180074 -720941 -718022 -597151
11911 -597151 -930475 -1335979 -1969545 -2546449 -2140510 -1484928 -1161238 -706793 -266855 -189025
11901 -189025 71359 -56977 -248133 -179929 -109304 -27615 83160 -80653 -457558 -811580
11891 -811580 -1296872 -1631647 -1850830 -1862946 -1259654 -465963 -467599 -901563 -1139567 -1001012
11881 -1001012 -859864 -891278 -950372 -1232533 -1204210 -1162021 -1078254 -932049 -665562 -314408
11871 -314408 -245178 -421338 -474082 -474816 -781052 -1222047 -1521634 -1736268 -1782769 -1855623 -1631182
11860 -1631182 -1004906 -298725 -139508 -99654 -134339 -338896 -447712 -266378 -286601 -131912
11850 -131912 585 200543 693629 809216 624599 385975 -95490 -271207 63625 98761
11840 98761 -270886 -749562 -1002809 -1034935 -1086328 -810475 -325347 -263427 -253834 -66808 207928
11829 207928 600918 659927 828981 487139 -100414 -333073 -175257 404634 444786 230265
11819 230265 73681 121701 343592 384492 400783 619394 349294 -238237 -824478 -1243580
11809 -1243580 -1752513 -1844354 -1444315 -1182659 -1048105 -842136 -356910 280047 942899 788114
11799 788114 894067 1137472 1158262 1071823 419036 -294645 -641742 -850767 -1160172 -1108265
11789 -1108265 -743132 -960072 -1006393 -829949 -393570 100553 -63278 -546015 -735639 -462295
11779 -462295 96141 57138 -168850 -163718 -152546 -158914 -61957 355560 599770 169918 -622343
11768 -622343 -774052 -789367 -583266 -423989 -332842 -534614 -738078 -967426 -1235236 -1157836
11758 -1157836 -679457 -488230 -948074 -956803 -639701 -470233 -355900 -415999 -608040 -913220
11748 -913220 -1079936 -965718 -778190 -474265 -269174 612012 1895605 2720962 2898422
11739 2898422 1870028 1058730 955013 794598 411557 -114690 -498642 -777013 -1114876
11730 -1114876 -1234398 -1096927 -1111397 -1388941 -1617657 -1334849 -697585 -298147 -3833 573072
11720 573072 777611 507550 129844 -106483 55603 327362 410183 457290 716235 686575
11710 686575 465821 490230 553023 527558 316022 307595 903450 1230180 1215630 1158656 836427
11699 836427 494749 355819 616953 990500 949745 491582 -128626 -723324 -840001 -691260
11689 -691260 -400468 -333142 -488951 -419185 -385743 -115506 81458 -292925 -745969 -967982
11679 -967982 -702225 -346525 -234606 -534704 -711895 -483781 -190475 -128393 -29125 390062
11669 390062 708938 547211 90345 -326000 -434633 -441319 -270442 -35834 136207 -171369
11659 -171369 -269215 -60481 150281 711706 846507 412449 -61786 197311 405698 207420
11649 207420 209064 423560 324119 -431902 -1192553 -1465105 -1315731 -1031011 -914877 -719819
11639 -719819 -694107 -711496 -885170 -1338141 -1405191 -899194 -217788 138166 -28410 -472929
11629 -472929 -646284 -484693 -329371 -149034 143158 231818 319167 495201 455418 500542
11619 500542 325599 292451 401172 152827 -229783 -350344 -486434 -907383 -1035369 -1081473
11609 -1081473 -970707 -1014200 -1106992 -943299 -779238 -975122 -1009303 -739612 -668921 -250260
11599 -250260 220541 321479 73126 -197059 -232025 -55437 -127207 50101 77651 -125254
11589 -125254 -810489 -1393969 -1353663 -1097827 -659228 -259852 -50293 257609 115937 -546187
11579 -546187 -1163939 -934638 -79323 664010 849341 790344 724917 435089 327134 46635
11569 46635 -572297 -744290 -272258 54593 147745 325722 369339 -40586 -532249 -670734
11559 -670734 -425459 29948 341759 679754 440399 -102053 -289806 -495654 -570148 -715711
11549 -715711 -723323 -623015 -844169 -1056368 -1360968 -1160012 -678496 -501119 -151127 60285
11539 60285 -247158 -591162 -838864 -1063261 -1417591 -1499701 -739186 -143083 -92273 -369761
11529 -369761 -468852 25390 523988 647952 516120 406803 543777 219733 -140538 -7457
11519 -7457 244148 257083 -141138 -266647 -466230 -611360 -529981 -521978 -698730 -1177822 -1524934
11508 -1524934 -1411237 -1242628 -1381546 -1777706 -1683041 -1114804 -452391 -192278 -80243 47935
11498 47935 97207 151703 426105 323346 -245169 -548238 -333975 -237014 -323390 -194903
11488 -194903 -51235 -125733 -427272 -118776 373812 459379 272119 -150116 -484239 -449989
11478 -449989 -453500 -463744 -565996 -516499 -477059 -655829 -633483 -819937 -858022 -472656 -342474
11467 -342474 -162790 -30196 62416 -120330 -630020 -920197 -897681 -631233 -631735 -995961
11457 -995961 -1037550 -1025853 -968230 -1016467 -837852 -783862 -793101 -1235522 -2346452 -3392574
11447 -3392574 -2765787 -1205116 456817 1488416 1049686 521416 431972 261772 -207548
11438 -207548 -440967 -840531 -1008820 -757464 -466312 -300057 -290966 -195849 65467 522359
11428 522359 758061 364824 -404898 -952826 -1195356 -1351565 -1131157 -588752 -142110 278722
11418 278722 727062 533352 385011 404095 426911 237267 184513 232497 100591 169277
11408 169277 66795 -238486 -484166 -769434 -295229 -49751 -291076 -434455 -290048 -223132
11398 -223132 -247610 -630613 -794313 -389396 -145050 -263512 -589288 -309529 -190840 -392655
11388 -392655 -101731 267348 215638 -84462 198483 646627 681595 180125 -242546 -198708
11378 -198708 -237614 -252533 -244880 40012 312800 575705 511577 134334 108432 146344 -241871
11367 -241871 -247565 40361 273981 352429 315439 -26914 -548996 -917455 -1201999 -1130889
11357 -1130889 -703019 -923357 -1279136 -1414595 -1202839 -1019570 -947777 -764494 -443944 -118045
11347 -118045 83594 149690 293971 246608 -267104 -722358 -704091 -787189 -1235260 -1493721
11337 -1493721 -1040191 -682754 -706087 -520464 -410740 -838707 -752443 -379947 -421464 -498781
11327 -498781 -407017 -292363 -157213 -115301 -315163 -337548 -484417 -552050 -826195 -1049597
11317 -1049597 -798688 -915581 -1234234 -1476256 -1599378 -1549896 -1101043 -628562 -417271 -608321
11307 -608321 -1027263 -957631 -911734 -1446861 -1809679 -1900178 -1747251 -1667308 -1606776 -1447138
11297 -1447138 -1345842 -1065190 -1090291 -1329090 -1187468 -1092606 -947246 -576339 -21792 293678
11287 293678 395193 -200397 -732003 -837281 -938254 -810151 -615312 -514652 -447914 -125634
11277 -125634 443613 682881 581853 156566 -267139 -313516 -508809 -881876 -1234586 -759163
11267 -759163 -220988 -490443 -1031136 -1087252 -818056 -410883 265567 393620 -94240 -741783
11257 -741783 -1209199 -1439820 -1477787 -912018 -395668 -437052 -749454 -836165 -583131 -73725
11247 -73725 270488 503942 350281 -104800 -284126 -891699 -1292824 -1088060 -903541 -974194
11237 -974194 -1349734 -1479507 -1313684 -1338230 -1079009 -683053 -549866 -816005 -1054676 -819188
11227 -819188 -445940 -323573 -163108 -43284 -104654 124797 130484 -385838 -807351 -800733
11217 -800733 -791524 -610434 -394215 -282083 -137713 156886 126016 -286068 -1021826 -1347513
11207 -1347513 -1388849 -1433160 -1497567 -1693161 -1971587 -1831374 -1644973 -1581176 -1217550 -915539
11197 -915539 -924612 -715523 -529732 -398997 -82923 353159 611375 409678 129652 -329490
11187 -329490 -619768 -300769 -147727 -398604 -813104 -945026 -976048 -1079410 -1188268 -1156251
11177 -1156251 -1052813 -793811 -594802 -839160 -1110643 -820349 -445141 -201170 -22508
11168 -22508 24693 -23607 -107197 -214909 -172211 -12718 -26408 -193933 -634736 -927168 -720754
11157 -720754 -754821 -645544 -567983 -588840 -449523 -237673 -810438 -1717452 -1754252 -1451216
11147 -1451216 -1401732 -1519819 -1297336 -726754 -735721 -1073858 -1008341 -295927 119794 -125189
11137 -125189 -419572 -409781 83266 232621 -71661 -414829 -253514 -157174 -79407 -148801
11127 -148801 -363226 -545244 -833899 -979097 -1167457 -1344097 -883705 -116175 564120 704744
11117 704744 46432 -448293 -677198 -879930 -707241 -606664 -637574 -332572 1240 28240
11107 28240 48297 -274069 -751717 -834199 -919140 -1113556 -1167304 -1013208 -730536 -315324
11097 -315324 220201 320886 462795 116920 -232997 -279609 -570184 -894154 -1258372 -1193012
11087 -1193012 -592678 -165142 374603 472957 54181 -36965 -373911 -815735 -596003 -459211
11077 -459211 -187492 38683 16595 -270034 -196440 -220360 -585905 -1114811 -1413084 -1427133
11067 -1427133 -1388735 -1011330 -695280 -695573 -1092054 -1083813 -1254167 -959964 -597257 -342723
11057 -342723 92934 194837 -206568 -625167 -1115567 -1184882 -794684 -751161 -1066318 -1176418
11047 -1176418 -1240107 -1034885 -705424 -670515 -482212 -415780 -414797 -342557 -206453 -192480 -561724
11036 -561724 -769651 -553923 -354748 -676904 -1439476 -1805156 -1522475 -977076 -424552 -62570
11026 -62570 343844 509330 369386 -494361 -676189 -200424 212292 208480 100138 409458
11016 409458 523947 256150 -81932 224781 169931 -196404 -287003 -399092 -593322 -628151
11006 -628151 -191513 256589 189932 115845 285159 336644 104984 28147 559367 860374
10996 860374 931346 958612 582927 225468 137759 158590 -238632 -422079 -320703 -74437
10986 -74437 -297216 -411965 -408511 -643523 -947447 -1089539 -1116357 -1016423 -519781 -160134
10976 -160134 -28163 -266391 -721134 -1061827 -928888 -475559 -467436 -602898 -699431 -484964
10966 -484964 -379430 -437708 -809282 -1015083 -854024 -875286 -548347 -391413 -810936 -1404258
10956 -1404258 -1749100 -1888839 -1667491 -1423455 -1722537 -2172511 -1752545 -1296363 -875123
10947 -875123 -816012 -1097922 -1132079 -1243549 -1383644 -1119676 -738087 -375511 -1233 234280
10937 234280 232083 36876 -59211 -24044 168685 97078 -374053 -931569 -1157843 -1324704
10927 -1324704 -1136583 -1180222 -1145946 -1077482 -1199387 -1253653 -1466953 -1332815 -1076814 -649780
10917 -649780 -487787 -536428 -391395 -360712 -611248 -533917 -348212 -282603 -350256 -233939
10907 -233939 -300226 -646761 -810601 -1119102 -1535190 -1544266 -1310605 -1179315 -1040176 -553002
10897 -553002 -154849 -66806 94400 143104 58645 -350640 -498447 -243717 -108064 -287930
10887 -287930 -632249 -759589 -864692 -1295738 -1530140 -1305815 -1287871 -1441568 -1473659 -1733887
10877 -1733887 -2164843 -2105882 -1902550 -1601332 -1029841 -861480 -1102792 -1104648 -1181264 -1350554
10867 -1350554 -1130250 -740461 -352460 31319 93401 -182133 -397144 -684756 -963088 -1066553
10857 -1066553 -958917 -1125602 -1169333 -737115 -429904 -327078 -77969 194791 38404 -314085
10847 -314085 -211630 -171923 -467582 -329815 -167723 -464667 -528293 -323400 -185526 -293736
10837 -293736 -253462 -115350 -196017 -174913 -90129 61020 518435 724672 470966 -3671
10827 -3671 -283068 -713709 -1103409 -1081941 -764429 -576012 -676555 -563812 -589933 -576351
10817 -576351 -200283 -112669 -117674 32140 435591 411458 253386 282817 322195 197440 -342799
10806 -342799 -876635 -1230288 -1278567 -985320 -988686 -891616 -740055 -763548 -968686 -942607 -877663
10795 -877663 -705301 -482131 -417088 -532068 -637707 -240938 111399 137922 -30351 -295975
10785 -295975 -179937 -56258 98537 -77857 -706955 -1462635 -1804830 -1459067 -1221360 -1325267
10775 -1325267 -1606082 -1551465 -1257830 -813404 -569463 -532737 -740971 -1245574 -1399535 -1078595
10765 -1078595 -765895 -234018 425095 531972 167234 -79719 -177842 -97487 -141310 -182067
10755 -182067 -108802 -142468 23493 471221 402707 -125818 -234340 -208221 -359382 -99417
10745 -99417 14476 -206320 -641481 -839220 -702644 -472423 -40245 115666 -232595 -132925
10735 -132925 -171377 -95039 260989 308295 -193475 -467404 -467134 -498609 -202671 -140231 -144439
10724 -144439 -401165 -588643 -584187 -568709 -256509 -55074 40965 43291 -237375 -608170 -698192
10713 -698192 -343255 -159318 -428512 -332650 -125106 -351299 -559166 -661076 -441643 -173706
10703 -173706 -299690 -245265 -232405 -356051 -329942 -334576 -854677 -1028711 -368786 4445
10693 4445 -60779 -491738 -683230 -612693 -934151 -1103615 -949256 -1241518 -1513238 -1517867 -1127393
10682 -1127393 -1126343 -1654335 -1843328 -1170170 -488173 -342247 -584128 -774030 -908476 -1023683
10672 -1023683 -932009 -1001531 -1223774 -1728401 -2051089 -1919793 -1706423 -1576355 -971783 -286995
10662 -286995 -201810 -428199 -714297 -867720 -888087 -635954 -243761 78559 -9524 -255536
10652 -255536 -1168 44852 69111 19345 -197681 -315402 -108981 346735 284001 143718
10642 143718 423290 657389 654517 114092 -406315 -807831 -1045920 -1023679 -990880 -1002349
10632 -1002349 -1035616 -909931 -673640 -746720 -880046 -751172 -351985 169742 474845 117304
10622 117304 -204150 30553 -143622 -357285 -690189 -1055081 -1338299 -1528842 -1644753 -1489188
10612 -1489188 -1041397 -693937 -408010 -122406 -130872 -309545 -135703 368466 716793 399882
10602 399882 173841 13975 -71706 168291 554046 362430 -221791 -594565 -806056 -340564
10592 -340564 343594 787577 630211 -20374 -598323 -168454 137674 -47439 57055 -218025
10582 -218025 -847698 -1148619 -993338 -674695 -452959 -333382 -662208 -1016868 -1352650 -1353797
10572 -1353797 -741755 -615171 -508997 -149166 -200269 -579124 -459176 -333760 -391080 -785726
10562 -785726 -1153980 -1091548 -1024990 -939800 -352631 55945 229537 448405 546781 517733
10552 517733 189538 -297489 -263818 -147625 89484 279289 30117 152357 378719 74656
10542 74656 -220160 -454626 -660932 -725514 -521851 -640185 -889193 -776419 -517867 -84684
10532 -84684 57178 -130487 -117853 -328280 -749722 -1229117 -1464765 -1503918 -1191108 -713644
10522 -713644 -425322 -353737 -320751 -443063 -921737 -793683 -107135 153302 -319711 -631951
10512 -631951 -412580 -156027 -117067 -309456 -258673 -99648 -429965 -839642 -1010767 -798040
10502 -798040 -408995 -203562 -14135 96238 6587 -334044 -858021 -920941 -629678 -504510
10492 -504510 -718188 -1033722 -1287201 -1750687 -1861650 -1218179 -710671 -652545 -686648 -674911
10482 -674911 -624544 -227692 88839 -110731 -516650 -287222 -212953 -203885 -222896 -446302
10472 -446302 -977611 -1071013 -396861 554549 1189947 1055520 460366 -174910 -532921 -757997
10462 -757997 -1131677 -1125013 -893308 -724184 -402755 -257578 -599043 -792029 -478445 -383822
10452 -383822 -654271 -910391 -828284 -871271 -957646 -903693 -1034528 -1377449 -1632482 -1629627 -1458238
10441 -1458238 -1579723 -1618635 -1437680 -917117 -436590 -577017 -904512 -820897 -351843 -286491
10431 -286491 -382439 -523092 -614951 -625716 -530579 -309916 102478 115437 -206741 -329104
10421 -329104 -482410 -271301 -213011 -408491 -656214 -628315 -465371 -453230 -1121318 -1559710
10411 -1559710 -1158669 -857561 -1119719 -1564967 -1308346 -834729 -490162 -763431 -1025649
10402 -1025649 -704239 -204821 -197970 -526222 -1020810 -1284852 -1328060 -1235124 -1088874 -648603
10392 -648603 -438568 -731542 -1376871 -1709618 -1276810 -1262539 -1643003 -1904811 -1666894 -1058301
10382 -1058301 -607368 -592740 -1120655 -1228928 -1192766 -1663017 -2026880 -1945111 -1954526 -2054535
10372 -2054535 -1841006 -1582339 -1312587 -1193444 -1161425 -1093623 -726618 -395399 -413827 -311582
10362 -311582 -281986 -338854 -256876 -327570 -454620 -310150 -112484 -253098 -482445 -794009
10352 -794009 -1105618 -933001 -623866 -636217 -717983 -587122 -646082 -855592 -1043473 -1194282
10342 -1194282 -1080297 -865135 -562863 -369276 -6342 399553 346876 -358705 -1455489
10333 -1455489 -1869567 -1722586 -1520298 -1351662 -1051463 -558219 -297662 151284 496541
10324 496541 145605 74133 575115 788225 657696 607594 538699 561871 251730 -358071
10314 -358071 -497661 -426538 -335737 -330590 -445985 -555517 -578069 -705261 -418690 295572
10304 295572 613180 267850 21988 279604 610716 601624 488427 66998 -180958 -233938
10294 -233938 -386651 -352375 -227511 -501470 -884650 -1049994 -1138448 -1200992 -955093 -626556
10284 -626556 -331083 64850 -12221 -772151 -1279639 -1087348 -792395 -509698 -202856 75517
10274 75517 100868 -32566 50884 114145 -181060 -430885 -284193 -347055 -408366 -337782 -360339
10263 -360339 -191323 214317 286129 108494 -125664 -507619 -860511 -854529 -605361 -238565
10253 -238565 237677 446830 450663 -45077 -526241 -350019 61174 128434 -24933 -218955
10243 -218955 -870682 -1169309 -916828 -781750 -847409 -860041 -630462 -491659 -572349 -614453
10233 -614453 -519848 -616610 -650356 -557025 -521938 -384028 -165073 -250863 -274106 -188754 -325328
10222 -325328 -287778 -667358 -973096 -775778 -946703 -784082 -558842 -837668 -1003280 -1015310
10212 -1015310 -1136125 -1146301 -929029 -663020 -573494 -700538 -747207 -718197 -157771 45204
10202 45204 30983 124084 -190631 -475052 -739828 -650051 -176718 178926 125921 119820 265683
10191 265683 449285 299422 -149119 -400253 -421163 40024 -76953 -726782 -972471 -771131
10181 -771131 -243795 -82241 -491208 -934847 -1088144 -1219134 -1452154 -1618148 -1633274 -1463946
10171 -1463946 -1306415 -809411 -579915 -964918 -906216 -698656 -502764 -407668 -302420 -186759
10161 -186759 -456391 -759372 -587790 -476104 -583072 -827795 -589881 -288705 -80628 4115
10151 4115 40246 -227694 -431229 -496544 -720038 -966696 -1089085 -490380 122213 278957
10141 278957 595433 907581 971878 558107 470038 434170 1681 -322653 -392189 -178823
10131 -178823 181768 289084 94340 -343729 -1000046 -1398534 -1185042 -925909 -842309 -732815
10121 -732815 -558903 -274577 -121974 52680 -96239 -384891 -730327 -1356922 -1510611 -1010501
10111 -1010501 -375204 -443585 -822462 -1028090 -1144576 -879279 -428651 31538 375114 -112446
10101 -112446 -768685 -1412695 -1618523 -1324319 -1112401 -710080 -665659 -689376 -467346 -306088
10091 -306088 -504463 -519138 -839603 -1413713 -1526811 -1341593 -1385787 -974880 -74913 645741
10081 645741 1016717 778447 229938 -227117 -535085 -613556 -1177201 -1587496 -1155276 -775234
10071 -775234 -505969 -432686 -91108 422284 653314 389203 -210455 -573086 -435892 -189608
10061 -189608 -157554 -114367 -92911 204552 360201 50727 48179 514541 208464 -232443
10051 -232443 -755366 -607013 -176148 469 -136853 125435 290630 -454401 -889867 -839908
10041 -839908 -617152 -505437 -328057 -211257 50007 -3785 -521013 -708191 -552276 -382272
10031 -382272 -434274 -377367 -523227 -836394 -749160 -439033 -242216 77029 490285 796797
10021 796797 831915 342791 -80288 -411668 -645092 -532360 -643202 -748909 -783010 -674032
10011 -674032 -308619 210992 711814 700318 675955 765310 564345 473224 541029 274598
10001 274598 330173 112901 -249557 -439633 -554062 -874636 -679230 86853 564924 343599
9991 343599 -9993 -121751 -307006 -248595 153 43599 -227371 -610635 -659181 -534049
9981 -534049 -535080 -607633 -469972 -244062 -155311 -212928 -211916 -501239 -1078108 -1240761 -1252608
9970 -1252608 -965788 -349322 -136030 -347584 -360740 -133540 -88942 -335414 -549740 -158371
9960 -158371 83666 -297749 -378820 -466491 -622631 -375501 -168188 62618 183542 117487
9950 117487 508639 962405 883750 271880 -163007 -852496 -1063344 -556191 -308474 -305691
9940 -305691 -387504 -650171 -920060 -865254 -874114 -702107 -359789 -261031 -546477 -1067186 -846007
9929 -846007 -497469 -873517 -1344434 -1138506 -355283 258242 370202 -177028 -393195 -260375
9919 -260375 -232476 -232400 -202258 -149282 -190631 -229388 105728 333604 118191 49486 104604 -202247
9907 -202247 -609250 -960771 -1055136 -744899 -791991 -1106165 -1357788 -1687530 -2018281 -1727764
9897 -1727764 -912227 -219024 -355794 -1067287 -1865434 -2182567 -1812428 -1639463 -1452504 -874775
9887 -874775 -626971 -559333 -1008915 -1908040 -2384829 -2695439 -2589653 -2035954 -1431214 -779143
9877 -779143 -315691 -166252 174109 722055 750956 281531 -216968 -646091 -992951 -1340425
9867 -1340425 -1475207 -1221397 -778352 -625312 -822001 -979857 -1266974 -1259784 -825832 -245279
9857 -245279 -41537 -83120 -452225 -654480 -773732 -1078777 -1160695 -795609 -733013 -910397
9847 -910397 -942097 -728431 -328153 -90753 -10952 -108374 108687 155529 -509413 -985162
9837 -985162 -960227 -592533 -468666 -260515 -257559 -928851 -1603580 -1748878 -1676560 -1842987
9827 -1842987 -1747478 -1273560 -822244 -355554 28818 -15231 -64713 -172014 -273774 -185391
9817 -185391 2188 373824 681614 450699 162614 29346 -216795 -477343 -435109 -523175
9807 -523175 -439642 -450785 -802679 -1193841 -1196727 -612318 -442333 -987768 -1165451 -961110
9797 -961110 -435984 -244311 -535356 -725123 -822195 -1127790 -1076864 -975640 -849955 -786112
9787 -786112 -838169 -313775 386572 666980 810563 952684 843320 679686 380896 26938
9777 26938 -60717 -349512 -900839 -1093612 -1010739 -520846 -159020 -419934 -644941 -484887
9767 -484887 -597272 -308175 287814 435298 456961 434895 37740 -670660 -926756 -735390
9757 -735390 -525056 -314943 -269990 -400900 -511437 -451765 -310872 -267731 -189854 -153878 -84975
9746 -84975 -498325 -651212 -589424 -737978 -863409 -977786 -1435917 -1514106 -1227019 -1117298
9736 -1117298 -821843 -765207 -879528 -663969 -336327 -246469 -364591 -880601 -1037621 -1178668
9726 -1178668 -1108613 -623945 -55558 -131455 -575336 -780772 -659489 -354981 -227809 -284405
9716 -284405 17422 58138 -21586 -143622 -946619 -1673252 -1927534 -1936657 -2026524 -2171617 -2056008
9705 -2056008 -1976554 -1857590 -1560228 -1084342 -472428 -277157 -440837 -507149 -225287 148403
9695 148403 -19979 -318089 -515336 -183637 416240 416402 241436 396703 798507 817191
9685 817191 145413 -219890 -535409 -584266 -437582 -609487 -868306 -873087 -576397 -316196
9675 -316196 -299496 -424338 -359972 -424140 -540816 -1090899 -1388671 -1109242 -981694 -901387
9665 -901387 -586762 -723150 -993825 -1105321 -1050964 -1089046 -1187037 -1023456 -486342 -398491
9655 -398491 -593711 -775107 -616087 -495679 -322423 -538704 -770742 -1259715 -2172890 -2044956
9645 -2044956 -1122710 -772392 -1125498 -998052 -667552 -1037940 -1489364 -1678272 -1515135 -1177694
9635 -1177694 -842728 -722074 -740708 -436243 -372284 -272917 -408511 -622488 -699660 -668834
9625 -668834 -286454 -37157 -36957 -77223 -155570 -541699 -829993 -717573 -527587 -576011 -603394
9614 -603394 -709357 -708878 -272043 113004 329605 444436 248804 -145154 -151836 -321836 -341088
9603 -341088 -24252 89807 2657 -49211 -38022 11493 249375 681941 801276 625704
9593 625704 467626 646503 896390 1150427 1384043 1295612 1214382 1346454 1771110 2754339
9583 2754339 4235173 5501016 7098884 9523311 12961875 16700918 21469305 28800191
9575 28800191 39546826 54814607 69124668 65609102 48679538 34298116 24682256
9568 24682256 18405514 13996447 10716080 8190547 6872213 5902088 5059561 3912031
9560 3912031 2918459 2206020 1746126 1590898 1737131 2197976 2059236 1580515 1517237 1408783
9550 1408783 1113677 912308 950850 1291946 1399079 1145885 951889 1081991 1125792 917314
9540 917314 737836 623481 598584 696965 483415 477281 742454 789489 861304 908256 881718
9529 881718 652036 575374 944895 1345386 1517846 1506115 1144813 841281 1066315 1215846
9519 1215846 923972 446173 434888 484403 398682 80241 -164896 7009 3000 218581
9509 218581 505353 911472 1113742 708280 417602 351242 380385 502904 573411 861777
9499 861777 1171267 973688 657693 551921 131256 -135355 -43961 209764 17923 -437314
9489 -437314 -1024047 -1098947 -481054 -9215 301201 787496 1019406 1219327 801555 411754
9479 411754 241788 479610 982148 1046936 1200990 1398293 1504709 1799853 2094868 2111992
9469 2111992 1907496 1703379 1895421 2231585 3086223 3809359 4452813 5322679 6342821
9460 6342821 7983117 10499325 13526436 17416112 23578252 33277294 46605015 62387737
9452 62387737 67292706 54575076 39276203 28516495 21415300 16698722 13110040 10110933
9444 10110933 7973525 6355741 5134631 4294846 3815329 3218312 2670301 2425163 1902137
9435 1902137 1443241 1324253 758837 376875 343354 21389 -221227 3280 284283 63360
9425 63360 9875 678829 1097378 1331636 1562378 1244340 775592 674533 556962 -8191
9415 -8191 -487219 -121073 613804 1175001 1167401 1069602 1190910 1251051 1230490 1308265 1230127
9404 1230127 956643 464235 199519 41463 -203099 -258148 -149397 -305245 -359070 -242773
9394 -242773 -30173 309165 243525 -481461 -1013624 -1429055 -1547789 -1300650 -1283387 -1287548
9384 -1287548 -828293 123475 727758 216378 -679450 -788703 -478647 -328923 -626850 -1023442
9374 -1023442 -1246913 -1227926 -1461196 -1061838 -195356 -165047 -394081 -541070 -605399 -468660
9364 -468660 -480094 -433709 -284668 -447967 -714122 -911976 -1257245 -1560566 -1595593 -984221
9354 -984221 -751513 -614228 -170294 361068 537341 505646 114786 -162348 -388793 -366523
9344 -366523 -494370 -610168 -735917 -857817 -531481 29731 135016 -92302 -68401 28888
9334 28888 -62286 -172844 1287 287238 446550 499366 570802 336510 -21328 -50723 122576
9323 122576 670583 785543 280071 -231593 -464632 -417451 -520177 -638007 -517877 -108243
9313 -108243 1769 -203067 -526233 -562053 -220065 -154733 138208 430727 716672 604883
9303 604883 488736 257417 -268805 -191529 3258 -232174 -220834 -74368 41630 11917
9293 11917 -488707 -780595 -780471 -610172 -126578 258982 625541 908174 794910 549355
9283 549355 408788 122843 -563554 -1318223 -1275411 -746192 -648715 -281256 419884 692383
9273 692383 449577 40764 -413871 -632713 -382570 -60695 -49694 -70085 -64960 -549066
9263 -549066 -859653 -617429 -263697 -680029 -1156645 -941220 -659911 -516037 -361594 -847152
9253 -847152 -1240742 -821541 -481230 -491893 -515575 -756742 -885432 -889240 -932267 -961020 -1059850
9242 -1059850 -1074229 -912372 -767241 -715679 -807455 -967716 -1274746 -1392173 -1507266 -1522525
9232 -1522525 -1056931 -1170982 -1378647 -1437054 -1718668 -2011132 -1721098 -1584431 -1242004 -650563
9222 -650563 -944712 -1427123 -1441640 -956306 -51906 405683 -52785 -480044 -398547 109517
9212 109517 227474 -64880 -367722 -378941 -217195 -249567 -118140 -161687 -207857 -525238
9202 -525238 -604069 -428069 -560722 -989743 -947788 -793541 -729688 -441912 -35287 222132
9192 222132 237610 355725 -160058 -620595 -761345 -445704 -50946 -6540 -39297 69052
9182 69052 148236 -115532 -645539 -746469 -757183 -772418 -906313 -1137702 -1362956 -1118239
9172 -1118239 -656732 -527978 -738256 -1009638 -1062578 -1164962 -1265353 -1162540 -888761 -758913
9162 -758913 -723432 -1035736 -1108102 -720400 -253811 -60268 -328019 -942783 -1342138 -1616663
9152 -1616663 -1875785 -1581906 -1508684 -1538725 -1237825 -1294905 -1352516 -1289654 -1169920 -1108430 -917948
9141 -917948 -654516 -6299 145559 -437604 -942821 -1031017 -725148 -701475 -772274 -696874
9131 -696874 -748000 -523649 -439251 -628032 -632224 -357137 -363629 -745417 -718969 -761134 -1059062
9120 -1059062 -1148172 -943099 -801136 -812182 -603439 -409955 -470270 -324739 -336535 -597005
9110 -597005 -1047583 -1128073 -558901 -238632 -143130 -149234 66834 -80831 -185658 -93736 118026
9099 118026 200787 392490 160993 -394342 -875570 -1266511 -1143936 -1040108 -899162 -326348
9089 -326348 -133605 -319318 -354940 -313073 -226314 -188347 -361555 -403747 -322489 -469291 -632727
9078 -632727 -820843 -570298 -42646 -10971 -134467 -558265 -966774 -1057316 -1136444 -1111067
9068 -1111067 -1089629 -863712 -377238 -364565 -599611 -850961 -904049 -816968 -1050800 -977149
9058 -977149 -1118128 -1150491 -1095621 -842114 -406389 -107216 -94487 188343 633852 412431
9048 412431 -88706 -308944 -545257 -645208 -815838 -964481 -1071599 -917017 -846865 -941801
9038 -941801 -895692 -574440 27604 190535 21514 -189664 -30111 161158 102009 70001
9028 70001 28387 -336705 -613237 -744642 -561973 177066 756454 534336 170976 1217
9018 1217 -155022 -579555 -1256386 -1100003 -296070 395430 666271 791316 590018 465026
9008 465026 844213 1240755 1123516 833416 747655 790383 536241 20223 -43276 236908
8998 236908 317663 371188 384053 387109 270483 111788 179992 86524 -315485 -876509 -1069184
8987 -1069184 -1250324 -1393486 -1462960 -1176807 -825055 -697195 -404982 -448338 -856315 -1049945
8977 -1049945 -756254 -699887 -1019672 -1220394 -1438432 -1184301 -1020345 -1095167 -694958 -523021
8967 -523021 -1016238 -1053872 -777413 -676790 -802001 -527166 -264384 -639498 -1023418 -615616
8957 -615616 -169469 -360306 -239095 14897 -35154 -175060 -607661 -1099735 -737107 -37346
8947 -37346 -10315 -352752 -410374 -278007 -233525 -346835 -189185 99613 87461 22527 -145492
8936 -145492 594 308685 177318 -86402 -109755 111970 413737 393382 -201058 -990777
8926 -990777 -1319625 -1196799 -1036375 -900686 -915414 -1063194 -1134457 -1107883 -1412183 -1366814
8916 -1366814 -1193454 -1099355 -1172394 -831008 50233 432923 363587 375221 533853 151409
8906 151409 201120 358629 229851 132763 -42464 -177943 -545278 -1085738 -984749 -616197
8896 -616197 -370976 -264104 -534640 -1225207 -1371769 -1175392 -865783 -530794 -607601 -961514
8886 -961514 -669774 -358114 -435522 -750783 -1056770 -1190832 -1271257 -1355930 -1155432 -752855
8876 -752855 -553954 -723241 -888845 -1147225 -1367146 -1438248 -1574395 -1610502 -1231530 -679742
8866 -679742 -344448 -119582 -352021 -695275 -704766 -824576 -1053407 -884471 -1052495 -1121938
8856 -1121938 -1009808 -929346 -853432 -894287 -1335116 -1424126 -1246089 -774634 -416972 -697977
8846 -697977 -1246508 -1489058 -1318640 -1005878 -894156 -1039925 -1261378 -1118099 -740663 -723331
8836 -723331 -824923 -1152210 -1747287 -1885416 -1927522 -1851640 -1798145 -1690095 -1596402 -1490087
8826 -1490087 -1416889 -1405419 -1245169 -1240709 -1425588 -1173529 -647144 -459927 -536825 -472790 -270376
8815 -270376 156054 283198 -310377 -550704 -423795 -46779 339410 489985 335839 -67489
8805 -67489 -569665 -1069800 -1256949 -1459265 -1725493 -1498473 -1044183 -1065944 -1041680 -1005069
8795 -1005069 -1124455 -1084049 -1030906 -948987 -469923 -209309 -101833 167042 373238 716969
8785 716969 673879 453727 434275 318758 -94554 -774346 -763009 -145848 -42355 -366838
8775 -366838 -654159 -389832 155380 85800 -172049 217042 664487 654380 479366 499812
8765 499812 532851 618204 579696 54197 -639614 -905416 -704479 -534727 -189577 187326
8755 187326 513782 451840 416742 349424 490167 624125 121541 -180357 -635890 -925736
8745 -925736 -892718 -853476 -795406 -505226 -20376 -64401 -274548 -159937 81630 -15701 -421948
8734 -421948 -689540 -699602 -949149 -888583 -190673 111931 -310795 -514450 -634136 -985063
8724 -985063 -1216215 -1152828 -1066796 -940273 -488384 -449094 -759405 -808922 -531292 -784116
8714 -784116 -1318489 -1440603 -1604822 -1609649 -1461343 -1393284 -1150164 -737396 -664648 -606342 -423238
8703 -423238 -404847 -771249 -1077502 -976751 -649404 -509947 -660617 -1018759 -1474521 -2033668
8693 -2033668 -1946470 -1327364 -1020041 -925342 -1202323 -1272372 -942143 -538769 -285371 17624
8683 17624 -40335 -191710 -133438 -151770 -196718 -294738 -766198 -1226455 -1305502 -1594254 -1443098
8672 -1443098 -891750 -492535 -483508 -594798 29501 922723 1319745 1200523 1078806 664059
8662 664059 -12462 -814538 -1465811 -1706842 -1302763 -1097673 -1354519 -1163522 -1269444 -2007916
8652 -2007916 -2507449 -2426478 -1840140 -1284364 -1122072 -764860 -572056 -393544 -97014 -299328
8642 -299328 -582528 -650617 -828166 -1347369 -1752951 -1531489 -1033942 -523509 -336790 -76622
8632 -76622 77692 -227051 -139448 107666 -1860 -50822 105862 408059 531698 306342
8622 306342 251787 283254 116498 -322444 -779097 -650715 -230258 -284505 -226293 -211490 -284821
8611 -284821 -131458 -228280 -353902 -745543 -1059118 -1075854 -786104 -524078 -478517 -349254
8601 -349254 -178998 -321580 -599941 -923752 -1186458 -996842 -411030 134399 511025 732004
8591 732004 927045 950012 541965 249371 122455 208246 76234 108581 368012 277005
8581 277005 303656 448833 364191 551887 781669 910955 835342 866755 580115 560391 301872
8570 301872 -405745 -775111 -1052466 -1266577 -856985 -523043 -839727 -1264159 -738366 -294545
8560 -294545 37805 363823 25731 -238953 -392937 -458486 -270013 -71162 -67507 293566
8550 293566 536355 389042 69470 -97435 -203287 -622176 -592726 -55271 183640 461940
8540 461940 676374 709407 302434 -429098 -975775 -1100922 -1006490 -852498 -382123 -127553
8530 -127553 17885 -266215 -735634 -822496 -397310 -168741 -473346 -692176 -935628 -1070624
8520 -1070624 -1415352 -1875034 -1663159 -1269670 -1222822 -1202087 -1094592 -763629 -557194 -634298
8510 -634298 -654304 -84094 278005 74971 -499020 -663447 -584866 -418358 -415979 -192164
8500 -192164 -111085 -635032 -1002067 -919829 -660615 -385388 330267 814445 910859 692704
8490 692704 452164 722113 967100 1069869 806256 514009 323614 46282 -346766 -549256
8480 -549256 -474018 -301796 -659238 -795750 -282812 -315746 -686454 -565946 -366446 -451232
8470 -451232 -718775 -1021287 -624789 -459963 -826320 -938226 -595019 -550995 -919516 -1015225
8460 -1015225 -1327341 -1642758 -1402011 -1073811 -615325 -446752 -629490 -821644 -919043 -995701
8450 -995701 -1137660 -1046292 -818663 -546759 -332336 -209047 89271 499237 679093 360143
8440 360143 25145 -68272 -248571 -746637 -1074883 -831642 -603515 -399092 -92167 -470400
8430 -470400 -830480 -708089 -459831 -822126 -1513608 -1571570 -1608838 -1477591 -937734 -459169
8420 -459169 -62296 -167252 -126704 -173707 -599748 -1218686 -1572821 -1418631 -1765585 -1834944
8410 -1834944 -1380551 -1368840 -1321424 -1117907 -1122661 -905559 -690057 -568865 -587900 -869474
8400 -869474 -1108035 -1196539 -964949 -625784 -496505 -167203 -156027 -365559 -294688 -22927
8390 -22927 -114746 -439654 -764467 -737842 -739351 -595336 -17356 695841 828707 430232 84745
8379 84745 -282021 -736286 -1067363 -786152 -477663 -382641 -243336 -394065 -579912 -614621
8369 -614621 -663017 -949245 -1240650 -913711 -572122 -494410 -130053 -107160 -647666 -862353
8359 -862353 -956348 -820663 -876521 -875498 -395552 -171919 -130039 -173834 -229553 320547 1040220
8348 1040220 1376682 1023762 504293 468647 460710 172360 -155343 -152519 -226579 -457684 -748341
8337 -748341 -1017423 -866989 -1346865 -1676971 -1358695 -961283 -808966 -880538 -887065 -804837
8327 -804837 -400852 3163 208191 -372920 -841770 -629808 -150605 194206 216341 83713
8317 83713 -179656 -44465 68443 101544 392524 811860 1185762 1086277 840633 580319
8307 580319 151652 -248195 -411347 -183428 -190640 -644149 -1225816 -1390359 -1335108 -1118273
8297 -1118273 -578654 -499904 -609840 -6057 403676 403609 414094 461714 573601 1053615 829637
8286 829637 379374 259152 86377 26366 282093 275350 -152704 -946945 -1708797 -1839509
8276 -1839509 -1326053 -611389 -438901 -523342 -757943 -463877 -184475 -11873 -181351 -780686
8266 -780686 -854101 -708813 -636121 -686492 -576532 -334307 -178350 154189 924325 1380335
8256 1380335 1056425 988915 1385679 1307521 963409 755127 649478 355130 -37119 -247723
8246 -247723 -289755 -369042 -758844 -850858 -658320 -462887 -546227 -382678 -144642 -83059 -496554
8235 -496554 -524542 -184296 124409 320574 290884 291710 148300 36513 -62190 -643364 -1307176
8224 -1307176 -1358447 -1086564 -924784 -1046383 -1228213 -1331602 -1364093 -1264648 -760369 -591217
8214 -591217 -614156 -762966 -1055122 -837346 -454524 -237056 -137018 -309574 -857167 -1011751
8204 -1011751 -795504 -818097 -513899 74672 304767 77054 -568069 -780552 -381062 -136767
8194 -136767 -292221 -617348 -837807 -979607 -1152168 -1338420 -1524058 -1291201 -787562 -921586
8184 -921586 -859685 -249247 -163185 -514968 -602971 -574772 -505064 -483408 -476931 -381851 -164133
8173 -164133 265298 271176 372351 336500 258689 145522 375429 195842 -222120 49177
8163 49177 80915 -76618 -196732 -340339 -278510 -212639 -312887 -489317 -87231 263971
8153 263971 361265 308566 55223 -178119 -249674 -34885 444616 647867 651592 413657 219460
8142 219460 196922 30491 167800 571918 956253 663051 306608 531394 813610 719885
8132 719885 596500 67592 -220189 60484 322281 461079 154748 -280713 -468001 -279685
8122 -279685 -65487 -135879 -288028 -223303 -184293 -469553 -566836 -545277 -1007657 -1329892 -1113042
8111 -1113042 -489094 -110572 -95249 -282729 -819124 -890745 -614191 -276505 166224 222765
8101 222765 -315219 -532056 -218010 -70664 -245427 -672529 -879377 -534201 -154079 -24314
8091 -24314 110580 449660 620611 581888 223079 37717 -297062 -461046 -272265 -199269
8081 -199269 -104059 -327210 -597625 -555839 -95517 -214144 -808912 -1321500 -1251246 -1051276
8071 -1051276 -979529 -928375 -1050141 -1279128 -1525929 -1686415 -1237254 -341122 -245579 -538585
8061 -538585 -587096 -354146 -158707 -241070 -162579 249333 339549 -71936 -209527 -44693
8051 -44693 -215687 -183500 -200970 -650486 -1143169 -1162185 -858869 -848085 -996662 -1101259 -1260793
8040 -1260793 -1107459 -1213337 -1398599 -1561882 -1390871 -956956 -746498 -498016 -113714 412128
8030 412128 588923 320756 -137580 -135429 -260487 -313330 86401 146294 -495417 -791947
8020 -791947 -569488 -732879 -867623 -210083 576183 810168 968389 733079 281869 55068
8010 55068 -172819 -281996 -557396 -448693 19883 292652 -229907 -344357 -242556 -543157
8000 -543157 -890662 -918261 -312069 37639 37954 243159 256578 35587 -438332 -622211 -448256
7989 -448256 -641825 -736297 -261618 132071 65497 216427 392731 38993 -672151 -933728
7979 -933728 -539325 18765 68990 27026 -292625 -789907 -1342516 -1937547 -1723237 -1586595
7969 -1586595 -1624485 -1248473 -932668 -785221 -780325 -751047 -866993 -989627 -792760 -378525
7959 -378525 94456 272091 255039 96740 70880 310402 458476 72413 -261842 -267646
7949 -267646 -393175 -1063282 -1792123 -1992507 -1579887 -684173 -363337 -632464 -784027 -202664
7939 -202664 -90723 -227105 -412729 -465372 -252154 -318548 -595173 -756112 -1008660 -1192757
7929 -1192757 -980049 -502596 149293 582743 465731 263452 -44690 -338388 -432290 -328336
$$ [...]
##END NTUPLES=NMR SPECTRUM
##END=
