##TITLE=C13_SA_61.237
 CDCl3, 21500 sc

 21.12.2020
##JCAMPDX= 6.0         $$ Bruker NMR JCAMP-DX V2.0
##DATA TYPE= NMR SPECTRUM
##DATA CLASS= NTUPLES
##ORIGIN= UXNMR, Bruker Analytische Messtechnik GmbH
##OWNER= root
$$ XWIN-NMR		Version 3.5
$$ Tue Dec 22 10:12:03 2020 Russian Standard Time (UT+4h)  she@DPX200
##.OBSERVE FREQUENCY= 50.327896
##.OBSERVE NUCLEUS= ^13C
##.ACQUISITION MODE= SIMULTANEOUS
##.ACQUISITION SCHEME= undefined
##.AVERAGES= 21500
##.DIGITISER RES= 17
##SPECTROMETER/DATA SYSTEM= spect
##.PULSE SEQUENCE= zgpg30
##.SOLVENT NAME= Pyr
##.SHIFT REFERENCE= (INTERNAL, Pyr, 0, 222.661)
##AUDIT TRAIL= $$ (NUMBER, WHEN, WHO, WHERE, WHAT)
$$ ##TITLE= Audit trail, XWIN-NMR		Version 3.5
$$ ##JCAMPDX= 5.01
$$ ##ORIGIN= Bruker BioSpin GmbH
$$ ##OWNER= she
$$ F:/spectra/data/she/nmr/c13/1/pdata/1/auditp.txt
$$ ##AUDIT TRAIL=  $$ (NUMBER, WHEN, WHO, WHERE, WHAT)
(   1,<2020-12-22 10:10:30.78 +0400>,<she>,<DPX200>,
      <created by zg, POWCHK disabled, PULCHK disabled
       terminated by command 'halt'
       configuration hash MD5:
       00 E9 B6 7A A2 85 ED C7 34 08 36 98 17 FE 4E 26
       data hash MD5: 32K
       D9 47 2A 6C C3 87 31 27 75 59 AB C3 95 E2 BC 76>)
(   2,<2020-12-22 10:10:37.35 +0400>,<she>,<DPX200>,
      <Start of raw data processing
       efp BC_mod = 2 LB = 1 FT_mod = 6 PKNL = 1 PHC0 = -283.1096 PHC1 = 37.76242 SI = 32K 
       data hash MD5: 32K
       DF B6 1F 8F 83 6E A7 33 51 1C B5 2E FC 56 1D 2A>)
(   3,<2020-12-22 10:10:45.53 +0400>,<she>,<DPX200>,
      <abs ABSG = 5 
       data hash MD5: 32K
       70 B2 BF 86 C5 C5 A3 32 B8 FF 63 DA 1A 77 42 0F>)
(   4,<2020-12-22 10:11:12.59 +0400>,<she>,<DPX200>,
      <pk PHC0 = -1.328631 PHC1 = -0.3999998 
       data hash MD5: 32K
       E2 DE 09 0B 3E C1 79 02 A1 40 F2 E9 47 6D 4C 2E>)
(   5,<2020-12-22 10:11:16.18 +0400>,<she>,<DPX200>,
      <abs ABSG = 5 
       data hash MD5: 32K
       4F 6D 27 3D 4A ED D8 89 16 52 E3 EC 11 5F FC 2B>)
$$ ##END=
$$ 
$$ hash MD5
$$ 23 92 17 55 18 18 5E 9D 30 87 61 C6 D5 AF 9D 72
##$RELAX= 
##$RELAX= 
##$RELAX= 
##$RELAX= 
##$RELAX= 
##$RELAX= 
##$RELAX= 
##$RELAX= 
$$ Bruker specific parameters
$$ --------------------------
##$DU= <F:/spectra>
##$EXPNO= 1
##$NAME= <c13>
##$PROCNO= 1
##$TYPE= <nmr>
##$USER= <she>
##$AMP= (0..31)
100 100 100 100 100 100 100 100 100 100 100 100 100 100 100 100 100 100 
100 100 100 100 100 100 100 100 100 100 100 100 100 100 
##$AQSEQ= 0
##$AQ_mod= 1
##$AUNM= <au_zg>
##$AUTOPOS= <>
##$BF1= 50.322709
##$BF2= 200.13
##$BF3= 50.322709
##$BF4= 500.13
##$BF5= 500.13
##$BF6= 500.13
##$BF7= 500.13
##$BF8= 500.13
##$BYTORDA= 1
##$CFDGTYP= 0
##$CFRGTYP= 5
##$CHEMSTR= <none>
##$CNST= (0..31)
1 1 145 1 1 1 1 1 1 1 1 1 1 1 1 1 1 1 1 1 1 1 1 1 1 1 1 1 1 1 1 1 
##$CPDPRG= <waltz16>
##$CPDPRG1= <>
##$CPDPRG2= <waltz16>
##$CPDPRG3= <>
##$CPDPRG4= <mlev>
##$CPDPRG5= <mlev>
##$CPDPRG6= <mlev>
##$CPDPRG7= <mlev>
##$CPDPRG8= <mlev>
##$CPDPRGB= <>
##$CPDPRGT= <>
##$D= (0..31)
$$ [...]
##$SUBNAM4= <"">
##$SUBNAM5= <"">
##$SUBNAM6= <"">
##$SUBNAM7= <"">
##$SUBNAM8= <"">
##$SUBNAM9= <"">
##$SW= 239.972175391363
##$SWIBOX= (0..15)
0 1 3 0 0 0 0 0 0 0 0 0 0 0 0 0 
##$SW_h= 12077.2946859903
##$TD= 32768
##$TD0= 1
##$TE= 0
##$TE2= 300
##$TE3= 300
##$TEG= 300
##$TL= (0..7)
120 120 120 120 120 120 120 120 
##$TP= (0..7)
150 150 150 150 150 150 150 150 
##$TP07= 0
##$TPNAME0= <>
##$TPNAME1= <>
##$TPNAME2= <>
##$TPNAME3= <>
##$TPNAME4= <>
##$TPNAME5= <>
##$TPNAME6= <>
##$TPNAME7= <>
##$TPOAL= (0..7)
0.5 0.5 0.5 0.5 0.5 0.5 0.5 0.5 
##$TPOFFS= (0..7)
0 0 0 0 0 0 0 0 
##$TUNHIN= 0
##$TUNHOUT= 0
##$TUNXOUT= 0
##$USERA1= <user>
##$USERA2= <user>
##$USERA3= <user>
##$USERA4= <user>
##$USERA5= <user>
##$V9= 5
##$VALIST= <valist>
##$VCLIST= <CCCCCCCCCCCCCCC>
##$VD= 0
##$VDLIST= <DDDDDDDDDDDDDDD>
##$VPLIST= <PPPPPPPPPPPPPPP>
##$VTLIST= <TTTTTTTTTTTTTTT>
##$WBST= 1024
##$WBSW= 4
##$XGAIN= (0..3)
0 0 0 0 
##$XL= 0
##$YL= 0
##$YMAX_a= 133212252
##$YMIN_a= -59626950
##$ZGOPTNS= <>
##$ZL1= 120
##$ZL2= 120
##$ZL3= 120
##$ZL4= 120
##$ABSF1= 222.6606
##$ABSF2= -17.33621
##$ABSG= 5
##$ABSL= 3
##$ALPHA= 0
##$AQORDER= 0
##$ASSFAC= 0
##$ASSFACI= 0
##$ASSFACX= 0
##$ASSWID= 0
##$AUNMP= <proc_1d>
##$AZFE= 0.1
##$AZFW= 0.5
##$BCFW= 0
##$BC_mod= 2
##$BYTORDP= 0
##$COROFFS= 0
##$CY= -3
##$DATMOD= 1
##$DC= 0
##$DFILT= <>
##$DTYPP= 0
##$F1P= 0
##$F2P= 0
##$FCOR= 0.5
##$FTSIZE= 32768
##$FT_mod= 6
##$GAMMA= 0
##$GB= 0
##$INTBC= 1
##$INTSCL= 4.134877e-10
##$ISEN= 128
##$LB= 1
##$LEV0= 0
##$LPBIN= 0
##$MAXI= 10000
##$MC2= 0
##$MEAN= 0
##$ME_mod= 0
##$MI= 0.1934396
##$NCOEF= 0
##$NC_proc= 2
##$NLEV= 6
##$NOISF1= 120.0001
##$NOISF2= 80.00006
##$NSP= 0
##$NTH_PI= 0
##$NZP= 0
##$OFFSET= 222.6606
##$PC= 1.4
##$PHC0= -284.4382
##$PHC1= 37.36242
##$PH_mod= 1
##$PKNL= yes
##$PPARMOD= 0
##$PSCAL= 0
##$PSIGN= 0
##$REVERSE= no
##$SF= 50.322729756361
##$SI= 32768
##$SIGF1= 140
##$SIGF2= 120
##$SINO= 11.81781
##$SIOLD= 32768
##$SREGLST= <13C.CDCl3>
##$SSB= 0
##$STSI= 32768
##$STSR= 0
##$SW_p= 12077.2946859903
##$SYMM= 0
##$S_DEV= 0
##$TDeff= 32768
##$TDoff= 0
##$TI= <>
##$TILT= no
##$TM1= 0
##$TM2= 0
##$TOPLEV= 0
##$USERP1= <user>
##$USERP2= <user>
##$USERP3= <user>
##$USERP4= <user>
##$USERP5= <user>
##$WDW= 1
##$XDIM= 32768
##$YMAX_p= 481369818
##$YMIN_p= -2244000
$$ End of Bruker specific parameters
$$ ---------------------------------
##NTUPLES= NMR SPECTRUM
##VAR_NAME=  FREQUENCY,     SPECTRUM/REAL,   SPECTRUM/IMAG
##SYMBOL=    X,             R,               I
##VAR_TYPE=  INDEPENDENT,   DEPENDENT,       DEPENDENT
##VAR_FORM=  AFFN,          ASDF,            ASDF
##VAR_DIM=   32768,         32768,           32768
##UNITS=     HZ,            ARBITRARY UNITS, ARBITRARY UNITS
##FACTOR=    0.368581032318806, 1,           1
##FIRST=     11204.8891385315, 0,            0
##LAST=      -872.405547458802, 0,           0
##MIN=       -872.405547458802, -2244000,    0
##MAX=       11204.8891385315, 481369818,    0
$$ Real data points
##PAGE= N=1
##DATA TABLE= (X++(R..R)), XYDATA
$$ [...]
15847B73919l0314L00551L9526p2080j52182j77677J64563K74849m61028m15331
$$ 273919 243605 544156 583682 511602 359420 181743 346306 621155 160127 -255204
15837b55204L25692m2073m51922L77840P10038J45630m0594j73262l82488l75731
$$ -255204 70488 28415 -423507 -45667 664371 810001 769407 596145 213657 -162074
15827a62074m2022j34177l07319k26432L6957K04827L34104J29400o24665n56648
$$ -162074 -204096 -338273 -645592 -872024 -835067 -630240 -296136 -166736 -791401 -1348049
15817a348049M8006K80690K13421q5962K58534J89490j47513l19679k18301K14054
$$ -1348049 -1300043 -1019353 -805932 -891894 -633360 -443870 -591383 -911062 -1129363 -915309
15807i15309R3964J18092L32952Q9143P0997k08090k42306o4124K5635q2197K0612
$$ -915309 -821345 -703253 -370301 -281158 -210161 -418251 -660557 -724681 -699046 -781243 -760631
15796g60631O70871N20645j13582k29328O1406l6318k86147N334l2227o9014k62573
$$ -760631 -89760 430885 317303 87975 149381 113063 -173084 -167750 -199977 -268991 -531564
15785e31564J71791K76423k67738O9048p5519k21183K40967J84910k60079l84443
$$ -531564 -359773 -83350 -351088 -282040 -357559 -578742 -337775 -152865 -412944 -797387
15775g97387J0382K15449m27849p38035k20182N10558L43267M33434M79833K80498
$$ -797387 -787005 -571556 -999405 -1737440 -1957622 -1447064 -1103797 -670363 -190530 89968
15765H9968K14701l05436p47510k97339J87099l5490J97466P06754M8316l12972
$$ 89968 304669 -767 -748277 -1045616 -858517 -894007 -696541 10213 58529 -254443
15755b54443j80810O8715R4085J74147K48030J30350J49437L975L8198k14610
$$ -254443 -435253 -366538 -272453 -98306 149724 280074 429511 433486 471684 257074
15745B57074p10380m99745J92185j46602k62806K36724N59355M35626L58948K1357
$$ 257074 -453306 -953051 -760866 -907468 -1170274 -933550 -374195 61431 420379 441736
15735D41736j08543k84742J9691R8937o60119m48810J08018M14119M59393J55072
$$ 441736 333193 48451 68142 167079 -493040 -941850 -833832 -419713 39680 194752
15725A94752j28077r3552R9598J2536J30277K31409J27790r8773k24638J65017
$$ 194752 66675 -26877 72721 85257 215534 446943 574733 475960 251322 416339
15715D16339J19529o22655r37180n34070J4671O72271R37166O50317L82995J48314
$$ 416339 535868 -86787 -1023967 -1558037 -1543366 -871095 66071 716388 1099383 1247697
15705A247697j56065o93140n37469K30581O71096N72364k03086q7307P3015m73334
$$ 1247697 1091632 398492 -138977 91604 762700 1335064 1131978 1044671 1117686 644352
15695F44352j45046J54252K14706L33752l16368o35699k21616k90251p63257k45393
$$ 644352 499306 653558 868264 1202016 885648 249949 28333 -261918 -1025175 -1270568
15685a270568L61406K28516J58738J49194L38618L40901j40115k99316j37692
$$ -1270568 -909162 -680646 -521908 -372714 -34096 306805 166690 -132626 -270318
15676b70318k28864k22188J12807m15831p38839Q3348O11226N31440L51574K78636
$$ -270318 -499182 -721370 -608563 -1024394 -1763233 -1679885 -1068659 -537219 -185645 92991
15666I2991j26098k76428k84030o4007l5475q7658J57915N36531N88017K28012
$$ 92991 -33107 -309535 -593565 -657572 -693047 -780705 -622790 -86259 501758 729770
15656G29770j31175k22084j62390j47785j74838l86457j99491Q6915K14536K20491
$$ 729770 598595 376511 214121 66336 -108502 -494959 -694450 -607535 -392999 -172508
15646a72508L56861J93778l88299o6576K78979K17389K5767j21642m33381l81887
$$ -172508 184353 378131 -10168 -76744 202235 419624 445391 323749 -109632 -491519
15636d91519L1334L94481K51513J8982j94454k15085K04823j48308n6041L03161
$$ -491519 -460185 -65704 185809 204791 10337 -204748 75 -148233 -204274 98887
15626I8887L39005M0158o00922p29892J50314L33046L60602J81199M9002P0031
$$ 98887 437892 478050 -122872 -852764 -702450 -369404 -8802 172397 221399 291430
15616B91430M0614J12686l50198j47995Q023l14401k53066r609J90673K24159
$$ 291430 332044 444730 94532 -53463 -45440 -359841 -612907 -622516 -431843 -207684
15606b07684l18878k99246j3715J14372M75543O29417K05785k81754j09625J28457
$$ -207684 -526562 -825808 -839523 -725151 -249608 379809 585594 303840 194215 322672
15596C22672R6630K6663k1752j03026k79172J07603M06058K74058J78512j62151
$$ 322672 419302 445965 424213 321187 42015 149618 555676 829734 1008246 846095
15586H46095j16807P3463j14444m28902k60821J01632J1260N2307N0164k62417
$$ 846095 729288 802751 688307 259405 -1416 100216 111476 163783 213947 -48470
15576d8470M32018O89330j84867o81552k35459J38926Q8646K78260K03556L74069
$$ -48470 383548 1072878 888011 206459 -29000 109926 198572 476832 680388 1054457
15566A054457L57539j56251K2161M6363K25301J03013k25038k53575n01059l66221
$$ 1054457 1411996 1255745 1277906 1324269 1549570 1652583 1427545 1173970 672911 306690
15556C06690k67620l8539L412J4612l03812j51427L57146O3102j9359l19535l70149
$$ 306690 39070 531 3943 18555 -285257 -436684 -79538 -16436 -35795 -355330 -725479
15545g25479O8457O4459k60592o6721K02876Q0850l72188L3453N64541O06544
$$ -725479 -657022 -592563 -853155 -919876 -717000 -636150 -1008338 -974885 -410344 196200
15535A96200J34236j72528j72996k34198j58939J24691Q5545K99863L15413j03052
$$ 196200 330436 157908 -15088 -249286 -408225 -283534 -197989 101874 417287 314235
15525C14235k20701o7060R609M69460N12556j07243n23138l88841j00913j6742
$$ 314235 93534 26474 36083 505543 1018099 910856 387718 -1123 -102036 -118778
15515a18778r4226m9842Q1886j61631k74838N1431L8303J25117L57664K32504
$$ -118778 -213004 -262846 -180960 -342591 -617429 -565998 -527695 -402578 -44914 187590
15505A87590K47891n5945l80013k33770m2848K64013J47694k25016l5445l10116
$$ 187590 435481 379536 -477 -234247 -277095 -13082 134612 -90404 -125849 -435965
15495d35965m33726L12333N02292J30860L56558K39120K8939j01350Q0320J09729
$$ -435965 -869691 -557358 -55066 75794 432352 671472 700411 599061 679381 789110
15485G89110o9948k30918l97637j61161j24494j38750O2095L58219j01273l42315
$$ 789110 719162 488244 90607 -70554 -195048 -333798 -271703 86516 -14757 -357072
15475c57072p5839J14860k1802j91706k0296M42734K39036k93886k23813l69105
$$ -357072 -432911 -318051 -339853 -531559 -551855 -109121 129915 -163971 -387784 -756889
15465g56889k10514m3868L65023J00362Q8562K96188K07778J60683l3869J01524
$$ -756889 -967403 -1011271 -646248 -545886 -457324 -161136 46642 207325 173456 274980
15455B74980J2129l25875m88919k89461L45371J14792k30607j36554K25523K86312
$$ 274980 287109 -38766 -527685 -817146 -471775 -356983 -587590 -724144 -498621 -212309
15445b12309J80117K99340n06974l33946O3359J26502J07720k66287k24850L05755
$$ -212309 -32192 267148 -239826 -573772 -510413 -383911 -276191 -542478 -767328 -461573
15435d61573P62808L81607o9168k16705m9034M42879M78280k54505q94711o20603
$$ -461573 301235 682842 613674 396969 347935 790814 1269094 1014589 119878 -500725
15425e00725l48172j89048K19917O14685O02364l34349o79372j33600j6906j8683
$$ -500725 -848897 -1037945 -818028 -203343 399021 64672 -614700 -748300 -765206 -783889
15415g83889O3762K10558K82492M2856M180K00512M39564N82697p6186m02521
$$ -783889 -720127 -509569 -227077 -184221 -180041 20471 460035 1042732 966546 564025
15405E64025J74605j88047n5128L01379M0999o14493k39100K16133N1955J0885
$$ 564025 738630 550583 495455 796834 837833 223340 -15760 200373 252328 263213
15395B63213l36272k07653j07363j29415J03335K45500K87826R8364j46767l63748
$$ 263213 -73059 -280712 -388075 -517490 -414155 -168655 119171 217535 70768 -292980
15385b92980m22437q3199J4801L10482L74578K5307n23343o69591k85962m9886
$$ -292980 -715417 -798616 -783815 -473333 -98755 -73448 -596791 -1266382 -1552344 -1602230
15375a602230Q6799J15864J07005J03976J75515L11167L17246M23783K32883J71886
$$ -1602230 -1515431 -1399567 -1292562 -1188586 -1013071 -701904 -384658 39125 272008 443894
15365D43894K26034N4391m92372k79653O7437r9562j85364k33832l3730J04092
$$ 443894 669928 724319 231947 -47706 19731 -79831 -265195 -499027 -532757 -428665
15355d28665L35661K79827L16396J2524r7017j06168k57481k35995K43228L74505
$$ -428665 -93004 186823 503219 515743 418726 312558 55077 -180918 62310 436815
15345D36815j18990r5341K9654m7291k61295j17655j42011n2474l15868l89476
$$ 436815 317825 222484 252138 204847 -56448 -174103 -316114 -368588 -684456 -1073932
15335a073932m6207J10681j8510K9887L09794q5955k13734m0154M86385L54548
$$ -1073932 -1120139 -1009458 -1027968 -998081 -688287 -774242 -987976 -1028130 -541745 -187197
15325a87197l1028K68753K01314J71816P3005n44686l97968R0919K24153L64880
$$ -187197 -218225 50528 251842 423658 496663 -48023 -445991 -355072 -130919 233961
15315B33961N33019N9360j58433O6228k55520l42614j44762m0537L31693M1791
$$ 233961 766980 826340 667907 734135 478615 136001 -8761 -49298 282395 324186
15305C24186l29486m28779k26280L2548j41750j41564M05055N21803L03250m1000
$$ 324186 -5300 -434079 -660359 -627811 -769561 -911125 -506070 15733 318983 277983
15295B77983k76922Q3959L4536l28035m59483K6270L6174N7686K01331M4860L70151
$$ 277983 1061 85020 119556 -208479 -667962 -641692 -605518 -547832 -346501 -301641 68510
15284F8510l0579k14096R2511M12533L42927M0533l98094j25161q619k61038J9309
$$ 68510 37931 -176165 -83654 328879 671806 712339 314245 189084 180465 -80573 -61264
15273f1264K35142p6877m87069k87047l16787L29413M15516p5808j73409j97157
$$ -61264 173878 97001 -390068 -677115 -993902 -664489 -248973 -324781 -498190 -695347
15263f95347K94045L94554l09463k78952R6082L25544L55624K28267q9720m75025
$$ -695347 -401302 -6748 -316211 -595163 -499081 -173537 182087 410354 320634 -154391
15253a54391j90159J37875k9489K31527O31100M9831j81501L3871P8641K10695
$$ -154391 -344550 -206675 -236164 -4637 626463 676294 494793 528664 607305 818000
15243H18000j01982j23660P4525k08864k50169m74905J56075L79037q5346j96647
$$ 818000 716018 592358 666883 458019 207850 -267055 -110980 268057 182711 -13936
15233a3936j21066R526j03295k98063l11658n6962L14209K56333L57621K61938
$$ -13936 -135002 -125476 -228771 -526834 -838492 -895454 -581245 -324912 32709 294647
15223B94647j10626k25492r19810q68220K41653L20127N41216O43030o7791Q337
$$ 294647 184021 -41471 -961281 -1829501 -1587848 -1267721 -726505 -83475 -151266 -142929
15213a42929j76112j08287J93761K36481K77333k25781l53256j49966k70047k83877
$$ -142929 -319041 -427328 -233567 2914 280247 54466 -298790 -448756 -718803 -1002680
15203a002680j46185j64430j08497M2246o1877J71642P43662N48206j17979N5969
$$ -1002680 -1148865 -1313295 -1421792 -1379546 -1441423 -1269781 -526119 22087 -95892 -39923
15193c9923P09580R89276N39975m26299r85148q74230n69702o00948M086L81259
$$ -39923 669657 1658933 2198908 1772609 787461 -86769 -656471 -1257419 -1253333 -872074
15183h72074K21420J88833l19012l63416k01608j34153L29810P30263M29084K00535
$$ -872074 -650654 -461821 -780833 -1144249 -1345857 -1480010 -1150200 -419937 9147 209682
15173B09682K25507K02428j63559M3623k40143l78827j25170M84525L10536p94
$$ 209682 435189 637617 474058 517681 277538 -101289 -226459 258066 568602 567808
15163E67808J61481J17973o1408P432k76269n08732p39459k34017R01537M49651
$$ 567808 729289 847262 785854 793286 517017 8285 -731174 -965191 -63654 385997
15153C85997j35536k990M64621K50937K843j47245m90669m05366j27491N03924
$$ 385997 250461 247471 712092 963029 965872 818627 327958 -77408 -204899 299025
15143B99025M37439J15548j31021o93835m29352m8662k38686j99465J56171K79966
$$ 299025 736464 852012 720991 27156 -402196 -450858 -689544 -889009 -732838 -452872
15133d52872J29237o2359n5018k79106L34983N82371L2555j4823L33589J93629
$$ -452872 -323635 -385994 -441012 -720118 -385135 197236 229791 214968 548557 742186
15123G42186Q8999P7326j49254n16068o6K00755j65501m5338j05161l92391j4085
$$ 742186 831185 908511 759257 243189 243123 443878 278377 233039 127878 -264513 -278598
15112b78598K27180l00845J09421k213P1084j46654m32386r5684L42479K37599
$$ -278598 -51418 -352263 -242842 -245055 -173971 -320625 -753011 -848695 -506216 -268617
15102b68617l08579l30463K65751K57203j62122n07323l3694P10873Q61841K39915
$$ -268617 -577196 -907659 -641908 -384705 -546827 -1054150 -1087844 -376971 484870 724785
15092G24785k47456n86073J10291N32749j4411l03971l34409O4277L9236j38475
$$ 724785 477329 -108744 1547 534296 519885 215914 -118495 -54218 -14982 -153457
15082a53457L66342K87170l38036o1920N75j91960m43250J0274L67780L51910
$$ -153457 212885 500055 162019 100099 100674 -91286 -534536 -524262 -156482 195428
15072A95428M13112K05963k72705k92111J84023N4834J2832J81504k1135J25038
$$ 195428 608540 814503 541798 249687 433710 488544 501376 682880 661745 786783
15062G86783m676J84265l1791k50861k78998j60038l76771j53620j5775j5738
$$ 786783 782107 966372 934581 683720 404722 244684 -132087 -285707 -301482 -317220
15052c17220O02606J09002j31633o3612N4095M07483K14573K90948Q22966J372972
$$ -317220 285386 394388 262755 199143 253238 660721 875294 1166242 1989208 3362180
15042C362180J383854J425027j6696j699033j831136j154425p76615j12587K05588
$$ 3362180 4746034 6171061 6154365 4455332 2624196 1469771 693156 580569 786157
15033G86157l42939m28677j39413j2382N0430m3039k91035l40805l71369M27768
$$ 786157 443218 14541 -124872 -137254 -86824 -129863 -420898 -761703 -1133072 -705304
15023g05304M93802J65564L20910L38563L49752J96715k97773l48835j70003l87932
$$ -705304 -211502 -45938 274972 613535 963287 1160002 862229 513394 343391 -44541
15013d4541m05416J60579M28806n2256k01290K07937R6041O2179K44468O1753
$$ -44541 -449957 -289378 139428 87172 -114118 93819 189860 252039 496507 558260
15003E58260J3552j37937j11171J14241K35840J04065j90645m06500l57388k2809
$$ 558260 571812 433875 322704 436945 672785 776850 586205 179705 -177683 -200492
14993b00492k2364O8158l600J18477J16482l30219m21249O7510J59085k67752
$$ -200492 -222856 -154698 -158298 -39821 76661 -253558 -674807 -607297 -448212 -715964
14983g15964l53983j22934Q6584K84569O69725M54153J85484j22976K3207M404
$$ -715964 -1069947 -1192881 -1106297 -821728 -152003 302150 487634 364658 387865 392269
14973C92269l00149N625M65064R0254m04404o71213n05609M78818K66641K32343
$$ 392269 92120 97745 562809 653063 248659 -422554 -928163 -449345 -182704 49639
14963D9639M14473M13224j57915n71747p15843m50040j70587J48773N52062P80066
$$ 49639 464112 877336 719421 147674 -568169 -1018209 -1188796 -1040023 -487961 292105
14953B92105L47973j46244j70649k90739M8878L7337m45690l08918P8292n6034
$$ 292105 640078 493834 323185 32446 81324 118661 -327029 -635947 -557655 -613689
14943f13689k2066K86074L64110K00832L37970K02882o449Q3702l16k71980n08205
$$ -613689 -635755 -349681 14429 215261 553231 756113 749664 833366 833050 561070 52865
14932E2865o47770k03164J49868M91770L59280m4604k30012j18201J2795n906
$$ 52865 -594905 -798069 -648201 -156431 202849 158245 -71767 -189968 -177173 -183079
14922a83079O4990P8672N0871p8653l52975l07812j42160j26284O6823L23688
$$ -183079 -118089 -39417 11454 -67199 -420174 -727986 -870146 -996430 -929607 -605919
14912f05919L37458k54762L29826M88209k43224n77567m61316l54J67201L53317
$$ -605919 -268461 -523223 -193397 294812 51588 -525979 -987295 -987649 -820448 -467131
14902d67131K22703p9761k65483O3909K55936J98472O2450J17375K38208J983
$$ -467131 -244428 -324189 -589672 -525763 -269827 -71355 -8905 108470 346678 348661
14892C48661k5545J5032Q4521n17535q80426m91248m2888K12783M88022J94881
$$ 348661 323116 338148 422669 -94866 -975292 -1466540 -1509428 -1296645 -808623 -613742
14882f13742K25688j26630j44941L14124K29107J19225J2935L7707J86657l04253
$$ -613742 -388054 -514684 -659625 -345501 -116394 2831 15766 53473 240130 -64123
14872f4123n85224m44804k75809J50883M33495J11920O1615L43809j36369n54089
$$ -64123 -649347 -1094151 -1369960 -1219077 -785582 -673662 -612047 -268238 -404607 -958696
14862i58696k35397K50579K86051L35374J79640J50896q9891k31294j1543n6974
$$ -958696 -1194093 -943514 -657463 -322089 -142449 8447 -81444 -312738 -324281 -381255
14852c81255K68240L05301j82930j60845k27714M0706N09905M12574N5254m43177
$$ -381255 -113015 192286 9356 -151489 -379203 -338497 171408 583982 639236 196059
14842A96059l54372n2532l56571l41159J88278L77367K20461L33442m4547m16485
$$ 196059 -158313 -210845 -567416 -908575 -720297 -342930 -122469 210973 166426 -250059
14832b50059j94552k15527j40745R8346L08964L18574L18258j24690o76376n37553
$$ -250059 -444611 -660138 -800883 -702537 -393573 -74999 243259 118569 -557807 -1095360
14822a095360J04033N99985K52805K808j53525l70775J71567L40344k3463K26055
$$ -1095360 -991327 -391342 -138537 -135729 -289254 -660029 -488462 -148118 -171581 54474
14812E4474J41710k14614k87088m0430K05072M27613K45066l09191n19044J95280
$$ 54474 196184 -18430 -305518 -345948 -140876 286737 531803 222612 -296432 -101152
14802a01152L05581j63982j64120j07811J1806L14020J66302j79794n79686m50299
$$ -101152 204429 40447 -123673 -231484 -219678 94342 260644 80850 -498836 -949135
14792i49135Q2058R5731J38844Q5496K18901M75249m8253l44731j68539K91833
$$ -949135 -867077 -771346 -632502 -547006 -328105 147144 98891 -245840 -414379 -122546
14782a22546L05376j79992l29114k8690K67772L20701K35687J17531k61120l19745
$$ -122546 182830 2838 -326276 -354966 -87194 233507 469194 586725 325605 5860
14772E860j37328k02451o75715l86971k04823p2393k60073k75691K80489N89756
$$ 5860 -131468 -333919 -1009634 -1396605 -1601428 -1673821 -1933894 -2209585 -1929096 -1339340
14762a339340N07313j38628J76009J61750r9603L54158L46767l39915j47522L62046
$$ -1339340 -832027 -970655 -794646 -632896 -732499 -378341 -31574 -371489 -519011 -156965
14752a56965J26435l17764o44666j82117L22056N39476M12642j31051k88288J27935
$$ -156965 -30530 -348294 -992960 -1175077 -853021 -313545 99097 -31954 -320242 -192307
14742a92307J45193q6141J52881Q2577r4443j19463K73535K35712j26960J36461
$$ -192307 -47114 -133255 19626 102203 7760 -111703 161832 397544 270584 407045
14732D07045m1893m9299L61250K64770p7024l64864m93051J39773K65026j52793
$$ 407045 365152 315853 677103 941873 864849 499985 6934 146707 411733 258940
14722B58940n85313o9503J6296k13558J78853K27961J52887j22247p795K58724
$$ 258940 -326373 -395876 -379580 -593138 -414285 -186324 -33437 -155684 -163479 95245
14712I5245K47308M38344J01985m28361o28214q84082j60683K28823P3247J57845
$$ 95245 342553 780897 882882 454521 -173693 -1057775 -1218458 -989635 -916388 -758543
14702g58543K05589J87219K00932K46331J95223J29260m0712j61118M3449j63448
$$ -758543 -552954 -365735 -164803 81528 276751 406011 365299 204181 247630 84182
14692H4182j99967j03380L42208N23312J35520n1489l16827l74283k21928j3596
$$ 84182 -115785 -219165 123043 646355 781875 730386 413559 39276 -182652 -196248
14682a96248Q638o1875j7673j84643j88960r1843k71429l30211k45824K54720
$$ -196248 -187610 -249485 -267158 -451801 -640761 -732604 -1004033 -1334244 -1580068 -1325348
14672a325348M69831L47194L08869j16371j80331L56833M57408j27836K37385
$$ -1325348 -855517 -508323 -199454 -315825 -496156 -139323 318085 190249 427634
14663D27634L45015o9102O6813J85292j29132l87183p4890m2818j94681p8415
$$ 427634 772649 703547 770360 955652 826520 439337 364447 321629 126948 48533
14653D8533k96784j16793J34370J90209j26305k7516J40359k10251J25666N63642
$$ 48533 -248251 -365044 -230674 -40465 -166770 -194286 -53927 -264178 -138512 425130
14643D25130N18417m7185n28696N0991K29058k76398k40523j99776m56744j96702
$$ 425130 943547 896362 367666 418657 647715 371317 130794 -68982 -525726 -722428
14633g22428k71338l05914j07147l5468K6087L68235L22863k18782n307N4970
$$ -722428 -993766 -1299680 -1406827 -1442295 -1416208 -1047973 -725110 -943892 -949199 -894229
14623h94229j77077p6058L04039L40918N98673L03251L60737L37699L28534K9747
$$ -894229 -1071306 -1147364 -843325 -502407 96266 399517 760254 1097953 1426487 1456234
14613A456234l99636j13139k03709o69873n33001k57488j5522M21164K98598j97385
$$ 1456234 1056598 943459 739750 69877 -463124 -720612 -736134 -314970 -16372 -213757
14603b13757p1349R6527j92526K35017L95388M4824l13498J06472L31875k1187
$$ -213757 -285106 -188579 -381105 -146088 249300 294124 -19374 87098 418973 397786
14593C97786l8104k98685l87675k01700j2094L8304n10201k87011J88035J33693
$$ 397786 359682 60997 -326678 -528378 -540472 -502168 -1012369 -1299380 -1111345 -977652
14583i77652L30031N27048J53392J50R1527n2564J88594J15510o5251O939J10715
$$ -977652 -647621 -120573 32819 32969 124496 71932 260526 376036 310785 317724 428439
14572D28439L4242j37285N97J7492K2265J47080o408j16137l059l32246n43568
$$ 428439 462681 325396 325993 343485 365750 512830 506422 390285 387226 54980 -488588
14561d88588l76516l38814j21134N667j42268L43115Q65108L54230R6222K80502
$$ -488588 -865104 -1203918 -1325052 -1319385 -1461653 -1118538 -253430 100800 197022 477524
14551D77524p7342j17219Q4265n0931m49627l54878k99564K13742N98100L05972
$$ 477524 400182 282963 367228 316297 -133330 -488208 -787772 -574030 24070 330042
14541C30042L06522J04886l37333j54654n196j77082O4647k06353n27335j05115
$$ 330042 636564 741450 404117 249463 244267 67185 131832 -74521 -601856 -706971
14531g06971l060K48640K53496o7861Q9554q226l2663J65613K31662J96087k15747
$$ -706971 -710031 -461391 -207895 -275756 -186202 -194428 -227091 -61478 170184 366271 150524
14520A50524q1244J78759K68230L09594J2870r3376n23135k01043k75191m51178
$$ 150524 69280 248039 516269 825863 838733 745357 222222 21179 -254012 -705190
14510g05190O1523Q49006N06312l19015l45401k08614k49689l5918J99754L5511
$$ -705190 -643667 205339 711651 392636 47235 -161379 -411068 -446986 -247232 -211721
14500b11721j59672m08174l27661k85057N61714Q06532J47148l12036l29130k79557
$$ -211721 -371393 -779567 -1107228 -1392285 -830571 -24039 123109 -188927 -518057 -797614
14490g97614l47797j81708J9767K78798M15330O89358P4097O8715L88298j06595
$$ -797614 -1145411 -1327119 -1307352 -1028554 -613224 76134 150231 218946 607244 500649
14480E00649m8582j17925l50848p4903J74728q1537K2693M2694j83869j05515
$$ 500649 452067 334142 -16706 -91609 83119 1582 24275 66969 -116900 -222415
14470b22415P8907M20162O82207j49350n99416m93043P9182J09098K4136k6517
$$ -222415 -143508 276654 958861 809511 210095 -282948 -203766 -94668 -70532 -97049
14460i7049L8738J02301K72294K48372n15397o67703O0217L49322J1096K48286
$$ -97049 -58311 43990 316284 564656 49259 -618444 -558227 -208905 -197809 50477
14450E0477j26862m85704j70609J12130k63204m23007K7602l2074K46445L71050
$$ 50477 -76385 -562089 -732698 -620568 -883772 -1306779 -1279177 -1311251 -1064806 -693756
14440f93756M39092M26302J03795j34029k17994k60594M2972R7067l4447l3136
$$ -693756 -254664 171638 275433 141404 -76590 -337184 -294212 -197145 -231592 -264728
14430b64728L6830L24885P19604M00315n34347q86011n10901O7179r3125K02930
$$ -264728 -227898 96987 816591 1216906 682559 -203452 -714353 -647174 -740299 -537369
14420e37369L19146J42148k23059j93189k90061j81744q8364j4576J44939r6007
$$ -537369 -218223 -76075 -299134 -492323 -782384 -964128 -1052492 -1067068 -922129 -1018136
14410a018136M4651m32425j37273K59238K90880J71340J31324o6471R3321L87840
$$ -1018136 -973485 -1405910 -1543183 -1283945 -993065 -821725 -690401 -756872 -663551 -275711
14400b75711M66447N5240m08198j22265L18631N1122m51254j44316j74642k11730
$$ -275711 190736 245976 -162222 -284487 34144 85266 -365988 -510304 -684946 -896676
14390h96676q5401J43550R6533N22849M77498J22941n1291J53914o7313o13798
$$ -896676 -982077 -838527 -741994 -219145 258353 381294 330003 483917 416604 -197194
14380a97194m72256J9611R5845M8434L59786M14721L30637N8158o3268N9804P6525
$$ -197194 -669450 -649839 -553994 -505560 -145774 268947 599584 657742 594474 654278 730803
14369G30803k50781r3027J74692K85788j13547l69407j58726l81442n28072k27311
$$ 730803 480022 386995 561687 847475 733928 364521 205795 -175647 -703719 -931030
14359i31030M44997N03616O69719M82631j407m82359m80353J7699K34467K12793
$$ -931030 -486033 17583 687302 1169933 1168526 686167 205814 223513 457980 670773
14349F70773k04091l50224m28339k42215n0437k12153l73921l30907K9487M91414
$$ 670773 466682 116458 -311881 -554096 -604533 -816686 -1190607 -1521514 -1492027 -1000613
14339a000613P48603M90456K40784j16831q6351o6580l28475r1949j08118j38118
$$ -1000613 -252010 238446 479230 362399 276048 209468 -119007 -210956 -319074 -457192
14329d57192K07664M38443n7295j86684l67795k02043O2732L77349L36811J91344
$$ -457192 -249528 188915 131620 -55064 -422859 -624902 -562170 -184821 151990 343334
14319C43334k98636n82881J67756M92146L90737j28746l37403l40032j44979j40155
$$ 343334 44698 -538183 -370427 121719 512456 383710 46307 -293725 -438704 -578859
14309e78859p658N3203R0551M0757M18485N52940K30312j62975l23424l46922
$$ -578859 -586517 -533314 -442763 -402006 16479 569419 799731 636756 313332 -33590
14299c3590j49143J45645j91463q8058L47142K31377r6022l38266Q2427R6747
$$ -33590 -182733 -37088 -228551 -316609 30533 261910 165888 -172378 -89951 6796
14289F796L82937K41656k16753k81127n3392l64167K52688M21930O3420n07491
$$ 6796 389733 631389 414636 133509 80117 -284050 -31362 390568 453988 -53503
14279e3503p94182j27774K95331M00786L45780Q828q6537k39862J04147J44325
$$ -53503 -847685 -975459 -680128 -279342 66438 75266 -11271 -251133 -146986 -2661
14269b661p1186j33504J03994K49752N4250j75931l77965k02280r7977Q0101K55960
$$ -2661 -73847 -207351 -103357 146395 200645 24714 -353251 -555531 -653508 -573407 -317447
14258c17447J4764L18984N14376m1761n29850l30860l1549M6906P8753j29534
$$ -317447 -302683 16301 530677 488916 -40934 -371794 -403343 -356437 -277684 -407218
14248d07218o3342J79064O46186J62430k7233K83722J58775k22926j54712k16481
$$ -407218 -470560 -291496 354690 517120 489887 773609 932384 709458 554746 338265
14238C38265j84248r862n744k99381k18357J4748M9599M4634k71634k43649j57972
$$ 338265 154017 144155 138411 -160970 -379327 -364579 -314980 -270346 -541980 -785629 -943601
14227i43601j97560L92244L26543p9186J56042K82600j75976M15882M00039p2761
$$ -943601 -1141161 -748917 -422374 -501560 -345518 -62918 -238894 176988 577027 504266
14217E04266o9800J65507M00577Q3991j64624L97162O7042l91203o35294o72579
$$ 504266 434466 599973 1000550 1084541 919917 1317079 1384121 992918 357624 -314955
14207c14955k00919L28498J81622l51309j59544J82185J63896p6901J7479K29202
$$ -314955 -515874 -187376 -5754 -357063 -516607 -334422 -170526 -247427 -229948 -746
14197g46O3084K7786o1978m9771m57809o25579K06789O98309L12961M72787L75941
$$ -746 62338 90124 28146 -21625 -479434 -1105013 -898224 -199915 113046 585833 961774
14186I61774r3189l3014O7459O3480j21915n62759o09729n75061k10912L38207
$$ 961774 868585 835571 903030 966510 844595 281836 -327893 -902954 -1113866 -775659
14176g75659N85237M15568k18030q9326n4231k88985J66590M17311J65967R0715
$$ -775659 -190422 225146 7116 -82210 -136441 -425426 -258836 158475 324442 415157
14166D15157J49896K8589p346K04489m10145m38440m3535l2425j35634j47111
$$ 415157 565053 593642 586296 790785 380640 -57800 -101335 -133760 -269394 -416505
14156d16505J94121Q1548N9288l7772L13906M66741l2646k60524n02970k31909
$$ -416505 -222384 -140836 -81548 -119320 194586 661327 628681 368157 -134813 -366722
14146c66722q9628K26865L33480m01055j50406M42133K63040O997O0494Q3409
$$ -366722 -456350 -229485 103995 -297060 -447466 -5333 257707 264704 325198 408607
14136D08607J30459J39768k51561j09848m3144r4056k54345k35234L99L30654
$$ 408607 539066 678834 427273 317425 274281 180225 -74120 -309354 -308955 21699
14126B1699m6949n27192n1483N73214N09932K17140j89629m09727p6433k02368
$$ 21699 -25250 -552442 -603925 -30711 479221 696361 506732 97005 20572 -181796
14116a81796j32040L5121J07178J84626J8572O5165j12320l10332m10662l47333
$$ -181796 -313836 -278715 -171537 13089 31661 96826 -15494 -325826 -736488 -1083821
14106a083821L20577K92624o5829k10437j15636j50746j57274L02615M68018J65122
$$ -1083821 -763244 -470620 -536449 -746886 -862522 -1013268 -1170542 -867927 -399909 -234787
14096b34787q6214J9839L50526N35829J68773l49489n49293p11061r7473N82663
$$ -234787 -321001 -301162 49364 585193 753966 404477 -144816 -855877 -953350 -370687
14086c70687M85688k45128m25779K48767N48714J14876j72719j07816k13918l28511
$$ -370687 115001 -130127 -555906 -307139 241575 356451 183732 75916 -138002 -466513
14076d66513j94326m7628R2117K08168J22695L66797Q51032K84788n37874k05828
$$ -466513 -660839 -708467 -616350 -408182 -285487 81310 932342 1217130 679256 473428
14066D73428m15441m26643J21073J34701j08928j71085j27932J03294j35870l61514
$$ 473428 57987 -368656 -247583 -112882 -221810 -392895 -520827 -417533 -553403 -914917
14056i14917J64745K38845p9528K79644P46753j58590p34192m92812l52809k29135
$$ -914917 -750172 -511327 -590855 -311211 435542 276952 -457240 -950052 -1302861 -1531996
14046a531996K34791N53410L98361M4973j54170J75242M2005j94233k78511k08108
$$ -1531996 -1297205 -743795 -345434 -300461 -454631 -279389 -237384 -431617 -710128 -918236
14036i18236k16480J92568N45169P9582l17816k44798M7716J34667J98334J13934
$$ -918236 -1134716 -942148 -396979 -317397 -635213 -880011 -832295 -697628 -499294 -385360
14026c85360L458J07891M18893M76593J34249p0646o30767o38732j49468M39862
$$ -385360 -381902 -274011 144882 621475 755724 685078 54311 -584421 -733889 -294027
14016b94027N11975J78797k5924n1993m3664j18687m9974j51151n21258q5349
$$ -294027 217948 396745 370821 318828 275164 156477 106503 -44648 -565906 -651255
14006f51255J91638L558m91577n67355M2115O61455O55874k34708o89403j868
$$ -651255 -459617 -456059 -947636 -1514991 -1472876 -811421 -155547 -390255 -1079658 -1081526
13996a081526P78409M47040q2642j13801q9394k1121k85807m44093L89697Q31148
$$ -1081526 -303117 143923 61281 -52520 -141914 -163035 -448842 -892935 -503238 327910
13986C27910K97025J9806k24641k10134K60396J40172j32610p86405o70801N0485
$$ 327910 624935 644741 420100 209966 470362 610534 477924 -308481 -979282 -928797
13976i28797K67516k70982k99358L32473N0417r3471r4842L69949M06494J22404
$$ -928797 -661281 -932263 -1231621 -899148 -848731 -942202 -1037044 -667095 -260601 -138197
13966a38197L85208J53228j36419K3524l255j64896k48216k00970j42218J40581
$$ -138197 247011 400239 263820 287344 284089 119193 -129023 -329993 -472211 -331630
13956c31630J44737K4513K3831j48055j71858j58131k78113j59596j3977O35358
$$ -331630 -186893 -162380 -138549 -286604 -458462 -616593 -894706 -1054302 -1068279 -432921
13946d32921N52950k78961l51442k51652m94629p9770N85431N24929J94849R2424
$$ -432921 120029 -158932 -510374 -762026 -1256655 -1336425 -750994 -226065 -31216 61208
13936F1208o8795P7471j71507l28647J6194K33067K88635r571k6114J31175K62071
$$ 61208 -7587 69884 -101623 -430270 -414076 -181009 107626 98055 71941 203116 465187
13925D65187J36988j31002n17780m15381j69494L85980K61056l24968k99469l49352
$$ 465187 602175 471173 -46607 -461988 -631482 -245502 15554 -309414 -608883 -958235
13915i58235l42992Q8077M98228M13391N7437r8263l03212k4983n7965l80368
$$ -958235 -1301227 -1213150 -714922 -301531 -244094 -342357 -645569 -670552 -728517 -1108885
13905a108885O0656O35810L07119j02039K38589L95475N0180j93463m41768M5705
$$ -1108885 -1048229 -412419 -105300 -207339 31250 426725 476905 283442 -158326 -112621
13895a12621l2163p8389K63206K92027q9686J84783K61308J05302n4768N1091
$$ -112621 -144784 -223173 40033 332060 242374 427157 688465 793767 738999 790090
13885G90090J41492k02537m38685K5444K28908l03092j05935j9564k24893L01331
$$ 790090 931582 729045 290360 315804 544712 241620 135685 116121 -108772 192559
13875A92559J77520j94693l15008k42547k46010J54554L15087K76619k38252n65841
$$ 192559 370079 175386 -139622 -382169 -628179 -473625 -158538 118081 -120171 -686012
13865f86012k81117J57719K89538K2828L25214J93901k47036l53581K77457O8274
$$ -686012 -967129 -809410 -519872 -497044 -171830 22071 -224965 -578546 -301089 -232815
13855b32815o06649R8502M53865O379k3936J88345K24696m6584n2350M13538M24852
$$ -232815 -839464 -740962 -287097 -280718 -304654 -116309 108387 61803 9453 422991 847843
13844H47843m77443n02670k11530l50310j82163J55211J89217J36632J66158O27448
$$ 847843 370400 -132270 -343800 -694110 -876273 -721062 -531845 -395213 -229055 398393
13834C98393P35120K7413k75479l23177j17617k61013k73246j99066O9527M30168
$$ 398393 1133513 1160926 885447 562270 444653 183640 -89606 -288672 -219145 211023
13824B11023J15020k50533l62642k62577r9157J63264L14078K33779J4310j74310
$$ 211023 326043 75510 -287132 -549709 -648866 -485602 -171524 62255 76565 -97745
13814i7745o7149j48167n00886M1403r8634O823M38258m11579n85907J68397J99769
$$ -97745 -164894 -313061 -813947 -772544 -871178 -864355 -426097 -837676 -1423583 -1255186 -1055417
13803a055417N7431J72185R7809J06587L6672J2679J22621k23615P1447K07290
$$ -1055417 -997986 -825801 -727992 -621405 -584733 -572054 -449433 -673048 -601601 -394311
13793c94311k22486J05123J44966K05467k3282k1539K69516q7758j94553M06084
$$ -394311 -616797 -511674 -366708 -161241 -184523 -206062 63454 -24304 -218857 187227
13783A87227L05411J85082j21205k92449j80945O9877m0699O5278J31281o75270
$$ 187227 492638 677720 556515 264066 83121 152998 112299 177577 308858 -366412
13773c66412r13125k13357L05196J30525K74758K70905Q9738j59958L7069K30938
$$ -366412 -1279537 -1492894 -1187698 -1057173 -782415 -511510 -421772 -581730 -544661 -313723
13763c13723R8176k68868L26372M88244J63896J29943n04179q39352j9216O09257
$$ -313723 -215547 -484415 -158043 330201 494097 624040 119861 -719491 -738707 -129450
13753a29450N13558J05360J4768N1231K84231L97422J55651m22474o16091q43183
$$ -129450 384108 489468 504236 555467 839698 1237120 1392771 970297 354206 -488977
13743d88977k74124J07073J21338K32805K2847J24357J75878j28906n4792j26996
$$ -488977 -763101 -656028 -534690 -301885 -279038 -154681 21197 -107709 -162501 -289497
13733b89497R9425J9107j42994p7338j5457j17823P695K98594K42517n13117m59778
$$ -289497 -190072 -170965 -313959 -391297 -406754 -524577 -516882 -218288 24229 -488888 -948666
13722i48666J64393J96635J09651J34191J7424L52629O44876K53571l21740l54601
$$ -948666 -784273 -587638 -477987 -343796 -326372 26257 671133 924704 602964 248363
13712B48363k44665k12354K19729O4551M8430K1118j97970R5733j40553k51647
$$ 248363 3698 -208656 11073 75624 124054 145172 -52798 42935 -97618 -349265
13702c49265l21799m46842O98M41674J70750O3290j95141j86489K49077K54117
$$ -349265 -671064 -1117906 -1117208 -675534 -504784 -441494 -636635 -823124 -574047 -319930
13692c19930J05282j21316j35704j2254q8601j84276M56475K76600K0652m3600
$$ -319930 -214648 -335964 -471668 -483922 -572523 -756799 -300324 -23724 -3072 -46672
13682d6672k95268j05142R1989j48942k6159O51862M39761k29564o09669q3986
$$ -46672 -341940 -447082 -355093 -504035 -530194 121668 561429 331865 -277804 -361790
13672c61790M1539m06139k16468K21265K68468j7264n2360J43704J92847K56488
$$ -361790 -320251 -726390 -942858 -721593 -453125 -470389 -522749 -379045 -186198 70290
13662G0290M55789L57723j76827o70096o81591l56872J61689M66619J39651m06551
$$ 70290 526079 883802 706975 36879 -644712 -1001584 -839895 -373276 -233625 -640176
13652f40176m24062l8749J79394K17901L47810K89021J95523r6856k09159j50679
$$ -640176 -1064238 -1102987 -923593 -705692 -357882 -68861 126662 29806 -179353 -330032
13642c30032J41727L82878Q3867m84203l06333O4926J87834M23518K76618j07157
$$ -330032 -188305 194573 278440 -205763 -512096 -447170 -259336 164182 440800 333643
13632C33643J23385J06181n4802m3263J72962J25648m06810k72933k64686k18766
$$ 333643 457028 563209 508407 465144 638106 763754 356944 84011 -180675 -399441
13622c99441J58525N20433L32068p1178j33265l67712k26972J44668L35042L7876
$$ -399441 -240916 279517 611585 540407 407142 39430 -187542 -42874 292168 330044
13612C30044n02972j04265L56645L88150P5971l28806k50774k44379J68494L12476
$$ 330044 -172928 -277193 79452 467602 543573 214767 -36007 -280386 -111892 200584
13602B00584M7464l69421m52027k6474L66879K09640M8580j0957L55859N29805
$$ 200584 248048 -121373 -573400 -599874 -232995 -23355 25225 14268 370127 899932
13592H99932j8690j04226K16571K7262l34683l11132j21958P0842L06289j28733
$$ 899932 881242 777016 993587 1020849 686166 375034 253076 323918 630207 501474
13582E01474n88191n05103j17606M08373M89244j27769m46030j64552k9941j00657
$$ 501474 -86717 -591820 -709426 -301053 188191 60422 -385608 -550160 -580101 -680758
13572f80758k06075n7453n2087k43136J90543K13252J98987L90297k1503n80865
$$ -680758 -886833 -944286 -996373 -1239509 -1048966 -835714 -636727 -246430 -267933 -848798
13562h48798j45866L25391N60687M80829j15100k89139q4868P0790J05796K23277
$$ -848798 -994664 -669273 -108586 372243 257143 -31996 -116864 -46074 59722 282999
13552B82999M7564l58133n03531K56494L67961J42735l51159k68282l1481j21249
$$ 282999 330563 -27570 -531101 -274607 93354 236089 -115070 -383352 -414833 -536082
13542e36082j38471l5210j65662l1190O6545L12325J48751j0195O94546L36925
$$ -536082 -674553 -709763 -875425 -906615 -840070 -527745 -378994 -389189 305357 642282
13532F42282k45512l27826l62945l60667l17556N8336J57538j20379K37989L3536
$$ 642282 396770 68944 -294001 -654668 -972224 -913888 -756350 -876729 -638740 -605204
13522f05204j00663l8976J86536L86153L43112j27116k85782O1514M50095P8097
$$ -605204 -705867 -744843 -558307 -172154 170958 43842 -241940 -180426 269669 347766
13512C47766k74594J00283j24632m66989j06151J89988J94677k16005j99032L37999
$$ 347766 73172 173455 48823 -418166 -524317 -334329 -139652 -355657 -554689 -216690
13502b16690N34995K48472j59049m69500l20924o7495N3620m8982J6253k24329
$$ -216690 318305 566777 407728 -61772 -382696 -450191 -396571 -445553 -429300 -653629
13492f53629o4493j32526j13430O4788Q1216L59153J43181J35615L18313n8176
$$ -653629 -718122 -850648 -964078 -899290 -818074 -458921 -315740 -180125 138188 80012
13482H0012M6457M85742J53890m46112m15170r9876M53136K28363j75254J23409
$$ 80012 126469 612211 766101 319989 -95181 -195057 258079 486442 311188 434597
13472D34597J23502R734K14620L13906O2293m80509l49940m16372p01914j60208
$$ 434597 558099 567833 782453 1096359 1158652 678143 328203 -88169 -790083 -950291
13462i50291j78621j95425J76820J33058J81636J43224j11793r9315J25721P39166
$$ -950291 -1128912 -1324337 -1147517 -1014459 -832823 -689599 -801392 -900707 -774986 -35820
13452c5820Q82742M86742k46943j49107N1333R9074l14618l44010k09461k33992
$$ -35820 846922 1333664 1086721 937614 988947 1088021 773403 429393 219932 -14060
13442a4060L22681K79250N1883P7593p2935n72611k59127J86881n5869k1140J05898
$$ -14060 308621 587871 639754 717347 644412 71801 -187326 -445 -56314 -77454 28444
13431B8444j23232K09711J35555m53824k16817J76509N5792l1550K86002K58057
$$ 28444 -94788 114923 250478 -203346 -420163 -243654 -187862 -219412 66590 324647
13421C24647q0509j39852M0380L32001K50350J9118l37248l16773j6621j24677
$$ 324647 244138 104286 144666 476667 727017 746135 408887 92114 75493 -49184
13411d9184l77824J1719K38277M62544M11294J23491R0641j29175l37016l73525
$$ -49184 -427008 -415289 -177012 285532 696826 820317 910958 781783 444767 71242
13401G1242k78128j03404L4924K44042K50214l4043R1605l3824j71477p7822K6714
$$ 71242 -206886 -310290 -275366 -31324 218890 184847 276452 242628 71151 -6671 20043
13390B0043K78045L6917k13278j82723j25016M296j48409o65324j97374L80890
$$ 20043 298088 335005 121727 -60996 -186012 -181716 -330125 -995449 -1192823 -811933
13380h11933J24927m1214L32242M45325q6053q0083k21885k42597J80724K86406
$$ -811933 -687006 -728220 -395978 49347 -36706 -116789 -338674 -581271 -400547 -114141
13370a14141J52881K40601N01973K46881K3264L28936M20553J46026j19602P9824
$$ -114141 38740 279341 781314 1028195 1051459 1380395 1800948 1946974 1827372 1907196
13360A907196n8084m02468m06191k02866k21217l06051k96038j49094K67846J34787
$$ 1907196 1849112 1446644 1040453 837587 616370 310319 14281 -134813 133033 267820
13350B67820j30726K93090K52641K1476J01593K98536k8949k26388j02858l8793
$$ 267820 137094 430184 682825 704301 805894 1104430 1075481 849093 746235 707442
13340G07442l18707k14547K19756N22162L56207J17918k86037l69471k12964j43034
$$ 707442 388735 174188 393944 916106 1272313 1390231 1104194 734723 521759 378725
13330C78725j23341L28337J8894l3151k5236K39842M93725M33318J65226j24893
$$ 378725 255384 583721 602615 569464 544228 784070 1277795 1711113 1876339 1751446
13320A751446j90415j46552j62603j91203j87443K0173k63443m96090k38763K01419
$$ 1751446 1561031 1414479 1251876 1060673 873230 893403 629960 133870 -104893 96526
13310I6526k7201l66883J26227L43329J22856J35546P6393j2482K04922J26404
$$ 96526 69325 -297558 -171331 171998 294854 430400 506793 494311 699233 825637
13300H25637j25107m62717l63604m1431m2886L5646M81394L27462J0703P3467
$$ 825637 700530 237813 -125791 -167222 -210108 -174462 306932 634394 645097 718564
13290G18564K78822J86048J50445j25285o055K44573n349J99380K52718l49637
$$ 718564 997386 1183434 1333879 1208594 1202539 1447112 1441763 1641143 1893861 1544224
13280A544224j64016j91608l19883k60899k6195l32712j16136K15319J26352p0770
$$ 1544224 1380208 1188600 868717 607818 581623 248911 132775 348094 474446 403676
13270D03676k27282L49524j08380j80502K3024O6522K93786P60971P2500n45038
$$ 403676 176394 525918 417538 237036 260060 326582 620368 1381339 1453839 908801
13260I08801l22832l1872L08891K08339p2904k62839J40998N33043L94216L19388
$$ 908801 585969 554097 862988 1071327 998423 735584 876582 1409625 1803841 2123229
13250B123229k94891r02004m49948R1421K14314K62190L41591K13656k87614n08898
$$ 2123229 1828338 926334 476386 567807 782121 1044311 1385902 1599558 1311944 803046
13240H03046k80764J72298L46225K04103k62599m54582L54821M89620k1311l4693
$$ 803046 522282 694580 1040805 1244908 982309 527727 882548 1372168 1350857 1316164
13230A316164L1367K30531k0958m62075j14537m8804k74007p5033L6501L7287
$$ 1316164 1347531 1578062 1557104 1095029 980492 931688 657681 582648 619149 656436
13220F56436q7062j01782K25109M21198K31231m88698l80656J21089J62571K59218
$$ 656436 569374 467592 692701 1113899 1345130 856432 475776 596865 759436 1018654
13210A018654J60133P7213Q1880j63429j37186j36635j7905N01552K39442k99469
$$ 1018654 1178787 1256000 1337880 1174451 1037265 900630 882725 1384277 1623719 1324250
13200A324250l05462j89532K4448N5553j78233o24084l49739l0213Q5926j16924
$$ 1324250 1018788 829256 853704 909257 731024 106940 -242799 -273012 -187086 -304010
13190c04010J91677L83230k76450j0349L93326J01311j01052L1971l6244L23476
$$ -304010 -112333 270897 -5553 -15902 377424 478735 377683 409654 373410 696886
13180F96886M60717k09682o23862l15052K100J82303J86830q3500j15120j16369
$$ 696886 1157603 947921 324059 9007 11107 193410 380240 296740 181620 65251
13170F5251J08265N9204L20280M84831r8493m07212o6080K87322M51063J5540
$$ 65251 173516 232720 553000 1037831 939338 532126 466046 753368 1204431 1219971
13160A219971l97440l88380j43561M481K63615l0697j32352r14k1358M0092N4583
$$ 1219971 822531 434151 290590 295071 558686 527989 395637 394723 373365 413457 468040
13149D68040k64554j87185p0122k76949j68318J7016L56064L22808K71250J12189
$$ 468040 203486 16301 -53821 -330770 -499088 -482072 -126008 196800 468050 580239
13139E80239L40387K20581q8396j47238N8552O4497j6918l43815J01256J61158
$$ 580239 920626 1141207 1052811 905573 964125 1028622 1011704 667889 769145 930303
13129I30303l56853m13317o5745J07616K62985j44611m08936O9760J04027J65595
$$ 930303 573450 160133 94388 202004 464989 320378 -88558 -18798 85229 250824
13119B50824R6652M1233M54824L11303j33418k54412Q9481n0429O95K20220j00215
$$ 250824 347476 388709 843533 1154836 1021418 767006 856487 806058 806753 1026973 926758
13108I26758K84464J82057J44566k5189l75877m59144m67172J47958O34151N73368
$$ 926758 1211222 1393279 1537845 1512656 1136779 677635 210463 358421 992572 1565940
13098A565940n2529l29792M7788J41313K18776o9809K10044J99188m7316o6400
$$ 1565940 1513411 1183619 1231407 1372720 1591496 1521687 1731731 1930919 1883603 1817203
13088A817203j55718J02302K75485k01038k48692k63171o3075L34582L95489J35825
$$ 1817203 1661485 1763787 2039272 1838234 1589542 1326371 1263296 1597878 1993367 2129192
13078B129192j94777J3028J12275K01435L91010O2001J09361K40637k97280j15817
$$ 2129192 1934415 1947443 2059718 2261153 2652163 2714164 2823525 3064162 2766882 2651065
13068B651065L9001j5343k42584L8624M20266L65821M668j14239j76888J852R4199
$$ 2651065 2690066 2674723 2432139 2470763 2891029 3256850 3261518 3147279 2970391 2972243 3066442
13057C066442l68952o59507J53310O40506J33347M26618J29316k68501k15482
$$ 3066442 2697490 2037983 2191293 2831799 2965146 3391764 3521080 3252579 3037097
13048C037097j06167J67372n1161m286J37858P5415J12619j46304J28920J03134
$$ 3037097 2930930 3098302 3047141 3042855 3180713 3256128 3368747 3222443 3351363 3454497
13038C454497p4590K13151L25673q8024l11053j87936J35127K0758M64185O81978
$$ 3454497 3379907 3593058 3918731 3830707 3519654 3331718 3466845 3487603 3951788 4633766
13028D633766R4758j1935J38614J164P8045M5884K6317L33303M94637L02697K64362
$$ 4633766 4728524 4716589 4855203 4856367 4934412 4980296 5006613 5339916 5834553 6137250 6401612
13017F401612L66043P33639M77115J05793j0868K39198N93084P07287Q05094P16685
$$ 6401612 6767655 7501294 7978409 8084202 8073334 8312532 8905616 9612903 10417997 11134682
13007A1134682O43894P29009Q68726J085388J360583J454723J642278J833471
$$ 11134682 11778576 12507585 13376311 14461699 15822282 17277005 18919283 20752754
12999B0752754K278353K481952L376044M484253M953964N580690P053097Q900017
$$ 20752754 23031107 25513059 28889103 33373356 38327320 43908010 50961107 59861124
12991E9861124J1745080J5352141J9524427K5453431L2906202M3640955N8060070
$$ 59861124 71606204 86958345 106482772 131936203 164842405 208483360 266543430
12984B66543430P3649285P7470972M7745682j3264560o4117980p8213158o8131357
$$ 266543430 340192715 417663687 465409369 452144809 388026829 309813671 241682314
12977B41682314n1970466l8335166k8298759k1152886j6451848j2787712j0267330
$$ 241682314 189711848 151376682 123077923 101925037 85473189 72685477 62418147
12970F2418147q677727o977654n385610m331847l615511l129728k527795j888662
$$ 62418147 53740420 46762766 41377156 37045309 33429798 30300070 27772275 25883613
12962B5883613k082357j921285j685770j891552j633052j146477r70220q75247
$$ 25883613 23801256 21879971 20194201 18302649 16669597 15523120 14552900 13677653
12954A3677653m60962l39353k68866p13793p29800l98755o7585J75044J87432
$$ 13677653 13216691 12877338 12608472 11894679 11164879 10766124 10698539 10873583 11061015
12945A1061015k64492m06137k03478m31202J01592M07595m17212n08655j40881
$$ 11061015 10796523 10390386 10186908 9755706 9857298 10264893 9847681 9339026 9198145
12936I198145L67132N92551N92923N92623N74234O20682M75025M36100Q30243
$$ 9198145 9565277 10157828 10750751 11343374 11917608 12538290 13013315 13449415 14279658
12927A4279658K053621K567608K790069L220235K938178R21584j016296k230355
$$ 14279658 16333279 18900887 21690956 24911191 27849369 28770953 27754657 25524302
12919B5524302k268565j211462l52036K01683N41306P75484R92529J691490K691117
$$ 25524302 23255737 22044275 21692239 21893922 22435228 23210712 24203241 25894731 28585848
12910B8585848L058655L702454N061529O318885P761213R609990J2600115J5950758
$$ 28585848 31644503 35346957 40408486 46727371 54488584 64098574 76698689 92649447
12902I2649447J9773372K5359993L4435272M7167238O2779167P7906418P9168547
$$ 92649447 112422819 137782812 172218084 219385322 282164489 360070907 439239454
12895D39239454M2130364k6061550p4133017q1490989o7460989n0242317l6923512
$$ 439239454 481369818 455308268 381175251 299684262 232223273 181980956 145057444
12888A45057444k7595589k0652962j5739740j2098877r295388p557807o565265
$$ 145057444 117461855 96808893 81069153 68970276 59674888 52117081 45551816
12881D5551816n460065m365983l572577l325203k703369k107158j826808k017678
$$ 45551816 40091751 35725768 32153191 28827988 26124619 24017461 22190653 20172975
12873B0172975j788967j552380j377554n10713k86412p41454q47441l43129m04105
$$ 20172975 18384008 16831628 15454074 14943361 14656949 13915495 13068054 12724925 12320820
12864A2320820m72784m88162n74667l95281j02161j11004R2697J4189l07422k26148
$$ 12320820 11848036 11359874 10785207 10389926 10287765 10176761 10269458 10283647 9976225 9750077
12854I750077J4201m76627n64717j65352j69432M7168j26578N358J66034K70434
$$ 9750077 9764278 9287651 8722934 8557582 8388150 8435318 8308740 8314098 8480132 8750566
12844H750566K58978K22739K37150R4202R6517M11249Q93151Q87951K37655P0323
$$ 8750566 9009544 9232283 9469433 9563635 9660152 10071401 10964552 11852503 12090158 12160481
12834A2160481O53084R31978N94139Q05746J021041Q16816J456455J913106K125515
$$ 12160481 12813565 13745543 14339682 15145428 16166469 16983285 18439740 20352846 22478361
12825B2478361K839750L029799L304472M320936N523194O584495Q158641J0406557
$$ 22478361 25318111 28347910 31652382 35973318 41496512 48081007 56239648 66646205
12817F6646205J3006373J6109019K0414024K6799517L5942013M8597929O3829988
$$ 66646205 79652578 95761597 116175621 142975138 178917151 227515080 291345068
12810B91345068P6990816P1879559K9251289l4638925p4006646p7224339o3615373
$$ 291345068 368335884 440215443 469466732 434827807 360821161 283596822 219981449
12803B19981449m7592501l4999278k5784910j9330178j4999567j1607342r228530
$$ 219981449 172388948 137389670 111604760 92274582 77275015 65667673 56439143
12796E6439143p917811o455034n215190m183491l177203k592717k822714k786277
$$ 56439143 48521332 42066298 36851108 32667617 29490414 26897697 24074983 21288706
12788B1288706k029450j509358j499775j478046j432864j230773j336579j141913
$$ 21288706 19259256 17749898 16250123 14772077 13339213 12108440 10771861 9629948
12780I629948o12678l30422m87424m27423j96340l66651m39145o8755j38130m70591
$$ 9629948 9017270 8686848 8199424 7772001 7575661 7209010 6769865 6701110 6562980 6092389
12770F092389n11833L8236m02638l75430m43963m54467M3045N6989M1039P81K00727
$$ 6092389 5580556 5618792 5216154 4840724 4396761 3942294 3985339 4042328 4083367 4084148 4284875
12759D284875M3775k47870k78080o04710j65630O1975j43676k40642J09936L6451
$$ 4284875 4328650 4080780 3802700 3197990 3032360 3094335 2950659 2710017 2819953 2856404
12749B856404j61542l74349J95172p1431m63366J27614L75846L39713M56606j5744
$$ 2856404 2694862 2320513 2515685 2444254 1980888 2108502 2484348 2824061 3280667 3264923
12739C264923j87410j56277j36481j44200o34926q70096l97273L8831J76853K99028
$$ 3264923 3077513 2921236 2784755 2640555 2005629 1135533 738260 777091 953944 1252972
12729A252972O788P1527K89565J46956m88841j90891K03489J370k7083K50869
$$ 1252972 1259760 1331287 1620852 1767808 1278967 1088076 1291565 1292935 1265852 1516721
12719A516721j16487k99279J50813L4938k97076k82955j01744J84647l2114m33734
$$ 1516721 1400234 1100955 1251768 1286706 989630 706675 604931 789578 757464 323730
12709C23730J08841L03013j8230L9025L62348M45503l04624k72693j34333m09985
$$ 323730 432571 735584 717354 756379 1118727 1564230 1259606 986913 852580 442595
12699D42595n6721J3261K53834r6100n40269j54129P4212L07200p3999o5471J5677
$$ 442595 385874 399135 652969 556869 16600 -137529 -63317 243883 169884 104413 120090
12688A20090l77257l21240M02674M26163L33804Q626m00912l03469j36479O7468
$$ 120090 -257167 -578407 -175733 250430 584234 592860 191948 -111521 -248000 -180532
12678a80532M39880K30936j99314L6649N26796P62906M47987m26183n49189m67589
$$ -180532 259348 490284 290970 327619 854415 1617321 2065308 1639125 1089936 622347
12668F22347j079K52827J02678j61627q0382L74222O46482M93010r9046m61425
$$ 622347 621268 874095 976773 815146 734764 1108986 1755468 2248478 2149432 1688007
12658A688007l70490n29455k04464O0292k45309p4049k58122k98852q5693q6514
$$ 1688007 1317517 788062 583598 643890 398581 324532 66410 -232442 -318135 -404649
12648d04649J55156J59750K92779K26835J85760K25227K28424P8768J14355j12416
$$ -404649 -249493 -89743 203036 429871 615631 840858 1069282 1148050 1262405 1149989
12638A149989K4722M56444K35125m01985m36984o81626n14632m1041L05868K6594
$$ 1149989 1174711 1631155 1866280 1464295 1027311 345685 -168947 -209988 95880 122474
12628A22474o7646K31725O80091N28555p4317l96957l00829o7101n9934j21542
$$ 122474 54828 286553 966644 1495199 1420882 1023925 723096 655995 596061 474519
12618D74519K7241J48219J47793J31085j15370K584M14345L00458n2935l85223
$$ 474519 501760 649979 797772 928857 813487 816071 1230416 1530874 1477939 1092716
12608A092716o08575l12039j65926l949N3337k6970M8897j01141k07035L09263
$$ 1092716 484141 172102 6176 2227 55564 28594 77491 -23650 -230685 78578
12598G8578L44614j37613L7080L76435L57557p7252j43079J2891o7230k06457
$$ 78578 423192 285579 322659 699094 1056651 979399 836320 849211 781981 575524
12588E75524l48932k34099j66295q4186J59854J19435K72279K00745m3796k0303
$$ 575524 226592 -7507 -173802 -257988 -98134 21301 293580 494325 450529 430226
12578D30226J66172j3210l29419k10457n9289n3462J89827K61808L1108K5965
$$ 430226 596398 583188 253769 43312 -15977 -69439 120388 382196 413304 439269
12568D39269j71803k49843k91604p5752J06463n7256P9036M95445L41577J63210
$$ 439269 267466 17623 -273981 -349733 -243270 -300526 -221490 273955 615532 778742
12558G78742N0188k59995M553Q6664l18321k57604q6605l87291m07660k91865
$$ 778742 828930 568935 573488 660152 341831 84227 -2378 -389669 -797329 -1089194
12548a089194J98888K61771N14314L71607L43661K17159j33591j91924m2745k20828
$$ -1089194 -890306 -628535 -114221 257386 601047 818206 684615 492691 449946 229118
12538B29118n94404l68022m4120J64406N92807N82669L13030J72614L3452j26961
$$ 229118 -365286 -733308 -777428 -613022 -20215 562454 875484 1048098 1081550 954589
12528I54589j85985m12611n26692j36693K28582j02383k44851p7629J99185M13176
$$ 954589 768604 355993 -170699 -307392 -78810 -181193 -426044 -503673 -304488 108688
12518A08688P3943r0072J11478K73180Q6947p6080m12831l07280J12127K02156
$$ 108688 182631 92559 204037 477217 564164 488084 75253 -232027 -119900 82256
12508H2256J34690K26351l47326l38163k04442j83405P3735M74457M79478N9011
$$ 82256 216946 443297 95971 -242192 -446634 -630039 -556304 -81847 397631 456642
12498D56642k46602M0539J0927j02070j46915p381K88398n841j87395Q8020r088
$$ 456642 210040 250579 261506 159436 12521 5140 293538 287697 100302 188322 179234
12487A79234j19683n84641o08024Q8202R33622J056102K68015l79124k95637j7177
$$ 179234 59551 -525090 -1133114 -1044912 -111290 944812 1212827 833703 538066 520889
12477E20889O0105K01858L17369r8473o27094n69018q3697L66473N69396J87732
$$ 520889 580994 782852 1100221 1001748 374654 -194364 -278061 88412 657808 845540
12467H45540j43200l00195j85245L3043j38070l07555r7583m2831q0913K07204
$$ 845540 702340 402145 216900 249943 111873 -195682 -293265 -336096 -417009 -209805
12457b09805J87725j68433j49266j01406N85249L64147j47258l68472m77308k77548
$$ -209805 -22080 -190513 -339779 -441185 144064 508211 360953 -7519 -484827 -762375
12447g62375j66260O03487N99751N5168K23182J36273k77294m09786k74404P6911
$$ -762375 -928635 -325148 274603 329771 552953 689226 411932 2146 -272258 -195347
12437a95347L79692J02049m38855n97998m86724Q9649J85207K90255L53563J94856
$$ -195347 184345 286394 -152461 -750459 -1237183 -1147534 -962327 -672072 -318509 -123653
12427a23653l20498l33554j55021j823L38072r846L6947N5829J78151P4547m05317
$$ -123653 -444151 -777705 -932726 -934549 -596477 -606323 -569376 -513547 -335396 -260849 -666166
12416f66166n72449l26040J66712K3833L53756M36642J77496L53619J99525J96128
$$ -666166 -1238615 -1564655 -1397943 -1374110 -1020354 -583712 -406216 -52597 146928 343056
12406C43056J72713J82386j18043m86344l61798M0080L33185L20110k73857K4438
$$ 343056 515769 698155 580112 93768 -268030 -227950 105235 425345 151488 175926
12396A75926P0J95279K94752j36016k48362j04858L36439J76199K46609L15941
$$ 175926 175996 371275 666027 530011 281649 176791 513230 689429 936038 1251979
12386A251979P8757R2336k20643m08979m38044o09796m36726k30359M7752O79556
$$ 1251979 1330736 1423072 1202429 793450 355406 -254390 -691116 -921475 -873723 -194167
12376a94167O35428N37053O14049L40651N82334J102821J271741J137579m68943
$$ -194167 441261 978314 1592363 1933014 2515348 3618169 4889910 6027489 5558546
12367E558546j816255j297096l99428L3287O1131r0494k09382k15069m07104M2170
$$ 5558546 3742291 2445195 2045767 2079054 2140185 2049691 1840309 1625240 1218136 1260306
12357A260306j0344o6390j32777n20872n81490L299N68025N58449N4248q45585
$$ 1260306 1249962 1183572 1050795 529923 -51567 -48268 519757 1078206 1132454 286869
12347B86869l84058L48469J86177j9465L02647P28479O52945J71473k70516n87113
$$ 286869 -97189 251280 437457 417992 720639 1449118 2102063 2273536 2003020 1415907
12337A415907p18992n87742k13854q3279K2133L66731N82888K40227j13432k54436
$$ 1415907 696915 109173 -104681 -187960 -165827 200904 783792 1024019 910587 656151
12327F56151n5706J39757m37415m33144r9550J89884J97532q0185J14512K33635
$$ 656151 600445 740202 302787 -130357 -229907 -40023 157509 77324 191836 425471
12317D25471L10725J57143j06647m95358l29477J02556L7530m43960Q0046M92869
$$ 425471 736196 893339 786692 291334 -38143 64413 101943 -342017 -261971 230898
12307B30898K52493J00522N45573Q8395r31943r30572j05487L83313k1256Q984
$$ 230898 483391 583913 1129486 1217881 285938 -644634 -750121 -366808 -388064 -379080
12297c79080J43939k78193o53122k90100J06176N89569J71765k47002K57104P50246
$$ -379080 -235141 -513334 -1166456 -1456556 -1350380 -760811 -589046 -836048 -578944 171302
12287A71302L97219k31455n89234r4860N36526M93289L58382J68074l55321m74952
$$ 171302 568521 337066 -252168 -347028 189498 682787 1041169 1209243 853922 378970
12277C78970j80056K82575J50745j51351l54595m49208P7165L48761J61378k61878
$$ 378970 198914 481489 632234 480883 126288 -322920 -245755 103006 264384 2506
12267B506j46584N2366J87740K24120R8757q9291l75461k76956N3995L07961K29197
$$ 2506 -144078 -91712 96028 320148 418905 329614 -45847 -322803 -268808 39153 268350
12256B68350j27697J35371k5720m00528l15141j01411L12487K36553L68261J94176
$$ 268350 140653 276024 250304 -150224 -465365 -566776 -254289 -17736 350525 544701
12246E44701J32310J29753j34385L05800M10375k05105l74153k34220j92690O404
$$ 544701 677011 806764 672379 978179 1388554 1183449 809296 575076 382386 388790
12236C88790j38258j08154Q8098L85509L93486M11654j16304p69875l52817n1978
$$ 388790 250532 142378 230476 615985 1009471 1421125 1304821 534946 182129 130151
12226A30151j14006m03187m36386m0758O12528K62943L53821M13216J64519o2969
$$ 130151 16145 -387042 -823428 -864186 -251658 11285 365106 778322 942841 879872
12216H79872p06758n14716J60209K62739K02418L97663k2261n12234k45717K49842
$$ 879872 173114 -341602 -181393 81346 283764 681427 659166 146932 -98785 151057
12206A51057Q43385N0360n46345L8973J97903J70371J41368j09281J1049r184
$$ 151057 994442 1044802 498457 537430 735333 905704 1047072 937791 948840 939656
12196I39656K90024L22233m46481o69007m47047q7299k7567K073r0680N4610M35304
$$ 939656 1229680 1551913 1105432 436425 -10622 -97921 -125488 -123415 -214095 -159485 275819
12185B75819K99593M0851k67911j28735j98402j85908R5142j92625j74774M1894
$$ 275819 575412 616263 348352 219617 21215 -164693 -69551 -262176 -436950 -395056
12175c95056O9924j13145l4853K8525k01386l39257J65525K22550K55055N59289
$$ -395056 -325132 -438277 -473130 -444605 -645991 -985248 -819723 -597173 -342118 217171
12165B17171R7293k67123k33947k1744m5065P5587L72687J02358n79693q36159
$$ 217171 314464 47341 -186606 -208350 -253415 -177828 194859 297217 -282476 -1118635
12155a118635l84139N94864M21278L73380R0932j9256M5671j4235L6740L95763
$$ -1118635 -1502774 -907910 -486632 -113252 -22320 -41576 4095 -10140 26600 422363
12145D22363L37544K79413p893m12872k27171j77744j59383q7396m6839o6389
$$ 422363 759907 1039320 1031427 618555 391384 213640 54257 -33139 -79978 -146367
12135a46367k98542O4281P53188M67604J86379j646k58724k78685n54052q83909
$$ -146367 -444909 -380628 372560 840164 1026543 1024897 766173 487488 -66564 -950473
12125i50473K71400Q22029j45083k71321J32082M97529M7625m93133m56761K18249
$$ -950473 -679073 142956 -2127 -273448 -141366 356163 403788 -89345 -546106 -327857
12115c27857J13928k88005m0316L35566M05781O53774K13923p12471n21258M3044
$$ -327857 -213929 -501934 -542250 -206684 199097 852871 1066794 354323 -166935 -123891
12105a23891l08579o01860j26987L51569K79378M71311K60904k00676Q2829K99843
$$ -123891 -432470 -1034330 -1161317 -809748 -530370 -59059 201845 1169 83998 383841
12095C83841L74141J38o8448j7901K83795L47337l61434n83209j93753k46272
$$ 383841 757982 758120 689672 671771 955566 1302903 941469 358260 164507 -81765
12085h1765k35343j58638J9175K55471J79916o421K7279k4671j38115j63215K04299
$$ -81765 -317108 -475746 -456571 -201100 -21184 -27605 -326 -24997 -163112 -326327 -122028
12074a22028K34933q2347j95943M1475M2827l04937k30782J8958J72745L20136
$$ -122028 112905 30558 -165385 -123910 -81083 -386020 -616802 -597844 -425099 -104963
12064a04963M95312L16157N3925r5436m48738n74671k81668k5322M8751K29873
$$ -104963 390349 706506 760431 664995 216257 -358414 -640082 -665404 -616653 -386780
12054c86780K69244p7563m57139l53486m00265j44987r00L50730O72018L42900
$$ -386780 -117536 -195099 -652238 -1005724 -1405989 -1550976 -1551876 -1201146 -529128 -186228
12044a86228K6152l0597K22489j22819j74299j05451l1281l9694l4092M81690
$$ -186228 -160076 -190673 31816 -91003 -265302 -370753 -402034 -441728 -475820 5870
12034E870L80406L25142n8419m29795k42755m20678j92792L9725j18673J39306
$$ 5870 386276 711418 652999 223204 -19551 -440229 -633021 -593296 -711969 -572663
12024e72663L98528M43378K31221k37831m95451j47594K98387K52378l7806k35106
$$ -572663 -174135 269243 500464 262633 -232818 -380412 -82025 170353 132547 -102559
12014a02559m31N03591L25764K38012l28204o10735k54181k08460l32028o4633
$$ -102559 -102990 400601 726365 964377 636173 25438 -228743 -437203 -769231 -833864
12004h33864J17493n8471L82931N84687K39514Q7599p2797r7323j82336j83809
$$ -833864 -716371 -774842 -391911 192776 432290 519889 447092 349769 167433 -16376
11994a6376l4220N3180J04304J83922J41053M04263N26194M35032q2691q68268
$$ -16376 -50596 2584 106888 290810 431863 836126 1362320 1797352 1714661 846393
11984H46393p41253m26117j37242o7239j65777j26657k05262r1666J35434L58058
$$ 846393 105140 -320977 -458219 -525458 -691235 -817892 -1023154 -1114820 -979386 -621328
11974f21328L59707K72079J63276K43839L06316K0093k9493j20528l01244J56398
$$ -621328 -261621 10458 173734 417573 723889 743982 714489 593961 292717 449115
11964D49115J34270J60514k82836m09084j34816j2502m9093m35106K2786K14620
$$ 449115 583385 743899 461063 51979 -82837 -95339 -144432 -579538 -556752 -342132
11954c42132J40378L16622n3308l38607L1381K43217j08102k04548L1014M34067
$$ -342132 -201754 114868 61560 -277047 -245666 -2449 -110551 -315099 -284085 149982
11944A49982J76110j60004m19954j04857J63813j26564p7880J4891J39525l6626
$$ 149982 326092 166088 -253866 -358723 -194910 -321474 -399354 -384463 -244938 -281564
11934b81564M03559J91862k0662K11912r2134k80228J87220j30502m29252l51081
$$ -281564 121995 313857 293195 505107 412973 132745 319965 189463 -239789 -590870
11924e90870m2904l4818R6867n2519Q0771L75568K8772q0843p3881k99090N6370
$$ -590870 -633774 -668592 -571725 -624244 -543473 -167905 -139133 -219976 -293857 -592947 -536577
11913e36577M54153M1013k70214k76410p9427o2523K01955K87633L42277k51466
$$ -536577 -82424 -41411 -311625 -588035 -667462 -729985 -528030 -240397 101880 -149586
11903a49586k7498K8184j93121l26296l2026O2561K30023K99239L53060M15537
$$ -149586 -177084 -148900 -342021 -668317 -700343 -637782 -407759 -108520 244540 660077
11893F60077J236m09708n8919P5181K08990n7760j18745o6763l43895l05436l9363
$$ 660077 661313 251605 192686 267867 476857 419097 300352 233589 -110306 -415742 -455105
11882d55105J7634o3122n0035N51835K80182k99866j07345K17481J25059k98342
$$ -455105 -437471 -500593 -550628 1207 281389 -18477 -125822 91659 216718 -81624
11872h1624r06921o84032L72104O24624L79889Q1559j89242k71195K7761j9921
$$ -81624 -988545 -1672577 -1300473 -675849 -295960 -214401 -403643 -674838 -647077 -666998
11862f66998J1333l2097J98029K77626J0178m07808J95362K53025k39922j04947
$$ -666998 -655665 -687762 -489733 -212107 -201929 -609737 -414375 -161350 -401272 -506219
11852e06219J84749J92360l294n7553m5694j50463p1208J64010J26426L7959k20907
$$ -506219 -321470 -129110 -132404 -189957 -235651 -386114 -457322 -293312 -166886 -128927 -349834
11841c49834m8750L66183M03417j95082m8581L91825K31503L7183j66474j4089
$$ -349834 -398584 -32401 371016 175934 127353 519178 750681 787864 621390 607301
11831F07301L15088J02302m14077l05464m37345k97678j16087L44877K93445k25713
$$ 607301 922389 1024691 610614 305150 -132195 -429873 -545960 -201083 92362 -133351
11821a33351r8112R0315O072L4812j48675J91525n4990Q5609J25289k37540Q7128
$$ -133351 -231463 -141148 -135076 -100264 -248939 -57414 -112404 -26795 98494 -139046 -51918
11810e1918N65610M58131R7417p3768k88914o25247l65421J05295M01340K05111
$$ -51918 513692 971823 1069240 995472 706558 81311 -284110 -178815 222525 427636
11800D27636N3520L65113L79133l3860j88005p49443o11490m80702n99228m783
$$ 427636 481156 846269 1225402 1191542 1003537 254094 -357396 -838098 -1437326 -1442109
11790a442109J50745K18731O4219J66586O984J17357K87160J13223n7967j53987
$$ -1442109 -1291364 -1072633 -1008414 -841828 -834844 -717487 -430327 -317104 -375071 -529058
11780e29058L8296Q7663M09555J14743j49986k7539k6485l02087j06654K9417
$$ -529058 -490762 -403099 6456 121199 -28787 -56326 -82811 -384898 -491552 -462135
11770d62135K07961K56566K81276J16153j4561p2514j62242r1184P6136j48678
$$ -462135 -254174 2392 283668 399821 385260 312746 150504 59320 135456 -13222
11760a3222k08432J14331J06799J35980L04295Q9116J6988j4562m33687m39203
$$ -13222 -221654 -107323 -524 135456 439751 528867 545855 531293 97606 -341597
11750c41597j73736J6770N0983J10425J75684k44391l62913m1282L19484K96348
$$ -341597 -515333 -498563 -447580 -337155 -161471 -405862 -768775 -810057 -490573 -194225
11740a94225J42940M11372N40056M48452J32274k48835m0284p50250j032946J7567
$$ -194225 -51285 360087 900143 1348595 1480869 1232034 1191750 441500 -591446 -573879
11730e73879N9038j47441k19535K50991k01784k44194J70167K97485N07047J8689
$$ -573879 -514841 -662282 -881817 -630826 -832610 -1076804 -906637 -609152 -102105 -83416
11720h3416m39433l42455L5900L62210P02179N90801j12771m17394p98598k93218
$$ -83416 -522849 -865304 -829404 -467194 234985 825786 713015 295621 -502977 -796195
11710g96195J64823K65157K84448R0313p0726j37502j80224k2802j73173l02208
$$ -796195 -631372 -366215 -81767 8546 -62180 -199682 -379906 -402708 -575881 -878089
11700h78089j24536L410L64860L93067j04662l77348K34969Q98737L11982o52478
$$ -878089 -1002625 -999215 -634355 -241288 -345950 -723298 -488329 410408 722390 69912
11690F9912n69077J23618O298j89343q1839J51185r5846K8704L63376K30191r0203
$$ 69912 -499165 -375547 -369249 -558592 -640431 -489246 -585092 -556388 -193012 37179 -53024
11679e3024O6783R8036j44291l58218p90241l06580Q79695J166182N58217K12419
$$ -53024 13759 111795 -32496 -390714 -1180955 -1487535 -607840 558342 1116559 1328978
11669A328978k22921p56311l24641K63232J26237L7424K29449L84463j39170m88974
$$ 1328978 1106057 349746 25105 288337 414574 451998 681447 1065910 926740 437766
11659D37766k73324m86354k66152J59856K66902L21062l58695n55518K36445K71771
$$ 437766 164442 -321912 -588064 -428208 -161306 159756 -198939 -754457 -518012 -246241
11649b46241m810J94150J32992K26603k78456o03274l4066O26480N06955k08634
$$ -246241 -251051 -56901 76091 302694 24238 -579036 -613102 13378 520333 311699
11639C11699l48596j96099K03871M5572r2983n297L4431J54633k08116n87463
$$ 311699 -36897 -232996 -29125 16447 -76536 -81833 -47402 107231 -100885 -688348
11629f88348l6035Q8273j6632K65458J42920K62678L06587J08669L4021o9845
$$ -688348 -724383 -636110 -652742 -387284 -244364 18314 324901 433570 467591 397746
11619C97746k52972j35448p66638l13368O78610N51879J50118K36350K51773J9796
$$ 397746 144774 9326 -757312 -1070680 -392070 159809 309927 546277 798050 817846
11609H17846k6210k35882R4733L51581K78022M32554K40102m31989o06298n82100
$$ 817846 791636 555754 650487 1002068 1280090 1712644 1952746 1520757 914459 332359
11599C32359m38535k55317p2486r9068K92612O04580K4825m903J23031J96625
$$ 332359 -106176 -361493 -433979 -533047 -240435 364145 388970 384067 507098 703723
11589G03723n7197m61792p43846m49404j04450J06374K62288M85484N12678M2621
$$ 703723 646526 184734 -559112 -1008516 -1112966 -1006592 -744304 -258820 253858 296479
11579B96479N3794N8208n5542l65220j22028m716p1989K64332M2589N1111L5152
$$ 296479 350273 408481 352939 -12281 -134309 -139025 -211014 53318 95907 147018 182170
11568A82170p2391j95383k45461o3376p2606q1377K9615J83900J85145J06722
$$ 182170 109779 -85604 -331065 -394441 -467047 -548424 -518809 -334909 -149764 -43042
11558d3042L54652P37294M06628K92656l30757r52008o52349l4418M31072J34778
$$ -43042 311610 1048904 1455532 1748188 1417431 465423 -186926 -221344 209728 344506
11548C44506j91454k31894O358J23197R2265Q2185L0202j45868J80810L06249
$$ 344506 153052 -78842 -72484 50713 142978 225163 255365 109497 290307 596556
11538E96556m41348n75735L2667J99520L63670P9207p3379K64144j30424l6214
$$ 596556 155208 -420527 -387860 -188340 175330 254537 181158 445302 314878 278664
11528B78664Q00757M63559k12445l65537k97163p2251k19854o32977m84789j0429
$$ 278664 1079421 1542980 1330535 964998 667835 595584 375730 -257247 -742036 -752465
11518g52465J63456r4447n0156J9102j1589J35935L22546L84848M84405j05288
$$ -752465 -589009 -683456 -733612 -714510 -726099 -590164 -267618 117230 601635 496347
11508D96347L6829L78411l36448m45583K0182L97950N40105J45444l49229l63589
$$ 496347 533176 911587 575139 129556 149738 547688 1087793 1233237 884008 520419
11498E20419m58053o27428l13372L39456M65963J84388k4711m23229r48794k83559
$$ 520419 62366 -565062 -878434 -538978 -73015 111373 86662 -336567 -1285361 -1568920
11488a568920L20565K91315M48969N02789K55315p6704l37647L00427N96989j88478
$$ -1568920 -1248355 -957040 -508071 -5282 250033 173329 -164318 136109 733098 544620
11478E44620k97681R9711l55050l97952M5368m3247j87782l42672l76250P1842
$$ 544620 246939 346650 -8400 -406352 -360984 -404231 -592013 -934685 -1310935 -1239093
11468a239093K39782J91329K50575J35287L03497N51505K7308j14084q8530J8618
$$ -1239093 -999311 -807982 -557407 -422120 -118623 432882 460190 346106 257576 276194
11458B76194L89032M27110P4883k27510k47919n6924J37343M1023j4979j30105
$$ 276194 665226 1092336 1167219 939709 691790 634866 772209 813232 798253 668148
11448F68148j94926p7989Q4135k51223k99706J95858M27996j5362l58673n67368
$$ 668148 473222 395233 479368 228145 -71561 124297 552293 536931 178258 -389110
11438c89110k57592N29775P41951N75837k20902j190042p67287m628N57557K16324
$$ -389110 -646702 -116927 625024 1200861 979959 -210083 -977370 -981998 -424441 -208117
11428b08117q6297J36378R229J5175K52838k4275n20261j93593M44881L37292
$$ -208117 -294414 -158036 -148807 -133632 119206 94931 -425330 -618923 -174042 163250
11418A63250o8534k47000N3493N29940M21224J71556m66540o80503n97635k91299
$$ 163250 94716 -152284 -98791 431149 852373 1023929 557389 -123114 -720749 -1012048
11408a012048P3205l04713j70543N74078L31550k83731j59772K8620J89878k5382
$$ -1012048 -938843 -1243556 -1414099 -840021 -508471 -792202 -951974 -923354 -733476 -758858
11398g58858j224L54416L01625J97060L44788j21083m03223K85727K51157j46307
$$ -758858 -760082 -405666 -104041 93019 437807 316724 -86499 199228 450385 304078
11388C04078l08501j86864J25270j0456j20415M4855l18566k21019K65508K56005
$$ 304078 -4423 -191287 -66017 -76473 -196888 -152033 -470599 -691618 -426110 -170105
11378a70105J23913m00501k71562m9951m87769q1581J66182M23798P59071N14516
$$ -170105 -46192 -446693 -718255 -768206 -1255975 -1337556 -1171374 -747576 11495 526011
11368E26011l8767k65985j36094l36636m78657j83108k81931p1442M71403J04605
$$ 526011 487244 221259 85165 -251471 -730128 -913236 -1195167 -1266609 -795206 -690601
11358f90601k99375j57174N630J73780J45694k29343j38106j41853J92277N41532
$$ -690601 -989976 -1147150 -1141520 -967740 -822046 -1051389 -1189495 -1331348 -1139071 -597539
11348e97539N33423N13498o6135q8815k19212m39764m39347r8013O2977N1727
$$ -597539 -64116 449382 383247 294432 75220 -364544 -803891 -901904 -838927 -787200
11338g87200P4442L49810M35661K8262l64455m70668p21630l41914J83840M38139
$$ -787200 -712758 -362948 72713 100975 -263480 -734148 -1455778 -1797692 -1613852 -1175713
11328a175713O04449N10309K00121j72434Q9919j5975k09478k40095m30868q3770
$$ -1175713 -571264 -60955 139166 -33268 56651 40676 -168802 -408897 -839765 -923535
11318i23535K73573L4821k31371R8954L01615J93041M3707L33108N04812L94373
$$ -923535 -649962 -615141 -846512 -747558 -445943 -252902 -209195 123913 628725 1023098
11308A023098M14425j68611l43178n7226N9962k148m37527n20160n6624L35582
$$ 1023098 1437523 1268912 925734 868508 928470 926322 488795 -31365 -87989 247593
11298B47593J11313J82389j64024k73756j89680j35988j5119O612L11825K36901
$$ 247593 358906 541295 377271 103515 -86165 -222153 -237272 -230660 81165 318066
11288C18066n61238k79479J76480j09722J3630J91456k4855k13050L90053O18033
$$ 318066 -243172 -522651 -346171 -455893 -442263 -250807 -275662 -488712 -98659 519374
11278E19374N211l08092m36662m78096J81579M08648k999j66123j15292l77989
$$ 519374 524585 216493 -220169 -698265 -516686 -108038 -111037 -277160 -392452 -770441
11268g70441K72725R96089O86778l89820n59124j40084R7494n89657n17099O9078
$$ -770441 -497716 498373 1185151 795331 236207 96123 193617 -396040 -913139 -844061
11258h44061L81294P57208N58281M0754m64925o88418n62510K99257R59533O04968
$$ -844061 -462767 294441 852722 893476 428551 -259867 -822377 -523120 436413 1041381
11248A041381q7652l41279l10832J87288L16367k35664k76105p0953j25804k06257
$$ 1041381 953729 612450 301618 488906 805273 569609 293504 222551 96747 -109510
11238a09510j02858N3989Q8569L4267n2916J95938K03177m1313K6857j87147j36729
$$ -109510 -212368 -158379 -69810 -35543 -88459 107479 310656 269343 296200 109053 -27676
11227b7676Q2856l771q4070l19513J92257K67614m61365j80029J81733J89108
$$ -27676 55180 51409 -32661 -352174 -159917 107697 -353668 -533697 -351964 -162856
11217a62856j18131l97023P3564N76783M26450Q5977k49795j93990k26090k25805
$$ -162856 -280987 -678010 -604446 -27663 398787 484764 234969 40979 -185111 -410916
11207d10916O6474K59204J54137M2065K85257j09556l11438p0236m51387j21802
$$ -410916 -344442 -85238 68899 110964 396221 286665 -24773 -95009 -546396 -668198
11197f68198K83009J59442O43722M50372L6247l02685j40591p5151j22186n4481
$$ -668198 -385189 -225747 417975 868347 904594 601909 461318 386167 263981 209500
11187B09500M8714J37858n08j57674m64149o09916K37240M06429l32343k86587
$$ 209500 258214 396072 395564 237890 -226259 -836175 -598935 -192506 -524849 -811436
11177h11436L86332M39246L07235M3676o6506j99262o988L17793J30152l79140
$$ -811436 -425104 14142 321377 365053 298547 99285 92297 410090 540242 161102
11167A61102l45181k26818m37516J33193K52945M78572L73170k25040m1218J72904
$$ 161102 -184079 -410897 -848413 -715220 -462275 16297 389467 164427 123209 296113
11157B96113r9307R2591p097O5813N6795L3338k99976j96164J34794K74215P0678
$$ 296113 196806 289397 282300 348113 404908 438246 138270 -57894 76900 351115 421793
11146D21793l73381k07402M48832R8406n43134l39354j32936o7072k6044P8859
$$ 421793 48412 -158990 289842 388248 -154886 -494240 -627176 -694248 -720292 -641433
11136f41433L44716K12039L4018l1218M4888k13909j74619p187j28387j84685
$$ -641433 -296717 -84678 -50660 -81878 -36990 -250899 -425518 -432705 -561092 -745777
11126g45777J712J83247J81853J66205M70872M23665K10817o4003j00437l21444
$$ -745777 -744065 -560818 -378965 -212760 258112 681777 892594 828591 728154 406710
11116D06710m29868k51620j56157Q5099M80490N59289L84411L44331J66940q8381
$$ 406710 -23158 -274778 -430935 -345836 134654 693943 1078354 1422685 1589625 1501244
11106A501244k7360k9514O4230q3146j99502j30345n71044p33210m46608p048
$$ 1501244 1473884 1444370 1508600 1425454 1225952 1095607 524563 -208647 -655255 -662303
11096f62303M82268J62739k54827l52311m29537p9564L65451J52507l8316K41659
$$ -662303 -180035 -17296 -272123 -624434 -1053971 -1133535 -768084 -615577 -653893 -412234
11086d12234M24036R0580l05286n08882j53970j47148l5345k64559k06757R7055
$$ -412234 11802 102382 -202904 -711786 -865756 -1012904 -1048249 -1312808 -1519565 -1422510
11076a422510p6920L03989N73808N77138Q202o95646m41682L64671L21030J79952
$$ -1422510 -1499430 -1195441 -621633 -44495 -36293 -731939 -1173621 -808950 -487920 -307968
11066c07968L132J36451M01042K2756l50289k0173l6839k02198P2842N91511J81278
$$ -307968 -304836 -168385 232657 255413 -94876 -115049 -151888 -354086 -281244 310267 491545
11055D91545l54297l69609m29192j10057O61584O69538j07664n44574l81294j60135
$$ 491545 137248 -232361 -661553 -771610 -110026 559512 451848 -92726 -474020 -634155
11045f34155L09744M07853P8892j97804p9503J33273j4958j08498m2845M26247
$$ -634155 -324411 83442 162334 -35470 -114973 18300 3342 -105156 -148001 278246
11035B78246N72090P8498j96234j98089j52053q0018p9976L5474L45441j20330
$$ 278246 850336 928834 732600 534511 382458 302440 222464 257938 603379 483049
11025D83049p29582o12348M2452K14569L76768K28507l81593k73997K61213M81700
$$ 483049 -246533 -858881 -816429 -601860 -225092 3415 -378178 -652175 -390962 90738
11015I0738K18202k22541j39566j25597j49010J64390M59200K57235k17821l45490
$$ 90738 308940 86399 -53167 -178764 -327774 -163384 295816 553051 335230 -10260
11005a0260l75722n3533L54782O67667J95607m83910K3489J07728q6096q5525
$$ -10260 -385982 -439515 -84733 582934 778541 294631 318120 425848 339752 254227
10995B54227j1986q2780j77251m88819l88924j48130L58288N7879J12278J26277
$$ 254227 242241 159461 -17790 -506609 -895533 -1043663 -685375 -627496 -515218 -388941
10985c88941j33667J74575l8781l5772J55594K17801L24450M13626J13068j67895
$$ -388941 -522608 -348033 -386814 -422586 -266992 -49191 275259 688885 801953 634058
10975F34058l72552K11257O8010l32983L0450j53151m86608q786L15730K14905
$$ 634058 261506 472763 540773 207790 238240 85089 -401519 -410305 -94575 120330
10965A20330k8316R4830o7182o2251k2542j77596l07808k46195l16615l01671
$$ 120330 92014 186844 119662 57411 34869 -142727 -450535 -696730 -1013345 -1315016
10955a315016K27417K11524m9630k93836j54204o9583K40040N12451J86883k08357
$$ -1315016 -1087599 -876075 -925705 -1219541 -1373745 -1443328 -1203288 -690837 -503954 -712311
10945g12311k9598M08146K66691P6289j46803l07701J9614l5577R2860N16431
$$ -712311 -741909 -333763 -67072 9217 -137586 -445287 -425673 -461250 -368390 148041
10935A48041J67560j37176p3044k03290l52065k72891r7510M90748M37744M9381
$$ 148041 315601 178425 105381 -97909 -449974 -722865 -820375 -329627 108117 157498
10925A57498K42751p6506k95039P1272L79714K17427m960l00424n43208k05239
$$ 157498 400249 323743 28704 99976 479690 697117 692157 391733 -151475 -356714
10915c56714M28834r1899k09591k26662k76589K23547J81067J02296K5278j09381
$$ -356714 72120 -19779 -229370 -456032 -732621 -509074 -328007 -225711 -200433 -309814
10905c09814l16492j60729j87811O7380L69839j09463L8578L09784j10162r1061
$$ -309814 -626306 -787035 -974846 -907466 -537627 -647090 -608512 -298728 -408890 -499951
10895d99951r7026L6853K75439K75739P109m00754l95432j64757j91480N4575
$$ -499951 -596977 -560124 -284685 -8946 -1837 -402591 -798023 -962780 -1154260 -1099685
10885a099685O8390J03710K28577J10427J39071l5784p5818l54108k13283K05364
$$ -1099685 -1031295 -927585 -699008 -588581 -449510 -485294 -561112 -915220 -1128503 -923139
10875i23139L52739K71898K69019L75789K90342p8864j79871l56540q0632k77183
$$ -923139 -570400 -298502 -29483 346306 636648 557784 377913 21373 -59259 -336442
10865c36442n69763K92028M39497J77624L93010J61702L20618k0823n32675m25285
$$ -336442 -906205 -614177 -174680 2944 395954 557656 878274 857451 324776 -100509
10855a00509p0119J82345m5396N34716N80831n48637m84293P9443k42892l12189
$$ -100509 -170628 11717 -33679 501037 1081868 533231 48938 128381 -114511 -426700
10845d26700j30379J21321K81535P1354J56767R1317k77200o709K61253j56053
$$ -426700 -557079 -435758 -154223 -82869 73898 165215 -111985 -118694 142559 -13494
10835a3494n55463k91514J57169J71078M8905J20787M50213J48842k44241k93905
$$ -13494 -568957 -860471 -703302 -532224 -483319 -362532 87681 236523 -7718 -301623
10825c01623l57376O5809M07258K27858m5072j36223l02832k40364J20003O9544
$$ -301623 -658999 -593190 -185932 41926 -3146 -139369 -442201 -682565 -562562 -493018
10815d93018K8174J6067j66824m2482k14109K81521M86181K603q395J32476K43672
$$ -493018 -464844 -448777 -615601 -658083 -872192 -590671 -104490 -101887 -110282 22194 265866
10804B65866K65723Q0855j37785k76355l77153l99390J58950M77917K4609l85449
$$ 265866 531589 612444 474659 198304 -178849 -578239 -419289 58628 83237 -302212
10794c02212m12611l16708J46315K60480l8089N46901M20271m8143j97859k84956
$$ -302212 -714823 -1031531 -885216 -624736 -662825 -115924 304347 256204 58345 -226611
10784b26611J66278J84011K17184Q0319j4014J04930J41113L0589n64389l90125
$$ -226611 -60333 123678 340862 421181 407167 512097 653210 683799 119410 -270715
10774b70715K02220L07308l5809l33648l3094L55393K05843J38524o6927j24783
$$ -270715 -68495 238813 203004 -130644 -163738 191655 397498 536022 469095 344312
10764C44312o54401n41334P7567J23063K71771L93415N05909L1349k33406Q2949
$$ 344312 -310089 -851423 -773856 -650793 -379022 14393 520302 551651 318245 401194
10754D01194m8208n4523J62099J40694k27767r5933L34902L05968L1637p9586
$$ 401194 352986 298463 460562 601256 373489 277556 612458 918426 950063 870477
10744H70477L17140p952j68061k21416l44990l44733k0340L16920K72345o7428
$$ 870477 1187617 1179665 1011604 790188 445198 100465 80125 397045 669390 601962
10734F01962k86291j14266J53093M08982O27957O19379Q14959J155407R96539
$$ 601962 315671 201405 354498 763480 1391437 2010816 2825775 3981182 4977721
10725D977721N87553L93066l2093o49577q34264r79482j062647q79661p41138
$$ 4977721 5565274 5958340 5926247 5276670 4442406 3462924 2400277 1520616 779478
10716G79478m74984Q8200J7604R4630M79068K4724m16698j48369J10936L47528
$$ 779478 304494 392694 410298 504928 983996 1008720 592022 443653 554589 902117
10706I02117P8400j97619j80731l16050O9194n7875l01273k12052n6192j50308
$$ 902117 980517 782898 602167 286117 355311 297436 -3837 -215889 -272081 -422389
10696d22389K59162R1817m27539l58058L65851J88905m5405L36448K54261K05648
$$ -422389 -163227 -71410 -498949 -857007 -491156 -302251 -347656 -11208 243053 448701
10686D48701K28891K17102N6631Q7245J0748j75555k04765k61651j17801k40848
$$ 448701 677592 894694 951325 1038570 1049318 873763 668998 407347 289546 48698
10676D8698O6779L36219j55643j85054L80051M87950J33840m44070l86487k50292
$$ 48698 115477 451696 296053 110999 491050 979000 1112840 668770 282283 31991
10666C1991o9842m23069j47905L46992J37265k49223j61260R4460J36045L10810
$$ 31991 -37851 -460920 -608825 -261833 -124568 -373791 -535051 -440591 -304546 6264
10656F264M77465J80961M6439J83061j01027j89071j01877l9147q3245j42433
$$ 6264 483729 664690 711129 894190 793163 604092 502215 463068 379823 237390
10646B37390j43578l20774m40192L3068J34415N9620n3461M81209K80380l31132
$$ 237390 93812 -226962 -667154 -634086 -499671 -440051 -493512 -12303 268077 -63055
10636f3055m54864J11848O78036K54811m19297n46857J1414K01674N5828l15893
$$ -63055 -517919 -406071 271965 526776 107479 -439378 -427964 -226290 -170462 -486355
10626d86355r5415K34041j48019m0245M60324K62396K47925K24195J44065J84297
$$ -486355 -581770 -347729 -495748 -535993 -75669 186727 434652 658847 802912 987209
10616I87209j80490n20534l68613K7149K11009Q202q6498p1555j47212j3128n1293
$$ 987209 806719 286185 -82428 -55279 155730 163932 77434 5879 -141333 -154461 -205754
10605b05754j2634J30889l7878J92940O23223L34224J05253j69876j74749k3192
$$ -205754 -218388 -87499 -125377 67563 690786 1025010 1130263 960387 785638 762446
10595G62446p0249m56212j93323K6726o4868j73446p950r7610M7186m44862n15549
$$ 762446 692197 235985 42662 69388 4520 -168926 -176876 -274486 -227300 -672162 -1187711
10584a187711J93808N27537L84509P7606o4928j712J29773p86l4833m9744O9833
$$ -1187711 -993903 -466366 -81857 -4251 -69179 -70891 58882 58096 23263 -26481 43352
10573D3352K84423l0473j86438M55k04168l99223Q2906Q4393j09384n5338k83456
$$ 43352 327775 297302 110864 111319 -92849 -492072 -409166 -324773 -434157 -489495 -772951
10562g72951K44622M00384j39386j57355L90952R1831J43513N54885K80474p7100
$$ -772951 -528329 -127945 -267331 -424686 -33734 58097 201610 756495 1036969 959869
10552I59869n67832k03118J30673J14224j38793k99078j01832L05423M33368K52896
$$ 959869 392037 188919 319592 433816 295023 -4055 -105887 199536 632904 885800
10542H85800k51698m70642j57487k2153o0222j92132J9576K99879N68660M98168
$$ 885800 634102 163460 5973 -16180 -76402 -268534 -248958 50921 619581 1117749
10532A117749k50003m37128j80359J5826L46635M04603Q4922l10181m29010m34998
$$ 1117749 867746 430618 250259 266085 612720 1017323 1102245 792064 363054 -71944
10522g1944m4579J03177l44084k70920J03144K74098M78380J93501j97670n66110
$$ -71944 -116523 -13346 -357430 -628350 -525206 -251108 227272 420773 223103 -343007
10512c43007q69446j54091J35833M33034K74958j92115J74608L09643j131M008
$$ -343007 -1212453 -1366544 -1230711 -797677 -522719 -714834 -540226 -230583 -231714 -227706
10502b27706j54163m83582j53718L4450P7150J39986l0230j32466L15123N17517
$$ -227706 -381869 -865451 -1019169 -984719 -907569 -767583 -797813 -930279 -615156 -97639
10492i7639N44387N07000P4368k16520m47990j01231K12367m96366l71110J30128
$$ -97639 446748 953748 1028116 811596 363606 262375 474742 -21624 -392734 -262606
10482b62606J98663K26964j11431k31655K36459M22063L43807L67876K20304l36389
$$ -262606 -63943 163021 51590 -180065 56394 478457 822264 1190140 1410444 1074055
10472A074055n34551k51547L6700j59691L22458P7445p080k19692j64149n8235
$$ 1074055 539504 287957 324657 164966 487424 564869 557789 338097 173948 115713
10462A15713k25357j99507n8374j29514j36163o6956L30523L12872m7280k87259
$$ 115713 -109644 -309151 -367525 -497039 -633202 -700158 -369635 -56763 -104043 -391302
10452c91302o66136j04678N3399L5137n9458M08197J94459O7984K20696O2448
$$ -391302 -1057438 -1162116 -1108717 -1073580 -1133038 -724841 -530382 -462398 -241702 -179254
10442a79254j27944k29380j24106K72803N45766N35799J04391q2104P85j11995
$$ -179254 -307198 -536578 -660684 -387881 157885 693684 798075 715971 716756 604761
10432F04761L05538K22914k48132m30567o56295p09132M5105L29422J56861k19333
$$ 604761 910299 1133213 885081 454514 -201781 -910913 -865808 -536386 -379525 -598858
10422e98858k39117k97305n451L66705J23160J37309R0163j21582k70403K30297
$$ -598858 -837975 -1135280 -1140731 -774026 -650866 -513557 -423394 -544976 -815379 -585082
10412e85082L73499J04746L43137L385l72374j07405j82810p00124o01823K57408
$$ -585082 -211583 -106837 236300 239685 -132689 -240094 -422904 -1123028 -1724851 -1467443
10402a467443M19588N21110M28561P9015j56696k62010m35667j31699M88257M91964
$$ -1467443 -1047855 -526745 -98184 -19169 -175865 -437875 -873542 -1005241 -516984 -25020
10392b5020M57617L68067j18214l68048k16087K30260N0796O4206M65877M22616
$$ -25020 432597 800664 682450 314402 98315 328575 379371 443577 909454 1332070
10382A332070K4601n10238n67574k38936Q1661L61439l2905j56995j73703k54626
$$ 1332070 1356671 846433 278859 39923 121584 483023 450118 293123 119420 -135206
10372a35206j23561n247k2640L8605j10828j94534j48338k35189r7262j36503
$$ -135206 -258767 -264014 -286654 -248049 -358877 -553411 -701749 -936938 -1034200 -1170703
10362a170703j22822p309K90937M42602M80045K35284J15174k01607m54174m35728
$$ -1170703 -1293525 -1300834 -1009897 -567295 -87250 148034 263208 61601 -392573 -828301
10352h28301k97956K3044J70853r6548O3644J63006M6779R4723J06864J83642
$$ -828301 -1126257 -1103213 -932360 -1028908 -965264 -802258 -755479 -660756 -553892 -370250
10342c70250K18205r7912l59374l91356l2904L4455J23090L88331L12498j41535
$$ -370250 -152045 -249957 -609331 -1000687 -1033591 -999136 -876046 -487715 -175217 -316752
10332c16752k81039p4505L27583O73866R4634J3984j14822q4883K36242K85287
$$ -316752 -597791 -672296 -344713 329153 423787 437771 322949 238066 474308 759595
10322G59595k30817n56294m39389O4537M40564J98971j74336j52985Q5038P0310
$$ 759595 528778 -27516 -466905 -402368 38196 237167 62831 -90154 -5116 65194
10312F5194l47935K1255M18819K77399n3035j97003M8660o7581J57416O3815k01977
$$ 65194 -282741 -261486 157333 434732 381697 184694 233354 165773 323189 387004 185027
10301A85027j50702k43053K88482N62533J24814n61999l75859K70225L62306R0481
$$ 185027 34325 -208728 79754 642287 767101 205102 -170757 99468 461774 552255
10291E52255n35775m27432m54328k99185K18820J06556K54578K07311j57758L35196
$$ 552255 16480 -410952 -865280 -1164465 -945645 -839089 -584511 -377200 -534958 -199762
10281a99762J31539n16389j61359M43835L33826j4409K67873L99864J7986J44856
$$ -199762 -68223 -584612 -745971 -302136 31690 17281 285154 685018 703004 847860
10271H47860M08023L85845K9727J497j96683o88425n66295j20023J86400J10739
$$ 847860 1255883 1641728 1671455 1672952 1476269 787844 221549 101526 287926 398665
10261C98665j82562q0183r3902m47213k2678m7383j00410N0867K69360L6367N1158
$$ 398665 216103 135920 42018 -405195 -427873 -475256 -575666 -524799 -255439 -219072 -167914
10250a67914K57949M2292j12061K04213L33346M25360J98104O645j99173n27227
$$ -167914 90035 132327 20266 224479 557825 983185 1181289 1187934 988761 461534
10240D61534m02738K02728N64570K6433n09851m1073O30046K86162l86912o57141
$$ 461534 58796 261524 826094 852527 342676 301603 931649 1217811 830899 173758
10230A73758k506J74963J98624R2016J08820k70688n85052J73686J67363k40158
$$ 173758 171252 346215 544839 636855 745675 474987 -110065 63621 230984 -9174
10220i174j54833K02965j40412m49275m77385l19094J17369L21121L2621R2946
$$ -9174 -164007 38958 -101454 -550729 -1028114 -1347208 -1229839 -908718 -876097 -783151
10210g83151M68543J83190o4224q8433P2175o8197J5093l5313j48308L23553M54121
$$ -783151 -314608 -131418 -195642 -284075 -211900 -280097 -265004 -300317 -448625 -125072 329049
10199C29049J46509m74442o31940R247K83917K35676J18177l60176m35685J7220
$$ 329049 475558 1116 -630824 -621577 -337660 -101984 16193 -343983 -779668 -762448
10189g62448K08628K27988n0331n7923P7639m7058J41888L82164Q835j68585K79356
$$ -762448 -553820 -325832 -376163 -434086 -356447 -403505 -261617 120547 129382 -39203 240153
10178B40153P4500J12769K16728P2893K49848k68964l68993n17518l96294k98380
$$ 240153 314653 427422 644150 717043 966891 697927 328934 -188584 -584878 -883258
10168h83258o31488m84325L51000Q09591M79594L44367j94517O4470K87189K3320
$$ -883258 -1514746 -1999071 -1648071 -838480 -358886 -14519 -209036 -144566 142623 165943
10158A65943l34136n76831j49110L92545L02894r0197J87454K43486l21223m15793
$$ 165943 -168193 -745024 -894134 -501589 -198695 -288892 -101438 142048 -179175 -594968
10148e94968J07145J90936k4811J12742M27363M65297R0177j11475Q7167m2305
$$ -594968 -487823 -296887 -321698 -208956 218407 683704 773881 662406 749573 707268
10138G07268l59585l54612j84055r948p347Q8005M55950N14788l6026l13094K65926
$$ 707268 347683 -6929 -190984 -200932 -208279 -120274 335676 850464 814438 501344 767270
10127G67270p2348k54558k39091k67096J33036K22674K00902j88371q04659n55928
$$ 767270 694922 440364 201273 -65823 67213 289887 490789 302418 -502241 -1058169
10117a058169P0694M65515K48494o4410j97280m20333j01902K32906J82303j00242
$$ -1058169 -987475 -521960 -273466 -337876 -535156 -955489 -1057391 -824485 -642182 -742424
10107g42424j08955j01076K51623M46031m5314j4879k07117j12710L31705J72669
$$ -742424 -851379 -952455 -700832 -254801 -300115 -314994 -522111 -634821 -303116 -130447
10097a30447j59884m56691K78849R91933N70397L0284j06199q7781k79305n81282
$$ -130447 -290331 -747022 -468173 523760 1094157 1124441 1018242 930461 651156 69874
10087F9874J2276L92748j2868k55344m64051l05754r4344l2385k39254j31493
$$ 69874 82150 474898 462030 206686 -257365 -563119 -657463 -689848 -929102 -1060595
10077a060595L05259N82764L59080o1267J26813J13308j48436k13464l3355J91212
$$ -1060595 -755336 -172572 186508 125241 252054 365362 216926 3462 -29893 161319
10067A61319J36040l94524l99474K94773M56297M2118n56591l34434J20758Q1184
$$ 161319 297359 -97165 -496639 -201866 254431 296549 -260042 -594476 -473718 -392534
10057c92534J66640N5230k22128Q8484R2780J07631j88486j79565K63119O1056
$$ -392534 -225894 -170664 -392792 -304308 -211528 -103897 -292383 -471948 -208829 -147773
10047a47773k03718k47014M2833K10319j91349j06747M32874P00039J73209p1432
$$ -147773 -351491 -598505 -555672 -345353 -536702 -643449 -210575 489464 662673 591241
10037E91241M2374k01578m67825m96809m18478J82559L64426M5241p8908j81995
$$ 591241 633615 432037 -35788 -532597 -951075 -768516 -404090 -358849 -437757 -619752
10027f19752m20113j82170J83280M22938L79082n2826l35732l9332k67520k43366
$$ -619752 -1039865 -1222035 -1038755 -615817 -236735 -289561 -625293 -664625 -932145 -1175511
10017a175511M24133J098844K64235p41336l42458j2726K67762M0238j59102l8621
$$ -1175511 -751378 347466 611701 -129635 -472093 -484819 -217057 -176819 -335921 -374542
10007c74542r3880j52109K89775L05086k33339n13942p23875n89524K8217K13287
$$ -374542 -468422 -620531 -330756 -25670 -259009 -772951 -1496826 -2086350 -2058133 -1844846
9997a844846K54637Q4928N0581M98171N41137J96363P9861N5723j82928k16114
$$ -1844846 -1590209 -1505281 -1454700 -956529 -415392 -219029 -139168 -83445 -266373 -482487
9987d82487J4219J74769J78845Q1578J87315m447m81126l4024K19094l8636r4279
$$ -482487 -468268 -293499 -114654 -33076 154239 149792 -331334 -365358 -146264 -184900 -279179
9976b79179J5789K02269J83803M34196J61202m88893m56551L5347k20479L15133
$$ -279179 -263390 -61121 122682 556878 718080 229187 -227364 -192017 -412496 -97363
9966i7363O29975l24239o74011J5748J65316J14392j10777j07579l4497j04441
$$ -97363 532612 208373 -465638 -449890 -284574 -170182 -280959 -388538 -423035 -527476
9956e27476L31358N20936J45264j7780k88074l10377k12169k97211j2052K89607
$$ -527476 -196118 324818 470082 452302 164228 -146149 -358318 -655529 -667581 -377974
9946c77974L11398p2219l78573o08677K7020J89218o0594L495K5610L06796J64380
$$ -377974 -66576 -138795 -517368 -1126045 -1099025 -909807 -970401 -966906 -941296 -634500 -470120
9935d70120K99453N40198K33704Q9360k88140o95112m65218k04341J57030M03949
$$ -470120 -170667 369531 603235 692595 404455 -290657 -755875 -960216 -803186 -399237
$$ [...]
##END NTUPLES=NMR SPECTRUM
##END=
