##TITLE=C13_SA_54.212
 CDCl3, 21500 sc

 7.7.2020
##JCAMPDX= 6.0         $$ Bruker NMR JCAMP-DX V2.0
##DATA TYPE= NMR SPECTRUM
##DATA CLASS= NTUPLES
##ORIGIN= UXNMR, Bruker Analytische Messtechnik GmbH
##OWNER= root
$$ XWIN-NMR		Version 3.5
$$ Wed Jul  8 09:58:36 2020 Russian Standard Time (UT+4h)  she@DPX200
##.OBSERVE FREQUENCY= 50.327896
##.OBSERVE NUCLEUS= ^13C
##.ACQUISITION MODE= SIMULTANEOUS
##.ACQUISITION SCHEME= undefined
##.AVERAGES= 21500
##.DIGITISER RES= 17
##SPECTROMETER/DATA SYSTEM= spect
##.PULSE SEQUENCE= zgpg30
##.SOLVENT NAME= CDCl3
##.SHIFT REFERENCE= (INTERNAL, CDCl3, 0, 222.661)
##AUDIT TRAIL= $$ (NUMBER, WHEN, WHO, WHERE, WHAT)
$$ ##TITLE= Audit trail, XWIN-NMR		Version 3.5
$$ ##JCAMPDX= 5.01
$$ ##ORIGIN= Bruker BioSpin GmbH
$$ ##OWNER= she
$$ F:/spectra/data/she/nmr/c13/1/pdata/1/auditp.txt
$$ ##AUDIT TRAIL=  $$ (NUMBER, WHEN, WHO, WHERE, WHAT)
(   1,<2020-07-08 09:57:09.15 +0400>,<she>,<DPX200>,
      <created by zg, POWCHK disabled, PULCHK disabled
       terminated by command 'halt'
       configuration hash MD5:
       00 E9 B6 7A A2 85 ED C7 34 08 36 98 17 FE 4E 26
       data hash MD5: 32K
       84 DD 58 0F 5C 5B F5 C3 8B DB CA D7 66 C9 D1 AA>)
(   2,<2020-07-08 09:57:11.64 +0400>,<she>,<DPX200>,
      <Start of raw data processing
       efp BC_mod = 2 LB = 1 FT_mod = 6 PKNL = 1 PHC0 = -216.8411 PHC1 = 9.562382 SI = 32K 
       data hash MD5: 32K
       D2 F5 7E 6D 1B 1E 3F 38 DD 89 69 D2 E9 BD 2D 95>)
(   3,<2020-07-08 09:57:14.42 +0400>,<she>,<DPX200>,
      <abs ABSG = 5 
       data hash MD5: 32K
       1C 7D 25 26 6D 41 DE E7 30 69 53 9D 52 D0 D0 6C>)
(   4,<2020-07-08 09:57:41.01 +0400>,<she>,<DPX200>,
      <pk PHC0 = -8.689899 PHC1 = 14 
       data hash MD5: 32K
       56 2D 42 64 24 EF 02 B1 8C 11 2A D1 5C 97 12 C2>)
(   5,<2020-07-08 09:57:43.78 +0400>,<she>,<DPX200>,
      <abs ABSG = 5 
       data hash MD5: 32K
       7B 74 8A FE B7 C4 FF 99 39 73 28 D2 30 4E 02 33>)
$$ ##END=
$$ 
$$ hash MD5
$$ 7F D0 9D 0D 8E 36 6D C5 73 AF 27 20 7E 5B 35 58
##$RELAX= 
##$RELAX= 
##$RELAX= 
##$RELAX= 
##$RELAX= 
##$RELAX= 
##$RELAX= 
##$RELAX= 
$$ Bruker specific parameters
$$ --------------------------
##$DU= <F:/spectra>
##$EXPNO= 1
##$NAME= <c13>
##$PROCNO= 1
##$TYPE= <nmr>
##$USER= <she>
##$AMP= (0..31)
100 100 100 100 100 100 100 100 100 100 100 100 100 100 100 100 100 100 
100 100 100 100 100 100 100 100 100 100 100 100 100 100 
##$AQSEQ= 0
##$AQ_mod= 1
##$AUNM= <au_zg>
##$AUTOPOS= <>
##$BF1= 50.322709
##$BF2= 200.13
##$BF3= 50.322709
##$BF4= 500.13
##$BF5= 500.13
##$BF6= 500.13
##$BF7= 500.13
##$BF8= 500.13
##$BYTORDA= 1
##$CFDGTYP= 0
##$CFRGTYP= 5
##$CHEMSTR= <none>
##$CNST= (0..31)
1 1 145 1 1 1 1 1 1 1 1 1 1 1 1 1 1 1 1 1 1 1 1 1 1 1 1 1 1 1 1 1 
##$CPDPRG= <waltz16>
##$CPDPRG1= <>
##$CPDPRG2= <waltz16>
##$CPDPRG3= <>
##$CPDPRG4= <mlev>
##$CPDPRG5= <mlev>
##$CPDPRG6= <mlev>
##$CPDPRG7= <mlev>
##$CPDPRG8= <mlev>
##$CPDPRGB= <>
##$CPDPRGT= <>
##$D= (0..31)
$$ [...]
##$SUBNAM4= <"">
##$SUBNAM5= <"">
##$SUBNAM6= <"">
##$SUBNAM7= <"">
##$SUBNAM8= <"">
##$SUBNAM9= <"">
##$SW= 239.972175391363
##$SWIBOX= (0..15)
0 1 3 0 0 0 0 0 0 0 0 0 0 0 0 0 
##$SW_h= 12077.2946859903
##$TD= 32768
##$TD0= 1
##$TE= 0
##$TE2= 300
##$TE3= 300
##$TEG= 300
##$TL= (0..7)
120 120 120 120 120 120 120 120 
##$TP= (0..7)
150 150 150 150 150 150 150 150 
##$TP07= 0
##$TPNAME0= <>
##$TPNAME1= <>
##$TPNAME2= <>
##$TPNAME3= <>
##$TPNAME4= <>
##$TPNAME5= <>
##$TPNAME6= <>
##$TPNAME7= <>
##$TPOAL= (0..7)
0.5 0.5 0.5 0.5 0.5 0.5 0.5 0.5 
##$TPOFFS= (0..7)
0 0 0 0 0 0 0 0 
##$TUNHIN= 0
##$TUNHOUT= 0
##$TUNXOUT= 0
##$USERA1= <user>
##$USERA2= <user>
##$USERA3= <user>
##$USERA4= <user>
##$USERA5= <user>
##$V9= 5
##$VALIST= <valist>
##$VCLIST= <CCCCCCCCCCCCCCC>
##$VD= 0
##$VDLIST= <DDDDDDDDDDDDDDD>
##$VPLIST= <PPPPPPPPPPPPPPP>
##$VTLIST= <TTTTTTTTTTTTTTT>
##$WBST= 1024
##$WBSW= 4
##$XGAIN= (0..3)
0 0 0 0 
##$XL= 0
##$YL= 0
##$YMAX_a= 92577863
##$YMIN_a= -144108571
##$ZGOPTNS= <>
##$ZL1= 120
##$ZL2= 120
##$ZL3= 120
##$ZL4= 120
##$ABSF1= 222.624
##$ABSF2= -17.3728
##$ABSG= 5
##$ABSL= 3
##$ALPHA= 0
##$AQORDER= 0
##$ASSFAC= 0
##$ASSFACI= 0
##$ASSFACX= 0
##$ASSWID= 0
##$AUNMP= <proc_1d>
##$AZFE= 0.1
##$AZFW= 0.5
##$BCFW= 0
##$BC_mod= 2
##$BYTORDP= 0
##$COROFFS= 0
##$CY= -3
##$DATMOD= 1
##$DC= 0
##$DFILT= <>
##$DTYPP= 0
##$F1P= 0
##$F2P= 0
##$FCOR= 0.5
##$FTSIZE= 32768
##$FT_mod= 6
##$GAMMA= 0
##$GB= 0
##$INTBC= 1
##$INTSCL= 4.134877e-10
##$ISEN= 128
##$LB= 1
##$LEV0= 0
##$LPBIN= 0
##$MAXI= 10000
##$MC2= 0
##$MEAN= 0
##$ME_mod= 0
##$MI= 0.1934396
##$NCOEF= 0
##$NC_proc= 2
##$NLEV= 6
##$NOISF1= 120.0001
##$NOISF2= 80.00006
##$NSP= 0
##$NTH_PI= 0
##$NZP= 0
##$OFFSET= 222.6606
##$PC= 1.4
##$PHC0= -225.531
##$PHC1= 23.56238
##$PH_mod= 1
##$PKNL= yes
##$PPARMOD= 0
##$PSCAL= 0
##$PSIGN= 0
##$REVERSE= no
##$SF= 50.322729756361
##$SI= 32768
##$SIGF1= 140
##$SIGF2= 120
##$SINO= 11.81781
##$SIOLD= 32768
##$SREGLST= <13C.CDCl3>
##$SSB= 0
##$STSI= 32768
##$STSR= 0
##$SW_p= 12077.2946859903
##$SYMM= 0
##$S_DEV= 0
##$TDeff= 32768
##$TDoff= 0
##$TI= <>
##$TILT= no
##$TM1= 0
##$TM2= 0
##$TOPLEV= 0
##$USERP1= <user>
##$USERP2= <user>
##$USERP3= <user>
##$USERP4= <user>
##$USERP5= <user>
##$WDW= 1
##$XDIM= 32768
##$YMAX_p= 489453396
##$YMIN_p= -2471033
$$ End of Bruker specific parameters
$$ ---------------------------------
##NTUPLES= NMR SPECTRUM
##VAR_NAME=  FREQUENCY,     SPECTRUM/REAL,   SPECTRUM/IMAG
##SYMBOL=    X,             R,               I
##VAR_TYPE=  INDEPENDENT,   DEPENDENT,       DEPENDENT
##VAR_FORM=  AFFN,          ASDF,            ASDF
##VAR_DIM=   32768,         32768,           32768
##UNITS=     HZ,            ARBITRARY UNITS, ARBITRARY UNITS
##FACTOR=    0.368581032318806, 1,           1
##FIRST=     11204.8891385315, 0,            0
##LAST=      -872.405547458802, 0,           0
##MIN=       -872.405547458802, -2471033,    0
##MAX=       11204.8891385315, 489453396,    0
$$ Real data points
##PAGE= N=1
##DATA TABLE= (X++(R..R)), XYDATA
$$ [...]
15731c2218J07941q1966j01236J35234L8899k36534P227J46630P9212J15652k2981
15720A55860L236k63518j68963J78280l3125m5355j4831k09890K45384M15188
15710B62266Q7214k99009l76997J12743L49409J82016l37601k40147R9857K1887
15700a38362M6978L01576P8509l35787m72285q8252N1182M34506O07383k42391
15690B43057m05812M1033J58919J89571K42377k1154j16336J40285Q5866k85927
15680B71879n17274m04918j34399K14816L39643R5747K35545K45392j1679k96588
15670C8164l1487J37125k21902k16715J54198N5764q3432l9719o5615K99080L14694
15659C40155Q939N5563j43485J21068k40681n24893m55443m8604L70471N6305
$$ plain form
15731 -32218 75723 -6243 -107479 27755 66654 -169880 -162653 -16023 63189 178841 155860
15720 155860 159096 -104422 -273385 -95105 -128230 -173585 -188416 -398306 -152922 262266
15710 262266 349480 50471 -326526 -213783 135626 317642 -19959 -260106 -160249 -138362
15700 -138362 -91384 210192 288701 -47086 -519371 -607623 -556441 -121935 485448 243057
15690 243057 -162755 -121722 37197 226768 469145 447991 331655 471940 557806 271879
15680 271879 -245395 -650313 -784712 -569896 -230253 -134506 101039 346431 334752 38164
15670 38164 6677 143802 -78100 -294815 -140617 -84853 -168285 -208004 -273619 25461 340155
15659 340155 349094 404657 261172 382240 141559 -383334 -838777 -887381 -516910 -460605
15649d60605K18474J75993k7365j02021o14975n423l1084k11257L00104N45178
15639b12981P38481Q4967l70050n33960m15332J25854K73741L37025M82834K34240
15629G44819j25754J37401J85885j03444k8625J31361j24657M42795L7125o00257
15619F96649m34483n1827j80461j5444M1830K47470N2452J55362M26798m23928
15609E14418m79133j88287p765N4818O9811l84266k90073l10623l58578j25975
15599a505653L10305j78645K00667Q09169L12678N65108O76665l21909p41082
15590A27303m58646n3436L93451K30714R5090J37560L4249k86081l23556j59832
15580b63184o9841K0025l22875m023O02383P34790K02059l52297m12010K6129
$$ plain form
15649 -460605 -242131 -66138 -93503 -195524 -810499 -815922 -847006 -1058263 -758159 -212981
15639 -212981 525500 610467 240417 -293543 -708875 -583021 -309280 27745 510579 744819
15629 744819 619065 756466 942351 838907 810282 941643 816986 1259781 1296906 696649
15619 696649 262166 210339 29878 14434 56264 303734 356186 511548 938346 514418
15609 514418 35285 -153002 -160767 -105949 -36138 -420404 -710477 -1021100 -1379678 -1505653
15599 -1505653 -1195348 -1373993 -1173326 -364157 -51479 513629 1190294 868385 127303
15590 127303 -331343 -384779 8672 239386 334476 472036 506285 220204 -103352 -263184
15580 -263184 -333025 -313000 -635875 -639898 -37515 697275 899334 547037 135027 161156
15570A61156r3928m4491J94669M60993L73324j48843l69586j76081J24265l76255
15560A05223o71985j72652L85664J56175k2170r9711k24318k63403j01685K91674
15550f17188K62091j6758j63525K09930M95525J64390L66492K01991l03742m62265
15540A36941m75869L38006K79489K03760N16698l28166k61978O7871k75009k19496
15530a7753J10064J69350R2250J14378q5960j78838j33779j83258p60P5847L7227
15519a232Q2141j21882j47950J44648l0424M029k73628k73082k79044q8469M10019
15508e74874K56666n591k19672k51195M3323J92575K01400L63715K59796j46286
15498A19857k31826l06664j22557k00838R9909Q81662N11821J41877k05134n40163
$$ plain form
15570 161156 67228 22737 217406 678399 1051723 902880 533294 357213 481478 105223
15560 105223 -566762 -739414 -353750 -197575 -219745 -319456 -543774 -807177 -908862 -617188
15550 -617188 -355097 -371855 -535380 -325450 170075 334465 700957 902948 599206 136941
15540 136941 -338928 -922 278567 482327 999025 670859 408881 476752 201743 -17753
15530 -17753 92311 261661 353911 468289 382329 203491 69712 -113546 -114306 -38459 -1232
15519 -1232 80909 -40973 -188923 -44275 -74699 -70670 -344298 -617380 -896424 -984893 -574874
15508 -574874 -318208 -323799 -543471 -794666 -751343 -558768 -357368 6347 266143 119857
15498 119857 -111969 -418633 -541190 -742028 -642119 239543 751364 893241 688107 147944
15488A47944o99772p69813n3656N54281K57571n3404J14111Q6135m9293K71283
15478a94613L30649j26682o63082j79097K5181L00468J64881k62417n91529l25628
15468a521869P89108J119525N22089j63789l74117k27870P9206M29424p2359l53795
15458B25553j92270j19900K00434J64226p1645l03452o7859k65402q5975J92609
15448c23681O7736K69993j1039k44582O9857j731n61592l71102r4884L24643O15800
15437b60582K23912l35696j94894l55707l42056j52996L48725Q55944M08351r6257
15427I8744L2953K02402M75026J7634n65396n97990l36560r6365J29516j10368
15417g50404j09127L00151L26159J91714J22852j85182r4818k3199K9263j30044
$$ plain form
15488 147944 -551828 -1321641 -1375297 -821016 -563445 -616849 -502738 -416603 -465896 -194613
15478 -194613 136036 9354 -653728 -832825 -807644 -507176 -342295 -604712 -1196241 -1521869
15468 -1521869 -732761 386764 908853 745064 370947 143077 222283 651707 579348 225553
15458 225553 33283 -86617 113817 278043 206398 -97054 -164913 -430315 -516290 -323681
15448 -323681 -255945 14048 3009 -241573 -171716 -173447 -735039 -1106141 -1201025 -876382 -260582
15437 -260582 -36670 -372366 -567260 -922967 -1265023 -1418019 -1069294 -213350 195001 98744
15427 98744 131697 334099 809125 826759 261363 -336627 -673187 -769552 -640036 -750404
15417 -750404 -859531 -559380 -233221 -41507 81345 -103837 -198655 -221854 -192591 -322635
15407c22635J29610j2749m17432j95654j3810o9299O9017J52858K62198O8925
15397c48971m09669m17011J92014L10492J56081J91735R3391P143m56182m1953
15387g22930M96525L60770M66737N51675K21285k62950k69464k17228L7808J66021
15377H28249r1448N8890j23727j81358l55612m64296j69909o840k42996N9248
15367f89799K8895K68049N67976O12209l19959p31135p50338m17946M2469N14919
15357h74660N05413J75695o729Q3946P091m75528L0481O33197L81583J42044K6299
15346F28832o9246o9079J77300m48346o81948K30262N50936M12811J22065P9856
15336I33443m22342j52878J89349j04552m52426m1499M12786J83166m10815m53254
$$ plain form
15407 -322635 -193025 -205774 -623206 -818860 -832670 -901969 -832952 -680094 -417896 -348971
15397 -348971 -758640 -1175651 -983637 -673145 -517064 -325329 -231938 -224795 -680977 -722930
15387 -722930 -226405 134365 601102 1152777 1374062 1111112 841648 624420 662228 828249
15377 828249 736801 795691 671964 490606 134994 -329302 -499211 -506051 -749047 -689799
15367 -689799 -660904 -392855 175121 787330 467371 -263764 -1014102 -1432048 -1389579 -874660
15357 -874660 -369247 -193552 -200281 -116335 -109244 -584772 -554291 78906 460489 602533 628832
15346 628832 559586 490507 667807 219461 -462487 -232225 318711 731522 853587 933443
15336 933443 511101 358223 547572 443020 -9406 -50905 361881 545047 134232 -319022
15326c19022J62891N04278L27482O7814k20609k26958k22138k98490l09211r9395
15316f33358q2400M01903L94506P3178p2921j0047J92362k26771j57129k73239
15306c93916m97684j23718L69238M23901K34333M2273O5064J50007L77722L35158
15296I82378j15188n16338l75027l69130r9829J75118M09420M64757j06303l70558
15286G9300J9600K65496j99955k3009J36057n2025N49976O22556R5011n42894
15276I50113m99380k56264K0856M35775L27863o3902l08750p5708p5333l02467
15266A52803j48727j92797j52756o8584k03340l28957M2285R5868j08617l06227
15256a219049L1287J37948J77635K67269O1636K71883Q8479m20279n19008K30855
$$ plain form
15326 -319022 -156131 348147 675629 743443 522834 295876 73738 -224752 -533963 -633358
15316 -633358 -715758 -313855 80651 153829 80908 70861 263223 36452 -120677 -393916
15306 -393916 -891600 -1015318 -646080 -222179 12154 54427 119491 269498 647220 982378
15296 982378 867190 350852 -24175 -393305 -493134 -318016 91404 556161 449858 79300
15286 79300 98900 364396 164441 141432 277489 225464 775440 1397996 1493007 950113
15276 950113 450733 194469 215325 651100 978963 915061 606311 530603 455270 152803
15266 152803 4076 -188721 -341477 -410061 -613401 -942358 -900073 -804205 -912822 -1219049
15256 -1219049 -1187762 -1049814 -872179 -604910 -543274 -271391 -182912 -603191 -1122199 -891344
15246h91344M22818L33677K39297j01626p1773o0630o2957L05406P4572k08533
15236b1093j91113j31245L06838J75834J71362J67020N0999k92435j80268M38488
15226D94387L93225p8556k75662q0291L48763L59066k88650p21654m35005m65120
15216g49497k73049K44938M47120L47891m1520m7080R5148l07265l48266o1411
15206f92991M0606K64443K95649K74770L82554K6346n29660m66496j82293M87082
15196i9990K36975l42325J60671L30024o9667j91370p8663k4167K72813M3035
15186B37336p9275r8685r5645J68933l05491o67947m03150J2144M69694K14423
15176e47663m31170l8572L98842J49409J97546L78963k62105m41434j35634J16274
$$ plain form
15246 -891344 -468526 -134849 104448 2822 -68951 -129581 -192538 112868 187440 -21093
15236 -21093 -212206 -343451 -36613 139221 310583 477603 528602 236167 55899 494387
15226 494387 887612 809056 533394 453103 801866 1160932 872282 150628 -284377 -749497
15216 -749497 -1022546 -777608 -330488 17403 -24117 -71197 23951 -283314 -631580 -692991
15206 -692991 -652385 -387942 -92293 182477 565031 591377 61717 -404779 -587072 -99990
15196 -99990 136985 -205340 -44669 285355 215688 24318 -54345 -78512 194301 237336
15186 237336 158061 59376 -36269 132664 -172827 -840774 -1243924 -1231780 -762086 -547663
15176 -547663 -978833 -1017405 -618563 -469154 -271608 107355 -154750 -596184 -731818 -615544
15166f15544L02085J32899m31271k64273l9153n4629R1703Q1478J94091m0483
15156f43097k12043j25809j49980k41106J90926N35304J91461K10938l11301n93150
15146a147857l80950N7995M63830L92409M58429K18289J30909j72816o37260l18110
15136i35132Q7294L43107N84971R3162k11343k24384j19567J56365M08081M54998
15126F37552j1214j18623L05351N9558m65509r5486k24709j04752L26326K43131
15116E51625n5611K3311K98344M40205K09892j52859L7850K06554k59404j44928
15106A154979P1498L75929O05208J64181l57824J22484Q52713J210492J979856
15097F179516K252936L04786k166242k111129j536887p25255r29675p42059Q7462
$$ plain form
15166 -615544 -313459 -180560 -611831 -876104 -915257 -969886 -878183 -796705 -602614 -643097
15156 -643097 -855140 -980949 -1130929 -1372035 -1181109 -645805 -454344 -243406 -554707 -1147857
15146 -1147857 -1528807 -1470812 -1006982 -614573 -156144 62145 193054 20238 -617022 -935132
15136 -935132 -847838 -504731 80240 173402 -37941 -262325 -381892 -225527 182554 637552
15126 637552 626338 507715 813066 872624 407115 311629 86920 -17832 308494 551625
15116 551625 496014 519325 817669 1257874 1467766 1314907 1352757 1559311 1299907 1154979
15106 1154979 1226477 1602406 2207614 2371795 2013971 2136455 2989168 4199660 6179516
15097 6179516 8432452 8737238 6570996 4459867 2922980 2197725 1268050 525991 613453
15088F13453J02760J81462n2271l96384m7559m3260O6983j3698r5221M4041J83719
15077E44025j55653o21676m12256O6043L41338M23999K21229J2088k70620k05438
15067e6921j75131j31364J58127K74603M67034P46492K48550l10098m51132l07962
15057D62198j56376m01504j62912j32848J14093K69301R5450n6112l38972q4158
15047c91840M49012O66693O02147l44871l93445m39184j83787J61936O28376J89407
15037I44444m64175j43259L38685J78759l08690k20424j41554m58765k05890M9570
15027d31299M06410K13744k61628N2241J25999m9347l05314k4197J19738J93620
15017C9967J93663Q3128l7044j59335o3866K41681l9825k21595L27443J96989
$$ plain form
15088 613453 716213 897675 845404 449020 401461 358201 425184 411486 316265 360306 544025
15077 544025 388372 -233304 -645560 -579517 -238179 185820 407049 419137 148517 -56921
15067 -56921 -232052 -363416 -205289 69314 536348 1282840 1531390 1221292 770160 462198
15057 462198 305822 -95682 -258594 -391442 -277349 -8048 87402 31290 -307682 -391840
15047 -391840 57172 723865 1326012 981141 587696 148512 -35275 126661 755037 944444
15037 944444 480269 337010 675695 854454 545764 325340 183786 -274979 -480869 -431299
15027 -431299 -24889 188855 -72773 -20532 105467 56120 -249194 -273391 -153653 39967
15017 39967 233630 316758 279714 120379 56513 298194 258369 36774 364217 561206
15007E61206r5124l5852J59155K09407J33738J21505l40566l63946m13815j45042
14997b09334P2677m5650K74781L29076k6178l20646j34629J03710K9401J04581
14987A77789k45254m37828l39918n9736K22080L56511o9815k61229N9238n8441
14977f56603L08156K70642m78923l78094K48877J23073r4480J4773J01022O4565
14967d76992K51547K41478L8346J53408L60532K76175R5l4138k4399k52269R9150
14956F32933r1654l75051M8411L10162P973L844L8451q00419n77732P0327P90802
14945E8047P78361K9101k45521m98038n97126l91027k00692P6950N75275O06537
14935A91867p2201k31333j42151k86483k71267N978L48541M5959l11270J14292
$$ plain form
15007 561206 466082 430230 589385 798792 932530 1054035 713469 349523 -64292 -209334
14997 -209334 -136657 -182307 92474 421550 395372 74726 -59903 43807 73208 177789
14987 177789 -67465 -505293 -845211 -904947 -682867 -326356 -396171 -657400 -598162 -656603
14977 -656603 -348447 -77805 -556728 -934822 -685945 -562872 -657352 -642579 -541557 -476992
14967 -476992 -225445 16033 54379 207787 568319 844494 844589 810451 786052 533783 632933
14956 632933 541279 166228 214639 524801 532774 536618 575069 -225350 -803082 -732755 58047
14945 58047 836408 865509 619988 121950 -475176 -866203 -1066895 -989945 -414670 191867
14935 191867 119666 -111667 -253818 -540301 -811568 -805590 -457049 -411090 -722360 -608068
14925f08068K50411l80592o32512l39462k12185j02257M02749N58499N78310K05601
14915b79506k50367L29814J81676J01996L31519j77964j45208l00542m62689r5178
14905g66449j14747q2962K25388K88803j1003p0897J50352J06288j6634j06997
14895c98858j99385L82852M15977J91971k12821m12828j81588J60026P6450k82822
14885d61026k0355K59322K61908K0249m69276o396L58621L32818N59026L24521
14875A159412o1637m72109l56630J31160n8129j76503r2584Q4051n59J93632M1018
14864C91122r5167N7187n9942J7905j40397k84368k32616l48570m96355j02072
14854a293273J0725J29392M79123O37715N52179M60253K13944p3063l26543k13933
$$ plain form
14925 -608068 -357657 -738249 -1370761 -1710223 -1922408 -2024665 -1621916 -1063417 -485107 -279506
14915 -279506 -529873 -200059 -18383 83613 415132 237168 91960 -208582 -671271 -766449
14905 -766449 -881196 -964158 -738770 -449967 -460970 -531867 -381515 -275227 -291861 -398858
14895 -398858 -598243 -215391 200586 392557 179736 -233092 -414680 -254654 -178204 -461026
14885 -461026 -481381 -222059 39849 60098 -409178 -415574 -56953 275865 834891 1159412
14875 1159412 1097775 625666 269036 400196 342067 165564 72980 157031 156472 350104 391122
14864 391122 295955 353142 293200 311105 170708 -113660 -346276 -694846 -1191201 -1293273
14854 -1293273 -1282548 -1153156 -674033 -36318 515861 976114 1190058 1116995 790452 576519
14844E76519m70730m76357k79732j61506l5714J26287o3502k68501P4639M78132
14834e00465O70896J14663m80034n95491l11419j22073j61597K42880K98008K62009
14824e82623J76694J6090Q5166J91617O0083K03671l08978k72034K68096K86882
14814A24664K09635m8158r9198k658k35711l36061O2023P9718J23422K14480K17248
14803C09404k98055p30328p0764J24936k59310p57273m41542K52508P03583K40441
14793i26400K57139L53634N47814R07702r9162q00288n36921k53868q952q0812
14783f40114j47388N31445M41234J02258J22797R1916j49235l78805l28527l81000
14773g35419j20190L7965q8450M50967P36891L99224L44820m1398q8065L9208
$$ plain form
14844 576519 105789 -370568 -650300 -811806 -847520 -721233 -784735 -1053236 -978597 -500465
14834 -500465 170431 285094 -194940 -790431 -1101850 -1223923 -1385520 -1142640 -844632 -582623
14824 -582623 -405929 -389839 -304673 -113056 -52973 150698 -158280 -430314 -162218 124664
14814 124664 334299 286141 186943 184285 -51426 -387487 -325464 -245746 -122324 92156 309404
14803 309404 11349 -718979 -789743 -664807 -924117 -1681390 -2122932 -1870424 -1166841 -926400
14793 -926400 -669261 -315627 232187 1139889 1040727 240439 -296482 -550350 -559302 -640114
14783 -640114 -787502 -256057 185177 287435 410232 502148 352913 -25892 -354419 -735419
14773 -735419 -855609 -817644 -906094 -455127 281764 680988 1025808 984410 896345 935553
14763I35553K19930n08878n90432n365l9449j93480m43632J1281K74928r6995
14753d36539j25626J40379p6317L5629N6767k32729J40944K24748J06146P5859
14743i0739j40438K95812L39788p8536l95065m14332J35850N52867L47162k26180
14733C26189j17103k46239l82304j05955M164n3112O1793P4794l66509q8460K09021
14722f83721K71591j21626l59417P618N62019K55381R9269l7838k41473r4673
14712c42870m00091k62570q0029l50607K54266R26936O66605J58819j80140k20389
14702A69930J97826K84870L7795l42670m91861n61431o22206K02542K94234j08451
14692i39422k58928K70441K89317M66922J066674O66554o0248n48812n77250n50277
$$ plain form
14763 935553 1155483 646605 56173 50808 11359 -182121 -625753 -614472 -339544 -436539
14753 -436539 -562165 -421786 -498103 -462474 -405707 -638436 -497492 -272744 -166598 -90739
14743 -90739 -231177 64635 404423 325887 -69178 -483510 -347660 205207 552369 326189
14733 326189 209086 -37153 -419457 -525412 -521248 -574360 -512567 -437773 -804282 -892742 -683721
14722 -683721 -412130 -533756 -893173 -885555 -323536 -68155 31114 -6724 -248197 -342870
14712 -342870 -742961 -1005531 -1085560 -1436167 -1181901 -254965 411640 570459 390319 169930
14702 169930 367756 652626 690421 347751 -144110 -705541 -1327747 -1125205 -830971 -939422
14692 -939422 -1198350 -927909 -638592 -171670 895004 1561558 1501310 952498 375248 -175029
14682a75029k20375K5213J93018K34534j0659j39836R5463L14808m80658k79222
14672d42743N57447N07005j54817o49582m75072K72493O48048M4631j42229n65229
14662d00048l95104k79152k67479L5982M48819M54703L85034L27615k1812R0358
14652C78916l61048k11213k52138j77643j39555r9210L14448K63034j94531j96715
14642f75655K06471L19572K68842L14085N03697M29386k57404o38788l4687L41270
14632G76789K04890n08618m39695M2412J01185k19585l64078R6704L19465M31937
14622D41406j28993j0896Q2107L6229j80142m20125k4655p5869j89301l93510
14612h63749j18804J20934q1837j88275n6981N1108L17256P8844J21604R485J07721
$$ plain form
14682 -175029 -395404 -370191 -177173 57361 46702 -93134 2329 317137 -163521 -442743
14672 -442743 114704 621709 466892 -182690 -657762 -385269 262779 307410 165181 -400048
14662 -400048 -795152 -1074304 -1341783 -1305801 -856982 -402279 -17245 310370 288558 378916
14652 378916 17868 -193345 -445483 -623126 -762681 -861891 -547443 -284409 -478940 -675655
14642 -675655 -469184 -149612 119230 433315 937012 1366398 1108994 470206 435519 776789
14632 776789 981679 473061 33366 75778 176963 -42622 -406700 -309996 9469 441406
14622 441406 312413 301517 383624 419853 239711 -180414 -205069 -280938 -470239 -863749
14612 -863749 -982553 -861619 -943456 -1131731 -1188712 -1137604 -820348 -741504 -619900 -610415 -502694
14601e02694k61115o57708l46433K60408K33412L88741M96958L51554K13268j92229
14591a5838p28122j62139M18138M29382J21799J77008j04820J0720J94435J91877
14581E32440j83030o52581o35605j89988M66201N73705P8323l44114K0208L11567
14571b2874J0616q2304l2923k90321q3210J23396L87665l5428k79673J33745M42905
14560B71594N39028J21560j66091q6932j82533m26509r9420J49602R5651R5565
14550C11515J72901o9985m4834k40346k92595J22022R5231J88893j66054r1244
14540a4496K78970N07923M56683J54464j51124j58111l23999n64636j0435l16202
14530a40963o03791N5452K85848l9184k12766q6714K07496L74335N41847K03184
$$ plain form
14601 -502694 -763809 -1421517 -1767950 -1507542 -1274130 -885389 -388431 -36877 176391 -15838
14591 -15838 -743960 -906099 -487961 -58579 63220 240228 135408 146128 340563 532440
14581 532440 349410 -303171 -938776 -1128764 -662563 -88858 -10535 -354649 -334441 -22874
14571 -22874 -12258 -94562 -127485 -417806 -501016 -377620 10045 -25383 -305056 -171311 271594
14560 271594 810622 932182 766091 679159 496626 70117 -29303 120299 215950 311515
14550 311515 484416 414431 369597 129251 -163344 -41322 53909 242802 76748 -14496
14540 -14496 264474 772397 1229080 1383544 1232420 1074309 750310 185674 175239 -140963
14530 -140963 -744754 -689302 -403454 -442638 -655404 -742118 -534622 -160287 381560 584744
14520E84744p14816j217978l83643O80804K14455l24322k07952L74361P89791
14511b04556P77760M67400k63995m85547j01008m6831j42515j58263l18972K28573
14501b47954M29760j8046k72261q2343J23283L26688J3356l65670j74226r3231
14491c60644j08870o6774K40965J33997l49583m07584n4406l7011k58034m72906
14481a740850j71400L18633M08591M90101J63112l1314L935k50889J59728N05656
14471a44697N29450L63607j2166j63011M96724J26248m35723l05024r1826j11777
14461B51805J25p1958J0388m4304n8575k25603j03984n8358K64318J90072K39546
14450C93472O32310o4480o53194j189943o79819M27249O09710M42220J14112k34360
$$ plain form
14520 584744 -130072 -1348050 -1731693 -1050889 -836434 -1160756 -1368708 -994347 -204556
14511 -204556 573204 1040604 776609 291062 190054 143223 708 -157555 -476527 -247954
14501 -247954 181806 163760 -108501 -190844 -67561 259127 272483 -93187 -267413 -360644
14491 -360644 -469514 -536288 -295323 -161326 -510909 -918493 -972899 -1009910 -1267944 -1740850
14481 -1740850 -1912250 -1593617 -1185026 -694925 -531813 -563127 -559192 -810081 -650353 -144697
14471 -144697 384753 748360 736194 573183 1069907 1196155 760432 455408 363582 251805
14461 251805 251930 179972 190360 146056 87481 -138122 -242106 -300464 -36146 153926 393472
14450 393472 1025782 961302 308108 -881835 -1561654 -1134405 -524695 -82475 31637 -202723
14440b02723k93447K71567N43114M89851K50904k14008o36087l33347l28894l14021
14430g67091r8322j37902J92673N46198K39031R4913R568k28398k32528j92444
14420e74302k30244K51286N09465M1991m29185Q0207P61720K37461n16547k74910
14410a43058r6840l65428Q0868N01343N09723K30189l08954k82030l42879k98196
14400e15262k12351k19527K12535L54975N51210L65237J26397j36340l44470j63116
14390A9288p3614J58424l87013p87692k72277M28821O60154N0673j90608J97164
14380a96680K38366j18607j39702J67588L25684o9282n5477J9539j74106k05300
14370b07977k1959k6177K21685L54557J66805j14677M42K99278j49608n01555
$$ plain form
14440 -202723 -496170 -224603 318511 808362 1059266 845258 209171 -124176 -453070 -767091
14430 -767091 -865413 -1003315 -810642 -264444 -25413 69500 79068 -149330 -381858 -574302
14420 -574302 -804546 -553260 -43795 -1804 -430989 -350782 410938 648399 131852 -143058
14410 -143058 -239898 -605326 -524458 -23115 486608 716797 407843 125813 -217066 -515262
14400 -515262 -727613 -947140 -734605 -379630 171580 536817 663214 526874 182404 19288
14390 19288 -54326 104098 -282915 -1070607 -1342884 -914063 -253909 -203236 -393844 -196680
14380 -196680 41686 -76921 -216623 -49035 276649 207367 151890 171429 -2677 -207977
14370 -207977 -229936 -256113 -34428 320129 486934 372257 372699 671977 522369 20814
14360B0814k49438m53095k56497j4988O1232J73458Q9913L48639P40942O05213
14350A066193n0350m40927o33456n49650j46521M87551O20824J6056l12488j44497
14340h7265l84644l32248q0907K76548L83948L33174R4002J03112Q4900k22545
14330A68075j4368J31086O19935N24729k85993m78071p0162l82404o44295k22905
14320f54373J91606K89238L15143m1426P2586K83209k32845m67562n88948k52173
14310a085545K40761O8434J59269L36840K3542q0038j68547J7432J46515N4782
14300b86555k00046k78996r1244K22027Q83640L54767j70238j8563l31157k51109
14290a67474M955M27281P21706J42212m82877p55993m30055q1280K68674k46896
$$ plain form
14360 20814 -228624 -681719 -938216 -953204 -891972 -718514 -628601 -279962 460980 1066193
14350 1066193 1015843 574916 -58540 -608190 -754711 -267160 353664 369720 57232 -87265
14340 -87265 -471909 -804157 -885064 -608516 -224568 108606 202608 305720 390620 168075
14330 168075 153707 284793 904728 1429457 1143464 665393 595231 212827 -431468 -654373
14320 -654373 -462767 -173529 141614 100188 172774 455983 223138 -244424 -833372 -1085545
14310 -1085545 -844784 -776350 -617081 -280241 -256699 -336737 -505284 -487852 -341337 -286555
14300 -286555 -486601 -765597 -856841 -634814 248826 603593 433355 414792 83635 -167474
14290 -167474 -162519 264762 986468 1128680 645803 -110190 -540245 -621525 -352851 -599747
14280e99747m77792j88164j16624l2364k74894L04220N38662P42794M74533k02299
14270A68325m99995j56525l66690n014L33920K09299L59428J53337K0977n37359
14260c20297l18880J04752L60807L57491K65417L94555K06256N6975M136J3444
14250A124656K26017k77173l22798r6192j36775l90862k29683r4223q5494K0865
14240b61662k08768L21856K27271R4559J54646K60607j5291k17674J00973k30250
14230B26267m54998q5389J94238l292r7848j32178p1898J31161L36206J1452j32368
14219g8647j6193n1299J87807L22880P9631k14825k07278k00987J7421o42j73159
14208c35291K15568L93564L99842j18768l33796l63340l1878K28252K39445L42655
$$ plain form
14280 -599747 -1077539 -1265703 -1382327 -1414691 -1689585 -1385365 -846703 -103909 370624 168325
14270 168325 -331670 -488195 -854885 -859899 -525979 -316680 42748 196085 217062 -320297
14260 -320297 -639177 -534425 -173618 183873 449290 843845 1050101 1107076 1111212 1124656
14250 1124656 1350673 1073500 750702 654510 517735 126873 -102810 -197033 -282527 -261662
14240 -261662 -470430 -148574 78697 173256 327902 588509 573218 355544 456517 226267
14230 226267 -228731 -314120 -119882 -123174 -221022 -353200 -425098 -293937 42269 53721 -78647
14219 -78647 -94840 -146139 41668 364548 444179 229354 22076 -178911 -161490 -162132 -335291
14208 -335291 -119723 273841 673683 554915 221119 -142221 -174099 54153 293598 636253
14198F36253K30656j26261k06282j33258j52361q1695M2844o3618j11246P7168
14188A12200O6902j31305m8896l5675O6764J03705M3620J68853L5649j85148k42322
14177d5653K4917L2643l38825n05522O4801L60555J20162m1968L89662K92290
14167C53062o73751o98814r6112j47620n28192J94259Q32182L01041q0516L3512
14157e10949k46835l52479M35798Q28889L59815j04844j51880n1637m76508m05799
14147f76429Q5741j0104j36703k55588k82856J89236J67647l6189J63394J59538
14137f32313R50K5889J66038L82969J7028k67600j03359r605j02833p0712J44766
14126d48782N23340P46209Q14241R3619m01611l03072k22762L2392j16060k44048
$$ plain form
14198 636253 866909 740648 534366 401108 248747 167052 209896 146278 35032 112200
14188 112200 179102 47797 -1099 -36774 29990 133695 177315 346168 381817 196669 -45653
14177 -45653 -20736 11907 -326918 -832440 -767639 -407084 -286922 -328890 60772 353062
14167 353062 -320689 -1019503 -1115615 -1263235 -1791427 -1597168 -764986 -463945 -544461 -510949
14157 -510949 -757784 -1110263 -674465 154424 514239 409395 257515 205878 -270630 -676429
14147 -676429 -590688 -600792 -737495 -993083 -1275939 -1086703 -919056 -955245 -791851 -632313
14137 -632313 -631363 -605474 -439436 -56467 -39439 -307039 -410398 -420003 -522836 -593548 -448782
14126 -448782 74558 820767 1635008 1728627 1327016 1023944 801182 833574 717514 473466
14116D73466j99436r3250j052N2433j62731j73492k03779l7419L29163K58382
14106B42285n4941l39118l04303P095J39071J35908J85204L09598K89536k53486
14096C56849k03108K3193j16753n89102l05974L25312J31969K06908k93409m80900
14086i45015j89416J55046P1891J15874M72726M16967m72777m83870j98061N585
14076a051050L38277l01627o1561L14406J98443O70164L80969l06288n62417q6074
14066d66758j95732j17670J49779L9260o6236j98030J4263O7940K86812K35437
14056b50935r6488o62576m68575L70130L05169K71287K40726K21176L22893K28568
14046D81375J32740j42130m38102q32044k51991K31537M1006L79499K62491p1934
$$ plain form
14116 473466 274030 180780 179728 232161 69430 -104062 -307841 -345260 -16097 242285
14106 242285 187344 -151774 -456077 -448982 -309911 -174003 11201 320799 610335 356849
14096 356849 153741 176934 60181 -528921 -834895 -509583 -377614 -170706 -464115 -945015
14086 -945015 -1134431 -979385 -907494 -791620 -318894 98073 -374704 -858574 -1056635 -1051050
14076 -1051050 -712773 -1014400 -1075961 -761555 -563112 107052 488021 181733 -380684 -466758
14066 -466758 -662490 -780160 -630381 -591121 -657357 -855387 -841124 -773184 -486372 -250935
14056 -250935 -347423 -1009999 -1478574 -1108444 -803275 -531988 -291262 -70086 252807 481375
14046 481375 614115 471985 33883 -798161 -1050152 -818615 -777609 -398110 -135619 -207553
14036b07553j25685M594o1277l30895n6460N7229K75074k4431l07666K65089O44766
14025A32785N03668P2378l30004j65012o8098j35372J82073k09712k05382n4716
14015b77392l10352m20618j32056L48725L10637M62570M78943K12409r7616k96860
14005B78390p28387m64158J95143N15522K78849J18677k1865k04793k35326K21043
13995d6905K88663J85458P8758l27019m72587j8287K12926n0132m12793q5156
13985f47074M5495l03550j06904J86929j1087k8835j24171K9113L14682j12921
13975g58323m2715L94251L48821K15859J81643j32336l8741K25331J88169P7974
13965F59933J24000j4787m78073l40072j23136m53316n90927k57454N90912P19301
$$ plain form
14036 -207553 -333238 -328644 -389921 -720816 -777276 -720047 -444973 -469404 -777070 -511981 132785
14025 132785 636453 708831 378827 213815 145717 10345 192418 -17294 -222676 -277392
14015 -277392 -587744 -1008362 -1140418 -791693 -481056 -18486 460457 672866 575250 278390
14005 278390 -449997 -914155 -719012 -203490 75359 194036 172171 -32622 -267948 -46905
13995 -46905 241758 427216 505974 178955 -293632 -311919 -98993 -149125 -561918 -647074
13985 -647074 -601579 -905129 -1012033 -825104 -836191 -865026 -989197 -960084 -645402 -758323
13975 -758323 -801038 -406787 -57966 157893 339536 207200 168459 393790 581959 659933
13965 659933 783933 769146 291073 -48999 -172135 -625451 -1216378 -1473832 -882920 -163619
13955a63619K9543r11999o52340k2982L64781K97399O33127M24178P8343m193
13945G2238q0079j50444J51658J12732k12196k79484q8882K48711K20873M0317
13935C5444j06821j76070m1484N718J18812n9188K230n1793M0835K66673j48485
13924a14129r2779J38993M4341N5330K605M1811K9542m3715j26269j96572j68613
13913d29455k74675k45368J3497J61883M2436K47394N06592O7484m91560k41036
13903f42808O9834j63162k68451L3721J68277L47560J68582q7892k01766l72800
13893i48905k71188J80802K43512L46833M02096M84940M58231Q3330J9684l09830
13883F89505k50657j9955k31496k74978j2709K8477m64754k33870K14814M30862
$$ plain form
13955 -163619 -134076 -1046075 -1698415 -1721397 -1356616 -1059217 -426090 -1912 76431 72238
13945 72238 -7841 -158285 -6627 106105 -106091 -385575 -474457 -225746 -4873 35444
13935 35444 -71377 -247447 -288931 -283213 -164401 -223589 -221359 -273152 -232317 34356 -114129
13924 -114129 -206908 -67915 -23574 31756 34361 76172 105714 61999 -64270 -260842 -429455
13913 -429455 -704130 -949498 -936001 -774118 -731682 -484288 22304 89788 -401772 -642808
13903 -642808 -572974 -736136 -1004587 -970866 -802589 -455029 -286447 -374339 -576105 -948905
13893 -948905 -1220093 -1039291 -795779 -448946 -46850 438090 896321 979651 999335 689505
13883 689505 438848 418893 187397 -87581 -100290 -71813 -536567 -770437 -555623 -124761
13873a24761L18143l60949m43251j4888m0829K79714M93335p2128m91705j73843
13863f31162N09147N14281O0290j53813j15788K0092J66370j88877j67524p9458
13853f6442l54687j44584j22949J52525O39612M9919j47594L41770j78575m89515
13843c20520k12019P0815j2604j90041J8956L61585l8312j01816Q1222K70389
13833g2345L63419j9107m7122k9307l58214o29624n24929l6697O64500Q27853
13823A38427L02100k98148P7217L85733R8057M8902K38033j66181m06182m12183
13813E775m63824r2095o8083j47418O6851J43073P3836k69946l16514n7968O87201
13802d39112L88645l04548l22315L03021O01479K77711K20613K84630J42558j97876
$$ plain form
13873 -124761 193382 -167567 -610818 -625706 -666535 -386821 106514 34386 -457319 -631162
13863 -631162 -122015 392266 452556 298743 182955 203047 369417 180540 13016 -66442
13853 -66442 -421129 -565713 -688662 -536137 103475 153394 5800 347570 168995 -320520
13843 -320520 -532539 -461724 -474328 -664369 -645413 -283828 -322140 -423956 -342734 -72345
13833 -72345 291074 271967 224845 195538 -162676 -792300 -1317229 -1353926 -689426 138427
13823 138427 440527 142379 219596 605329 703386 752288 990321 824140 417958 5775
13813 5775 -458049 -550144 -618227 -765645 -698794 -555721 -481885 -751831 -1068345 -1126313 -439112
13802 -439112 -50467 -355015 -677330 -374309 227170 504881 725494 1010124 1152682 954806
13792I54806q59882m60966L65798K54348O929K4377L64923J43984q3451J97027
13782I07893J45694k61825l31057Q8613J33528r1958m58239l63864J72948K15900
13772A57633J35879J22102K6078K49865M94876P8720k73234k35078L1563k73457
13762E14947l87566m76916k26836M75985J003296K62668n20519q14166l10933
13753d80040j27917k0987L12891L96718L37353k6750j8148k20807n15338O7540
13743b95485M11748J07702J038J51619J00193l14835k35255j73802j99466m516
13733d51059J86415K30625M15756M28065J08949j13212j62453l98237n73150j05162
13723d33463K33978n39l23638l84100l91257P2383J66888P0656K042p1919M58713
$$ plain form
13792 954806 94924 -366042 -244 254104 261033 285410 650333 794317 710866 907893
13782 907893 1053587 791762 460705 549318 682846 590888 132649 -231215 -58267 157633
13772 157633 293512 415614 441692 691557 1186433 1265153 991919 756841 788404 514947
13762 514947 127381 -349535 -576371 -100386 902910 1165578 645059 -169107 -480040
13753 -480040 -607957 -628944 -316053 80665 418018 391268 373120 152313 -363025 -295485
13743 -295485 116263 223965 225003 376622 476815 161980 -73275 -247077 -446543 -451059
13733 -451059 -264644 -34019 381737 809802 918751 805539 643086 244849 -328301 -433463
13723 -433463 -199485 -200024 -523662 -907762 -1299019 -1226636 -1059748 -989092 -987050 -1058969 -600256
13712f00256O55920O24239N19480p7386p03017q11539l90197r2044J14647Q4278
13702f75875j88561O8555K61773J87849n4744J94930K75633J32423M21921J23765
13692G47669O8944L22513J42333l00205k87850k06404j32774M6600L42809j13801
13682F29834p04276n86241m41909l46525K59760M08114L31153J82638L13945O75333
13672G21826J13199l58502n18554l90094k27476J26762M13483P4267k81778N0307
13662b76560O14273K28148l88766q58116n20244N5250M88497P66804L17021J32257
13652E58564N4328j86465O5288n5704l59610m87470m42514k60028K96894K01486
13642f15231n1512L2724J35378L99769L72398K3008n51567k50830K03125L49424
$$ plain form
13712 -600256 55664 679903 1199383 1121997 418980 -392559 -782756 -874800 -760153 -675875
13702 -675875 -864436 -795881 -534108 -346259 -401003 -206073 69560 201983 623904 747669
13692 747669 816613 1139126 1281459 981254 693404 487000 354226 400826 743635 629834
13682 629834 -74442 -660683 -1102592 -1449117 -1189357 -781243 -450090 -267452 46493 721826
13672 721826 835025 476523 -42031 -432125 -659601 -532839 -119356 -45089 -326867 -276560
13662 -276560 337713 565861 177095 -681021 -1201265 -1146015 -657518 109286 426307 558564
13652 558564 612892 426427 491715 436011 76401 -411069 -853583 -1113611 -816717 -615231
13642 -615231 -666743 -634019 -498641 -98872 273526 296534 -255033 -505863 -302738 46686
13632D6686J24516j84826j41596M39010K65352k8372j53688n807j76017k83454
13622i8196m58571j63038O8554K48893M37822L22780n53k15548n31651m13941
13612h03449P464L25910M42782K61293j66583N2614J25513l2211N0065k2821M03375
13601F43952M72234k69223n56796l72210l4212J44650O25925M09423k75438J56049
13591I44354p13r3312l34806r15246k08863L83855j47251r5070p7742J69465K62020
13580a13309j081k49590l74575j3378L51733L15629j91686m96985k24762K33718
13570g64286O56613M58561o0823l27117K92351M85295M41565j2700n02768k08880
13560D57811L65216K74696k1179J35141m07607j29278K35826j86197l10825m23919
$$ plain form
13632 46686 171202 -13624 -155220 283790 549142 520770 367082 361275 185258 -98196
13622 -98196 -556767 -719805 -651251 -402358 35464 358244 357691 142143 -389508 -803449
13612 -803449 -795985 -470075 -27293 234000 67417 120031 245544 213333 263398 240577 643952
13601 643952 1116186 846963 290167 -82043 -116255 28395 654320 1063743 788305 944354
13591 944354 943641 850329 515523 -399723 -608586 -224731 -371982 -467052 -544794 -375329 -113309
13580 -113309 -114390 -363980 -738555 -751933 -400200 -84571 -276257 -773242 -998004 -764286
13570 -764286 -107673 350888 290065 -37052 255299 740594 1182159 1169459 666691 457811
13560 457811 823027 1097723 1076544 1211685 804078 674800 910626 724429 413604 -10315
13550a0315k73422k32680j46922K97448L50164Q6955R9001j84240J36672L93377
13540E16038k77383n01598j38099Q5546q3796L93417M64575K5073q8418M3195
13530D38550J27088M4545j55327k75694J26144M66295J96524J11898j71773n24487
13520C83763j36612L49817O24318K11594k80035k11840j27736k30064K01056L75456
13510A159717K03520J41169J92238L21042J20046n39959n86258m72696l81821
13501A56998k73764l72307j31967r9251L11999Q47554M94067K63155j4682m54917
13491G26885l55623j88176K8391K41059J39190j29600p746L12247p4487n76638
13481A15502j95361j39592o4408M41091N72825j94431o89261n15390M7763M15656
$$ plain form
13550 -10315 -283737 -516417 -663339 -365891 -15727 71228 170229 -14011 122661 516038
13540 516038 238655 -262943 -401042 -315496 -399292 -5875 458700 483773 395355 438550
13530 438550 565638 610183 454856 179162 305306 771601 968125 1080023 908250 383763
13520 383763 247151 596968 1221286 1432880 1152845 941005 813269 583205 784261 1159717
13510 1159717 1363237 1504406 1696644 2017686 2137732 1597773 1011515 538819 156998
13501 156998 -116766 -489073 -621040 -720291 -408292 439262 933329 1196484 1181802 726885
13491 726885 371262 183086 211477 452536 591726 462126 454380 766627 692140 115502
13481 115502 -79859 -219451 -283859 157232 730057 535626 -153635 -669025 -621262 -205606
13471b05606K99723k16933J2340K91890J78813j10148m41567l60190L60747O69621
13461D78690K17898J44837m4853K29657O3647j09274k9597k67006j97101q748
13451D78150p9569k7926Q803N8836J83954R5488J47721k01898l61824o9795J03588
13440C35528Q8321R6814K27088r8781k97667r8317J14604K23627M56801L44430
13430A392448n9768q7185K10607M21147j0416l46614m81434j52415k58038m93626
13420A34706L5625j35175k97295J97869M74328l786O0700M11244O4293k74621
13410F67888j14354j02143l00621K15418J54696j35673j15956j21957R306K42263
13400C98867M60759N52797J09171o35566m87540K45530M59796M73136L81385m2180
$$ plain form
13471 -205606 94117 -122816 -110476 181414 360227 250079 -191488 -551678 -190931 478690
13461 478690 696588 841425 796572 1026229 1089876 980602 951005 683999 486898 478150
13451 478150 398581 370655 379458 438294 622248 717736 865457 663559 301735 231940 335528
13440 335528 423849 520663 747751 648970 351303 252986 367590 591217 1048018 1392448
13430 1392448 1332680 1245495 1456102 1877249 1866833 1520219 1038785 886370 628332 134706
13420 134706 170331 35156 -262139 -64270 410058 406272 466972 878216 942509 667888
13410 667888 553534 451391 150770 366188 520884 385211 269255 147298 156604 398867
13400 398867 859626 1412423 1521594 886028 398488 644018 1103814 1576950 1958335 1916155
13390A916155m48019l54093l21906k16831J8544n1910R8803o3198K9544L48029
13380I55118P739J04012l499j38216M3498L06010K55935p6627l97771n91071m68617
13369c489j28271K81595J93364j44726m25831p0682M62405L05147j7973j65039
13359B86500J00515N63350N06395K29039j32194j06088j38978j48372j65696k95252
13349F99219j26784p7569K26795J06892m96419l14942K1258j50965k39701j37445
13339d89661K54427J73151m97498k94485Q6323L33973L25109J21310O9372n6743
13329B5278j6966j45429k96866K58770N72962P8972j48722K08391J09130K48500
13319H94020L34915N7908q9844n39J83987L06738K56757L05616J39899j33132
$$ plain form
13390 1916155 1468136 1114043 792137 575306 593850 541940 640743 577545 607089 955118
13380 955118 962857 1066869 1063370 925154 968652 1274662 1530597 1453970 1056199 465128 -3489
13369 -3489 -131760 149835 343199 198473 -227358 -298040 164365 469512 451539 286500
13359 286500 387015 950365 1456760 1685799 1553605 1447517 1308539 1160167 994471 699219
13349 699219 572435 494866 721661 828553 332134 17192 38450 -112515 -352216 -489661
13339 -489661 -235234 -62083 -559581 -854066 -767743 -433770 -108661 12649 82021 25278
13329 25278 8312 -137117 -433983 -175213 397749 476721 327999 536390 645520 894020
13319 894020 1228935 1286843 1196999 1196460 1380447 1687185 1943942 2249558 2389457 2256325
13309B256325k84976m70227m28602k53142J63769P7809K92575N50548L25902l44467
13299A885514n3328J08237j40314j04581L7597J793n68824k71919J98024L78898
13289A471097K73781O3008j25989k72038k77610R5488L13994m5452L2387N41013
13279B069679L87736k27337l47121m43513p20503k45366j24030j42771j98600
13270H174K4836M26869L40678K98470l19135p84469q54547l45902K0944L27438
13260h56644M38494L10039N48810O46076N17619J82611m07244j1642p8392m91439
13250G98288k07305N41711L19757o50640m64289l19236m7300N78512L95310m293
13240I40515J96683J92285j85091l35163m00590m09054J56392m0171k10316j33979
$$ plain form
13309 2256325 1971349 1501122 1072520 819378 983147 1060956 1353531 1904079 2229981 1885514
13299 1885514 1832186 1940423 1800109 1695528 1733125 1734918 1166094 894175 1092199 1471097
13289 1471097 1744878 1807886 1681897 1409859 1132249 1227737 1541731 1496279 1528666 2069679
13279 2069679 2457415 2230078 1882957 1439444 718941 473575 349545 206774 8174
13270 8174 33010 459879 800557 1099027 779892 -4577 -859124 -1205026 -1184082 -856644
13260 -856644 -418150 -108111 440699 1086775 1604394 1787005 1379761 1368119 1289727 798288
13250 798288 590983 1132694 1452451 801811 337522 18286 -29014 549498 944808 940515
13240 940515 1137198 1329483 1144392 809229 408639 -415 155977 115806 -94510 -228489
13230b28489M36540N14445r5785r7301O7122k1854m75564o34109O2345M88020
13220A5370O59475O71475J14191l78946k32564k33629k88631K04019N37418K33201
13210A301379M20297N01264n3660j87408k80017o16767n33874l7122M7013M5637
13200F06742J89932L81165L39172K7427p9569l85683r30310o67751L27450M11334
13190B19909j37163j63524L93671K15599J62950m0604n76359J57807K13653J50685
13180E96624L90389M38127K48073K09405J51399l20102r9869K27187M88628J38105
13170B467966l38898m76967l20877j11344j19766j98373k42302j57239J33549
13161F35749r5097J05167O6860k84912k42631j38291J06759L53435K23249M06697
$$ plain form
13230 -228489 208051 722496 626711 529410 596532 574678 99114 -534995 -472650 15370
13220 15370 674845 1346320 1460511 1081565 849001 615372 326741 530760 1068178 1301379
13210 1301379 1721676 2222940 2169280 1981872 1701855 1085088 551214 514092 561105 606742
13200 606742 796674 1177839 1517011 1544438 1464869 1079186 148876 -518875 -191425 219909
13190 219909 82746 -80778 312893 528492 691442 650838 74479 232286 445939 596624
13180 596624 987013 1425140 1673213 1882618 2034017 1713915 1614046 1841233 2329861 2467966
13170 2467966 2129068 1652101 1331224 1219880 1100114 901741 659439 502200 635749
13161 635749 540652 645819 712679 427767 185136 46845 153604 507039 730288 1136985
13151A136985M75900L06758J36277j27832k04262l46050l59879l09520m4547J7646
13141F81476J77719L81017M39497j94834n95658k23986P183L91910M18276L81742
13131A864342M55031l3934l33859J43566K57281J56011n03500n18025K638J98438
13121A687989K36921n0843J1462J85254k09390k99826R8926Q7870J42841l19564
13111A571640m08975j32692L32359K85920J13594j32127k57664j29780j19769
13102A122506j29034N9869K45781k4404j18179Q0013J23420J84197L78060J35295
13092B057524M983K9859J07167j9612o59664k56144P53211O77178r3824l89573
13082B211105k94907J31278J0598M01371N91552J31243o82323n89258K2282J75890
$$ plain form
13151 1136985 1612885 1919643 2055920 1928088 1723826 1377776 1017897 708377 663830 681476
13141 681476 859195 1240212 1679709 1484875 889217 665231 672414 1064324 1482600 1864342
13131 1864342 2319373 2285439 1951580 2095146 2352427 2508438 2004938 1486913 1489551 1687989
13121 1687989 1924910 1874067 1885529 2070783 1861393 1561567 1660493 1748363 1891204 1571640
13111 1571640 1162665 1029973 1362332 1648252 1761846 1629719 1372055 1242275 1122506
13102 1122506 993472 1053341 1299122 1274718 1156539 1236552 1359972 1544169 1922229 2057524
13092 2057524 2062507 2092366 2199533 2179921 1520257 1264113 2017324 2694502 2600678 2211105
13082 2211105 1916198 2047476 2058074 2459445 3050997 3182240 2499917 1910659 1932941 2108831
13072B108831R7873Q6090M7338L99755K31008J09654r469j48612J11021o1548
13062B971941k28175j08282K29299L85449M47340P8623j70720k43488l03080k42015
13052B816892m58970R4190J47449l23968k26231J75708M4855n3858L05191O82282
13042C203540N21106k71131k80678O998P4380j60901m6460Q6871P7402L01600
13032C512727K02142j89114N6521M34300K78712J28350J99260M57416L36916j2897
13022E404333j72049m21478m23209o8570P3150J44764J07484j0106K5691L38506
13012D998516L23873L08085L43871L37482m0975k4111J59741K35308O65176O57657
13002G964623P09500N21400R0392M22864O36299R49658J125675P29534M84682
$$ plain form
13072 2108831 2206704 2292794 2340132 2739887 2970895 3080549 3071080 2922468 3033489 2971941
13062 2971941 2743766 2635484 2864783 3250232 3697572 3776195 3605475 3361987 3058907 2816892
13052 2816892 2357922 2452112 2599561 2275593 2049362 2225070 2269925 2216067 2521258 3203540
13042 3203540 3724646 3453515 3172837 3179835 3254215 3093314 3046854 3133725 3211127 3512727
13032 3512727 3714869 3525755 3582276 4016576 4295288 4423638 4622898 5080314 5417230 5404333
13022 5404333 5232284 4810806 4387597 4319027 4392177 4536941 4644425 4634319 4660010 4998516
13012 4998516 5322389 5630474 5974345 6311827 6270852 6246741 6406482 6641790 7306966 7964623
13002 7964623 8674123 9195523 9285915 9708779 10345078 11294736 12420411 13149945 13634627
12993A3634627O62306J278335J483644J847432J995578K453865K660640K831645
12985B8848072M336920N622279O950965Q704576J1088238J4210022J8727733K5125671
12977A23614476L3747071M6286445O2730628P9231113Q2112865M9214533j4060760
12970D62876371o4835693p8810426o8903652n3152643l9147776k9052561k1925720
12963A07047900j6940647j3345962j0827769q792407p160010n958039m829389
12956C9193677l833534l701156l157170k720221k423951j766686j756780j502722
12948A8331457j221751p26770n76597q86850j033769o72039q10231j147904j469383
12939I786163r91131m5966l979J79573M59446L33983k17736k11159j7091K2797
$$ plain form
12993 13634627 14296933 15575268 17058912 18906344 20901922 23355787 26016427 28848072
12985 28848072 33184992 38807271 45758236 54462812 65551050 79761072 98488805 123614476
12977 123614476 157361547 203647992 266378620 345609733 427722598 476937131 462876371
12970 462876371 398040678 319230252 250326600 197173957 158026181 128973620 107047900
12963 107047900 90107253 76761291 65933522 57141115 49981105 44023066 39193677
12956 39193677 35360143 31658987 28501817 25781596 23357645 21590959 19834179 18331457
12948 18331457 17109706 16382936 15806339 14919489 13885720 13213681 12403450 11255546 9786163
12939 9786163 8795032 8749066 8745087 8924660 9384106 9718089 9500353 9289194 9272103 9294900
12929I294900k0415J88784K36865K42042N3797J2114K92116Q13845P61381N50507
12919A2425936O18066O49340J224462J855580K663846K873040K069932L75118
12911B4755320j215957j655492j166654m85428o84491m22865L18433R87614J448665
12902B1879145J453006J769969K648488L596868M491967N138088O822906Q955682
12894E6756119J1566657J5588367K0856310K7869169L7875778N1566095O8980693
12887B91059188Q4550809Q0137781L3705618l4859167p6840253q0199062o5614644
12880B31940270m9091923l5956774k6610910j9916743j5455176j2171466r701698
12873F3035580q200143o760936n355069m494866l938678l749415l023046k259787
$$ plain form
12929 9294900 9274485 9463269 9700134 9942176 9995973 10008087 10300203 11114048 11875429 12425936
12919 12425936 13044002 13693342 14917804 16773384 19437230 22310270 24380202 24755320
12911 24755320 23539363 21883871 20717217 20231789 19547298 19124433 19442866 20430480 21879145
12902 21879145 23332151 25102120 27750608 31347476 35839443 40977531 47800437 56756119
12894 56756119 68322776 83911143 104767453 132636622 170512400 222078495 291059188
12887 291059188 375609997 455747778 489453396 454594229 377753976 297554914 231940270
12880 231940270 182848347 146891573 120280663 100363920 84908744 72737278 63035580
12873 63035580 54835437 48074501 42719432 38224566 34285888 30536473 27513427 25253640
12865B5253640j986521k076295k093593j600730j335717j111744q01612o58413
12857A3589015o81461r02697n03222k71357n24053m66437N8475K70138O1l11916
12847A0256546n96925n55553k67218j437l97413r15458n84636P2106K29193J88775
12837G427980J03719L00547M92397L53432J05602K07893K24746N17003O02915
12828A0336234L71555n9699R8152L01877L94649M60942P08247J174059J220315
12819A5006331R05965N21726J194405J807760K583656K567131K661017L731268
12811C0979259M922274O346272P972169J0145369J2671503J6439318K2117611
12804A11593775K9813652M0971569N5922350P3037520Q3885343O7967349J2641072
$$ plain form
12865 25253640 23267119 21190824 19097231 17496501 16160784 15049040 14247428 13589015
12857 13589015 12907554 12004857 11501635 11230278 10706225 10239788 10298263 10568401 10568462 10256546
12847 10256546 9659621 9104068 8836850 8835413 8438000 7522542 6937906 7010012 7239205 7427980
12837 7427980 7531699 7832246 8324643 8678075 8783677 8991570 9216316 9733319 10336234
12828 10336234 10707789 10648090 10746242 11048119 11442768 11903710 12611957 13786016 15006331
12819 15006331 15912296 16434022 17628427 19436187 22019843 24586974 27247991 30979259
12811 30979259 35901533 42247805 50219974 60365343 73036846 89476164 111593775
12804 111593775 141407427 182378996 238301346 311338866 395224209 463191558 475832630
12797D75832630m9092757p7893679p4739275n9562138m4646857l2928436k4784191
12790A12185297j8848165j4782161j1884793r204314p392101o417218n220196
12783C8436349m174075l780773l301735k655723k409764k175837j842386j650108
12775A6445948j289673q80819j013638j319247j227304j105041p11331l98352
12767H500543j20786k69560n58960q26777p75873k36800j80179K72063P62074
12758F565745L50021o47200r72105n00685j1383P9336l03538l56811j70270k74665
12748C758445l15375J7917k0912j45817j36042q2479l99710k30687K6732K3805
12738B495877q9192j08538q568l17049n45038k68365J094K94809K50764j23684
$$ plain form
12797 475832630 426739873 348846194 274106919 214544781 169897924 136969488 112185297
12790 112185297 93337132 78554971 66670178 57465864 50073763 43656545 38436349
12783 38436349 34262274 30481501 27179766 24524043 22114279 19938442 18096056 16445948
12775 16445948 15156275 14275456 13261818 11942571 10715267 9610226 8898895 8500543
12767 8500543 8379757 8110197 7551237 6724460 5948587 5711787 5531608 5803671 6565745
12758 6565745 6915766 6268566 5296461 4795776 4784393 4863729 4560191 4203380 4033110 3758445
12748 3758445 3443070 3460987 3440075 3294258 3158216 3075737 2676027 2445340 2472072 2495877
12738 2495877 2406685 2298147 2289579 1972530 1427492 1159127 1160221 1455030 1705794 1582110
12728A582110k3814j88542J91963O9874j15123M52950K82171l48152j09109L3079
12718A827407n95144o8270N94454J54459j55807p4413l68175o1911L77268N1836
12708A681704q4442j62789m91184l1822l3186l70295r2580K47946m6305L33564
12698I50611L63755O6574j13777k95337j29364j45567k70193l31577Q0670J46070
12688C21865j93056p1484J37525p4305O3677l11907p10915n1855O24697R01738
12678F35980J95471j16706l25153n12919k85682J0253k19322j48412J11553K67642
12668c87295M31961M07736j4872o0832O0559n9493K03404L3751l98894k15025
12658A000J0210J85137N63704L29366j05015K86204N55845j7939j33159j31365
$$ plain form
12728 1582110 1558296 1369754 1561717 1631591 1516468 1969418 2251589 1903437 1794328 1827407
12718 1827407 1232263 1163993 1758447 1912906 1757099 1682686 1314511 1252600 1629868 1681704
12708 1681704 1597262 1434473 943289 911467 878281 507986 415406 663352 617047 950611
12698 950611 1314366 1380940 1267163 971826 842462 696895 426702 95125 175795 321865
12688 321865 128809 57325 194850 120545 184222 -127685 -838600 -890455 -265758 635980
12678 635980 831451 714745 389592 -123327 -409009 -398756 -618078 -766490 -654937 -387295
12668 -387295 44666 452402 437530 376698 437257 377764 581168 614919 216025 1000
12658 1000 11210 196347 760051 1089417 984402 1270606 1826451 1808512 1675353 1543988
12648A543988M4497K19465j12406n46629m02133j11147m46681n26368K51349L19246
12638B33181M4798N8143M0304k11731o9797Q9641k13120K77947K38109O04192
12628A091667O02704o7484m04564p06245k88932j86261N8267O9433k1800p6987
12618F9798P4672K25095N50649K63274k57920k6518j79066l16201k76702l92014
12608b64933m58834k22794L15240L82338P4906J2314L14321M17610j3222m56721
12598A00225p6478M10190J34876k23994j81510J28469J60106J02768o1564k85360
12588B07728k84588p9426J65763P5134J47324j61330M1389K26364k66165n25265
12578d53072J3456J4073n768J32625J53549j28672J97904L52139j44205k92469
$$ plain form
12648 1543988 1588485 1807950 1695544 1148915 746782 635635 188954 -337414 -86065 233181
12638 233181 277979 336122 376426 164695 94898 184539 -28581 249366 487475 1091667
12628 1091667 1694371 1626887 1222323 516078 227146 40885 99152 168585 146785 69798
12618 69798 144470 369565 920214 1183488 925568 899050 719984 403783 127081 -264933
12608 -264933 -723767 -946561 -631321 -248983 -174077 -161763 152558 570168 556946 100225
12598 100225 23747 433937 568813 344819 163309 291778 451884 554652 493088 207728
12588 207728 -76860 -156286 9477 84611 231935 70605 111994 338358 72193 -453072
12578 -453072 -439616 -425543 -431311 -298686 -145137 -273809 -75905 276234 132029 -160440
12568a60440k47574l49934l47920N1661M11789K32538K10718L40777L99822K94327
12558H35764m7496k83644n9533L13488L44558R14o07495m89318J65148k0876j70765
12547a9255J63260K47105J43340j33740p8530q4732N8356L34214L66244L33261
12537A329523q2762n04736k56067n60282m06368L04644K29584L57033L44230K03990
12527I58789R7470K17104L19304K56665j97481k01117m90300p27987k02817J79940
12517B09570Q3707l39027m92890k6269M90338L61565K17044L61260L9586m50638
12507D54246l94030k63794L0210K60021L96886j48746j73281J83284K57084K0170
12497F22050K83288L82678j86187o76503m73835M5126Q2570N2199Q2982R592J26009
$$ plain form
12568 -160440 -408014 -757948 -1105868 -1054207 -642418 -409880 -199162 141615 541437 835764
12558 835764 788268 504624 445091 758579 1103137 1104051 496556 7238 172386 151510 -19255
12547 -19255 144005 391110 534450 400710 322180 237448 295804 630018 996262 1329523
12537 1329523 1246761 742025 485958 -74324 -480692 -176048 53536 410569 754799 958789
12527 958789 1056259 1273363 1592667 1849332 1651851 1450734 960434 232447 29630 209570
12517 209570 293277 -45750 -538640 -564909 -74571 286994 504038 865298 904884 454246
12507 454246 60216 -203578 -173368 86653 483539 334793 161512 344796 601880 622050
12497 622050 905338 1288016 1101829 425326 -48509 -3383 79187 131386 214368 223960 349969
12486C49969J75445l51252n97587l31389k12483l25529N09960R48386K06933J00848
12476D73301K37057k46789l27966K1697N5439m2091k1714j40410j43695J65248
12466C0077O16320L69353j21400Q122l42288m49109j01041n7714P1617m7777k5384
12455d9224M83427N92324M13677j44365m51949j87915m91651j15268q1887k12827
12445b45658M64677L68243J79868k40745k51514k31482k15634j1672l1752J00677
12435a14992j85857l40281r6804L10287L46117L179j70079P9873m59022m55759
12425a083338L96593M80791L35679J68275N62339K89026m78087o85356m50682
12416d64760p8662J07753J21649P35K42994K53774l736j66751l04384J67100K10431
$$ plain form
12486 349969 525414 174162 -423425 -754814 -967297 -1292826 -782866 165520 372453 473301
12476 473301 710358 463569 135603 157300 212739 170648 148934 8524 -135171 30077
12466 30077 646397 1015750 894350 902472 560184 111075 10034 -47680 23937 -23840 -49224
12455 -49224 434203 1026527 1440204 1295839 843890 655975 164324 49056 -32831 -245658
12445 -245658 219019 587262 767130 526385 274871 43389 -172245 -183917 -215669 -114992
12435 -114992 -300849 -641130 -737934 -427647 -81530 -78351 -248430 -168557 -627579 -1083338
12425 -1083338 -686745 -205954 129725 298000 860339 1149365 671278 -14078 -464760
12416 -464760 -543422 -435669 -314020 -313285 -70291 183483 179747 12996 -291388 -124288 86143
12405H6143L572j8719O554M4833l2215m57902n70487j46025k01201j7342N53422
12394g49367K44698K60708L86826M9635k99254P4679J52149m74201r9710K4052
12384d29785K01873O8622q3344l26900o861K85246K43503L25254K0449k43405
12374E4652l40210n0802O07856L53649m43971o33651k72774N9622K54549P11561
12364C00481N24954j07426k65982K2475K71117j24023k27343J66914M29022J98279
12354A188468k24375l17633k80420j02165j28201K68074m0952k9500L18081k7415
12344F23962n61908j15031J94099J86040K82004J35955O8974j34910k16428J30316
12334E93073j01282L5960N2862j1506k94268m19118O6087L99640L17118k92080
$$ plain form
12405 86143 89715 70996 77550 122383 90168 -367734 -938221 -1084246 -1285447 -1302789 -749367
12394 -749367 -504669 -243961 142865 192500 -106754 -32075 120074 -354127 -453837 -429785
12384 -429785 -227912 -159290 -242634 -569534 -576395 -291149 -47646 277608 298057 54652
12374 54652 -285558 -336360 271496 625145 181174 -452477 -725251 -665629 -411080 300481
12364 300481 825435 718009 452027 474502 745619 621596 394253 561167 990189 1188468
12354 1188468 964093 646460 366040 263875 135674 403748 362796 333296 651377 623962
12344 623962 62054 -52977 141122 327162 609166 745121 814095 679185 462757 593073
12334 593073 491791 527751 580613 569107 274839 -144279 -78192 321448 638566 346486
12324C46486o86145O6411O58674N24377j75762m44437k64372o5040m3191L98365
12314C15366N89125M7861n16767n82730k51329L7021L28283K01710P1633l84271
12304a44098l08684r6665J57334J11401m1820J14066J67758j72872k53791l4351
12294e01722J78545K85936P9995j64867l06309L74425N75810r1985k45259Q371
12284A92940j83573K10723K04733j81955j61442k07808m2371J22568L90280Q8198
12274D32293m2511K7362j00610k86958j33512K11902J67322K83683J99097j91718
12264E66350J56633M76112J48842l49057m00305j8162o7820k69831r0955l28860
12254a77053l00789J19562N60076O97459L39996j34534l87426k29805K110j93815
$$ plain form
12324 346486 -339659 -273248 385426 909803 734041 289604 25232 -39808 -82999 315366
12314 315366 904491 952352 435585 -147145 -398474 -361453 -33170 168540 240173 -144098
12304 -144098 -452782 -549447 -392113 -280712 -322532 -208466 -40708 -213580 -467371 -501722
12294 -501722 -323177 -37241 42754 -122113 -428422 -53997 521813 429828 184569 192940
12284 192940 9367 220090 424823 242868 81426 -126382 -168753 -46185 344095 432293
12274 432293 389782 417144 316534 29576 -103936 107966 275288 558971 758068 566350
12264 566350 722983 1199095 1347937 998880 598575 580413 512593 242762 151807 -177053
12254 -177053 -477842 -358280 201796 899255 1239251 1104717 717291 487486 489596 295781
12244B95781n13005m03144j33644J53012N76408Q12160P4128l08720J42545l80258
12234C15263p55489k93240k56819P0223L69701K79566k58608m31024k29235k67738
12224a457400o7273M97051P43391K4550l96970R300M19449J72958q5357K93750
12214A53449N39587K2585m90263o85731n05249j4070K36015Q0351j37398N18L32702
12203d67504O5477K42211L66503j17781m43262k29385o3151L74672L60262k6684
12193F1358l77947j20235M86515O56808O2651o99243r9673R7549k58663l92244
12183e83124r7211M16969p6863k38856j76569j22769j25644J7530L61855L38984
12173b85698Q8505n4775J73680K04205Q2466n4679M1397L12032M67646J56691
$$ plain form
12244 295781 -217224 -620368 -754012 -601000 -24592 787568 861696 552976 695521 315263
12234 315263 -440226 -733466 -990285 -920062 -550361 -270795 -529403 -960427 -1189662 -1457400
12224 -1457400 -1524673 -1027622 -284231 -259681 -656651 -647351 -227902 -54944 -140301 153449
12214 153449 693036 715621 225358 -460373 -965622 -979692 -743677 -663326 -800724 -800206 -467504
12203 -467504 -402027 -159816 206687 88906 -354356 -583741 -646892 -272220 88042 61358
12193 61358 -316589 -436824 49691 706499 769150 69907 -29766 67783 -190880 -583124
12183 -583124 -680335 -263366 -340229 -579085 -755654 -878423 -1004067 -986537 -624682 -285698
12173 -285698 -197193 -251968 -78288 125917 208383 153704 195101 507133 974779 1131470
12163A131470m1732M7248J84114O9191n4405q4448m12566m42740l58356j97244
12153a59468n1309m30447l2004K74753L91770J09836l15699p1296L75652N45184
12143F36972L26940k45062p53981n22318j04528k66022j00212j00263J92384M21560
12133e14530l46268k73445o871O7239J34053K0807J00910j25782k12039K01050
12123i54876K01235j93842P0305R30965J50271q1951J19525p3198Q1555K52990
12113E02979l6985O1871J6584J43807K7737k74708o56342l34016k69045k45002
12103a063120K07277Q14551P67504M10152L35530r7853n85420p66442m59876J12343
12093c25354L41989j88911q0794P3007k75443j47337R4040j749q7049q6448k90825
$$ plain form
12163 1131470 1089738 1136986 1321100 1390291 1335886 1251438 838872 396132 37776 -159468
12153 -159468 -210777 -641224 -673228 -398475 -6705 103131 -212568 -283864 91788 636972
12143 636972 963912 718850 -35131 -557449 -661977 -927999 -1028211 -1128474 -936090 -514530
12133 -514530 -860798 -1134243 -1141114 -1073875 -939822 -919015 -818105 -943887 -1155926 -954876
12123 -954876 -753641 -947483 -877178 53787 204058 122107 241632 168434 249989 502979
12113 502979 465994 527865 544449 688256 715993 441285 -215057 -549073 -818118 -1063120
12103 -1063120 -855843 -41292 726212 1136364 1471894 1374041 788621 22179 -437697 -325354
12093 -325354 16635 -172276 -253070 -180063 -455506 -602843 -508803 -510552 -597601 -684049 -974874
12082i74874M9620q604l34971j57174K09229P73001Q20262j26015m22002l3159
12072b04687Q5871J70697R8186N2737Q4600R3287l38002k32326J79452M47411
12062D37226J998k43424n7602j04557j70950k36118k69884M14148K46474l30266
12052c12955k50652j6873Q3465M25714J93598P8048J14286j67016K20297K94613
12042F62525J10752o0696m51965o59535k95700J32750K52063J55740j90539k24643
12032e69248m60784j37040L60952L42633K67793N11867L69151M17451M12882k08741
12022A306916o88283q25146j02283L59922J78602R9074l23370l20406l72637m103
12012f91714J72513K90816O62889K53158j54008J20404N11421J62278J00200n8365
$$ plain form
12082 -974874 -925254 -933858 -1268829 -1426003 -1216774 -443773 376489 250474 -171528 -204687
12072 -204687 -118816 51881 150067 202804 287404 380691 42689 -189637 -10185 437226
12062 437226 439224 195800 138198 33641 -137309 -373427 -643311 -229163 17311 -312955
12052 -312955 -563607 -580480 -497015 -71301 122297 200345 314631 147615 367912 662525
12042 662525 773277 712581 260616 -398919 -694619 -561869 -309806 -154066 -344605 -569248
12032 -569248 -1030032 -1167072 -806120 -463487 -195694 316173 685324 1102775 1515657 1306916
12022 1306916 618633 -206513 -308796 51126 229728 328802 5432 -314974 -687611 -691714
12012 -691714 -519201 -228385 434504 687662 533654 654058 1165479 1327757 1427957 1369592
12002A369592o23867n3772P41419O11879N44881Q43393L08531m46213n90151n31842
11992B173850l17675p2272L01718J10352K990r1218l15544j6672j8161n7620k31417
11981A468331l52658j97184n91566n07210j77548j7116K32945L04374J1997m06234
11971b31869m029L30348Q868R8898K99103J75599j44839k15574j42093k36740
11961f2328J63526J06812O124L51268K597m59433J36974j78555k71396m21675
11951f26086k08426M41671O47414L05985m99564n72099K6496L83377J16291k46655
11941b31596m3734L63633k46k69123k9008j4850j76957m025L9991R5142J81055
11930h9718Q4881K12923K62069k00842p69079o49360J97337O52279M63663j84540
$$ plain form
12002 1369592 745725 691953 1433372 2045251 2590132 3433525 3742056 3295843 2705692 2173850
11992 2173850 1856175 1783903 2085621 2195973 2198963 2107745 1792201 1775529 1757368 1699748 1468331
11981 1468331 1115673 918489 326923 -180287 -357835 -374951 -142006 162368 174365 -231869
11971 -231869 -235898 94450 103318 202216 501319 676918 532079 316505 174412 -62328
11961 -62328 101198 208010 214134 565402 567999 108566 245540 66985 -204411 -626086
11951 -626086 -834512 -392841 254573 560558 60994 -511105 -484609 -101232 15059 -231596
11941 -231596 -275330 88303 88057 -181066 -210074 -224924 -401881 -405906 -365915 -270773 -89718
11930 -89718 -4837 208086 470155 269313 -499766 -1149126 -951789 -299510 164153 -20387
11920b0387l91818J04989K63448J17198j85444l8040P3184L49060K53167n2432
11910D72925j71630j97892p4261k6780M80274M35144m7303k30660j66486j53844
11900C19487j21788j70177j67393K56364Q02755N62220L7195q59393l69922L28491
11890F17839J66321k5249m95923m33291L5059M7669q8412J45464K56767L39162
11880E65406J11263j18322J92371L24561M5947l51886m27851l55124K00242Q8326
11870B74933m3881j50419l31885l75353j46900J98662K41621J53923K89064K73070
11860C82835j07573k77942j87053K53376M22507N8476k49142J19382J74124j43608
11850D45382k70216N3915L07308K012k13942k00862k90184p2533K6854L3846K98584
$$ plain form
11920 -20387 -412205 -307216 -43768 73430 -112014 -150054 -76870 272190 525357 472925
11910 472925 301295 103403 29142 2362 482636 917780 870477 639817 473331 319487
11900 319487 197699 27522 -139871 116493 919248 1481468 1518663 659270 289348 617839
11890 617839 784160 758911 262988 -170303 -135244 -87575 -175987 -30523 226244 565406
11880 565406 676669 558347 750718 1075279 1121226 769340 341489 -13635 186607 274933
11870 274933 231052 80633 -251252 -626605 -773505 -574843 -333222 -179299 109765 382835
11860 382835 275262 -2680 -189733 63643 486150 544626 295484 414866 588990 445382
11850 445382 175166 229081 536389 538401 324459 123597 -166587 -239120 -212266 -178420 120164
11839A20164K01675l0951o03950m66683L5834J79928K08807L72078J92811k33755
11829b4042l04364J18535O17730M02300K81737o9269p53499l80009Q8769L83639
11819C61527K63437r7646j33838M1597q4689k86935J91902J02869q7312m24197
11809a53285l57999L10342L18091L91242K74256k6938j70865l73928o5276n1536
11799I4104j0240J60957J10203R1553j76823l80301J98812Q32502L59685l72636
11789I07816l77334j09816j71894m10916n46676L9975J40757J65267J46088k5202
11779b41935P0747l28175j78461J81832m1541j73968J07727K32690J29290J6445
11769b25349O2944j18875r2511J28684J39669J95296J24229o9662o0327K93415
$$ plain form
11839 120164 321839 290888 -313062 -779745 -743911 -563983 -355176 16902 209713 -24042
11829 -24042 -328406 -209871 407859 810159 1091896 1022627 269128 -110881 -22112 361527
11819 361527 624964 527318 393480 435077 350388 63453 255355 358224 270912 -153285
11809 -153285 -511284 -200942 117149 508391 782647 755709 584844 210916 145640 94104
11799 94104 83864 244821 355024 446577 269754 -110547 88265 920767 1280452 907816
11789 907816 530482 420666 248772 -162144 -708820 -668845 -528088 -362821 -216733 -241935
11779 -241935 -171188 -499363 -677824 -495992 -537533 -711501 -603774 -371084 -241794 -225349
11769 -225349 -162405 -281280 -373791 -245107 -105438 89858 214087 144425 84098 377513
11759C77513M0831n06582n63956l15681R2551K73748K8438J81247q9429p2016
11749e53336K67811O49948O08604K9181l09909l19048K43244P3757M71090K71695
11739A433037m02834K21418k87651r83745j03209j31478l09208J83322Q44724
11730D64376N49655j24495N0096j84323n98902m23213k45802o7524M81526M4186
11720e4420m93306k23791j26397R9660P8402M13937L88946K32775j14050k75532
11710g3776r9106K38595K14160J78848L97474j95054l67171l46628j2946L54211
11700B88607n914j9119p4881k92880l8279J94948M33051j28517n20756k62132
11690d25872O7409K40238P3435J43242K13891l02708l07815j85452k87268l01530
$$ plain form
11759 377513 418344 -88238 -652194 -967875 -875324 -601576 -573138 -391891 -481320 -553336
11749 -553336 -285525 364423 973027 1002208 692299 373251 616495 690252 1161342 1433037
11739 1433037 1030203 1251621 963970 -19775 -122984 -254462 -563670 -380348 464376
11730 464376 1014031 889536 939632 755309 156407 -266806 -512608 -580132 -98606 -54420
11720 -54420 -547726 -771517 -897914 -798254 -719852 -305915 83031 315806 201756 -73776
11710 -73776 -172882 65713 279873 458721 856195 661141 293970 -52658 -65604 288607
11700 288607 282693 263574 188693 -104187 -142466 52482 485533 357016 -163740 -425872
11690 -425872 -358463 -118225 -44790 98452 312343 9635 -298180 -483632 -770900 -1072430
11680a072430P4090j80122n69637j47932P9378L30049N14887M09171J00975J38559
11670c23012M88738K54034N5005J18251o7373O2235J50684N6186l94891l83285
11660A6572j46489k42673J825K61718M99008J67008l04654j20224P2859J08340
11650C13290K27667K07362l70839r98783o37142J77842l3496j17411K34827M13076
11640e83607K73517M27615J56288l71572k23641r6479K14712L93828l33880n67680
11630g10899K66801R68512O57555r8071q06667j075071j82134K23027L27071k98923
11620g28799k46506L55431N0753l0904k3386J65202M04836J09529k31991k31987
11610d07822J18872K47717N13687k04932o46402r9469J3071j56629J08692J34214
$$ plain form
11680 -1072430 -998340 -1178462 -1748099 -1896031 -1816653 -1486604 -971717 -562546 -461571 -323012
11670 -323012 165726 419760 474765 593016 525643 587878 738562 794748 399857 16572
11660 16572 -129917 -372590 -370765 -109047 389961 556969 252315 132091 204950 313290
11650 313290 540957 748319 377480 -621303 -1258445 -1080603 -1114099 -1231510 -996683 -583607
11640 -583607 -310090 117525 273813 -97759 -321400 -417879 -203167 190661 -143219 -710899
11630 -710899 -444098 524414 1181969 1083898 277231 -797840 -979974 -756947 -429876 -728799
11620 -728799 -975305 -619874 -569121 -600025 -623411 -458209 -53373 56156 -175835 -407822
11610 -407822 -288950 -41233 472454 267522 -378880 -478349 -465278 -621907 -513215 -379001
11600c79001j82736J44299L83082K84358m6877J86994K60181K90660K3244l77326
11590E86878p34750m35665N8128O04295L98374l06345j2059L02223Q26077L7292
11580A324448r06510m61404L15312O1715k70298n5241Q2225L29400K25174J03655
11570G48476k01125m38252p1745M4361m71532j49271M74314K86143J8506j54914
11560H4961j27589k49032l24997m4099j04746P2821L9748M08854M44450J66705
11550C67076K81882O0524k57497l9887J28258J33246J65206l18594k96080J20177
11540C44311J07299K22839J85818j3531j79627j9000M0306l31756j03381m2009
11530B11269k48055k78384j6682K78524J00625j87813M4535q0062l42323j21628
$$ plain form
11600 -379001 -561737 -417438 -34356 250002 203125 390119 650300 940960 964204 586878
11590 586878 -147872 -583537 -525409 78886 477260 170915 158856 461079 1287156 1324448
11580 1324448 417938 -43466 271846 333561 63263 8022 90247 419647 644821 748476
11570 748476 547351 109099 37354 81715 -389817 -539088 -64774 221369 239875 84961
11560 84961 -42628 -291660 -616657 -660756 -765502 -692681 -652933 -244079 200371 367076
11550 367076 648958 709482 451985 412098 540356 673602 838808 520214 224134 344311
11540 344311 451610 674449 860267 846736 667109 648109 688415 356659 253278 211269
11530 211269 -36786 -315170 -331852 -53328 47297 -140516 -95981 -176043 -518366 -639994
11520f39994j58781k32217j67967k27144K05821R4033j19865Q7898N50632O70353
11510F2769M5043j65464j97271k99045j82876J47387L44403j2749j40350O5971
11500c32182j6313m93689q9543K48762K28793L84649K59579M63323J62209j26932
11490F88656j53592O6711l26873l89237K22534N19580K72490j16839j53006k34067
11480C96357j50630k7048J27623k69548j53430J94369K78147N8680r3150q3057
11470B78313j52883m048J41176J35291Q9866l851J57756K9260m30015p48279l19766
11459h27180j06503n11482k56716J62883J89362K01137P43876P33561j74567J08826
11449B63197P2648n47376N5813K70596m704k60907k48431l0780l8837K25513k4508
$$ plain form
11520 -639994 -798775 -1030992 -1198959 -1426103 -1220282 -1126249 -1246114 -1158216 -607584 62769
11510 62769 107812 -57652 -254923 -553968 -736844 -589457 -245054 -257803 -398153 -332182
11500 -332182 -348495 -842184 -931727 -682965 -454172 -69523 190056 653379 815588 688656
11490 688656 535064 601775 274902 -114335 108199 627779 900269 783430 630424 396357
11480 396357 245727 218679 346302 76754 -76676 117693 395840 454520 361370 278313
11470 278313 125430 121382 262558 397849 487715 483864 641620 670880 240865 -507414 -827180
11459 -827180 -933683 -1445165 -1701881 -1538998 -1349636 -1148499 -404623 328938 154371 263197
11449 263197 335845 -211531 -155718 114878 110174 -150733 -399164 -429944 -468781 -243268 -267776
11438b67776l62101m68191J23774M43296L89022K03095K85663L05654j71278j57376
11428C23782q23142r9278J95864J93591N92168K32763J47295j72463k30293P0231
11418D30518k34151m36649j48024M8922k58173k60823j8597J22150L9083J66735
11408e49009Q2816J82923J14401K29145K22602m3893k62056n2156k4957l24653
11398d24837m62808K74048N50784M3686P2490J63386K54242k79105n76896K56971
11388a28039P40310J51053k01849l28523m28236J17351P5568j78815l9961M4300
11378a76841K01563l1932J1473k04130p0471J49192K1605kp798k45578J71695
11367a81224K37510R1073J43831m39706n97277n57104j20248M26972J90125J90280
$$ plain form
11438 -267776 -629877 -1098068 -974294 -530998 -141976 61119 346782 652436 481158 323782
11428 323782 -499360 -598638 -402774 -209183 382985 615748 763043 590580 360287 430518
11418 430518 196367 -240282 -388306 -339384 -597557 -858380 -876977 -754827 -715744 -549009
11408 -549009 -466193 -283270 -168869 60276 282878 238985 -23071 -75227 -100184 -424837
11398 -424837 -887645 -613597 -62813 -19127 53363 216749 470991 191886 -385010 -128039
11388 -128039 612271 763324 561475 232952 -195284 -77933 -2365 -181180 -221141 -176841
11378 -176841 24722 -7210 4263 -199867 -270338 -121146 -99541 -99543 -107341 -352919 -181224
11367 -181224 56286 147359 291190 -148516 -745793 -1302897 -1423145 -996173 -806048 -615768
11357f15768L96007K42346l0392P3539J64520O6304K65691K12432K12395J28559
11347A115633J52775K20446N18m24341m60050n88197l92870m02689l84500J77274
11337i86001N64381K44555j64463j50060k08900p8343m176J36986M37394K85281
11327G6654K40489N80898M3992l45529n91810l59495j2854J41978k03935j50034
11317e79646o2531j9493J41614K43480M19837J36288j03848L97308M78418M54873
11307A506300L69908l4063o43795n63920o08175l97851R4383K21361L60991m6423
11297B58716k47044o20485O7456K39911m9115J79070n3215j96036Q6406K12094
11287a22242J79508k58534J74320L21866P2131j15515k63768n511L30852N64880
$$ plain form
11357 -615768 -219761 22585 -7807 65732 230252 296556 562247 774679 987074 1115633
11347 1115633 1268408 1488854 1489372 1065031 604981 16784 -376086 -778775 -1163275 -986001
11337 -986001 -421620 -177065 -341528 -491588 -700488 -778831 -783007 -646021 -208627 76654
11327 76654 317143 898041 942033 596504 4694 -354801 -367655 -225677 -429612 -579646
11317 -579646 -642177 -661670 -520056 -276576 143261 279549 175701 573009 1051427 1506300
11307 1506300 1876208 1842145 1198350 634430 26255 -371596 -277213 -55852 305139 258716
11297 258716 11672 -608813 -541357 -301446 -350561 -171491 -224706 -420742 -334336 -122242
11287 -122242 57266 -201268 -26948 294918 367049 251534 -12234 -17745 313107 877987
11277H77987j9126l10035m92337o01427r4620k8225j03450l29395k16700L50265
11267i67063J08997j88376M6813K37528M3096j42049j04397K04131J07254J20703
11257e33363L15740L74877j03494m96557k20836J68238R1088K57567J26741K31722
11247B11723J58752Q3383k3164k09661J11377M19466R0904l57034k41522M1683
11237B85907k57649l78402l9038K62708L31977K10766m51566m78645N8054L05363
11227a50525N37057J35486J69214K92751L38273m63833l84774P6993M14816M6456
11217A011914l68771k96205l82834q4823L62196L90874M695j19190l4536m23072
11207F0248m69868P419R1035j24968L11408Q5223j62266o9803K5978L9571L4915
$$ plain form
11277 877987 858861 548826 56489 -544938 -639558 -667783 -771233 -1100628 -1317328 -967063
11267 -967063 -858066 -1046442 -999629 -762101 -719005 -861054 -965451 -761320 -654066 -533363
11257 -533363 -217623 157254 53760 -442797 -663633 -495395 -404307 -146740 -19999 211723
11247 211723 370475 453858 430694 221033 332410 751876 842780 485746 244224 285907
11237 285907 28258 -350144 -389182 -126474 205503 416269 -35297 -513942 -455888 -150525
11227 -150525 386532 522018 691232 983983 1322256 858423 473649 550642 965458 1011914
11217 1011914 643143 346938 -35896 -120719 241477 632351 637046 517856 483320 60248
11207 60248 -409620 -402201 -311166 -436134 -124726 -39503 -201769 -271572 -245594 -206023 -171108
11196a71108P2604j45161j25368J95232N48611K69407K1770l86164n45346k57223
11186e22746K51790J46918q4942J03093j03360M1883L66657L65531j58088j19649
11176B87087L04960m7777N6632P5907k3210K21131M36184M3730k39346l42400
11166G72898o14503k88468Q7581L18071K30478K2173l41505m82484O2248J96498
11156c7013k2458J45453K68468K65726J59209j69852l12482M0561J02273n52199
11146a12314k03965K24166j49351j07862L04423N76058K52941j37990n79047n39894
11136d72835J02082J53922P7733J75205r1066r4281l147Q1671K23795R8087m5241
11125B05925J73813L26517p7878k74898m96047r0401K37766q9842k14256l8900
$$ plain form
11196 -171108 -98504 -243665 -369033 -173801 374810 644217 665987 279823 -265523 -522746
11186 -522746 -270956 -124038 -208980 -105887 -209247 -167364 199293 564824 406736 287087
11176 287087 592047 544270 600902 676809 653599 874730 1310914 1354644 1115298 772898
11166 772898 158395 -130073 -42492 275579 506057 528230 186725 -295759 -233511 -37013
11156 -37013 -59471 85982 354450 620176 779385 609533 297051 337612 439885 -112314
11146 -112314 -316279 -92113 -241464 -349326 -44903 531155 784096 646106 67059 -472835
11136 -472835 -370753 -216831 -139098 36107 -54959 -149240 -152387 -70716 153079 251166 205925
11125 205925 379738 706255 628377 353479 -142568 -232969 4797 -85045 -299301 -338201
11115c38201L83610O4650n80990q4384Q39394L58762p6623n2070R3225J17157
11105G24530p8143P8404P3433k55011k16294k12588l28871l26464P0351N52092
11095H1439J9853n94519j32337n9401m13382k05616J4350N19310R01955O54162
11085G85814L287j53150l25905l37637j98613l32967R4267J98455J18105K40464
11075I2120N3275L72726J97291q1199P6723Q7189J07242K29439m35939p45302
11065d6435l13744K98530M0917j21571j0864L42820L12921k14559o30636o3275
11055d05896N01353n3351m31585l319M10431N33560K16760j96360J06165j50974
11045E26784m12668j6449K90679N8878k54632j17001j61876Q590j87836k94856
$$ plain form
11115 -338201 45409 110059 -470931 -555315 284079 642841 566218 514148 607373 724530
11105 724530 646387 724791 798224 543213 326919 114331 -214540 -541004 -470653 81439
11095 81439 101292 -493227 -625564 -684965 -1098347 -1303963 -1289613 -770303 131652 785814
11085 785814 789101 635951 310046 -27591 -226204 -559171 -464904 -266449 -148344 92120
11075 92120 145395 518121 715412 634213 710936 798125 905367 1134806 698867 -46435
11065 -46435 -360179 -61649 -20732 -142303 -153167 189653 502574 288015 -342621 -405896
11055 -405896 95457 42106 -389479 -392798 17633 551193 767953 571593 677758 526784
11045 526784 114116 97667 388346 447224 192592 75591 -86285 -77695 -265531 -560387
11035e60387J934m19240O3243K51971L31918j8931n04535j8009N20170K9474N3
11024c22339M17333N08471J49795J03230L67440J51121m49414o10761j25452l04835
11014a15411p4125L35586J22433J9468O5597j8402J59025O502k18932K25920O06542
11003A114203M96397n2183l43872j65776m22460m55388l4164j37973p31570m55313
10993a188099J8856K52022J65829M32142L42862k0359k02366j31905Q7858J76386
10983f6774R745j21721j80605J25715M32416J59172j19619m03827m77057k81287
10973i23842j33988K58670M69605N05587K52532k36029o2501L50146K28559j015
10963G07724j67960p42226o85406R9032L92044M28792N68412O6356J05002J04763
$$ plain form
11035 -560387 -558453 -977693 -914450 -662479 -330561 -349492 -854027 -872036 -351866 -322392 -322339
11024 -322339 94994 603465 753260 856490 1223930 1375051 925637 314876 189424 -115411
11014 -115411 -189536 146050 268483 287951 353548 335146 494171 500673 281741 507661 1114203
11003 1114203 1610600 1558417 1214545 1048769 626309 170921 136757 -1216 -732786 -1188099
10993 -1188099 -1169243 -917221 -751392 -319250 23612 3253 -199113 -331018 -243160 -66774
10983 -66774 -57029 -178750 -359355 -233640 198776 357948 238329 -165498 -642555 -923842
10973 -923842 -1057830 -799160 -329555 176032 428564 192535 130034 480180 708739 707724
10963 707724 539764 -202462 -887868 -788836 -396792 32000 600412 666768 771770 876533
10953H76533o06107o55262l94064L2312K72608J59616K26490O2659R5525j91768
10943a21458k69749k33425j23916M2023J59950O18905N18913J02802j13106m06017
10933A74922J674L13517k36744o12927m45271L05372K78505j49848L34933N84153
10923E48286j63460k79437O237r9085j284J73858J57797k31647o840L7230k70087
10912a28432k84339J30514q5476M6749L43492J29837R5611K40488P4395l79448
10902A83391n28941n14628k65381J33964K77006N92888L05650K33186o1250j82828
10892A73057j13892l8152k31759M05082M26239k89890N144p0024l31447L51095
10882B85453P67166q5979m33747j64979Q2131J10754j3431L0797L14488K28544
$$ plain form
10953 876533 270426 -384836 -778900 -746588 -473980 -314364 -87874 -25215 70310 -121458
10943 -121458 -391207 -624632 -748548 -706525 -546575 72330 591243 694045 580939 174922
10933 174922 176596 490113 253369 -359558 -804829 -499457 -220952 -370800 -35867 548286
10923 548286 384826 105389 111626 12541 11257 185115 342912 111265 104425 141655 -128432
10912 -128432 -412771 -282257 -367733 -320984 22508 152345 247956 488444 562839 183391
10902 183391 -345550 -860178 -1125559 -991595 -714589 -121701 183949 417135 355885 173057
10892 173057 59165 21013 -210746 194336 620575 330685 335829 265805 -65642 285453
10882 285453 1052619 966640 532893 367914 450045 560799 547368 578165 892653 1121197
10872A121197j0848R2327j74716m26285j48786L71698M3056k73300m7851K9701
10862E76193m01973k54259k3711R2715K30395J28929j27133n45317k97680m2585
10852f64426m01172K8835N16009J77429n68929k05293P48002O17556Q4196n55820
10842b23613k5616J49842l372r8374j88408j78092m32323n18531J60963O89061
10832f68463M93457N26742O83871K9406n29944j50210j66509j11022j41314n13701
10822e47687l54918k23869M13707P44763M71883J07652j30929k25746l44445l00457
10812c90046P4862K11622L51811k2364n71867m58635O0280K07680Q4556J4755
10802d37346M7912j78985n52575k87314J61320M48754K70433J14835J73555J01423
$$ plain form
10872 1121197 1110349 1202676 1027960 601675 452889 824587 867643 594343 546492 576193
10862 576193 174220 -80039 -103750 -11035 219360 348289 221156 -324161 -621841 -664426
10852 -664426 -1065598 -1036763 -520754 -343325 -912254 -1117547 -369545 248011 332207 -223613
10842 -223613 -249229 -99387 -102759 -201133 -389541 -567633 -999956 -1518487 -1357524 -668463
10832 -668463 -175006 351736 1035607 1065013 535069 384859 218350 107328 -33986 -547687
10822 -547687 -902605 -1126474 -712767 31996 503879 611531 480602 254856 -89589 -390046
10812 -390046 -315184 -103562 248249 225885 -345982 -804617 -744337 -536657 -452101 -437346
10802 -437346 -389434 -568419 -1120994 -1408308 -1246988 -798234 -527801 -412966 -239411 -137988
10792a37988J10017j0801l4176K8664j85931n93896l80617M35974K58914k88270
10782g98110p9162K18872j29984R0011N84283L37673l29811l58078N3230m1391
10772d52467J62844J87897J23049J91585J13680j12979j68018K66989N87311L91424
10762A291315n9667o205n804j10374q50k83842l68534k85024q7237R7466j14274
10751F6970j00609J32196J29710J05604k40298k16675K52723L18617M3281l52426
10741A39093j29459L30668j51896l76124j56046m4912j62634o5680J65176M05003
10731d6811J48450j76528Q3537l2237n92025p5539J29751j44395l79151j10403
10721a195351N02708L09999M05654N14343k10474l98116Q7462L6510k2700L27029
$$ plain form
10792 -137988 -27971 -38772 -72948 -44284 -230215 -824111 -1204728 -768754 -509840 -798110
10782 -798110 -877272 -658400 -788384 -698373 -114090 223583 -106228 -464306 -411076 -452467
10772 -452467 -289623 -101726 21323 212908 326588 213609 45591 312580 899891 1291315
10762 1291315 1231648 1225443 1219639 1109265 1108415 824573 456039 171015 83778 181244 66970
10751 66970 -33639 98557 228267 333871 93573 -123102 129621 448238 491519 139093
10741 139093 9634 340302 188406 -187718 -343764 -388676 -551310 -616990 -451814 -46811
10731 -46811 101639 -74889 8648 -23589 -615614 -691153 -561402 -705797 -1084948 -1195351
10721 -1195351 -692643 -382644 23010 537353 326879 -71237 16225 52735 30035 357064
10711C57064N920l17039m6221R9268k4902o9960K26235Q6763o78586q79384j37226
10700a378068L03403K34017j07581j20306K43228l08123o48632p280J1643M8050
10690a729649L67552J58669L65954L39123N03479M06649j47827j64800L2377j09812
10680B1715k15602k08872K23644M9439n6857Q411J34129j0544O139N98333M48099
10669I98034o17942r84851l99091L47189K89996r4989k22817K56638N78530J12358
10659B63055J81770P5444m66928m05964L15152L97937J32516j31186k11658k66441
10649a16303k72580k4444j61954J2933L49313J12964K59436K56367K24635j42023
10639D98344k27777m8355N4629k36423k86398p2305Q1858N7351n1465J14624o0323
$$ plain form
10711 357064 362984 45945 -276 98992 74090 4130 230365 317128 -361458 -1240842 -1378068
10700 -1378068 -1074665 -840648 -948229 -1068535 -825307 -1133430 -1782062 -1789342 -1777699 -1729649
10690 -1729649 -1362097 -1203428 -837474 -498351 5128 411777 263950 99150 131527 21715
10680 21715 -193887 -402759 -179115 -129676 -186533 -178122 -43993 -54537 -48398 549935 998034
10669 998034 380092 -604759 -1003850 -656661 -366665 -461654 -684471 -427833 150697 263055
10659 263055 444825 520269 53341 -352623 -37471 360466 492982 361796 150138 -116303
10649 -116303 -388883 -413327 -575281 -562348 -213035 -100071 159365 415732 640367 498344
10639 498344 270567 222212 276841 40418 -245980 -318285 -236427 -179076 -230541 -115917 -176240
10628a76240m25425m9109K09438O3580J54190q381j38921l01981j99634L09809
10618e62674L89196j83482n78747p1784J97613J05140Q5773J04555k68268k40762
10608a023440p0173j41613J80373R1733M65963J84794k30490J40615L05687L87383
10598B90832k96066o53838J24184L95912n02389m93680K29491L93184K81790M17878
10588A87298M8748j52312k20171n19008l08530K57712L72860M43824K39919r5952
10578B54388l29818m34113j41112N9365j33784m2165J30760l2357J69208N19973
10568B0345L70158k19103n80772J45445M59173J48558j6083l34365o93261n33416
10558a233321m30680k19392p8052K88023L39397L80798O72209N48810m9469l16030
$$ plain form
10628 -176240 -601665 -650774 -441336 -377756 -223566 -231947 -370868 -672849 -872483 -562674
10618 -562674 -173478 -356960 -935707 -1007491 -809878 -704738 -618965 -514410 -782678 -1023440
10608 -1023440 -1093613 -1235226 -1054853 -963120 -497157 -312363 -542853 -402238 -96551 290832
10598 290832 -5234 -659072 -534888 -138976 -641365 -1135045 -905554 -512370 -230580 187298
10588 187298 236046 83734 -136437 -655445 -963975 -706263 -333403 110421 350340 254388
10578 254388 -75430 -509543 -650655 -591290 -725074 -767239 -636479 -668836 -499628 20345
10568 20345 390503 171400 -409372 -263927 195246 343804 327721 -6644 -699905 -1233321
10558 -1233321 -1664001 -1883393 -1961445 -1673422 -1334025 -953227 -281018 267792 218323 -97707
10548i7707K31463M87113K43206L02883L46671k47599o07416q93588l80439q6605
10538g02018j7746J19522K110N8225j72590J30516P7580m2455M59252M18152m06539
10527g5991M55113P13603l40073n16251k75067J3366L36653K04193n2886N6069
10517E18729L332k67140N10507N06901m45696m36750k57499M6254j49763m7390
10507a8515J08105J80136M36753K87822l26189n25237m15981n45908K33895K70681
10497c14438K50971L37811l5684K87201l9078j20731J10861m5363m23936q6945
10487g9331M15750M05060m9069q4837m88460l41351J12306R1425q8611k5165k92122
10476d24405l59175l6453L24629O26127M72396j5329k72237m61051m80587Q8951
$$ plain form
10548 -97707 133756 620869 864075 1166958 1513629 1266030 658614 -234974 -615413 -702018
10538 -702018 -719764 -600242 -598132 -539907 -712497 -581981 -504401 -546856 -87604 330548 -75991
10527 -75991 379122 1092725 752652 236401 -38666 -25300 311353 515546 462660 518729
10517 518729 522061 254921 765428 1272329 826633 389883 132384 178638 28875 -18515
10507 -18515 89590 269726 706479 994301 668112 142875 -273106 -819014 -585119 -314438
10497 -314438 -63467 274344 238660 525861 486783 366052 476913 431550 7614 -79331
10487 -79331 336419 741479 692410 607573 119113 -222238 -109932 -18507 -107118 -132283 -424405
10476 -424405 -783580 -820033 -495404 130723 603119 587790 315553 -145498 -626085 -537134
10466e37134L29886q0896m22280k7946K55162j66173n46206j04465M82019L59503
10456d58530k31115k53781J34125Q4259J37668J47883M19j80159l0449n84971
10446a234651n15229J56856O44885M22642P5177K89608N84428M33146n42420n72463
10436b58021O8846M73668K34139J92554m3967j63957k68364k89691k4821j94283
10426b73897K23156K19092j68291m1234L83161P0777l5508l32396m24116O9447
10416c09809m1490O5786K74789J81466j7184m1149l54671j02254r0274j47723
10406e82513j0148J54879L50697J29257m6112m0226L24127J26661l21352m96737
10396d11467j59589N1441k09983J07560N28633K66456M5519j10811K36944N76821
$$ plain form
10466 -537134 -207248 -288144 -710424 -738370 -483208 -649381 -1195587 -1300052 -818033 -458530
10456 -458530 -689645 -943426 -809301 -725042 -587374 -439491 -439072 -619231 -649680 -1234651
10446 -1234651 -1749880 -1593024 -948139 -525497 -450320 -160712 423716 856862 314442 -258021
10436 -258021 -189175 284493 518632 711186 667219 503262 234898 -54793 -79614 -273897
10426 -273897 -50741 168351 60 -41174 341987 412764 377256 44860 -379256 -309809
10416 -309809 -351299 -285513 -10724 170742 153558 112409 -242262 -344516 -434790 -582513
10406 -582513 -592661 -437782 -87085 42172 -3940 -44166 279961 406622 85270 -411467
10396 -411467 -571056 -519615 -729598 -622038 -93405 173051 218570 107759 344703 921524
10386I21524K20575o8300k11686j84438j75588R5325l52679l84576k00308l5570
10376c75721L58677O09240K21178j00738j23252p4187K19460O7316k06675k45146
10366C50152o1048q1709K42162K75402o5338m16034J24851j8844k21637k25530
10356i7573j46388R3022M48568M46187l35987o02188k38506J78783k4917J3269
10346b65730L03045L21652m02843n14762m96205j98260l9060p7996N75060P78693
10336a6406K24820l47649m20217k60345j4138j08779J82380J55488j23289O6578
10326f61557M29278L75954k24075j3919M67007M63997k53665k68695R6704J92822
10316F03851J30087L79116M5899n90442o09690j10636r337j3299j2771K56191
$$ plain form
10386 921524 1142099 1073799 862113 677675 502087 597412 244733 -139843 -340151 -375721
10376 -375721 -17044 592196 813374 712636 589384 515197 734657 801973 595298 350152
10366 350152 289104 207395 449557 724959 659621 243587 368438 349594 127957 -97573
10356 -97573 -243961 -150939 297629 743816 407829 -194359 -432865 -254082 -278999 -265730
10346 -265730 37315 358967 -43876 -558638 -1054843 -1253103 -1292163 -1370159 -795099 -16406
10336 -16406 208414 -139235 -559452 -819797 -833935 -942714 -760334 -604846 -728135 -661557
10326 -661557 -232279 143675 -80400 -94319 372688 836685 583020 314325 411029 603851
10316 603851 733938 1113054 1158953 568511 -41179 -151815 -161152 -174451 -187222 68969
10306F8969K83126J10393O1823K84869L95655M2261m99004p02815k77990m4874
10296b77587J6639k06931l89422L1365L20816p5841j49813j81330q3347J82057
10286h13394J97047n363J40407O04601N38076J83459n6283j00949n36608m62262
10276c11269j51510j37361o2560J9615J32299p3656j7988K12011M80P940Q511
10265c73488P8367P7104k38989o6933J75510P1452j26233j24760m0721j34370
10255g03061L82123J71771k87000N4k69553J63959M90326k15381k93574K30746
10245c29590J49708l37687m27185j35898J33968J44989K83608M53263N51897J34927
10235F22000o32038k77682L26292K80519L4292L70087M56286j34016o40239n33077
$$ plain form
10306 68969 352095 462488 524311 809180 1204835 1247096 748092 45277 -232713 -277587
10296 -277587 -260948 -467879 -857301 -825936 -505120 -580961 -730774 -912104 -995451 -813394
10286 -813394 -616347 -621710 -481303 123298 661374 844833 788550 687601 150993 -311269
10276 -311269 -462779 -600140 -662700 -643085 -510786 -584442 -602430 -390419 -389939 -381999 -373488
10265 -373488 -295121 -218017 -457006 -523939 -348429 -276977 -403210 -527970 -568691 -703061
10255 -703061 -320938 -149167 -436167 -436113 -705666 -541707 -51381 -266762 -560336 -329590
10245 -329590 -179882 -517569 -944754 -1080652 -946684 -801695 -518087 -64824 487073 622000
10235 622000 -10038 -287720 38572 319091 353383 723470 1179756 1045740 405501 -127576
10225a27576l68772k52859l2077J65570J33033J97783M4789q5181J48770l69081
10215e45601k17691K47756K40617k24552l40280L04089J48074j0086M06345K25549
10205B34220J35555L22527L70257L36416l00595l04446j11708l58643m55216m06638
10195e38271L43783O8374k46365L61447L94126L12617L42045J83559k84997J40521
10185A076839j64070m93864o0741j9397j23728k91044J70576O72884K59674k7912
10175I99217l77483l19760l5329k5134j96160N470J22941l5324N11457N59648
10165A209543N3481J7134q5998j53516k75296O6094M01225l2023j20222l4102
10155A046320m24466l67551o01992q68248J41127O15643K42423j7593n64K24054
$$ plain form
10225 -127576 -496348 -749207 -781284 -615714 -482681 -284898 -240109 -325290 -176520 -545601
10215 -545601 -763292 -515536 -274919 -499471 -839751 -535662 -387588 -397674 8671 234220
10205 234220 369775 692302 1062559 1398975 1098380 793934 682226 323583 -131633 -538271
10195 -538271 -194488 -126114 -372479 -11032 383094 695711 1037756 1221315 936318 1076839
10185 1076839 912769 418905 358164 338767 215039 -76005 94571 767455 1027129 999217
10175 999217 621734 301974 266645 241511 45351 50821 173762 138438 649895 1209543
10165 1209543 1263024 1280158 1194160 1040644 765348 831442 1232667 1200644 1080422 1046320
10155 1046320 621854 254303 -347689 -1215937 -1074810 -459167 -216744 -234337 -234901 -10847
10145a0847k60918m62329N9617J67180j10689j37527J62430m2749J00136K80144
10135b55552K05667j40322j17261L84411L69661l6420o6109J01503j82371K4075
10125B87282K27049K05910J11674J66474l36511m66855M9603L27108J12523p4675
10115F09582j64809k61643j68880O8683L53707M93704J09431m90035n13523l50227
10105c14010l54766l43413k69216K8170L61010N4024m5077M62818K90340j06729
10095b36849q0349J25284J73427k8015m28374j7286j72265n02758J19860P44002
10085c03323O92915O0513P9702m0668r8647l1679k14032l13463j24879K07270
10075h6291J99085K32514N66676R5203m06038j84941l828K03355K65930n8122
$$ plain form
10145 -10847 -271765 -734094 -674477 -507297 -617986 -755513 -593083 -635832 -535696 -255552
10135 -255552 -49885 -190207 -307468 76943 446604 410184 344075 445578 263207 287282
10125 287282 514331 720241 831915 998389 661878 195023 244626 571734 684257 609582
10115 609582 444773 183130 14250 82933 436640 930344 1039775 549740 36217 -314010
10105 -314010 -668776 -1012189 -1281405 -1253235 -892225 -838201 -883278 -420460 -130120 -236849
10095 -236849 -317198 -191914 -18487 -46502 -474876 -492162 -664427 -1167185 -1047325 -303323
10085 -303323 389592 450105 529807 489139 390492 358813 144781 -168682 -293561 -86291
10075 -86291 112794 345308 911984 1007187 601149 416208 412380 615735 881665 823543
10065H23543k63634k15546J96753M06931M8688l71726l81501j56545m3486j8334
10055B5143j61568j39968k59130l23625J41700K52861q7283m63606n53643L737
10045a565382L8110L49321N07621J98190L56098M20838J55986o3428K98066P13525
10035A408945L86897n35200p05435m66810R0632j97938r2343M42398N37976o2336
10025H06786l49650P6555L50587J20193m22151k60363K95350N3747l52395p8696
10015B39963R6361L09756J12193K13672j28732k56270J12283q6869k93046l89898
10005g0587m4205J71271K2247J57085R6006J22795P4267k58248o11698m33233
9995g74300L96783N27006k433n84917o12005j9023L99718P2124K49019M08379
$$ plain form
10065 823543 559909 344363 541116 948047 996735 625009 243508 86963 43477 25143
10055 25143 -136425 -276393 -535523 -859148 -717448 -464587 -551870 -1015476 -1569119 -1565382
10045 -1565382 -1527272 -1177951 -670330 -472140 -116042 304796 460782 397354 695420 1408945
10035 1408945 1795842 1260642 555207 88397 179029 -18909 -111252 331146 869122 806786
10025 806786 457136 533691 884278 1004471 582320 321957 617307 671054 318659 239963
10015 239963 336324 646080 758273 971945 843213 586943 699226 612357 319311 -70587
10005 -70587 -114792 56479 78726 235811 331817 454612 528879 270631 -341067 -774300
9995 -774300 -377517 149489 147056 -437861 -1049866 -1068889 -669171 -597047 -348028 60351
9985F0351m131o7302K6699q5218k74462k45991J55143L34798p4573K69267J34903
9974B29484l6545j6609l46492m8663K00785L84958L28238k82307p37311j67199
9964d91661J82750J79848N44069J30110m01227L1133L77023P39332r7577r35205
9954B58595r69883n31587k2913J87963P9184j4J9331n4671Q0368K24931j90512
9943i19208j61150R9986M6747K27248K71667K43694M20247j607J08937K20812
9933E57373O9204K97808j6890m41492n87468l96253L32917k75818p29896j18896
9923a309411O4615M1982J13682M47457M82085K91928o4659j64303M5074K34322
9913A82772L34179M16697J98659j56218o13451n55555p4520J69197J111k02263
$$ plain form
9985 60351 56220 -11082 15617 -69601 -344063 -590054 -434911 -100113 -174686 94581 229484
9974 229484 192939 176330 -170162 -218825 -18040 366918 695156 412849 -324462 -491661
9964 -491661 -308911 -129063 415006 545116 143889 175022 552045 1291377 1193800 258595
9954 258595 -711288 -1242875 -1265788 -1077825 -998641 -998655 -979324 -1033995 -953627 -728696 -919208
9943 -919208 -1080358 -980372 -933625 -706377 -434710 -191016 229231 227624 336561 557373
9933 557373 626577 924385 907495 466003 -121465 -517718 -184801 -460619 -1190515 -1309411
9923 -1309411 -1244796 -1202814 -1089132 -641675 -159590 132338 67679 -96624 -51550 182772
9913 182772 516951 933648 1132307 976089 362638 -192917 -267437 -98240 -97129 -299392
9903b99392k74098j96381k1276K72770L34527M1877l98815k27722O9168J20j23369
9892h22591P347J05805L51041N12683k04593m46685j41339l00541j86965l1135
9882a156973K13013P66849M35850J21853J43501j1518j25244K17989l9766m23562
9872A41992m21892k02311j47965j19159P2531k36745k56322L05340N17247L63102
9862A5818N37173K68838K05836m21197n95297j23241j7286O0028k44085j33242
9852d46655J07816Q3078K44617K27511O7037k33448j35649k5908l6235J56258
9842H422k17107l62952k34911k050J1095J45535J91714K61659N12082L48795L1336
9831F93618n2540Q6423K18702j27566j10192o2985o03829n16338j76847L47320
$$ plain form
9903 -299392 -573490 -769871 -791147 -518377 -183850 -141973 -540788 -768510 -699342 -699222 -822591
9892 -822591 -815244 -709439 -358398 154285 -50308 -496993 -638332 -938873 -1125838 -1156973
9882 -1156973 -943960 -177111 258739 380592 524093 512575 387331 605320 565554 141992
9872 141992 -279900 -482211 -630176 -749335 -676804 -913549 -1169871 -864531 -347284 15818
9862 15818 552991 821829 1027665 606468 11171 -112070 -129356 -69328 -313413 -446655
9852 -446655 -338839 -255761 -11144 216367 283404 49956 -85693 -111601 -147836 8422
9842 8422 -208685 -571637 -806548 -808598 -797503 -651968 -460254 -198595 313487 662282 693618
9831 693618 641078 727501 946203 818637 708445 645460 41631 -474707 -651554 -304234
9821c04234O69731J83570o4587K21490K24228l04767l81608l02909j42150K5845
9811a75391L11808L90878J40783K6339r1671j86719j04976n9803m07748j92824
$$ plain form
9821 -304234 365497 549067 484480 705970 930198 625431 243823 -59086 -201236 -175391
9811 -175391 136417 527295 668078 694417 602746 416027 311051 251248 -156500 -349324
$$ [...]
##END NTUPLES=NMR SPECTRUM
##END=
