##TITLE=C13_SA_52.211
 DMSO-d6, 20000 sc

 2.7.2020
##JCAMPDX= 6.0         $$ Bruker NMR JCAMP-DX V2.0
##DATA TYPE= NMR SPECTRUM
##DATA CLASS= NTUPLES
##ORIGIN= UXNMR, Bruker Analytische Messtechnik GmbH
##OWNER= root
$$ XWIN-NMR		Version 3.5
$$ Fri Jul  3 11:40:33 2020 Russian Standard Time (UT+4h)  she@DPX200
##.OBSERVE FREQUENCY= 50.327896
##.OBSERVE NUCLEUS= ^13C
##.ACQUISITION MODE= SIMULTANEOUS
##.ACQUISITION SCHEME= undefined
##.AVERAGES= 20000
##.DIGITISER RES= 17
##SPECTROMETER/DATA SYSTEM= spect
##.PULSE SEQUENCE= zgpg30
##.SOLVENT NAME= CDCl3
##.SHIFT REFERENCE= (INTERNAL, CDCl3, 0, 222.624)
##AUDIT TRAIL= $$ (NUMBER, WHEN, WHO, WHERE, WHAT)
$$ ##TITLE= Audit trail, XWIN-NMR		Version 3.5
$$ ##JCAMPDX= 5.01
$$ ##ORIGIN= Bruker BioSpin GmbH
$$ ##OWNER= she
$$ F:/spectra/data/she/nmr/c13/1/pdata/1/auditp.txt
$$ ##AUDIT TRAIL=  $$ (NUMBER, WHEN, WHO, WHERE, WHAT)
(   1,<2020-07-03 11:37:25.87 +0400>,<she>,<DPX200>,
      <created by zg, POWCHK disabled, PULCHK disabled
       terminated by command 'halt'
       configuration hash MD5:
       00 E9 B6 7A A2 85 ED C7 34 08 36 98 17 FE 4E 26
       data hash MD5: 32K
       79 02 EC 77 EF 7D 36 30 39 BA 60 F0 39 08 37 1A>)
(   2,<2020-07-03 11:37:30.43 +0400>,<she>,<DPX200>,
      <Start of raw data processing
       efp BC_mod = 2 LB = 1 FT_mod = 6 PKNL = 1 PHC0 = -251.8461 PHC1 = 50.80638 SI = 32K 
       data hash MD5: 32K
       60 8E 87 83 B3 38 98 8F 66 27 A6 6F D3 78 39 85>)
(   3,<2020-07-03 11:37:34.46 +0400>,<she>,<DPX200>,
      <abs ABSG = 5 
       data hash MD5: 32K
       B9 A5 2B 01 A7 DD A8 C7 EF 9A 61 45 25 94 0E 36>)
(   4,<2020-07-03 11:37:50.68 +0400>,<she>,<DPX200>,
      <pk PHC0 = 0.02429218 PHC1 = 4.768372e-07 
       data hash MD5: 32K
       FC F4 96 1D 54 30 51 FA 58 77 79 9D A6 3B 03 9C>)
(   5,<2020-07-03 11:37:54.01 +0400>,<she>,<DPX200>,
      <abs ABSG = 5 
       data hash MD5: 32K
       40 7F A6 8B 3E E4 4E 9D B3 07 67 0C 9C 0D 83 75>)
(   6,<2020-07-03 11:39:07.46 +0400>,<she>,<DPX200>,
      <pk PHC0 = 12.78878 PHC1 = -16.8 
       data hash MD5: 32K
       A2 E8 EE 7A BC 30 39 39 3A 16 9B 28 E5 0E E1 5D>)
(   7,<2020-07-03 11:39:10.90 +0400>,<she>,<DPX200>,
      <abs ABSG = 5 
       data hash MD5: 32K
       CB 17 5D B3 C8 31 6F CE 26 F8 5F CA DD 6B 9B A9>)
$$ ##END=
$$ 
$$ hash MD5
$$ 33 2B 90 F7 77 75 83 11 03 7B D0 76 33 F0 40 3B
##$RELAX= 
##$RELAX= 
##$RELAX= 
##$RELAX= 
##$RELAX= 
##$RELAX= 
##$RELAX= 
##$RELAX= 
$$ Bruker specific parameters
$$ --------------------------
##$DU= <F:/spectra>
##$EXPNO= 1
##$NAME= <c13>
##$PROCNO= 1
##$TYPE= <nmr>
##$USER= <she>
##$AMP= (0..31)
100 100 100 100 100 100 100 100 100 100 100 100 100 100 100 100 100 100 
100 100 100 100 100 100 100 100 100 100 100 100 100 100 
##$AQSEQ= 0
##$AQ_mod= 1
##$AUNM= <au_zg>
##$AUTOPOS= <>
##$BF1= 50.322709
##$BF2= 200.13
##$BF3= 50.322709
##$BF4= 500.13
##$BF5= 500.13
##$BF6= 500.13
##$BF7= 500.13
##$BF8= 500.13
##$BYTORDA= 1
##$CFDGTYP= 0
##$CFRGTYP= 5
##$CHEMSTR= <none>
$$ [...]
##$SUBNAM4= <"">
##$SUBNAM5= <"">
##$SUBNAM6= <"">
##$SUBNAM7= <"">
##$SUBNAM8= <"">
##$SUBNAM9= <"">
##$SW= 239.972175391363
##$SWIBOX= (0..15)
0 1 3 0 0 0 0 0 0 0 0 0 0 0 0 0 
##$SW_h= 12077.2946859903
##$TD= 32768
##$TD0= 1
##$TE= 0
##$TE2= 300
##$TE3= 300
##$TEG= 300
##$TL= (0..7)
120 120 120 120 120 120 120 120 
##$TP= (0..7)
150 150 150 150 150 150 150 150 
##$TP07= 0
##$TPNAME0= <>
##$TPNAME1= <>
##$TPNAME2= <>
##$TPNAME3= <>
##$TPNAME4= <>
##$TPNAME5= <>
##$TPNAME6= <>
##$TPNAME7= <>
##$TPOAL= (0..7)
0.5 0.5 0.5 0.5 0.5 0.5 0.5 0.5 
##$TPOFFS= (0..7)
0 0 0 0 0 0 0 0 
##$TUNHIN= 0
##$TUNHOUT= 0
##$TUNXOUT= 0
##$USERA1= <user>
##$USERA2= <user>
##$USERA3= <user>
##$USERA4= <user>
##$USERA5= <user>
##$V9= 5
##$VALIST= <valist>
##$VCLIST= <CCCCCCCCCCCCCCC>
##$VD= 0
##$VDLIST= <DDDDDDDDDDDDDDD>
##$VPLIST= <PPPPPPPPPPPPPPP>
##$VTLIST= <TTTTTTTTTTTTTTT>
##$WBST= 1024
##$WBSW= 4
##$XGAIN= (0..3)
0 0 0 0 
##$XL= 0
##$YL= 0
##$YMAX_a= 120447985
##$YMIN_a= -29404499
##$ZGOPTNS= <>
##$ZL1= 120
##$ZL2= 120
##$ZL3= 120
##$ZL4= 120
##$ABSF1= 222.624
##$ABSF2= -17.3728
##$ABSG= 5
##$ABSL= 3
##$ALPHA= 0
##$AQORDER= 0
##$ASSFAC= 0
##$ASSFACI= 0
##$ASSFACX= 0
##$ASSWID= 0
##$AUNMP= <proc_1d>
##$AZFE= 0.1
##$AZFW= 0.5
##$BCFW= 0
##$BC_mod= 2
##$BYTORDP= 0
##$COROFFS= 0
##$CY= -3
##$DATMOD= 1
##$DC= 0
##$DFILT= <>
##$DTYPP= 0
##$F1P= 0
##$F2P= 0
##$FCOR= 0.5
##$FTSIZE= 32768
##$FT_mod= 6
##$GAMMA= 0
##$GB= 0
##$INTBC= 1
##$INTSCL= 4.134877e-10
##$ISEN= 128
##$LB= 1
##$LEV0= 0
##$LPBIN= 0
##$MAXI= 10000
##$MC2= 0
##$MEAN= 0
##$ME_mod= 0
##$MI= 0.1934396
##$NCOEF= 0
##$NC_proc= 3
##$NLEV= 6
##$NOISF1= 120.0001
##$NOISF2= 80.00006
##$NSP= 0
##$NTH_PI= 0
##$NZP= 0
##$OFFSET= 222.624
##$PC= 1.4
##$PHC0= -239.033
##$PHC1= 34.00638
##$PH_mod= 1
##$PKNL= yes
##$PPARMOD= 0
##$PSCAL= 0
##$PSIGN= 0
##$REVERSE= no
##$SF= 50.3227315989248
##$SI= 32768
##$SIGF1= 140
##$SIGF2= 120
##$SINO= 11.81781
##$SIOLD= 32768
##$SREGLST= <13C.CDCl3>
##$SSB= 0
##$STSI= 32768
##$STSR= 0
##$SW_p= 12077.2946859903
##$SYMM= 0
##$S_DEV= 0
##$TDeff= 32768
##$TDoff= 0
##$TI= <>
##$TILT= no
##$TM1= 0
##$TM2= 0
##$TOPLEV= 0
##$USERP1= <user>
##$USERP2= <user>
##$USERP3= <user>
##$USERP4= <user>
##$USERP5= <user>
##$WDW= 1
##$XDIM= 32768
##$YMAX_p= 294612430
##$YMIN_p= -1399234
$$ End of Bruker specific parameters
$$ ---------------------------------
##NTUPLES= NMR SPECTRUM
##VAR_NAME=  FREQUENCY,     SPECTRUM/REAL,   SPECTRUM/IMAG
##SYMBOL=    X,             R,               I
##VAR_TYPE=  INDEPENDENT,   DEPENDENT,       DEPENDENT
##VAR_FORM=  AFFN,          ASDF,            ASDF
##VAR_DIM=   32768,         32768,           32768
##UNITS=     HZ,            ARBITRARY UNITS, ARBITRARY UNITS
##FACTOR=    0.368581032318806, 1,           1
##FIRST=     11203.0474431902, 0,            0
##LAST=      -874.247242800138, 0,           0
##MIN=       -874.247242800138, -1399234,    0
##MAX=       11203.0474431902, 294612430,    0
$$ Real data points
##PAGE= N=1
##DATA TABLE= (X++(R..R)), XYDATA
$$ [...]
$$ plain form
10921 -838908 -619386 -357618 -146647 -155435 -240965 -148021 -51774 -263103 -204888 150388 344556
10910 344556 388482 290902 97151 -118997 -5134 149469 -15112 -149425 -182845 -179629
10900 -179629 32146 188976 54056 37526 81289 73554 102444 156739 244378 330151 288621
10889 288621 305649 456401 446594 389604 346973 165604 34716 20478 99965 99936 -72962
10878 -72962 -197124 -171354 -282483 -386727 -425639 -284528 -130310 -15794 -25070 -23643 56185
10867 56185 245835 409131 490366 601412 637307 500627 314403 320496 394423 470365 438252
10856 438252 303596 135136 29720 -56884 -141303 -9488 126384 -80962 -237684 -253649
10846 -253649 -245399 -344193 -457033 -433149 -496214 -636774 -652991 -672504 -641876 -444707 -410488
$$ packed form
10921h38908K19522K61768K10971q788q5530R2944R6247k11329N8215L55276J94168
10910C44556M3926r7580j93751k16148J13863J54603j64581j34313l3420L216
10900a79629K11775J56830j34920j6530M3763p735K8890N4295Q7639Q5773m1530
10889B88621J7028J50752r807n6990m2631j81369j30888j4238P9487k9j72898
10878g2962j24162K5770j11129j04244l8912J41111J54218J14516r276J427P9828
10867E6185J89650J63296Q1235J11046L5895j36680j86224O093P3927P5942l2113
10856D38252j34656j68460j05416q6604q4419J31815J35872k07346j56722j5965
10846b53649Q250r8794j12840K3884o3065j40560j6217j9513L0628J97169L4219
$$ plain form
10835 -410488 -636644 -806565 -681858 -532910 -605517 -556403 -387198 -290815 -242453 -267412
10825 -267412 -213062 -171111 -99025 -29606 -149195 -171557 -64107 55489 47865 56262 -131295
10814 -131295 -152416 -314265 -630906 -626735 -425983 -352610 -304346 -70061 6861 -86921 -18556
10803 -18556 127454 254121 434697 603999 433394 143667 99083 193783 106534 -53138
10793 -53138 -137661 -292275 -368103 -307098 -183894 -79719 -10847 102277 118001 -23279 -185026
10782 -185026 -295048 -343910 -341837 -58697 173360 231050 450105 623879 564958 310107
10772 310107 186781 234469 166616 17407 139984 242362 132452 103662 155916 218851
10762 218851 292579 286602 189961 174497 136985 122004 180482 252466 247734 20405 -151150
$$ packed form
10835d10488k26156j69921J24707J48948p2607M9114J69205R6383M8362k4959
10825b67412N4350M1951P2086O9419j19589k2362J07450J19596p624Q397j87557
10814a31295k1121j61849l16641M171K00752P3373M8264K34285P6922r3782O8365
10803a8556J46010J26667J80576J69302j70605k89727m4584R4700q7249j59672
10793e3138q4523j54614p5828O1005J23204J04175O8872J13124J5724j41280j61747
10782a85026j10022m8862K073K83140K32057N7690K19055J73774n8921k54851
10772C10107j23326M7688o7853j49209J22577J02378j09910k8790N2254O2935
10762B18851P3728n977r6641j5464l7512j4981N8478P1984m732k27329j71555
$$ plain form
10751 -151150 58041 170739 65991 -140659 -370883 -436253 -395490 -108813 136244 46450
10741 46450 27107 185655 52121 -14412 87825 74974 118321 -59954 -291585 -467811
10731 -467811 -361328 -151273 37932 -65370 -420993 -509014 -624279 -607148 -352162 -69160
10721 -69160 -19575 -151496 -308360 -393560 -444635 -514934 -590698 -644098 -554973 -506628 -491905
10710 -491905 -360330 -367634 -353727 -259392 -366797 -322432 -128563 79932 248611 219760 45890
10699 45890 -3360 -196002 -361288 -289581 -161120 -142129 -186868 -109213 98701 167058 170415
10688 170415 224435 113180 24945 -13258 -21197 -168381 -266454 -67733 139986 253153 294087
10677 294087 391861 270825 -21303 -123991 -10638 105591 165850 12692 -49914 176067
$$ packed form
10751a51150K09191J12698j04748k06650k30224o5370M0763K86677K45057q9794
10741D6450j9343J58548j33534o6533J02237j2851M3347j78275k31631j76226
10731d67811J06483K10055J89205j03302l55623q8021j15265J7131K54986K83002
10721f9160M9585j31921j56864q5200n1075p0299p5764n3400Q9125M8345J4723
10710d91905J31575p304J3907R4335j07405M4365J93869K08495J68679k8851j73870
10699D5890m9250j92642j65286P1707J28461J8991m4739P7655K07914O8357L357
10688A70415N4020j11255q8235l8203p939j47184r8073J98721K07719J13167M0934
10677B94087R7774j21036k92128j02688J13353J16229O0259j53158o2606K25981
$$ plain form
10667 176067 222773 55212 -204222 -78238 78827 65593 64586 -26243 -57504 -124767 -76838
10656 -76838 -78084 -338968 -313377 -121913 -153591 -356072 -390483 -342076 -423975 -530848 -314779
10645 -314779 -233913 -156903 -33881 -45488 -97965 -127789 -69830 140684 462174 509179 270539
10634 270539 173441 234229 136354 71657 364677 666349 677413 572989 564240 471414 306278
10623 306278 329529 546897 588413 406422 140319 41748 69608 185883 389661 513057
10613 513057 326040 55250 -18269 -83942 -174920 -179725 -83143 -164809 -307928 -248044 -34930
10602 -34930 -18742 -231593 -549486 -700095 -653023 -434962 -56755 310887 351995 321062
10592 321062 356928 356292 311648 160325 162811 290719 399739 399357 482064 396026 479248 648167
$$ packed form
10667A76067M6706j67561k59434J25984J57065j3234j007r0829l1261o7263M7929
10656g6838j246k60884K5591J91464l1678k02481l4411M8407q1899j06873K16069
10645c14779Q0866P7010J23022j1607n2477k9824N7959K10514L21490M7005k38640
10634B70539r7098O0788r7875o4697K93020L01672J1064j04424q749r2826j65136
10623C06278K3251K17368M1516j81991k66103r8571K7860J16275K03778J23396
10613E13057j87017k70790p3519o5673r0978m805R6582q1666j43119N9884K13114
10602c4930J6188k12851l17893j50609M7072K18061L78207L67642M1108l0933
10592C21062L5866o36m4644j51323K486J27908J09020l82Q2707q6038Q3222J68919
$$ plain form
10580 648167 544008 370271 236360 202007 89431 198569 284419 143365 -72884 -262136
10570 -262136 -386863 -425528 -351530 -195709 -177915 -62716 92664 75449 14039 67537 -33758
10559 -33758 -316163 -496502 -378279 -167485 -191168 -153555 55810 252783 276715 226730
10549 226730 282307 352921 314660 94765 -117920 25144 184941 65194 -246229 -335033
10539 -335033 -283233 -171541 148711 270413 228213 98563 -296228 -478375 -349183 -204412
10529 -204412 15250 191741 198072 23961 -161605 -226698 -192735 -130490 204214 293024 48637
10518 48637 -38677 -18698 40092 -7125 -137665 -285403 -384935 -438817 -488505 -591073 -861587
10507 -861587 -1107060 -1058031 -906846 -604385 -367958 -253677 -92133 87524 131364 105153
$$ packed form
10580F48167j04159j73737j33911l4353j12576J09138Q5850j41054k16249j89252
10570b62136j24727l8665P3998J55821J7794J15199J55380j7215o1410N3498j01295
10559c3758k82405j80339J18223K10794k3683L7613K09365J96973K3932m9985
10549B26730N5577P0614l8261k19895k12685J43064J59797j19747l11423q8804
10539c35033N1800J11692L20252J21702m2200j29650l94791j82147J29192J44771
10529b04412K19662J76491O331j74111j85566o5093L3963O2245L34704Q8810k44387
10518D8637q7314J9979N8790m7217j30540j47738r9532n3882m9688j02568k70514
10507h61587k45473M9029J51185L02461K36427J14281J61544J79657M3840k6211
$$ plain form
10497 105153 154400 113932 202034 233478 7935 -181677 -192596 -149348 -150223 -56036 212780
10486 212780 514622 555146 189032 -172824 -404747 -548826 -371390 99687 268028 288266
10476 288266 319477 222913 -97453 -225562 -96751 -13682 -55357 -206137 -239019 -347308
10466 -347308 -339025 -169719 -57824 34972 -154002 -177428 -135931 -163392 -116544 -195524 -93796
10455 -93796 -8662 70797 152608 288396 362832 408381 483451 445794 513795 641726 444765
10444 444765 181519 151008 77438 -42323 -158707 -289372 -240996 -28009 124064 349834
10434 349834 471167 324309 148819 30502 60655 103892 -109913 -253217 -207497 -78802
10424 -78802 -2569 -120238 -318197 -450449 -385053 -272559 -142262 -120068 -246369 -245196 -211016
$$ packed form
10497A05153M9247m0468Q8102L1444k25543j89612j0919M3248q75R4187K68816
10486B12780L01842M0524l66114l61856k31923j44079J77436M71077J68341K0238
10476B88266L1211r6564l20366j28109J28811Q3069m1675j50780l2882j08289
10466c47308Q283J69306J11895R2796j88974k3426M1497k7461M6848p8980J01728
10455i3796Q5134P9459Q1811J35788P4436M5549P5070l7657O8001J27931j96961
10444D44765k63246l0511p3570j19761j16384j30665M8376K12987J52073K25770
10434C49834J21333j46858j75490j18317L0153M3237k13805j43304M5720J28695
10424g8802P6233j17669j97959j32252O5396J12494J30297K2194j26301J173L4180
$$ plain form
10413 -211016 -31784 130200 251111 224493 -17285 -225542 -602010 -794357 -606498 -456171
10403 -456171 -392809 -188071 -61162 60421 372476 567152 607171 494168 361400 213469
10393 213469 9808 -88242 -62979 -161167 -224632 -65463 -58262 -182412 -159490 -173869 -367340
10382 -367340 -553567 -571624 -504141 -432676 -438087 -530594 -483277 -430312 -364154 -322673 -357402
10371 -357402 -428393 -571078 -456512 -297764 -106065 -24784 -15745 61542 113836 15601 -68931
10360 -68931 -158878 -302642 -274207 -127984 -30311 -37981 -58025 -60212 -41 62741 -12477 48593
10348 48593 -81423 -229441 -471726 -512585 -417777 -398456 -358183 -391450 -352034 -477580 -545753
10337 -545753 -706347 -722522 -641232 -654099 -594831 -362942 -146704 52621 232562 167409
$$ packed form
10413b11016J79232J61984J20911k6618k41778k08257l76468j92347J87859J50327
10403d56171O3362K04738J26909J21583L12055J94676M0019j13003j32768j47931
10393B13469k03661r8050K5263r8188o3465J59169P201j24150K2922j4379j93471
10382c67340j86227j8057O7483P1465n411r2507M7317N2965O6158M1481l4729
10371c57402p0991j42685J14566J58748J91699Q1281R039P7287N2294r8235q4532
10360f8931q9947j43764K8435J46223R7673p670k0044k187O0171O2782p5218O1070
10348D8593j30016j48018k42285m0859R4808J9321M0273l3267L9416j25546o8173
10337e45753j60594j6175Q1290j2867N9268K31889K16238J99325J79941o5153
$$ plain form
10327 167409 38820 7143 -99651 -124835 -15284 17795 1839 72058 234259 331616 348712
10316 348712 291071 -9947 -210335 -136030 65944 256545 520904 300733 -40147 -20800
10306 -20800 208517 -54732 -551450 -939414 -1055922 -778165 -373874 -200754 -204462 -406451
10296 -406451 -546702 -278967 -122291 -253938 -426884 -358653 -216695 -357946 -539569 -628541
10286 -628541 -641091 -658425 -597870 -520700 -639233 -718766 -819951 -785213 -717816 -686752 -701601
10275 -701601 -506334 -368117 -484819 -437616 -446475 -563431 -552876 -282927 -67922 46122
10265 46122 140796 241491 211189 241575 262857 149393 15169 -76810 -128932 -248584 -320139
10254 -320139 -363695 -219849 -21906 1483 -57535 49483 283177 360963 217321 132585
$$ packed form
10327A67409j28589l1677j06794k5184J09551L3079j5956P0219J62201R7357J7096
10316C48712n7641l01018k00388P4305K01974J90601K64359k20171l40880J9347
10306b0800K29317k63249m96718l87964j16508K77757M04291J73120l708k01989
10296d06451j40251K67735J56676j31647j72946O8231J41958j41251j81623q8972
10286f28541j2550j7334O0555P7170j18533p9533j01185L4738O7397L1064j4849
10275g01601J95267J38217j16702M7203q859j16956J0555K69949K15005J14044
10265D6122R4674J00695l0302L0386K1282j13464j34224r1979n2122j19652p1555
10254c20139m3556J43846J97943K3389n9018J07018K33694P7786j43642q4736
$$ plain form
10244 132585 96519 -126219 -330805 -323058 -256806 -103799 107490 193863 214103 178922 181346
10233 181346 329015 238896 54257 174694 188914 25981 -58547 -201215 -394620 -497726
10223 -497726 -424481 -172070 87941 64049 45004 120951 -616 -23152 160850 369124
10213 369124 361605 292666 262867 350411 397548 534764 686135 605115 533809 534582 701362
10202 701362 581939 240821 -39348 -66326 19872 45308 103024 146590 -36190 -276837
10192 -276837 -316471 -186563 -181521 -303579 -348120 -323076 -243512 -297488 -381262 -445009 -475735
10181 -475735 -276691 23772 310668 466593 597198 654816 602020 720306 822519 733321
10171 733321 589774 443743 344496 407612 476770 355184 118944 -184236 -360062 -337950
$$ packed form
10244A32585l6066k22738k04586P747O6252J53007K11289Q6373K0240l5181K424
10233A81346J47669r0119j84639J20437J4220j62933q4528j42668j93405j03106
10223d97726P3245K52411K60011k3892j9045P5947j21567k2536J84002K08274
10213C69124p519o8939k9799Q7544M7137J37216J51371q1020p1306P73J66780
10202G01362j19423l41118k80169k6978Q6198K5436N7716M3566j82780k40647
10192b76837l9634J29908N042j22058m4541K5044P9564n3976q3774o3747l0726
10181d75735J99044L00463K86896J55925J30605N7618n2796J18286J02213q9198
10171G33321j43547j46031r9247O3116O9158j21586k36240l03180j75826K2112
$$ plain form
10161 -337950 -186294 -109497 -268349 -382033 -259064 -95353 -104577 -84837 30225 104455
10151 104455 89211 -70398 -219231 -251556 -134802 -84148 -125237 -18515 30164 246915
10141 246915 436818 226142 56084 148786 414223 583733 360083 9036 -111311 -38630
10131 -38630 -28487 -172795 -353509 -471886 -313259 -33861 82790 32596 -79065 -34548
10121 -34548 159248 261571 45417 -171666 -227162 -272649 -291779 -215020 -141882 -148595 -194017
10110 -194017 -257827 -337267 -425614 -236550 -43244 125727 419179 488967 181787 -235911
10100 -235911 -417038 -257677 -191903 -287252 -278288 -66000 99213 148712 103658 -93952 -123326
10089 -123326 -73111 -249508 -265309 1057 232351 370012 355305 270330 77303 -112109
$$ packed form
10161c37950J51656P6797j58852j13684J22969J63711r224J9740J15062P4230
10151A04455j5244j59609j48833l2325J16754N0654m1089J06722M8679K16751
10141B46915J89903k10676j70058R2702K65437J69510k23650l51047j20347P2681
10131c8630J0143j44308j80714j18377J58627K79398J16651n0194j11661M4517
10121c4548J93796J02323k16154k17083n5496m5487j9130P6759P3138o713m5422
10110a94017o3810p9440q8347J89064J93306J68971K93452O9788l07180m17698
10100b35911j81127J59361O5774r5349Q964K12288J65213M9499m5054j97610k9374
10089a23326N0215j76397j5801K66366K31294J37661j4707q4975j93027j89412
$$ plain form
10079 -112109 -26703 218431 162891 44462 -38958 63492 187132 258839 372621 263128
10069 263128 -2623 -66167 121315 336850 520424 499301 203857 -117758 -241811 -225633
10059 -225633 -150094 -167829 -157126 -51240 139550 181106 121693 233781 187966 5499 -11295
10048 -11295 277473 521366 532645 394402 310534 287301 236099 241422 213273 244916 250906
10037 250906 169249 131730 211892 255676 315049 387444 462020 509668 370661 113776 -28609
10026 -28609 -75922 -22290 -118110 -344479 -379298 -370583 -428186 -347486 -259938 -385684 -542754
10015 -542754 -388612 -194322 -33134 -117149 -294842 -49194 165717 -22339 -179155 -28463
10005 -28463 285550 441870 498831 454026 168892 -287363 -539478 -598162 -574621 -507586 -406786
$$ packed form
10079a12109Q5406K45134n5540j18429q3420J02450J23640P1707J13782j09493
10069B63128k65751o3544J87482K15535J83574k1123k95444l21615j24053J6178
10059b25633P5539j7735J0703J05886J90790M1556n9413J12088m5815j82467j6794
10048a1295K88768K43893J1279j38243q3868k3233n1202N323k8149L1643N990
10037B50906q1657l7519Q0162M3784N9373P2395P4576M7648j39007k56885j42385
10026b8609m7313N3632r5820k26369l4819Q715n7603Q0700Q7548j25746j57070
10015e42754J54142J94290J61188q4015j77693K45648K14911j88056j56816J50692
10005b8463L14013J56320N6961m4805k85134m56255k52115n8684K3541O7035J00800
$$ plain form
9994 -406786 -256023 -139571 -18648 -14752 -234507 -338924 -262880 -247001 -241520 -389035 -499686
9983 -499686 -444877 -223563 -216128 -350673 -427167 -498640 -420312 -284253 -199731 -178217 -277416
9972 -277416 -392782 -407974 -327871 -304718 -378920 -321177 -157293 -125040 10485 132183 -154259
9961 -154259 -341906 -382823 -471237 -428400 -313105 -256823 -62171 164551 183068 12834 -191094
9950 -191094 -241663 -291625 -396413 -526063 -559089 -553661 -348770 -131816 -149552 -172849 -19700
9939 -19700 115142 24097 56557 324536 444446 234153 18395 -58902 -118429 -108435 -203892
9928 -203892 -227190 140674 474296 511725 352966 178069 -123088 -387234 -611692 -640004
9918 -640004 -544897 -472085 -323570 -231627 -131278 -66550 -56147 -164860 -265650 -303328 -379117
$$ packed form
9994d06786J50763J16452J20923L896k19755j04417P6044J5879N481j47515j10651
9983d99686N4809K21314P435j34545p6494p1473P8328J36059Q4522K1514r9199
9972b77416j15366j5192Q0103K3153p4202N7743J63884L2253J35525J21698k86442
9961a54259j87647m0917q8414M2837J15295N6282J94652K26722J8517j70234k03928
9950a91094n0569m9962j04788j29650l3026N428K04891K16954j7736k3297J53149
9939a9700J34842r1045L2460K67979J19910k10293k15758p7297n9527R994r5457
9928b03892k3298L67864L33622L7429j58759j74897l01157k64146k24458k8312
9918f40004R5107P2812J48515R1943J00349O4728J0403j08713j00790l7678p5789
$$ plain form
9907 -379117 -324702 -171507 -202641 -263254 -261032 -349169 -385312 -401020 -398997 -280216 -162879
9896 -162879 -129114 -173668 -319535 -454051 -444115 -196966 78300 225568 175366 -117977 -252049
9885 -252049 -323767 -600944 -775525 -605988 -188270 116246 231221 273471 185135 140490
9875 140490 112693 -193879 -477371 -481139 -442115 -494175 -645535 -680766 -662091 -527984 -601200
9864 -601200 -591930 -422447 -393179 -498512 -501477 -529277 -391758 -67775 133595 113446 196050
9853 196050 372919 466100 637876 569757 447221 320763 311194 238392 -77900 -213553 -166850
9842 -166850 33808 226460 244457 152314 145314 300144 618593 563875 323785 98133 -281622
9831 -281622 -532522 -607222 -496359 -368865 -460680 -523212 -498750 -477029 -432070 -193239 61411
$$ packed form
9907c79117N4415J53195l1134o0613K222q8137l6143j5708K023J18781J17337
9896a62879L3765m4554j45867j34516R936K47149K75266J47268n0202k93343j34072
9885b52049p1718k77177j74581J69537M17718L04516J14975M2250q8336m4645
9875A40490k7797l06572k83492l768L9024n2060j51360l5231J8675J34107p3216
9864f01200R270J69483K9268j05333k965k7800J37519L23983K01370k0149Q2604
9853A96050J76869R3181J71776o8119j22536j26458r569p2802l16292j35653M6703
9842a66850K00658J92652J7997r2143p000J54830L18449n4718k40090k25652l79755
9831b81622k50900p4700J10863J27494r1815o2532K4462K1721M4959K38831K54650
$$ plain form
9820 61411 112972 -20971 -151705 -206464 -250984 75554 355389 274307 235247 98316 27795
9809 27795 -9476 -174756 -158296 -200095 -322304 -236844 -120930 64859 180996 8558 -83700
9798 -83700 61948 166175 -64424 -320295 -406365 -301834 -286736 -417531 -145004 82886
9788 82886 -177645 -195403 -74276 -179000 -359314 -201663 92724 144020 136750 91182 17358
9777 17358 -52459 -197320 -294524 -277497 -114882 -61020 -16497 -91675 -251552 -257377 -336711
9766 -336711 -483128 -514135 -620260 -587942 -484704 -346800 -186382 -71754 76016 83017
9756 83017 84232 26196 -114340 -353657 -435697 -352674 -257471 -178841 -58359 -72127 -532
9745 -532 242592 145684 -13317 -6176 -6034 -148200 -202825 -210094 -203418 -77329 -40257 13802
$$ packed form
9820F1411N1561j33943j30734n4759m4520L26538K79835q1082l9060j36931p0521
9809B7795l7271j65280J6460m1799j22209Q5460J15914J85789J16137j72438r2258
9798h3700J45648J04227k30599k55871q6070J04531J5098j30795K72527K27890
9788H2886k60531j7758J21127j04724j80314J57651K94387N1296p270m5568p3824
9777A7358o9817j44861r7204J7027J62615N3862M4523p5178j59877n825p9334
9766c36711j46417l1007j06125L2318J03238J37904J60418J14628J47770P001
9756H3017J215n8036j40536k39317q2040Q3023R5203P8630J20482j3768P1595
9745e32K43124r6908j59001P141J42j42166n4625p269O676J26089L7072N4059
$$ plain form
9733 13802 158230 160882 -3451 -51223 -115773 -160858 -128999 -165371 -194255 -8115 80350
9722 80350 20155 43475 38771 -26845 -130355 -76539 116980 195322 233732 276412 194812 93532
9710 93532 -14429 -33489 12977 51359 -145507 -285538 -205250 -163217 -55924 -12846 -173732
9699 -173732 -112601 74332 151369 28996 -78102 2666 -70262 -304019 -447835 -601463
9689 -601463 -501281 -329715 -278985 -218177 -148514 -257043 -450633 -480264 -372056 -359129 -297280
9678 -297280 -150131 -140262 -67645 93161 176388 174448 241551 303126 268191 117819 102187
9667 102187 121372 79905 106149 91071 57370 192847 298531 248673 19808 -122734 -143836
9656 -143836 -72723 10185 142445 165962 -64334 -285276 -212532 -185911 -263588 -341408 -547701
$$ packed form
9733A3802J44428K652j64333m7772o4550m5085L1859l6372k8884J86140Q8465
9722H0350o0195K3320m704o5616j03510N3816J93519P8342L8410M2680q1600j01280
9710I3532j07961j9060M6466L8382j96866j40031Q0288M2033J07293M3078j60886
9699a73732O1131J86933P7037j22373j07098Q0768p2928k33757j43816j53628
9689f01463J00182J71566N0730O0808O9663j08529j93590k9631J08208J2927O1849
9678b97280J47149R869P2617J60806Q3227j940O7103O1575l4935j50372j5632
9667A02187J9185m1467K6244j5078l3701J35477J05684m9858k28865j42542k1102
9656a43836P1113Q2908J32260K3517k30296k20942P2744K6621p7677p7820k06293
$$ plain form
9645 -547701 -685279 -874048 -1103621 -1107684 -832295 -418436 -181927 -147404 -137086 -237467
9635 -237467 -279567 -150682 35555 67837 41183 -9021 -86110 -10264 -102069 -88041 186500
9624 186500 220400 411018 598109 181263 -399698 -610688 -349748 -10906 247361 253124
9614 253124 -62259 -349426 -269441 -159479 -383798 -694227 -906477 -781471 -466068 -336273
9604 -336273 -276828 -36489 61295 25567 11035 188656 558936 569737 326572 111608 -29314
9593 -29314 -844 -50460 -374440 -520174 -563046 -557648 -405910 -113463 -174422 -303691 -218573
9582 -218573 -176706 -134626 19458 259955 347333 338071 284644 202821 104042 -69327 -127387
9571 -127387 41708 69146 -12092 -22751 -52199 -122372 -287106 -326393 52222 393842 323884
$$ packed form
9645e47701j37578j88769k29573m063K75389M13859K36509L4523J0318j00381
9635b37467m2100J28885J86237L2282k6654n0204p7089P5846r1805J4028K74541
9624A86500L3900J90618J87091m16846n80961k10990K60940L38842K58267N763
9614B53124l15383k87167P9985J09962k24319l10429k12250J25006L15403J29795
9604c36273N9445K40339R7784l5728j4532J77621L70280J0801k43165k14964j40922
9593b9314K8470m9616l23980j45734m2872N398J51738K92447o0959j29269Q5118
9582b18573M1867M2080J54084K40497Q7378r262n3427q1823r8779j73369n8060
9571a27387J69095K7438q1238j0659k9448p0173j64734l9287L78615L41620o9958
$$ plain form
9560 323884 -21887 -137415 -47412 239677 552571 617153 473025 158903 -10934 41852
9550 41852 210494 157032 64059 -30833 13603 83047 158483 324258 424276 495578 563032
9539 563032 504859 342592 264786 71670 17628 -141312 -205454 -237603 -464452 -569028 -494994
9528 -494994 -219636 -69876 -198999 -52475 25687 -20622 -182353 -507124 -648313 -416936
9518 -416936 -200975 -201774 -97244 -24980 34263 170483 -21667 -301004 -413827 -354865 -302328
9507 -302328 -132689 116131 120460 -37439 -19359 -15748 -256529 -421487 -358887 -254260 -240243
9496 -240243 -352580 -428071 -477298 -468889 -459632 -533388 -528806 -331254 -107234 -245348 -258501
9485 -258501 -247499 -174644 -93519 31572 36453 -174302 -235683 -100712 -7817 -131185 -114755
$$ packed form
9560C23884l45771j15528R0003K87089L12894O4582j44128l14122j69837N2786
9550D1852J68642n3462r2973r4892M4436O9444P5436J65775J00018P1302O7454
9539E63032n8173j62267p7806j93116n4042j58940o4142l2149k26849j04576P4034
9528d94994K75358J49760j29123J46524P8162m6309j61731l24771j41189K31377
9518d16936K15961p99J04530P2264N9243J36220j92150k79337j12823N8962N2537
9507c02328J69639K48820M329j57899J8080L611k40781j64958O2600J04627J4017
9496b40243j12337p5491m9227Q409R257p3756M582J97552K24020j38114j3153
9485b58501J1002P2855Q1125J25091M881k10755o1381J34971R2895j23368J6430
$$ plain form
9474 -114755 -9090 161212 20770 -186752 -143988 -246571 -153394 321842 554328 392939
9464 392939 76513 -151634 -179732 -106854 10399 -6488 -117395 -100340 -141275 -134139 -198941
9453 -198941 -356775 -610580 -699850 -464759 -245139 -136976 -300278 -419896 -308819 -7492
9443 -7492 176743 42748 -10557 79111 59579 -35808 -161760 -168293 -317846 -604031 -659276
9432 -659276 -463626 -557776 -561145 -364718 -440165 -515118 -479615 -402107 -410035 -401128 -337806 -215873
9420 -215873 -14890 -34687 -194824 -91666 -77636 -144742 -41245 83189 30705 -93620
9410 -93620 -228385 -203730 -43063 10998 -214351 -377772 -350463 -127960 102256 185575 340304
9399 340304 444039 259758 -114171 -222480 -70369 218743 320618 330144 386922 372873
$$ packed form
9474a14755J05665J70302j40442k07522M2764j02583R3177M75236K32486j61389
9464C92939l16426k28147k8098P2878J17253j6887j10907J7055m0935P136o4802
9453a98941j57834k53805q9270K35091K19620J08163j63302j19618J11077L01327
9443g492J84235j33995n3305Q9668j9532r5387j25952o533j49553k86185n5245
9432f59276J95650r4150l369J96427p5447p4953L5503P7508p928Q907O3322J21933
9420b15873K00983j9797j60137J03158J4030o7106J03497J24434n2484j24325
9410i3620j34765K4655J60667N4061k25349j63421K7309K22503K30216Q3319J54729
9399C40304J03735j84281l73929j08309J52111K89112J01875R526N6778j4049
$$ plain form
9389 372873 308900 332084 369171 415093 264570 58854 67 70702 -85617 -167575 -266185
9378 -266185 -453818 -546172 -607746 -607644 -396146 -248610 -70577 116746 296952 504969 476513
9367 476513 205335 5491 -140361 -311210 -446971 -435884 -346228 -345300 -317186 47752 189262
9356 189262 -2551 -187820 -184956 -23630 -350 91836 183521 99592 -66215 -272698 -236696
9345 -236696 -235119 -478902 -663650 -735115 -685673 -635371 -580214 -487844 -676817 -874701 -805904
9334 -805904 -761666 -563350 -308446 -78061 74076 124111 199812 306508 308327 408099 477084
9323 477084 520865 465652 284811 145164 9485 -99303 24064 123228 111819 51234 87139
9312 87139 106076 28880 14255 39264 107951 92000 104447 132740 11553 -183126 -38341
$$ packed form
9389C72873o3973K3184L7087M5922j50523k05716n8787P0635j56319q1958r8610
9378b66185j87633r2354o1574J02K11498J47536J78033J87323J80206K08017k8456
9367D76513k71178j99844j45852j70849j35761J1087Q9656R28K8114L64938J41510
9356A89262j91813j85269K864J61326K3280R2186R1685q3929j65807k06483L6002
9345b36696J577k43783j84748p1465M9442N0302N5157R2370j88973j97884O8797
9334h05904M4238J98316K54904K30385J52137N0035P5701J06696J819R9772O8985
9323D77084M3781n5213j80841j39647j35679j08788J23367R9164j1409o0585L5905
9312H7139J8937p7196j4625K5009O8687j5951J2447K8293j21187j94679J44785
$$ plain form
9301 -38341 232249 368791 281051 206727 246618 237396 257827 450105 450413 326544 144717
9290 144717 10306 -74416 -133057 -142734 -165906 -212010 -163876 -234251 -397282 -367274 -341970
9279 -341970 -366528 -343904 -268749 -274672 -88221 52710 83858 336215 390309 197826 49653
9268 49653 51025 230488 203254 585 -285459 -296251 -301732 -365917 -508988 -523189 -471128
9257 -471128 -554642 -690132 -761328 -700434 -755556 -756123 -434246 -215631 -171820 -149001 -225684
9246 -225684 -316917 -357738 -543357 -736990 -696026 -386752 -54929 125003 56758 38679 23588
9235 23588 -73862 -201885 -258485 -233938 -299507 -396869 -303173 -356172 -358981 -201553 -209833 -193838
9223 -193838 -33356 209696 235835 258378 143015 -72026 -161101 -290411 -327647 -276150 -218526
$$ packed form
9301c8341K70590J36542q7740p4324L9891r222K0431J92278L08j23869j81827
9290A44717j34411q4722n8641r677k3172m6104M8134p0375j63031L0008K5304
9279c41970k4558K2624P5155n923J86451J40931L1148K52357N4094j92483j48173
9268D9653J372J79463k7234k02669k86044j0792n481o4185j43071j4201N2061
9257d71128q3514j35490p1196O0894n5122n67L21877K18615M3811K2819p6683
9246b25684r1233m0821j85619j93633M0964L09274L31823J79932o8245j8079j5091
9235B3588r7450j28023n6600K4547o5569r7362R3696n2999k809J57428q280J5995
9223a93838J60482K43052K6139K2543j15363k15041q9075j29310l7236N1497N7624
$$ plain form
9212 -218526 -331311 -533367 -655410 -665179 -580660 -593098 -740740 -808881 -699312 -427264 -265299
9201 -265299 -168855 -114702 -247374 -456335 -526725 -438701 -479405 -346960 -106338 134354 191509
9190 191509 16103 67058 185318 265526 395735 404225 268653 -17316 -285261 -434802
9180 -434802 -463166 -376669 -371844 -380143 -397829 -441503 -275526 -137713 -39782 68729 65162 -36308
9168 -36308 -56653 42575 17208 3489 -10924 -258237 -365285 -216551 -92994 -56954 -138247
9157 -138247 -137646 -156864 -114187 -125369 -229801 -282957 -240869 -248112 -444666 -539931 -475185 -280980
9145 -280980 -45246 40966 -27846 -1771 44919 30608 35533 162512 116792 -83757 -381
9134 -381 221137 167280 -152582 -484370 -501145 -325112 -176989 -67376 -154968 -236023 -206252
$$ packed form
9212b18526j12785k02056j22043r769Q4519j2438j47642o8141J09569K72048J61965
9201b65299R6444N4153j32672k08961p0390Q8024m0704J32445K40622K40692N7155
9190A91509j75406N0955J18260Q0208J30209Q490j35572k85969k67945j49541
9180d34802k8364Q6497M825q299j7686m3674J65977J37813R7931J08511l567j01470
9168c6308k0345R9228k5367j3719j4413k47313j07048J48734J23557L6040q1293
9157a38247O01j9218M2677j1182j04432n3156M2088p243j96554r5265O4746J94205
9145b80980K35734Q6212o8812K6075M6690j4311M925J26979m5720k00549Q3376
9134c81K21518n3857l19862l31788j6775J76033J48123J09613q7592q1055K9771
$$ plain form
9123 -206252 -144424 -70625 -56550 -99463 -167103 -256188 -221395 -90054 -226384 -416027 -441114
9112 -441114 -274848 -14243 132620 254050 23883 -245364 -170245 -39748 -209086 -335004
9102 -335004 -406077 -600542 -701615 -492184 -397457 -508612 -557822 -372618 -251046 -170943
9092 -170943 -49327 133737 302804 328524 266998 169576 69470 44676 154037 -59952
9082 -59952 -331881 -512743 -512967 -482866 -476803 -369649 -187956 -117364 -331910 -533652 -374118
9071 -374118 -154841 6592 17410 -145334 -228794 -264663 -509669 -627198 -420397 -104204
9061 -104204 46590 125158 188521 358485 328388 99775 29548 -168977 -342141 -251757 -294290
9050 -294290 -339863 -292764 -193487 -310719 -476470 -536690 -291024 37133 95465 -97700 -186578
$$ packed form
9123b06252O1828P3799J4075m2913o7640q9085L4793J31341j36330j89643k5087
9112d41114J66266K60605J46863J21430k30167k69247P5119J30497j69338j25918
9102c35004p1073j94465j01073K09431R4727j11155m9210J85204J21572Q0103
9092a70943J21616J83064J69067K5720o1526r7422j00106k4794J09361k13989
9082e9952k71929j80862k24L0101O063J07154J81693P0592k14546k01742J59534
9071c74118K19277J61433J0818j62744q3460l5869k45006j17529K06801L16193
9061a04204J50794P8568O3363J69964l0097k28613p0227j98525j73164R0384m2533
9050b94290m5573M7099R9277j17232j65751o0220K45666L28157N8332j93165q8878
$$ plain form
9039 -186578 -84711 -206051 -445931 -337524 -104882 -9478 33830 113988 200203 54445
9029 54445 229563 408236 352016 196564 176629 183227 65319 -41703 -92150 -45296 -147805
9018 -147805 -33780 155059 88691 -122281 -259328 -151486 33606 81383 7197 47572
9008 47572 52990 36873 46824 81792 35574 51954 207376 139209 -133278 -70858 72480 116525
8996 116525 102359 144288 279689 363420 341954 240297 284211 204402 22838 61480 274979
8985 274979 72084 -136114 -97098 -60361 135169 369016 485091 208076 -254710 -437412
8975 -437412 -182247 -84614 -197711 -235837 -166854 -124316 -190475 -162619 -60141 -11723 74993
8964 74993 68864 -160323 -238621 -378559 -523189 -503788 -377091 -267951 -358685 -279942 -81011
$$ packed form
9039a86578J01867j21340k39880J08407K32642R5404M3308Q0158Q6215j45758
9029E4445J75118J78673n6220j55452j9935O598j17908j07022n0447M6854j02509
9018a47805J14025J88839o6368k10972j37047J07842J85092M7777p4186M0375
9008D7572N418j6117R951L4968m6218J6380J55422o8167k72487O2420J43338M4045
8996A16525j4166M1929J35401Q3731k1466j01657M3914p9809j81564L8642K13499
8985B74979k02895k08198L9016L6737J95530K33847J16075k77015m62786j82702
8975d37412K55165R7633j13097l8126O8983M2538o6159K7856J02478M8418Q6716
8964G4993o129k29187p8298j39938j44630J9401J26697J09140r0734P8743J98931
$$ plain form
8953 -81011 64845 279588 249157 316563 428719 479376 538650 368906 91692 -13492 -168215
8942 -168215 -233367 -156618 -82979 -108792 -292546 -449930 -590543 -695798 -454260 -195587
8932 -195587 -19992 15232 -53819 -89388 -170914 -296797 -335507 -471402 -579154 -326412 34279
8921 34279 248902 155783 135573 193455 443838 498558 278210 182169 76393 -223851 -367540
8910 -367540 -323713 -444551 -611673 -605293 -578055 -487357 -506154 -321258 -138466 -199897 -289952
8899 -289952 -322610 -562413 -564374 -403032 -541666 -585601 -390558 -159217 -213212 -351536 -544873
8888 -544873 -542779 -247304 -169860 -263548 -130131 50534 148595 212059 420690 502070 387124
8877 387124 253900 219078 258934 165036 134504 -9924 -144221 -55197 -21384 -33523 68671
$$ packed form
8953h1011J45856K14743l0431O7406J12156N0657N9274j69744k77214j05184j54723
8942a68215o5152P6749P3639k5813j83754j57384j40613j05255K41538K58673
8932a95587J75595L5224o9051l5569q1526j25883l8710j35895j07752K52742L60691
8921C4279K14623r3119k0210N7882K50383N4720k20348r6041j05776l00244j43689
8910c67540M3827j20838j67122O380K7238R0698j8797J84896J82792o1431r0055
8899b89952l2658k39803j961J61342j38634m3935J95043K31341n3995j38324j93337
8888e44873K094K95475P7444r3688J33417J80665R8061O3464K08631Q1380j14946
8877C87124j33224l4822L9856r3898l0532j44428j34297Q9024L3813j2139J02194
$$ plain form
8866 68671 77218 -94537 -293643 -397499 -269928 -51448 121930 161971 114402 3278 -41020
8855 -41020 91529 154532 82682 -139264 -271501 -216896 -92630 -7667 57515 99947 117755
8844 117755 124555 9824 -218557 -359991 -367485 -208123 -208778 -314505 -366151 -266087 -193400
8833 -193400 -293941 -458750 -627780 -716950 -711799 -621209 -488097 -334505 -263358 -311932 -300801
8822 -300801 -101185 52771 53440 -84342 -334837 -702712 -809163 -570064 -331191 -81715
8812 -81715 -130829 -304964 -239382 -151483 12085 41560 -132360 -110275 -162130 -173631 -75043
8801 -75043 -14516 -39496 -67985 -78747 -77127 -178549 -325938 -453323 -449338 -290739 -113345
8790 -113345 -76695 -72770 108005 184696 263841 399425 570257 548037 441481 212926 -2635
$$ packed form
8866F8671Q547j71755j99106j03856J27571K18480J73378M0041m7569j11124m4298
8855d1020J32549O3003p1850k21946j32237N4605J24266Q4963O5182M2432J7808
8844A17755O800j14731k28381j41434p494J59362o55j05727n1646J00064P2687
8833a93400j00541j64809j69030q9170N151R0590J33112J53592P1147m8574J1131
8822c00801J99616J53956O69j37782k50495l67875j06451K39099K38873K49476
8812h1715m9114j74135O5582Q7899J63568K9475j73920K2085n1855j1501R8588
8801g5043O0527k4980k8489j0762J620j01422j47389j27385L985J58599J77394
8790a13345L6650L925J80775P6691P9145J35584J70832k2220j06556k28555k15561
$$ plain form
8779 -2635 -99882 -239320 -353203 -370155 -206726 5651 6865 68834 144858 195836 187010 81883
8767 81883 -15540 -61231 14915 137644 218795 448159 442590 246552 128320 12092 57998
8756 57998 170110 155087 27132 -56880 -121377 -262939 -364074 -501994 -525826 -330685 -81767
8745 -81767 -90747 -177569 -275271 -202663 -1788 -6843 -217000 -294838 -263350 -403212 -576997
8734 -576997 -698990 -551155 -412150 -510061 -614174 -489229 -418183 -351712 -396531 -555535
8724 -555535 -367673 -214024 -236894 -151563 -58457 27834 32218 -76590 -228547 -269214 -340052
8713 -340052 -414931 -360859 -278317 -19670 47904 88196 103157 13340 -23497 23875 9599
8702 9599 87131 212389 177549 116179 12863 -88522 -65057 -74590 -111545 -186823 -327137
$$ packed form
8779b635r7247j39438j13883j6952J63429K12377J214O1969P6024N0978q826j05127
8767H1883r7423m5691P6146J22729Q1151K29364n569j96038j18232j16228M5906
8756E7998J12112j5023j27955q4012o4497j41562j01135j37920k3832J95141K48918
8745h1767q980q6822r7702P2608K00875n055k10157p7838L1488j39862j73785
8734e76997j21993J47835J39005r7911j04113J24945P1046O6471m4819j59004
8724e55535J87862J53649k2870Q5331R3106Q6291M384j08808j51957m0667p0838
8713c40052p4879N4072Q2542K58647O7574M0292J4961q9817l6837M7372j4276
8702I599P7532J25258l4840o1370j03316j01385K3465r533l6955p5278j40314
$$ plain form
8691 -327137 -167649 67990 11911 -161819 -175534 -44137 -41169 -19231 -142208 -422773 -541231
8680 -541231 -348049 -174815 -152451 -149216 -299040 -375765 -206179 -64436 -69902 -128591 -159117
8669 -159117 -212391 -126710 18003 150215 421582 564851 542013 420259 387986 321413 262485
8658 262485 223291 334082 426439 441937 491332 349308 47860 -65145 -27971 -14391 -28892
8647 -28892 -69797 -144356 -166610 -231541 -92065 132672 4563 -264516 -148031 135417 393767
8636 393767 410654 315409 63201 -197677 -289220 -210147 -114321 -399634 -432026 -224596 38940
8625 38940 129532 -84760 -410748 -556442 -519931 -384604 -229705 -103758 81700 220487
8615 220487 488291 266684 -64430 -114652 -93606 -121768 -153396 6041 -25765 -31789 103539
$$ packed form
8691c27137J59488K35639n6079j73730j3715J31397K968K1938j22977k80565j18458
8680e41231J93182J73234K2364L235j49824p6725J69586J41743n466n8689l0526
8669a59117n3274Q5681J44713J32212K71367J43269k2838j21754l2273o6573n8928
8658B62485l9194J10791R2357J5498M9395j42024l01448j13005L7174J3580j4501
8647b8892m0905p4559k2254o4931J39476K24737j28109k69079J16485K83448K58350
8636C93767J6887r5245k52208k60878r1543P9073R5826k85313l2392K07430K63536
8625C8940R0592k14292l25988j45694L6511J35327J54899J25947J85458J38787
8615B20487K67804k21607l31114n0222K1046k8162l1628J59437l1806o024J35328
$$ plain form
8604 103539 8848 -145953 -179480 -279146 -407203 -368608 -339224 -206209 -100665 -116873 -83221
8593 -83221 -47651 -112575 -240318 -295330 131208 482146 391541 151297 57548 189634 201203
8582 201203 120576 -803 -137096 -182845 -132853 -149959 -327394 -434563 -288298 -51837
8572 -51837 62392 131719 77944 -128621 -418037 -461665 -299758 -139724 -108687 -228814 -354478
8561 -354478 -320829 -290080 -349562 -267036 -16171 243293 403563 409765 79096 -180175 -248035
8550 -248035 -63399 191879 178143 179970 365806 382982 186142 24708 111048 69908 73312
8539 73312 135770 103443 -40754 -126059 -85300 152761 280700 152299 55477 81995 48182
8528 48182 94703 10974 -155157 -151049 -130556 -101086 -146823 -64650 -71878 -198015 -210502 -422581
$$ packed form
8604A03539r4691j54801l3527r9666j28057L8595K9384J33015J05544j6208L3652
8593h3221L5570o4924j27743n5012M26538L50938r0605k40244r3749J32086J1569
8582B01203q0627j21379j36293m5749M9992j7106j77435j07169J46265K36461
8572e1837J14229O9327n3775k06565k89416m3628J61907J60034L1037j20127j25664
8561c54478L3649L0749n9482Q2526K50865K59464J60270O202l30669k59271o7860
8550b48035J84636K55278j3736J827J85836J7176j96840j61434Q6340m1140L404
8539G3312O2458l2327j44197q5305M0759K38061J27939j28401r6822K6518l3813
8528D8182M6521q3729j66131M108K0493K9470m5737Q2173p228j26137j2487k12079
$$ plain form
8516 -422581 -518824 -254216 -248315 -328896 -378885 -276182 87712 244744 202331 203562 350874
8505 350874 593199 655860 608473 614733 506729 448133 673381 724660 651422 771204 728782
8494 728782 447610 170280 44684 57529 261985 496417 506575 163762 -51670 156707
8484 156707 316051 355830 482048 610364 625238 383972 217944 224436 269194 402995 623171
8473 623171 532997 351913 355752 411030 346461 41698 -236293 -224281 -65221 12948 96081
8462 96081 177741 311215 426382 632860 776614 679867 521796 374529 202217 75414
8452 75414 -19214 -100157 41798 82048 -62583 -69262 78323 346337 501564 334928 198270
8441 198270 150143 -35978 -291660 -289231 52061 329929 370330 404171 593312 707694 526100
$$ packed form
8516d22581r6243K64608N901q0581m9989J02703L63894J57032m2413J231J47312
8505C50874K42325O2661m7387O260j08004n8596K25248N1279p3238J19782m2422
8494G28782k81172k77330j25596J2845K04456K34432J0158l42813k15432K08377
8484A56707J59344L9779J26218J28316J4874k41266j66028O492M4758J33801K20176
8473F23171r0174j81084L839N5278o4569l04763k77991J2012J59060P8169Q3133
8462I6081Q1660J33474J15167K06478J43754r6747j58071j47267j72312j26803
8452G5414r4628q0943J41955M0250j44631o679J47585K68014J55227j66636j36658
8441A98270m8127j86121k55682K429L41292K77868M0401L3841J89141J14382j81594
$$ plain form
8430 526100 241775 69405 239594 546794 632905 463610 417394 407044 371558 333281 264450
8419 264450 257734 352247 355105 335621 416622 358813 264443 150746 311237 334682 204045
8408 204045 123323 109399 117266 229892 321356 390093 466808 560433 496656 526491 655844
8397 655844 748363 813398 695758 510557 449906 376724 268705 228586 337341 355384 220414
8386 220414 78708 -202988 -293954 -143635 37344 236692 205043 48569 33889 78310
8376 78310 -11089 6274 298709 427800 440209 388591 240728 183455 289443 416608 684815
8365 684815 859036 875365 549032 427796 583137 636611 606240 567869 520904 304086 236001
8354 236001 365199 464336 634134 845758 943419 945456 890434 799502 795589 671195 410845
$$ packed form
8430E26100k84325j72370J70189L07200Q6111j69295m6216j0350l5486l8277o8831
8419B64450o716R4513K858j9484Q1001n7809r4370j13697J60491K3445j30637
8408B04045q0722j3924P867J12626R1464O8737P6715R3625o3777K9835J29353
8397F55844R2519O5035j17640j85201o0651p3182j08019m0119J08755J8043j34970
8386B20414j41706k81696r0966J50319J80979J99348l1649j56474j4680M4421
8376G8310q9399J7363K92435J29091J2409n1618j47863n7273J05988J27165K68207
8365F84815J74221J6329l26333j21236J55341N3474l0371l8371m6965k16818o8085
8354B36001J29198R9137J69798K11624R7661K037n5022r0932l913j24394k60350
$$ plain form
8343 410845 328275 255602 277033 356609 394997 430562 384042 116197 98181 145085 76094
8332 76094 116178 200245 384147 517439 573592 629365 536143 491912 509247 467358 481716
8321 481716 625687 827430 864393 769170 775279 616113 525707 531658 516765 668724 738164
8310 738164 952243 881734 628528 459298 432589 476805 452948 277135 237600 257440 214901
8299 214901 368154 325272 188443 210018 193565 120504 312638 504823 475798 610820 873657
8288 873657 980339 1018560 864968 605108 499314 469239 372229 170754 146356 267441
8278 267441 420108 568739 496513 378864 326642 82328 -225929 -401427 -421536 -358350
8268 -358350 -179451 -39828 55283 282372 467635 519720 571877 513846 679041 957062
$$ packed form
8343D10845q2570p2673K1431P9576L8388L5565m6520k67845j8016M6904o8991
8332G6094M0084Q4067J83902J33292N6153N5773r3222m4231J7335m1889J4358
8321D81716J43971K01743L6963r5223O109j59166r0406N951j4893J51959O9440
8310G38164K14079p0509k53206j69230k6709M4216k3857j75813l9535J9840m2539
8299B14901J53253m2882j36829K1575j6453p3061J92134J92185k9025J35022K62837
8288H73657J06682L8221j53592k59860j05794l0075r7010k01475k4398J21085
8278B67441J52667J48631p2226j17649n2222k44314l08257j75498k0109O3186
8268c58350J78899J39623R5111K27089J85263N2085N2157n8031J65195K78021
$$ plain form
8258 957062 939588 794662 739187 611352 551984 597540 591568 597315 749016 926391 929924
8247 929924 849864 753752 675145 657489 505434 311413 311192 260151 271671 270214 387906 508759
8235 508759 602357 764394 720611 507106 453899 504852 611959 499139 392492 280698
8225 280698 371513 677660 529416 138529 8470 219471 476497 710155 794399 785772
8215 785772 668717 508159 346582 197269 226205 408253 560408 638668 689537 705042
8205 705042 429951 241421 158593 328841 679025 930912 1026462 1067784 1154501 1057060 831328
8194 831328 663745 551410 599731 809772 695839 643139 755361 662065 557473 504230
8184 504230 448572 474279 399695 409516 523185 691846 690162 715972 830858 966161 1087276
$$ packed form
8258I57062j7474j44926n5475j27835n9368M5556n972N747J51701J77375L533
8247I29924q0060r6112p8607j7656j52055j94021k21n1041J1520j457J17692J20853
8235E08759R3598J62037m3783k13505n3207N0953J07107j12820j06647j11794
8225B80698R0815L06147j48244l90887j30059K11001K57026K33658Q4244q627
8215G85772j17055j60558j61577j49313K8936J82048J52155P8260N0869J5505
8205G05042k75091j88530q2828J70248L50184K51887R5550M1322Q6717r7441k25732
8194H31328j67583j12335M8321K10041j13933n2700J12222r3296j04592n3243
8184E04230n5658K5707p4584R821J13669J68661j684K5810J14886J35303J21115
$$ plain form
8173 1087276 961907 682786 438035 469904 768153 845889 689641 480610 407142 552913
8163 552913 680721 630604 571045 491143 458129 645322 1016871 1078288 854086 672490 604858
8152 604858 623678 691756 766295 992909 1173084 1004427 757232 674070 568027 624649 811646
8141 811646 749191 809356 711361 357773 314362 360887 347884 250187 303120 590335 715840
8130 715840 750602 926448 1019316 996821 922093 802002 703487 592586 503206 643795 670731
8119 670731 662822 574335 567712 933895 1079843 856867 790813 948321 934412 887904 770353
8108 770353 679022 755254 826332 932159 972222 901588 745381 745006 811160 896862 1018348
8097 1018348 1098437 1112086 997170 1070684 1322706 1343932 1287385 1567028 1643781 1489820 1202310
$$ packed form
8173A087276j25369k79121k44751L1869K98249P7736j56248k09031p3468J45771
8163E52913J27808n0117n9559p9902l3014J87193L71549O1417k24202j81596o7632
8152F04858J8820O8078P4539K26614J80175j68657k47195q3162j06043N6622J86997
8141H11646o2455O0165r7995l53588m3411M6525j3003r7697N2933K87215J25505
8130G15840L4762J75846R2868k2495p4728j20091r8515j10901q9380J40589K6936
8119F70731p909q8487o623L66183J45948k22976o6054J57508j3909m6508j17551
8108G70353r1331P6232P1078J05827M0063p0634j56207l75O6154Q5702J21486
8097A018348Q0089J3649j14916P3514K52022K1226n6547K79643P6753j53961k87510
$$ plain form
8086 1202310 882946 672510 656321 1068743 1286899 1321295 1308961 1026373 772509 757843
8076 757843 932004 996508 1116079 1174821 1032196 927158 925918 885353 877829 1001038 1020655
8065 1020655 1114758 1192623 1336847 1450615 1331374 1284776 1207281 1096390 1245168 1487723
8055 1487723 1352059 989130 787279 924412 1081681 1199870 1263088 1249104 1191101 1144251
8045 1144251 1049425 868388 634394 568433 563546 657434 1038884 1241486 1303378 1359143 1495848
8034 1495848 1577731 1522548 1548679 1694390 1919583 2073161 2044466 1848228 1726939 1861370
8024 1861370 2112143 2214083 2195606 2206656 2316673 2278684 2319618 2571723 2823631 2804915
8014 2804915 2859128 2979968 3068259 3222760 3570644 4139842 4921599 5878400 6890207 8031605
$$ packed form
8086A202310l19364k10436j6189M12422K18156L4396j2334k82588k53864j4666
8076G57843J74161O4504J19571N8742j42625j05038j240m0565p524J23209J9617
8065A020655R4103P7865J44224J13768j19241m6598p7495j10891J48778K42555
8055A487723j35664l62929k01851J37133J57269J18189O3218j3984n8003m6850
8045A144251r4826j81037k33994o5961m887R3888L81450K02602O1892N5765J36705
8034A495848Q1883n5183K6131J45711K25193J53578k8695j96238j21289J34431
8024A861370K50773J01940j8477J1050J10017l7989M0934K52105K51908j8716
8014B804915N4213J20840Q8291J54501L47884N69198P81757R56801J011807J141398
$$ plain form
8004 8031605 9481454 11559425 14455527 18059468 22441806 27398153 32700750 37364804
7996 37364804 40453449 41773282 41217845 38758234 35001110 30706665 26536193 22786961
7988 22786961 19652950 17045532 14960396 13256292 11816776 10773920 10008683 9552133
7980 9552133 9299008 9069463 9068276 9279122 9591512 10071979 10540600 10602750 10199524 9432495
7970 9432495 8649075 8026394 7658234 7473233 7283365 7002926 6764549 6627988 6558591 6550459
7960 6550459 6614715 6965849 7261759 7695721 8369914 9027351 9963366 11281373 12829598
7951 12829598 14554826 16667289 19306998 22711180 27487698 33964248 42436353 53245161
7943 53245161 66464531 81540572 97313409 111671581 121969274 126244509 124060911
$$ packed form
8004H031605J449849K077971K896102L603941M382338M956347N302597M664054
7996C7364804L088645J319833n55437k459611l757124m294445m170472l749232
7988B2786961l134011k607418k085136j704104j439516j042856p65237m56550
7980I552133k53125k29545j187K10846L12390M80467M68621O2150m03226p67029
7970I432495p83420o22681l68160j85001j89868k80439k38377j36561o9397q132
7960F550459O4256L51134K95910M33962O74193O57437R36015J318007J548225
7951A2829598J725228K112463K639709L404182M776518O476550Q472105J0808808
7943E3245161J3219370J5076041J5772837J4358172J0297693M275235k183598
$$ plain form
7936 124060911 116098698 103983463 90050696 76465568 64496806 54487860 46507255
7929 46507255 40186865 35070280 31269393 28168963 25596423 23606652 22229498 21504739
7921 21504739 21260216 21362418 21752782 22004623 21917734 21453934 20513917 19318896 17973945
7912 17973945 16469708 15048039 14110425 13600207 13205657 12778986 12721815 12938256 13143004
7903 13143004 13536947 14189523 14975061 15816386 16838107 18113420 19752296 21936112 24544408
7894 24544408 27643251 31684334 37113548 44417060 54304268 67230333 83952144 105475399
7886 105475399 132008729 162366376 193738983 221946804 242026931 250354157 245639999
7879 245639999 229102037 204343989 176067325 148404120 123868142 103469966 87209888
$$ packed form
7936A24060911p962213j2115235j3932767j3585128j1968762j0008946p980605
7929D6507255o320390n116585l800887l100430k572540j989771j377154p24759
7921B1504739k44523J02202L90364K51841q6889m63800r40017j195021j344951
7912A7973945j504237j421669r37614n10218l94550m26671n7171K16441K04748
7903A3143004L93943O52576P85538Q41325J021721J275313J638876K183816K608296
7894B4544408L098843M041083N429214P303512R887208J2926065J6721811K1523255
7886A05475399K6533330L0357647L1372607K8207821K0080127Q327226m714158
7879B45639999j6537962k4758048k8276664k7663205k4535978k0398176j6260078
$$ plain form
7872 87209888 74682955 64938593 57194287 50816245 45757410 41936148 38974832 36890380
7864 36890380 35435395 34721439 34694319 34799258 34379905 33561195 32291884 30267932 27738404
7855 27738404 25376954 23306335 21604905 20270600 19412227 18951025 18547014 18236239 18117938
7846 18117938 18433409 18944802 19479329 20221513 21225699 22505865 24178578 26433649 29452119
7837 29452119 33413712 38318717 44842058 53513615 65050216 80255439 99953224 125261724
7829 125261724 156567473 192314676 229141430 262000523 285276167 294612430 288131064
7822 288131064 267915736 238108078 204217225 171117277 142021516 118115580 99149433
7815 99149433 84241983 72449131 63137361 55796204 49717129 44690796 40843082 37887848
$$ packed form
7872H7209888j2526933r744362p744306o378042n058835l821262k961316k084452
7864C6890380j454985p13956k7120J04939m19353q18710j269311k023952k529528
7855B7738404k361450k070619j701430j334305q58373m61202m04011l10775j18301
7846A8117938L15471N11393N34527P42184J004186J280166J672713K255071L018470
7837B9452119L961593M905005O523341Q671557J1536601J5205223J9697785K5308500
7829A25261724L1305749L5747203L6826754L2859093K3275644R336263o481366
7822B88131064k0215328k9807658l3890853l3099948k9095761k3905936j8966147
7815I9149433j4907450j1792852r311770p341157o079075n026333l847714k955234
$$ plain form
7807 37887848 35831917 34597615 33848548 33174497 32387063 31174272 29439881 27643058 25680437
7798 25680437 23550848 21947947 20698116 19488701 18372088 17908388 17670838 17199877 16905856
7789 16905856 16881692 17051923 17506206 18257378 19189545 20408319 22039277 24115898 26713755
7780 26713755 30024789 34540165 40410160 48100498 58032840 70807837 87491519 109046541
7772 109046541 135479178 165527527 196507134 224008879 243232366 250510776 244700992
7765 244700992 227027055 201288733 172661718 144862763 120321965 99814579 83307344
7758 83307344 70386446 60189349 52130808 45713058 40635775 36073800 32241700 29570449
7750 29570449 27639899 25981218 24609065 23641924 22549983 21405436 20117707 18743634
$$ packed form
7807C7887848k055931j234302p49067o74051p87434j212791j734391j796823j962621
7798B5680437k129589j602901j249831j209415j116613m63700k37550m70961k94021
7789A6905856k4164J70231M54283P51172R32167J218774J630958K076621K597857
7780B6713755L311034M515376N869995P690338R932342J2774997J6683682K1555022
7772A09046541K6432637L0048349L0979607K7501745J9223487P278410n809784
7765B44700992j7673937k5738322k8627015k7798955k4540798k0507386j6507235
7758H3307344j2920898j0197097q058541o417750n077283m561975l832100k671251
7750B9570449j930550j658681j372153r67141j091941j144547j287729j374073
$$ plain form
7742 18743634 17365260 16172634 15057662 14011910 13332523 12715283 12015990 11653938 11545451
7733 11545451 11166113 10781423 10816631 11135416 11594162 11842006 12158136 12778085 13722800 15041106
7723 15041106 16885627 19074339 21702801 25308235 30151545 36683542 45267021 56196876
7715 56196876 69546946 84627143 99889921 113199662 122449043 125772643 122467411 113610043
7707 113610043 100739613 86270808 72309644 60006027 50055723 42047001 35475020
7700 35475020 30311696 26301969 22999303 20120520 17831663 15997199 14292501 12915865
7692 12915865 11910017 11098640 10373445 9735753 9059651 8330995 7697425 7228401 6898656
7683 6898656 6587837 6207475 5752101 5557022 5539582 5329188 5256559 5256235 5053370 4873947
$$ packed form
7742A8743634j378374j192626j114972j045752o79387o17240o99293l62052j08487
7733A1545451l79338l84690L5208L18785M58746K47844L16130O19949R44715J318306
7723A5041106J844521K188712K628462L605434M843310O531997Q583479J0929855
7715E6196876J3350070J5080197J5262778J3309741R249381L323600l305232q857368
7707A13610043j2870430j4468805j3961164j2303617r950304q008722o571981
7700C5475020n163324m009727l302666k878783k288857j834464j704698j376636
7692A2915865j005848q11377p25195o37692o76102p28656o33570m69024l29745
7683F898656l10819l80362m55374j95079j7440k10394p2629l24k02865j79423
$$ plain form
7673 4873947 4869802 4970116 5196330 5456228 5666076 5909337 6411498 7284760 7978492 8746911
7663 8746911 10011106 11509934 13488170 16497567 20294835 24546248 29207638 33935047
7655 33935047 38070960 40929655 41804642 40661841 37773928 33781403 29237030 24535051
7647 24535051 20364676 17034492 14359015 12194893 10609647 9338961 8316970 7457391
7639 7457391 6571881 5816431 5429057 5196889 4841685 4362372 3880819 3458522 3206106 3039985
7629 3039985 2802446 2652954 2615018 2569701 2491042 2293903 2006030 1950159 1811511 1767928
7619 1767928 1879902 2030360 2061783 1802887 1530706 1533164 1705831 1635311 1505028 1519444
7609 1519444 1537017 1457394 1282596 1259872 1119700 798515 755485 1011127 1093745 1146990 1135496
$$ packed form
7673D873947m145J00314K26214K59898K09848K43261N02161Q73262O93732P68419
7663H746911J264195J498828J978236L009397L797268M251413M661390M727409
7655C3935047M135913K858695Q74987j142801k887913l992525m544373m701979
7647B4535051m170375l330184k675477k164122j585246j270686j021991q59579
7639G457391q85510p55450l87374k32168l55204m79313m81553m22297k52416j66121
7629C039985k37539j49492l7936m5317p8659j97139k87873n5871j38648m3583
7619A767928J11974J50458L1423k58896k72181K458J72667p0520j30283J4416
7609A519444J7573p9623j74798k2724j40172l21185m3030K55642Q2618N3245j1494
$$ plain form
7598 1135496 1069170 928307 987246 923510 994723 1108420 1063407 1032895 1144008 1137495 1023656
7587 1023656 962861 1016954 757776 619033 889960 867479 906833 1006619 1027043 1039352 1118572
7576 1118572 1159552 1275789 1441474 1509904 1412619 1208394 1004276 731111 661949 613364
7566 613364 488472 476669 578722 568528 649533 956002 905802 453398 115718 122717 263699
7555 263699 434005 427914 296288 401373 518447 660448 657078 266369 81725 143139 372054
7544 372054 562634 512653 494724 547457 722478 732361 665322 896615 848694 614603 426123
7533 426123 363369 407360 422714 400320 380975 391730 336074 448880 485830 599507 692222
7522 692222 874614 830910 641171 706286 872777 840775 847164 914105 1013088 1050534 982708
$$ packed form
7598A135496o6326j40863N8939o3736P1213J13697m5013l0512J11113o513j13839
7587A023656o0795N4093k59178j38743K70927k2481L9354R9786K0424J2309P9220
7576A118572M0980J16237J65685O8430r7285k04225k04118k73165o9162m8585
7566F13364j24892j1803J02053j0194Q1005L06469n0200m52404l37680O999J40982
7555B63699J70306o091j31626J05085J17074J42001l370l90709j84644O1414K28915
7544C72054J90580m9981j7929N2733J75021R883o7039K31293m7921k34091j88480
7533D26123o2754M3991J5354k2394j9345J0755n5656J12806L6950J13677R2715
7522F92222J82392m3704j89739O5115J66491l2002O389O6941R8983L7446o7826
$$ plain form
7511 982708 969187 1204769 1412379 1152938 852036 857019 992917 844486 550003 266287
7501 266287 190312 346111 587800 678318 759792 691551 426633 238657 284035 518747 608906
7490 608906 541711 634757 739033 698817 563677 440981 458488 554200 584178 511266 465680
7479 465680 443757 366460 347728 312832 323547 324653 261535 232043 248314 199316 8754 -147616
7467 -147616 -4025 284376 303196 303329 581687 801923 700084 612155 671154 647707 615906
7456 615906 557254 427166 248324 294161 220695 238384 293485 120703 -202118 -273060 -168464
7445 -168464 -5124 94564 231579 329861 342754 379667 505189 513071 505315 587178 464095
7434 464095 304134 356861 391137 201166 24220 -84964 -251318 -262220 -272058 -241908 -122330
$$ packed form
7511I82708j3521K35582K07610k59441l00902M983J35898j48431k94483k83716
7501B66287p5975J55799K41689R0518Q1474o8241k64918j87976M5378K34712R0159
7490F08906o7195R3046J04276m0216j35140j22696J7507R5712K9978p2912m5586
7479D65680k1923p7297j8732l4896J0715J106o3118k9492J6271m8998j90562j56370
7467a47616J43591K88401J8820J33K78358K20236j01839q7929N8999k3447l1801
7456F15906n8652j30088j78842M5837p3466J7689N5101j72782l22821p0942J04596
7445a68464J63340R9688J37015R8282J2893L6913J25522P882p756Q1863j23083
7434D64095j59961N2727L4276j89971j76946j09184j66354j0902r838L0150J19578
$$ plain form
7423 -122330 15295 135542 318382 425167 477897 526067 460435 396404 429256 610390 717470
7412 717470 584945 503419 591212 720945 683158 426171 144379 48104 178141 494526
7402 494526 544455 237838 -27762 -58154 146525 391948 647103 814687 696697 498269
7392 498269 389709 494233 395207 190953 42347 135280 425724 550646 439306 484162
7382 484162 674660 512623 554911 677503 770271 743119 560804 507597 500198 351070 497409
7371 497409 917242 1069151 837172 398946 66386 -57997 5152 57157 196279 499784
7361 499784 649686 737390 594288 300555 378830 482076 556172 601374 623933 417119 227288
7350 227288 134891 134349 297588 526844 597065 552550 491100 416204 470475 540536 564850 579065
$$ packed form
7423a22330J37625J20247J82840J06785N2730M8170o5632o4031L2852J81134J07080
7412G17470j32525q1526Q7793J29733l7787k56987k81792r6275J30037L16385
7402D94526M9929l06617k65600l0392K04679K45423K55155J67584j17990j98428
7392D98269j08560J04524r9026k04254j48606R2933K90444J24922j11340M4856
7382D84162J90498j62037M2288J22592R2768k7152j82315n3207p399j49128J46339
7371D97409M19833J51909k31979m38226l32560j24383O3149N2005J39122L03505
7361D99784J49902Q7704j43102k93733P8275J03246P4096M5202K2559k06814j89831
7350B27288r2397n42J63239K29256P0221m4515o1450p4896N4271P0061K4314J4215
$$ plain form
7338 579065 516453 373706 264123 131498 233347 327857 403207 523016 559434 354674
7328 354674 338019 538375 598082 350505 151944 267825 515687 776321 723140 654330
7318 654330 587294 467402 451672 369804 161017 -45035 -110387 -100536 -20970 5849 79690
7307 79690 251562 330012 368834 458270 426850 411800 482202 403448 281019 120809 79514
7296 79514 394787 518505 124509 -268232 -194980 13632 -86382 -287420 -271529 -187012
7286 -187012 -81622 -82435 -182314 -174493 -32295 61301 96911 310686 425980 283321 411527
7275 411527 451781 185846 39253 14567 135837 318872 349424 398122 429925 348931 416451
7264 416451 588828 705580 759355 427324 163416 -48747 -238836 -375614 -221867 -63175
$$ packed form
7338E79065o2612j42747j09583j32625J01849R4510P5350J19809L6418k04760
7328C54674j6655K00356N9707k47577j98561J15881K47862K60634n3181o8810
7318F54330o7036j19892j5730q1868k08787k06052o5352R851P9566K6819P3841
7307G9690J71872P8450L8822Q9436l1420j5050P0402p8754j22429j60210m1295
7296G9514L15273J23718l93996l92741P3252K08612j00014k01038J5891Q4517
7286a87012J05390q13r9879P821J42198R3596L5610K13775J15294j42659J28206
7275D11527M0254k65935j46593k4686J21270J83035L0552M8698L1803q0994O7520
7264D16451J72377J16752N3775l32031k63908k12163j90089j36778J53747J58692
$$ plain form
7254 -63175 -55068 51049 97262 -11271 17362 166059 150847 12539 138126 361274 333819
7243 333819 106095 -11648 88139 113600 7204 80234 262344 118189 103674 350506
7233 350506 576878 720832 812876 798717 722480 635044 775289 826742 746067 777126 656567
7222 656567 324359 52998 -58350 197538 476289 541387 517060 528726 495596 300679
7212 300679 124067 201866 91843 -124286 37472 437853 941948 1011291 797173 562747
7202 562747 391899 337896 229693 122545 6292 -132345 -155973 -167389 -36185 235537
7192 235537 276367 263024 348609 448837 470768 426150 513513 574553 576712 361705 -34273
7181 -34273 -109519 12296 -59989 -83859 126924 425976 485804 286752 84594 127775 276644
$$ packed form
7254f3175Q107J06117M6213j08533K8633J48697j5212j38308J25587K23148k7455
7243C33819k27724j17743R9787K5461j06396P3030J82110j44155j4515K46832
7233C50506K26372J43954R2044j4159p6237q7436J40245N1453q0675L1059j20559
7222F56567l32208k71361j11348K55888K78751O5098k4327J1666l3130j94917
7212C00679j76612P7799j10023k16129J61758M00381N04095O9343k14118k34426
7202E62747j70848n4003j08203j07148j16253j38637k3628j1416J31204K71722
7192B35537M0830j3343Q5585J00228K1931m4618Q7363O1040K159k15007l95978
7181c4273p5246J21815p2285k3870K10783K99052N9828j99052k02158M3181J48869
$$ plain form
7170 276644 274387 158737 45774 37964 -18132 56541 139740 142198 222609 298153 357440 417417
7158 417417 535240 392143 179521 183607 -4153 -68200 56704 153074 81007 -123877 -200742
7147 -200742 -305026 -271283 -33420 183333 147488 65244 21511 36025 140546 204715 279618
7136 279618 105935 -248029 -379841 -385859 -288671 -89497 -7212 56301 183578 260902 150871
7125 150871 -44342 -12265 83215 15845 6239 -57500 -53821 38607 155877 199245 108790 181047
7113 181047 89332 140617 391216 503397 670558 619789 498179 258767 44748 38617 164592
7102 164592 202503 174108 100261 96462 74085 152956 280531 205688 73620 8850 14413 42073
7090 42073 196726 424373 672079 717032 491357 335353 432338 587237 734282 704566
$$ packed form
7170B76644k257j15650j12963p810n6096P4673Q3199K458Q0411P5544N9287N9977
7158D17417J17823j43097k12622M086j87760o4047J24904R6370p2067k04884p6865
7147b00742j04284L3743K37863K16753l5845q2244m3733J4514J04521O4169P4903
7136B79618j73683l53964j31812o018R7188J99174Q2285O3513J27277P7324j10031
7125A50871j95213L2077R5480o7370r606o3739L679R2428J17270M3368r0455P2257
7113A81047r1715N1285K50599J12181J67161n0769j21610k39412k14019o131J25975
7102A64592L7911k8395p3847l799k2377P8871J27575p4843j32068o4770N563K7660
7090D2073J54653K27647K47706M4953k25675j56004R6985J54899J47045k9716
$$ plain form
7080 704566 655752 673062 614026 534744 471473 444767 496164 526939 683166 959195 975835
7069 975835 766309 680691 718472 512992 462941 579313 664732 620631 367725 200549 108436
7058 108436 226457 328372 375421 421814 407660 341974 205316 -58741 -28197 152362 33219
7047 33219 -110461 -9414 64917 -122509 -292310 -367747 -453992 -531910 -561812 -265268 -27052
7036 -27052 -74843 -230322 -252983 -428579 -543509 -278143 -16598 -36880 -151354 -83445 74123
7025 74123 52940 -56595 -128473 -177812 -250358 -284846 -81668 313523 391344 158186 -22863
7014 -22863 -38333 -142636 -144415 28489 -8577 -113475 -232569 -143047 22879 66281 249380
7003 249380 474216 484171 532048 597362 414112 211991 260189 252555 257969 251195 82242 70456
$$ packed form
7080G04566m8814J7310n9036p9282o3271k6706N1397L0775J56227K76029J6640
7069I75835k09526q5618L7781k05480n0051J16372Q5419m4101k52906j67176r2113
7058A08436J18021J01915M7049M6393j4154o5686j36658k64057L0544J80559j19143
7047C3219j43680J01047P4331j87426j69801p5437q6245p7918k9902K96544K38216
7036b7052m7791j55479k2661j75596j14930K65366K61545k0282j14474O7909J57568
7025G4123k1183j09535p1878m9339p2546l4488K03178L95191P7821k33158j81049
7014b2863j5470j04303j779J72904l7066j04898j19094Q9522J65926M3402J83099
7003B49380K24836R955M7877O5314j83250k02121M8198p634N414o774j68953j1786
$$ plain form
6991 70456 152634 279988 232292 -44622 -219112 -112909 191329 536088 717966 821075
6981 821075 889900 735447 619241 439785 229786 13873 145623 277236 269849 318284
6971 318284 320490 276797 306814 218912 82603 13991 27829 -35696 173326 410231 376989
6960 376989 272175 67915 -136288 -366301 -479330 -329276 -136352 -57054 49389 231992
6950 231992 446015 487658 478468 530025 573228 446498 210926 82206 -42369 -11040 71824
6939 71824 112499 15494 -159721 -150048 -81066 2857 18717 -9969 24752 108716 209976 283827
6927 283827 250337 65335 -65949 61096 140647 135026 306879 485785 466350 367178 288130
6916 288130 301894 286231 165119 102684 264287 415227 397623 200449 29552 38386 -76333
$$ packed form
6991G0456Q2178J27354m7696k76914j74490J06203L04238L44759J81878J03109
6981H21075O8825j54453j16206j79456k09999k15913J31750J31613p387M8435
6971C18284K206m3693L0017q7902j36309o8612J3838o3525K09022K36905l3242
6960C76989j04814k04260k04203k30013j13029J50054J92924P9298J06443J82603
6950B31992K14023M1643r190N1557M3203j26730k35572j28720j24575L1329Q2864
6939G1824M0675r7005j75215R673O8982Q3923J5860k8686L4721Q3964J01260P3851
6927B83827l3490j85002j31284J27045P9551n621J71853J78906j9435r9172p9048
6916B88130J3764j5663j21112o2435J61603J50940j7604j97174j70897Q834j14719
$$ plain form
6905 -76333 -122645 11743 -85147 -205588 38617 109567 -59303 -137794 -234797 -240548 -14881
6894 -14881 37968 59906 -78403 -88779 26352 170604 155433 36143 -93622 -196538 -327516
6883 -327516 -343730 -176104 -7542 244082 346047 456253 556983 591465 598300 585618 333303
6872 333303 226159 204622 77539 -34875 28786 211202 151146 50967 315546 620507
6862 620507 486661 261857 285082 318186 105572 -94467 -112007 -18809 177344 111373 78500
6851 78500 230117 389589 479063 537446 569177 480261 350212 373312 391702 520597 581307
6840 581307 425068 371593 598465 820630 775921 728911 712065 681810 798450 649362 316223
6829 316223 124200 104552 88498 105863 171185 83738 -131449 -320545 -394518 -347315 -273766
$$ packed form
6905g6333m6312J34388r6890j20441K44205P0950j68870p8491r7003n751K25667
6894a4881N2849K1938j38309j0376J15131J44252j5171j19290j29765j02916j30978
6883c27516j6214J67626J68562K51624J01965J10206J00730L4482O835j2682k52315
6872C33303j07144k1537j27083j12414O3661J82416o0056j00179K64579L04961
6862F20507j33846k24804K3225L3104k12614k00039j7540R3198J96153o5971l2873
6851G8500J51617J59472Q9474N8383L1731q8916j30049K3100J8390J28895O0710
6840E81307j56239n3475K26872K22165m4709m7010j6846l0255J16640j49088l33139
6829C16223j92023j9648j6054J7365O5322q7447k15187j89096p3973M7203P3549
$$ plain form
6818 -273766 -233263 -425459 -617205 -580136 -472174 -537132 -648181 -467205 -320001 -153319
6808 -153319 -117857 -152242 -254604 -317139 -344308 -389586 -268972 -209491 -312867 -298959 -109548
6797 -109548 56376 176873 272105 314187 500063 644681 613907 495817 438082 405657 335153
6786 335153 337223 267729 74491 -152728 -407185 -517985 -391507 -226414 -34759 40548
6776 40548 -170413 -325021 -252814 -139434 19614 301676 327361 87779 -55242 -65606
6766 -65606 -214654 -517801 -459164 -98473 66375 111141 22523 -68438 -165015 -115205 -170354
6755 -170354 -222935 -45351 175043 321262 319865 205957 138408 6256 28992 107940 -66652
6744 -66652 -224870 -335666 -360619 -409550 -341113 -144023 -112504 -150809 -31628 88490 53395
$$ packed form
6818b73766M0503j92196j91746L7069J07962o4958j11049J80976J47204J66682
6808a53319L5462l4385j02362o2535k7169m5278J20614N9481j03376J3908J89411
6797a09548J65924J20497R5232M2082J85876J44618l0774j18090n7735l2425p0504
6786C35153K070o9494j93238k27219k54457j10800J26478J65093J91655P5307
6776D0548k10961j54608P2207J13380J59048K82062K5685k39582j43021j0364
6766f5606j49048l03147N8637L60691J64848M4766q8618r0961r6577M9810n5149
6755a70354n2581J77584K20394J46219j397j13908o7549j32152K2736P8948j74592
6744f6652j58218j10796k4953m8931O8437J97090L1519l8305J19181J20118l5095
$$ plain form
6733 53395 58272 154806 453655 411703 218668 134593 21283 -1897 57158 238120 365650
6722 365650 264129 30384 53984 163917 320761 396416 222573 135710 115568 -55953
6712 -55953 -248225 -230698 -239226 -55060 35738 -190685 -203995 -179537 -94868 -22204 31533
6701 31533 113014 161453 122115 -29093 -87779 176225 368360 395446 356066 331397 353526
6690 353526 318926 127487 137134 165691 335185 522783 578671 524743 412304 271644 139581
6679 139581 252796 194089 55462 165441 293000 432047 446035 335200 286587 236055
6669 236055 269391 398359 531601 538621 456553 323918 314204 429790 408460 291262 133623
6658 133623 4587 61 115325 -196627 -357425 -298438 -254410 -128178 -84099 -31024 -72519
$$ packed form
6733E3395M877R6534K98849m1952j93035q4075j13310k3180N9055J80962J27530
6722C65650j01521k33745K3600J09933J56844P5655j73843q6863k0142j71521
6712e5953j92272J7527q528J84166R0798k26423j3310K4458Q4669P2664N3737
6701C1533Q1481M8439l9338j51208n8686K64004J92135K7086l9380k4669K2129
6690C53526l4600j91439R647K8557J69494J87598N5888n3928j12439j40660j32063
6679A39581J13215n8707j38627J09979J27559J39047J3988j10835m8613n0532
6669B36055L3336J28968J33242P020q2068j32635r714J15586k1330j17198j57639
6658A33623j29036m526J15264l11952j60798N8987M4028J26232M4079N3075m1495
$$ plain form
6647 -72519 -193635 -212905 -237794 -225369 -75173 78166 -82015 -302280 -481529 -604423
6637 -604423 -544224 -480017 -411379 -327093 -376739 -478133 -466255 -367924 -267007 -258193 -347723
6626 -347723 -319373 -292803 -359157 -184707 -20891 -185590 -374737 -364626 -291934 -153358 89207
6615 89207 70385 -99267 -127930 18917 123295 72813 -54496 -82504 189512 454241 430080
6604 430080 123657 -253007 -331291 -287443 -256495 -100606 67389 160290 194000 246663 164839
6593 164839 -108835 -373338 -624720 -588489 -462730 -459322 -343553 -4824 215443 308729
6583 308729 408389 356284 258019 147147 149149 37590 -147826 -92401 -85814 -138799 -201363
6572 -201363 -189388 48636 81615 -16836 1215 149483 385791 328444 129045 38009 -125205
$$ packed form
6647g2519j21116j9270k4889J2425J50196J53339j60181k20265j79249j22894
6637f04423O0199O4207O8638Q4286m9646j01394J1878R8331J00917Q814q9530
6626c47723K8350K6570o6354J74450J63816j64699j89147J0111P2692J38576K42565
6615H9207j8822j69652k8663J46847J04378n0482j27309k8008K72016K64729k4161
6604D30080l06423l76664p8284M3848L0948J55889J67995R2901L3710N2663q1824
6593A64839k73674k64503k51382L6231J25759L408J15769L38729K20267R3286
6583C08729R9660n2105r8265j10872K002j11559j85416N5425O587n2985o2564
6572b01363J1975K38024L2979r8451J8051J48268K36308n7347j99399r1036j63214
$$ plain form
6561 -125205 -266707 -158206 152530 255118 224199 278947 373251 221542 158952 101207 -174622
6550 -174622 -358557 -455940 -361464 -260554 -248572 -339996 -344585 -140207 100524 164297 54268
6539 54268 -174289 -446825 -510510 -415431 -322263 -278496 -240105 -196781 -142464 -105977 -82138
6528 -82138 -102795 -96847 -113165 36484 184801 284258 192383 213827 271489 198367 98026
6517 98026 13394 -79097 -225720 -206044 -745 -57852 -191595 -159382 -215266 -284799 -285889
6506 -285889 -131926 143411 241132 324173 287767 130341 22610 85095 85162 47553 78852
6495 78852 182577 205573 81609 -149365 -259741 -207760 11821 243780 438177 629886
6485 629886 496922 360338 317517 243541 224564 187591 276014 475199 562161 482465 232311
$$ packed form
6561a25205j41502J08501L10736J02588l0919N4748R4304j51709o2590n7745k75829
6550a74622j83935r7383R4476J00910J1982r1424m589K04378K40731O3773j10029
6539E4268k28557k72536o3685R5079R3168M3767L8391M3324N4317L6487K3839
6528h2138k0657N948j6318J49649J48317R9457r1875K1444N7662p3122j00341
6517I8026q4632r2491j46623J9676K05299n7107j33743L2213n5884o9533j090
6506b85889J53963K75337R7721Q3041l6406j57426j07731O2485O7l7609L1299
6495G8852J03725K2996j23964k30974j10376N1981K19581K31959J94397J91709
6485F29886j32964j36584m2821p3976j8977l6973Q8423J99185Q6962p9696k50154
$$ plain form
6474 232311 16497 -25523 43696 97610 50100 11377 -189971 -335919 -367637 -88107 109456
6463 109456 -96335 -239922 -268294 -476365 -583516 -378622 -164105 12668 114394 -31125
6453 -31125 -108370 34319 120441 129480 -29289 -136412 219151 435857 237088 -48592 -333873
6442 -333873 -381303 -368988 -316534 -282037 -184284 116426 231100 224376 369956 378547 359419
6431 359419 479993 645844 717727 684072 555218 204370 -108694 -153218 -100196 -202579
6421 -202579 -482438 -525324 -535450 -567573 -432321 -152267 66680 124774 152560 85558 -112163
6410 -112163 -427853 -501976 -297035 -38474 195445 199166 30444 -171042 -129029 -89145 -4091
6399 -4091 8467 180017 159289 -79907 -141558 -9548 136712 222305 172056 89175 -86402
$$ packed form
6474B32311k15814m2020O9219N3914m7510l8723k01348j45948l1718K79530J97563
6463A09456k05791j43587k8372k08071j07151K04894K14517J76773J01726j45519
6453c1125p7245J42689Q6122R039j58769j07123L55563K16706j98769k85680k85281
6442c33873m7430J2315N2454L4497R7753L00710J14674o724J45580Q591j9128
6431C59419J20574J65851P1883l3655j28854l50848l13064m4524N3022j02383
6421b02579k79859m2886j0126l2123J35252K80054K18947N8094K7786o7002j97721
6410a12163l15690p4123K04941K58561K33919L721j68722k01486M2013L9884Q5054
6399d091J2558J71550k0728k39196o1651J32010J46260Q5593n0249q2881j75577
$$ plain form
6388 -86402 -166288 -230140 -447346 -530669 -504407 -509272 -349435 -234767 -303267 -273184 -197823
6377 -197823 -287382 -177972 114076 353123 503549 370385 141299 207935 321945 291528
6367 291528 241627 58639 37241 63413 69911 128292 64246 3652 -72100 -349516 -479175
6356 -479175 -414864 -442843 -337146 -301970 -233612 -165339 -165610 -159504 12346 246004 307541 106100
6344 106100 -15756 7903 -87707 -317431 -461892 -388949 -384355 -233410 -97552 73298 133085
6333 133085 2656 -83679 -82358 -58389 -26947 88092 127763 121839 114611 -56476 -14142 61158
6321 61158 105751 140007 127489 251946 406694 391977 464285 379796 232881 319347 474037
6310 474037 401989 291100 301366 396847 195955 -124168 -252535 -244097 -132092 -120364 -164920
$$ packed form
6388h6402p9886o3852k17206q3323K6262m865J59837J14668o8500L0083P5361
6377a97823q9559J09410K92048K39047J50426j33164k29086O6636J14010l0417
6367B91528m9901j82988k1398K6172O498N8381o4046o0594p5752k77416j29659
6356d79175O4311k7979J05697L5176O8358O8273k71O106J71850K33658O1537k01441
6344A06100j21856K3659r5610k29724j44461P2943M594J50945J35858J70850N9787
6333A33085j30429q6335J321K3969L1442J15039L9671n924p228j71087M2334P5300
6321F1158M4593L4256j2518J24457J54748j4717P2308q4489j46915Q6466J54690
6310D74037p2048j10889J0266R5481k00892l20123j28367Q438J12005J1728m4556
$$ plain form
6299 -164920 -51446 23845 -8636 -75922 -59144 63044 130660 -13599 -73523 92708 145050
6288 145050 244032 254867 226300 227031 92453 6014 39257 83695 328952 510104 477280
6277 477280 255278 58032 -42356 -135708 5998 65254 -107265 -336425 -382735 -294806
6267 -294806 -193225 -38644 209595 146827 -122021 -313321 -327621 -122258 -66072 -21720
6257 -21720 160242 409142 488377 406864 306676 122613 -25563 -80169 -8131 57395 43195
6246 43195 -99039 -329886 -484369 -144955 244065 222752 46564 35993 87078 47207 62690
6235 62690 242698 258126 82883 -34391 -172423 -190904 -196024 -111343 -109415 -81916 56444
6224 56444 341396 742634 814909 479226 52755 -225195 -186678 -98984 -44950 -104533 -179415
$$ packed form
6299a64920J13474P5291l2481o7286J6778J22188O7616j44259n9924J66231N2342
6288A45050R8982J0835k8567P31j34578q6439L3243M4438K45257J81152l2824
6277D77280k22002j97246j00388r3352J41706N9256j72519k29160m6310Q7929
6267b94806J01581J54581K48239o2768k68848j91300j4300K05363N6186M4352
6257b1720J81962K48900P9235q1513j00188j84063j48176n4606P2038O5526j4200
6246D3195j42234k30847j54483L39414L89020k1313j76188j0571N1085l9871J5483
6235F2690J80008J5428j75243j17274j38032j8481n120Q4681J928K7499J38360
6224E6444K84952M01238P2275l35683m26471k77950L8517Q7694N4034n9583p4882
$$ plain form
6213 -179415 -168910 -109688 -11953 -75506 -131266 -105606 -165517 -268885 -243108 -194840 -185841 -65175
6201 -65175 -77036 -137412 100177 219025 124154 20100 -50296 -92982 -269579 -351655 -99323
6190 -99323 197089 308857 269533 5792 -222874 -136811 -93388 -74424 -84321 -2713 24304
6179 24304 60757 101015 -16577 -165708 -233119 -198377 -255659 -156344 -17936 -112895 -236584
6168 -236584 -118268 23379 87322 -44808 -176985 -167219 -232387 -227316 -200139 -170782 -189968
6157 -189968 -222999 -171594 -248598 -496099 -466196 -393389 -392832 -504527 -520296 -417302 -244936
6146 -244936 126219 228135 146835 202418 270493 245230 149168 -89586 -137979 -184622 -121230
6135 -121230 62091 205766 296119 289398 240353 228781 215591 251630 202111 55392 70880
$$ packed form
6213a79415J0505N9222R7735o3553n5760K5660n9911j03368K5777M8268Q999J20666
6201f5175j1861o0376K37589J18848r4871j04054p0396m2686j76597q2076K52332
6190i9323K96412J11768l9324k63741k28666Q6063M3423J8964r897Q1608K7017
6179B4304L6453M0258j17592j49131o7411L4742n7282R9315J38408r4959j23689
6168b36584J18316J41647O3943j32130j32177R766o5168N071K7177K9357j9186
6157a89968l3031N1405p7004k47501K9903P2807N57j11695j5769J02994J72366
6146b44936L71155J01916q1300N5583O8075k5263r6062k38754m8393m6643O3392
6135a21230J83321J43675R0353o721m9045j1572j3190L6039m9519j46719J5488
$$ plain form
6124 70880 308639 431812 431630 497352 531621 561892 634857 756171 877523 1014627 1224112
6113 1224112 1428183 1695994 1983458 2572523 3314201 4264829 5575726 7283628 9309071
6104 9309071 11409076 12525399 11802319 9760427 7666251 5970269 4580175 3541159
6096 3541159 2870193 2592663 2329974 1878756 1385702 1134514 1012817 681969 367243 227893
6086 227893 350364 588580 675829 556564 570876 500747 303775 44944 -225496 -248931
6076 -248931 -12269 247152 378481 346212 413937 390800 258476 241583 309407 454518 491383
6065 491383 359109 409744 550824 541787 532892 464827 611408 898118 976724 876596 727690
6054 727690 374522 241928 312955 172126 -42811 -72900 -78755 -140844 -119296 41769 135017
$$ packed form
6124G0880K37759J23173j82O5722L4269L0271P2965J21314J21352J37104K09485
6113A224112K04071K67811K87464N89065P41678R50628J310897J707902K025443
6104I309071K100005J116323p23080k041892k094176j695982j390094j039016
6096C541159o70966k77530k62689m51218m93054k51188j21697l30848l14726j39350
6086B27893J22471K38216Q7249j19265J4312p0129j96972k58831k70440k3435
6076b48931K36662K59421J31329l2269O7725k3137j32324j6893O7824J45111L6865
6065D91383j32274N0635J41080r037q895o8065J46581K86710P8606j00128j48906
6054G27690l53168j32594P1027j40829k14937l0089n855o2089K1548J61065R3248
$$ plain form
6043 135017 185612 377985 604173 694484 678005 482620 284152 157263 -95010 -223264
6033 -223264 -168267 -185954 -58975 119115 260422 417302 586327 683183 666553 720922 850217
6022 850217 825409 792988 775648 858955 847361 669147 317755 5940 -65549 112921 333086
6011 333086 436456 504491 574475 678333 699960 575740 319277 45720 -16147 64001 30542
6000 30542 -53472 4827 -83858 -243431 -416520 -480539 -413789 -297512 -66232 180214 98444
5989 98444 -175089 -272522 -322281 -248859 -220648 -220624 -91395 32763 172860 275996 390167
5978 390167 586298 679736 557085 426107 354056 283323 189148 181589 140751 175666 179851
5967 179851 54880 -55626 -226740 -221816 -201558 -262843 -272986 -223147 -197154 -212824 -245722
$$ packed form
6043A35017N0595J92373K26188R0311j6479j95385j98468j26889k52273j28254
6033b23264N4997j7687J26979J78090J41307J56880J69025R6856j6630N4369J29295
6022H50217k4808l2421j7340Q3307j1594j78214l51392l11815p1489J78470K20165
6011C33086J03370O8035O9984J03858K1627j24220k56463k73557o1867Q0148l3459
6000C0542q4014N8299q8685j59573j73089o4019O6750J16277K31280K46446q1770
5989I8444k73533r7433m9759P3422K8211K4J29229J24158J40097J03136J14171
5978C90167J96131R3438j22651j30978p2051p0733r4175p559m0838L4915M185
5967A79851j24971j10506j71114M924K0258o1285j0143M9839K5993j5670l2898
$$ plain form
5956 -245722 -82128 190262 238691 138639 85730 -131217 -360800 -511481 -463485 -210146
5946 -210146 738 60817 53851 207391 295803 136953 73164 72130 20081 230902 358633
5935 358633 265262 250750 376648 419812 380434 401990 432477 502407 343793 180149 311805
5924 311805 469031 533037 482769 301270 198180 127970 60986 47998 79561 282207 442401
5913 442401 526389 424491 229393 194940 233472 56244 -155332 10514 103983 178876 75183
5902 75183 -39472 -125703 -150621 -16293 255414 541244 617470 577879 571536 523302 357873
5891 357873 360545 217648 22257 19332 174892 162765 43290 -185552 -337705 -439356 -342438
5880 -342438 -46053 -106368 -303280 -302247 -454750 -626086 -456670 -285778 -67349 72857
$$ packed form
5956b45722J63594K72390M8429j00052n2909k16947k29583j50681M7996K53339
5946b10146K10884O0079o966J53540Q8412j58850o3789j034n2049K10821J27731
5935C58633r3371j4512J25898M3164l9378K1556L0487O9930j58614j63644J31656
5924C11805J57226O4006n0268j81499j03090p0210o6984j2988L1563K02646J60194
5913D42401Q3988j01898j95098l4453L8532j77228k11576J65846R3469P4893j03693
5902G5183j14655q6231k4918J34328K71707K85830P6226l9591o343m8234j65429
5891C57873K672j42897j95391k925J55560j2127j19475k28842j52153j01651R6918
5880c42438K96385o0315j96912J033j52503j71336J69416J70892K18429J40206
$$ plain form
5870 72857 41600 -38654 -63323 -34934 30860 118204 71481 53017 135269 252138 385170
5859 385170 386563 247633 54668 -108529 15492 179740 166820 -112409 -407224 -427179
5849 -427179 -470319 -559810 -525945 -406279 -414849 -442323 -583988 -553442 -245860 3960 64074
5838 64074 -81003 -217344 -263300 -196154 -89669 45870 64266 -53742 -113543 -52015 81608
5827 81608 116654 102709 147089 -51364 -280805 -271319 -192666 90614 404717 282992 49657
5816 49657 -108264 -73813 79611 35970 -60273 7036 72089 156960 175982 153279 -73902
5805 -73902 -209474 -224776 -25811 394382 766423 760310 395333 214443 54959 27879 220215
5794 220215 404238 506620 555439 740512 928583 1062080 1414920 2015358 2723190 3536626
$$ packed form
5870G2857l1257q0254k4669K8389O5794Q7344m6723j8464Q2252J16869J33032
5859C85170J393j38930j92965j63197J24021J64248j2920k79229k94815j9955
5849d27179m3140q9491L3865J19666q570k7474j41665L0546L07582K49820O0114
5838F4074j45077j36341m5956O7146J06485J35539J8396j18008n9801O1528J33623
5827H1608L5046j3945M4380j98453k29441R486P8653K83280L14103j21725k33335
5816D9657j57921L4451J53424m3641r6243O7309O5053Q4871J9022k2703k27181
5805g3902j35572j5302J98965M20193L72041o113l64977j80890j59484k7080J92336
5794B20215J84023J02382M8819J85073J88071J33497L52840O00438P07832Q13436
$$ plain form
5784 3536626 4891833 6803419 9465712 12934269 15969100 15852911 12800795 9578707
5776 9578707 7022924 5372848 4093949 2848521 2128981 1922144 1841054 1765554 1623955
5767 1623955 1588710 1446435 1162501 979823 733983 595544 534893 392039 259943 323532
5757 323532 227677 110248 111665 77157 73779 235605 347300 257969 77700 115846 256398
5746 256398 99893 -30189 -4401 12339 45383 141038 228128 153821 146495 35810 52959
5735 52959 201853 402500 533109 404170 191331 91650 -90945 -265780 -163862 -26621
5725 -26621 42353 34285 -79892 -80791 -30681 -45487 -103504 -263495 -352523 -327335 -118026 60670
5713 60670 243653 397821 410907 329841 78797 -146076 -247616 -89728 57333 -108841
$$ packed form
5784C536626J355207J911586K662293L468557L034831j16189l052116l222088
5776I578707k555783j650076j278899j245428p19540k06837q1090p5500j41599
5767A623955l5245j42275k83934j82678k45840j38439o0651j42854j32096O3589
5757C23532r5855j17429J417l4508l378J61826J11695q9331j80269L8146J40552
5746B56398j56505j30082K5788J6740L3044R5655Q7090p4307p326j10685J7149
5735E2959J48894K00647J30609j28939k12839r9681j82595j74835J01918J37241
5725b6621O8974q068j14177q99N0110j4806n8017j59991q9028K5188K09309J78696
5713F0670J82983J54168J3086q1066k51044k24873j01540J57888J47061j66174
$$ plain form
5703 -108841 -222972 -310590 -297134 -106100 -57843 -209938 -520274 -649271 -446541 -121534
5693 -121534 32611 42187 -59112 -2168 154836 179656 22437 -124920 -58723 115541 144120
5682 144120 129828 218704 250530 313182 221656 -53154 -312634 -330943 -255170 -164528 -132691
5671 -132691 -177773 -259141 -495554 -494017 -315758 -288214 -341259 -446658 -490877 -610301 -654469
5660 -654469 -417108 -109006 -14846 2710 191168 386045 250489 -61188 -337766 -528937
5650 -528937 -511639 -417978 -352036 -270563 -134577 26406 -1429 -179146 -161622 -138690 -75894
5639 -75894 154327 110042 95151 55682 -37130 -79215 -65797 -112879 -224969 -180139 -132974
5628 -132974 -181631 -251254 -265207 -181590 -29105 151949 144159 -89728 -281334 -336983 -259839
$$ packed form
5703a08841j14131q7618J3456J91034M8257j52095l10336j28997K02730L25007
5693a21534J54145R576j01299N6944J57004K4820j57219j47357O6197J74264K8579
5682A44120j4292Q8876L1826O2652r1526k74810k59480j8309P5773R0642L1837
5671a32691m5082q1368k36413J537J78259K7544n3045j05399m4219j19424m4168
5660f54469K37361L08102R4160J7556J88458J94877j35556l11677k76578j91171
5650e28937J7298R3661O5942Q1473J35986J60983k7835j77717J7524K2932O2796
5639g5894K30221m4285j4891l9469r2812m2085J3418m7082j12090M4830M7165
5628a32974m8657o9623j3953Q3617J52485J81054p790k33887j91606n5649P7144
$$ plain form
5617 -259839 -58043 207728 325317 369897 424907 354217 499378 626568 422882 175525
5607 175525 5231 50111 113905 -19844 -233704 -323391 -334837 -440999 -564789 -552337 -468831
5596 -468831 -493683 -336481 -246528 -336265 -276258 -157075 -25302 8581 -33312 -121436 -198219
5585 -198219 -390659 -532952 -376708 -249592 -118061 26264 217873 326203 126699 -61431
5575 -61431 -169123 -172413 -13014 87141 238923 427683 408650 144644 -141594 -252235
5565 -252235 -160002 73844 5814 -197971 -464983 -344782 27427 282154 326464 203696
5555 203696 -73976 -224752 -4618 80476 -60486 53397 237771 253504 113772 110512
5545 110512 50287 -176192 -263183 -55273 57061 67009 273291 462873 491189 569996 472487
$$ packed form
5617b59839K01796K65771J17589M4580N5010p0690J45161J27190k03686k47357
5607A75525j70294M4880O3794j33749k13860q9687j1446j06162j23790J2452Q3506
5596d68831k4852J57202Q9953q9737O0007J19183J31773L3883m1893q8124p6783
5585a98219j92440j42293J56244J27116J31531J44325J91609J08330j99504j88130
5575f1431j07692l290J59399J00155J51782J88760j9033k64006k86238j10641
5565b52235R2233K33846o8030k03785k67012J20201L72209K54727M4310j22768
5555B03696k77672j50776K20134Q5094j40962J13883J84374J5733j39732l260
5545A10512o0225k26479q6991K07910J12334R948K06282J89582K8316P8807r7509
$$ plain form
5534 472487 232183 67646 117485 258782 195017 -11020 -179143 -150724 21762 81886
5524 81886 280939 551982 494611 302770 155466 167222 9792 -291095 -315272 -215821 -182727
5513 -182727 -84013 59699 25844 -278640 -375429 -169425 -123155 -191961 -92882 127237 92911
5502 92911 -39861 -120988 -244932 -162720 -58895 -71795 155338 387948 424885 450362 420452
5491 420452 280845 -52798 -362598 -440347 -455966 -417493 -193239 9303 -136698 -143565 -220994
5480 -220994 -484425 -627757 -595880 -423428 -430066 -402778 -252093 -80377 -112400 -312747 -528189
5469 -528189 -546701 -418749 -171086 182689 414102 318048 48966 -128531 -189826 -245855
5459 -245855 -296891 -300382 -101077 70090 210721 243429 182039 7948 -158073 -111934 -54810
$$ packed form
5534D72487k40304j64537M9839J41297o3765k06037j68123K8419J72486O0124
5524H1886J99053K71043n7371j91841j47304J1756j57430l00887k4177R9451L3094
5513a82727R8714J43712l3855l04484r6789K06004M6270o8806R9079K20119l4326
5502I2911j32772q1127j23944Q2212J03825j2900K27133K32610L6937K5477k9910
5491D20452j39607l33643l09800p7749j5619L8473K24254K02542j46001o867p7429
5480b20994k63431j43332L1877J72452o638K7288J50685J71716l2023k00347k15442
5469e28189j8512J27952K47663L53775K31413r6054k69082j77497o1295n6029
5459b45855n1036l491J99305J71167J40631L2708o1390j74091j66021M6139N7124
$$ plain form
5448 -54810 -62081 -17805 -37452 -47358 -119844 -188418 -150758 36039 128204 72609 111395 345098
5436 345098 532151 537927 360309 111829 -115546 -181562 -69793 -98358 -234427 -189787 -59040
5425 -59040 90249 71601 -674 -177804 -439535 -507089 -460885 -410321 -383033 -418026 -408326
5414 -408326 -168238 160709 236756 129586 -11247 -205757 -121099 158033 232685 213874
5404 213874 5178 -206222 -284056 -236101 -157398 -53509 113208 77043 -9322 -91112 -108644
5393 -108644 -78392 -160862 -95598 -84816 -30604 85509 76872 -4739 -23490 -52007 -229845
5382 -229845 -241433 -212757 -114504 78495 211860 55514 -69230 -31929 -165097 -261684 -295554
5371 -295554 -257029 -227518 -96020 74696 57304 -198311 -474178 -410309 -97215 158816
$$ packed form
5448e4810p271M4276j9647r906p2486o8574L7660J86797R2165n5595L8786K33703
5436C45098J87053N776j77618k48480k27375o6016J11769k8565j36069M4640J30747
5425e9040J49289j8648p2275j77130k61731o7554M6204N0564K7288l4993R700
5414d08326K40088L28947P6047j07170j40833j94510Q4658K79132P4652j8811
5404B13874k08696k11400p7834M7955P8703J03889J66717l6165q6365q1790j7532
5393a08644L0252q2470O5264J0782N4212J16113q637q1611j8751k8517j77838
5382b29845j1588K8676R8253J92999J33365j56346j24744L7301j33168r6587l3870
5371b95554L8525K9511J31498J70716j7392k55615k75867O3869L13094K56031
$$ plain form
5361 158816 158389 171325 112482 -108145 -124988 35036 147196 242442 306611 390393 444560
5350 444560 347367 270200 469700 799451 1058923 982815 769388 590238 298162 97395
5340 97395 -54856 70343 114690 16051 170948 294603 434762 250090 87023 350577
5330 350577 558987 530501 447317 526383 640629 442022 166243 183180 345734 190860
5320 190860 -11419 18513 -45421 -304701 -517154 -735121 -688330 -341577 34714 72162
5310 72162 -145270 -202611 -101365 -37442 -82705 -134714 -70243 -48852 36808 71174 -26330
5299 -26330 -125826 -70184 -38083 1830 86999 24346 40281 -21474 -57428 123677 206742 19434
5287 19434 -77707 -46000 24040 -220037 -475696 -593195 -604974 -513457 -326625 -184561 21504
$$ packed form
5361A58816m27J2936n8843k20627j6843J60024J12160R5246O4169Q3782N4167
5350D44560r7193p7167J99500L29751K59472p6108k13427j79150k92076k00767
5340I7395j52251J25199M4347r8639J54897J23655J40159j84672j63067K63554
5330C50577K08410k8486q3184P9066J14246j98607k75779J6937J62554j54874
5320A90860k02279K9932o3934k59280k12453k17967M6791L46753L76291L7448
5310G2162k17432n7341J01246O3923m5263n2009O4471K1391Q5660L4366r7504
5299b6330r9496N5642L2101L9913Q5169o2653J5935o1755l5954J81105Q3065j87308
5287A9434r7141L1707P0040k44077k55659j17499j1779R1517J86832J42064K06065
$$ plain form
5276 21504 131382 -23503 -156432 -264713 -334480 -268307 -117366 -112414 -167498 -201828 -160620
5265 -160620 -132050 -231962 -412571 -531279 -219361 61328 72919 5071 -146966 -246549 -81539
5254 -81539 189175 165026 103343 50034 -92090 -190596 -54640 67459 -25503 -43718 137151
5243 137151 344235 324721 94991 6933 2060 84798 149527 -10651 -87608 -83920 -76528 38303
5231 38303 236332 432544 561766 485245 247745 41083 66633 270611 180270 -54194
5221 -54194 -26922 139492 43481 -4966 82680 92157 24241 -137632 -440564 -542068 -416957
5210 -416957 -377789 -433608 -429421 -296713 -187616 -88653 -154962 -267616 -179953 37799 110105
5199 110105 -8908 -244851 -311904 -190870 -179648 30272 93326 -211477 -288242 -125758
$$ packed form
5276B1504J09878j54885j32929j08281o9767O6173J50941M952n5084l4330M1208
5265a60620K8570r9912j80609j18708L11918K80689J1591o7848j52037r9583J65010
5254h1539K70714k4149o1683n3309j42124r8506J35956J22099r2962j8215J80869
5243A37151K07084j9514k29730q8058m873Q2738O4729j60178p6957L688P392J14831
5231C8303J98029J96212J29222p6521k37500k06662K5550K03978r0341k34464
5221e4194K7272J66414r6011m8447Q7646R477o7916j61873l02932j01504J25111
5210d16957L9168n5819M187J32708J09097R8963o6309j12654Q7663K17752P2306
5199A10105j19013k35943o7053J21034J1222K09920O3054l04803p6765J62484
$$ plain form
5189 -125758 16663 -113642 -320297 -121837 141242 427377 610838 587617 566842 545206
5179 545206 424905 356465 188100 -20015 -155856 -90137 86378 202274 188130 -53113
5169 -53113 -179168 -34491 56783 54447 47549 -158232 -367907 -344972 -188511 -77736 -146193
5158 -146193 -270052 -380605 -311449 -234980 -377404 -446561 -398792 -210216 -80850 -62261 -20253
5147 -20253 74942 163335 125444 -42715 20086 57912 -211983 -371391 -133019 99387 250021
5136 250021 234880 34785 2926 56641 234061 384337 402909 301356 227549 97052 -203451
5125 -203451 -339272 -456396 -561398 -531656 -349408 -289822 -358145 -379567 -370525 -451854 -268106
5114 -268106 -127761 -169762 -236275 -188648 -36746 14541 -98582 -100264 -9688 -4149 99737
$$ packed form
5189a25758J42421j30305k06655J98460K63079K86135J83461k3221k0775k1636
5179E45206j20301o8440j68365k08115j35841O5719J76515J15896j4144k41243
5169e3113j26055J44677R1274k336o898k05781k09675K2935J56461J10775o8457
5158a46193j23859j10553O9156P6469j42424o9157M7769J88576J29366J8589M2008
5147b0253R5195Q8393l7891j68159O2801L7826k69895j59408K38372K32406J50634
5136B50021j5141k00095l1859N3715J77420J50276J8572j01553p3807j30497l00503
5125b03451j35821j17124j05002K9742J82248N9586o8323k1422R042q1329J83748
5114b68106J40345m2001o6513M7627J51902N1287j13123j682R0576N539J03886
$$ plain form
5103 99737 120021 -77700 -169495 -47296 164550 381918 506527 580711 705700 724840 402376
5092 402376 121375 246137 410714 285475 122053 4840 -73130 47185 150478 106765
5082 106765 2640 50641 -57051 -197203 -168657 -238309 -239241 -173177 -129512 -233078 -371121
5071 -371121 -182608 47166 14796 -92128 19890 98665 124690 127940 10404 3180 26346
5060 26346 227118 393728 259163 61477 22409 -72880 110954 -557 -226970 -197821
5050 -197821 -204871 -281529 -213465 -142789 -179824 23121 206162 124633 69551 -21815 -224166
5039 -224166 -419188 -376701 -253968 -422366 -549728 -476580 -418159 -442910 -414004 -375011 -243163
5028 -243163 -161343 -208712 -222478 -196066 -44022 213728 403094 303122 86727 81406 132195
$$ packed form
5103I9737K0284j97721r1795J22199K11846K17368J24609P4184J24989J9140l22464
5092D02376k81001J24762J64577j25239j63422j17213p7970J20315J03293m3713
5082A06765j04125M8001j07692j40152K8546o9652r32O6064M3665j03566j38043
5071c71121J88513K29774l2370j06924J12018P8775K6025L250j17536p224K3166
5060B6346K00772J66610j34565j97686l9068r5289J83834j11511k26413K9149
5050a97821p050p6658O8064P0676l7035K02945J83041q1529n5082r1366k02351
5039b24166j95022M2487J22733j68398j27362P3148N8421k4751K8906L8993J31848
5028b43163Q1820m7369j3766K6412J52044K57750J89366r9972k16395n321N0789
$$ plain form
5017 132195 -23930 -127828 -64295 144526 230274 165590 -103518 -355561 -344834 -238582
5007 -238582 -95150 -144126 -359110 -471537 -430114 -322332 -207736 -320047 -473992 -592104
4997 -592104 -686855 -635628 -455941 -219804 -56934 -54049 -199194 -373192 -458557 -112264 149000
4986 149000 218564 315730 267759 44426 -217841 -403972 -463807 -336885 -71713 -32090 -33941
4975 -33941 -104800 -196179 -68476 234391 444142 369715 194498 233676 331796 76668 -21468
4964 -21468 44092 181029 197060 111697 255318 324829 311296 457485 599703 639731 468475
4953 468475 91434 -128657 -243620 -247192 -225453 -289047 -250401 -155769 -1627 51411 134975
4942 134975 70154 -146099 -147972 -205605 -465670 -801948 -847734 -867461 -933613 -886267 -652730
$$ packed form
5017A32195j56125j03898O3533K08821Q5748o4684k69108k52043J0727J06252
5007b38582J43432m8976k14984j12427M1423J07782J14596j12311j53945j18112
4997e92104r4751N1227J79687K36137J62870K885j45145j73998q5365L46293K61264
4986A49000O9564R7166m7971k23333k62267j86131n9835J26922K65172L9623j851
4975c3941p0859r1379J27703L02867K09751p4427j75217L9178R8120k55128r8136
4964b1468O5560J36937J6031q5363J43621O9511j3533J46189J42218M0028j71256
4953D68475l77041k20091j14963l572K1739o3594L8646R4632J54142N3038Q3564
4942A34975o4821k16253j873n7633k60065l36278m5786j9727o6152M7346K33537
$$ plain form
4931 -652730 -458289 -304271 -178106 -81243 -38323 -268468 -449747 -556904 -476139 -374276
4921 -374276 -467461 -285730 -24446 -123968 -292299 -177950 40067 36396 -62828 -30947 332999
4910 332999 628198 639221 354443 96725 -27715 118918 495479 504109 232657 108697
4900 108697 174730 376902 323359 154873 67843 273564 532255 611337 630288 615132 600314
4889 600314 414094 260172 71493 -103063 -215524 -268139 -184576 -139025 -213584 -131187 179362
4878 179362 320421 179501 -11500 71557 292763 390506 249295 123828 56951 51088 174679
4867 174679 432777 668822 614234 287795 -11652 -190840 -302773 -296460 -278312 -131937
4857 -131937 81548 220148 265232 255882 140213 -5523 -151804 -104877 -38235 -61424 46386
$$ packed form
4931f52730J94441J54018J26165R6863M2920k30145j81279j07157Q0765J01863
4921c74276r3185J81731K61284r9522j68331J14349K18017l671r9224L1881L63946
4910C32999K95199J1023k84778k57718j24440J46633L76561Q630k71452j23960
4900A08697O6033K02172n3543j68486q7030K05721K58691P9082J8951j5156j4818
4889F00314j86220j53922j88679j74556j12461n2615Q3563M5551p4559Q2397L10549
4878A79362J41059j40920j91001Q3057K21206R7743j41211j25467o6877n863J23591
4867A74679K58098K36045n4588l26439k99447j79188j11933O313J8148J46375
4857a31937K13485J38600M5084r350j15669j45736j46281M6927O6642k3189J07810
$$ plain form
4846 46386 107828 139334 70640 132584 97194 -64058 6535 195280 225678 -15172 -380445
4835 -380445 -473652 -300228 -1602 205136 201337 121148 21278 -68773 -312505 -534937 -458424
4824 -458424 -379550 -235436 -151020 -124727 -11893 -183942 -279680 -283378 -442047 -370624 -207087
4813 -207087 -39245 -80889 -151304 -20516 85830 224636 -103995 -670101 -795572 -674392
4803 -674392 -463442 -372667 -417535 -415415 -243930 -77423 -81041 -342957 -401281 -375671 -424726
4792 -424726 -444650 -466613 -388182 -160675 -233297 -384334 -237027 -251297 -472603 -456767 -127228
4781 -127228 -6953 -50184 -64764 -165996 -268425 -213622 -272323 -350090 -468450 -343971 -134080
4770 -134080 -231783 -234051 -204883 -242793 -149862 -181284 -273257 -383918 -629562 -687862 -591345
$$ packed form
4846D6386O1442L1506o8694O1944l5390j61252P0593J88745L0398k40850l65273
4835c80445r3207J73424K98626K06738l799q0189r9870r0051k43732k22432P6513
4824d58424P8874J44114Q4416K6293J12834j72049r5738l698j58669P1423J63537
4813b07087J67842m1644p0415J30788J06346J38806l28631n66106j25471J21180
4803f74392K10950R0775m4868K120J71485J66507l618k61916n8324K5610m9055
4792d24726j9924k1963P8431K27507p2622j51037J47307j4270k21306J5836L29539
4781a27228J20275m3231j4580j01232j02429N4803n8701p7767j18360J24479K09891
4770a34080r7703k268K9168l7910R2931l1422r1973j10661k45644n8300R6517
$$ plain form
4759 -591345 -437107 -491204 -615814 -732886 -760865 -737526 -722289 -670261 -479564 -301635 -353465
4748 -353465 -449085 -488286 -586604 -474333 -207138 -209583 -277378 -339390 -421377 -224302 23089
4737 23089 106826 -103288 -386270 -442644 -478433 -527658 -542829 -436943 -254577 -47169 247622
4726 247622 585352 554078 350076 213626 120316 28272 113458 166935 232855 207957 27083
4715 27083 11973 -95196 -170572 26104 243871 241411 50108 -120268 -263515 -388882 -455401
4704 -455401 -368356 -344535 -166453 6310 -47021 -66712 -42447 -21463 -36731 119121 325891
$$ packed form
4759e91345J54238n4097j24610j17072k7979K3339J5237N2028J90697J77929n1830
4748c53465r5620l9201r8318J12271K67195k445o7795o2012q1987J97075K47391
4737B3089Q3737k10114k82982n6374l5789m9225j5171J05886J82366K07408K94791
4726B47622L37730l1274k04002j36450r3310r2044Q5186N3477O5920k4898j80874
4715B7083j5110j07169p5376J96676K17767k460j91303j70376j43247j25367o6519
4704d55401Q7045K3821J78082J72763n3331j9691K4265K0984j5268J55852K06770
$$ [...]
##END NTUPLES=NMR SPECTRUM
##END=
