##TITLE=C13_SA_51.206
 CDCl3, 25000 sc

 10.6.2020
##JCAMPDX= 6.0         $$ Bruker NMR JCAMP-DX V2.0
##DATA TYPE= NMR SPECTRUM
##DATA CLASS= NTUPLES
##ORIGIN= UXNMR, Bruker Analytische Messtechnik GmbH
##OWNER= root
$$ XWIN-NMR		Version 3.5
$$ Thu Jun 11 09:55:04 2020 Russian Standard Time (UT+4h)  she@DPX200
##.OBSERVE FREQUENCY= 50.327896
##.OBSERVE NUCLEUS= ^13C
##.ACQUISITION MODE= SIMULTANEOUS
##.ACQUISITION SCHEME= undefined
##.AVERAGES= 17446
##.DIGITISER RES= 17
##SPECTROMETER/DATA SYSTEM= spect
##.PULSE SEQUENCE= zgpg30
##.SOLVENT NAME= DMSO
##.SHIFT REFERENCE= (INTERNAL, DMSO, 0, 222.624)
##AUDIT TRAIL= $$ (NUMBER, WHEN, WHO, WHERE, WHAT)
$$ ##TITLE= Audit trail, XWIN-NMR		Version 3.5
$$ ##JCAMPDX= 5.01
$$ ##ORIGIN= Bruker BioSpin GmbH
$$ ##OWNER= she
$$ F:/spectra/data/she/nmr/c13/1/pdata/1/auditp.txt
$$ ##AUDIT TRAIL=  $$ (NUMBER, WHEN, WHO, WHERE, WHAT)
(   1,<2020-06-11 08:48:32.46 +0400>,<she>,<DPX200>,
      <created by zg, POWCHK disabled, PULCHK disabled
       terminated by command 'halt'
       configuration hash MD5:
       00 E9 B6 7A A2 85 ED C7 34 08 36 98 17 FE 4E 26
       data hash MD5: 32K
       3F 60 CB 48 D4 33 90 3D BB F0 AB F8 39 39 C2 82>)
(   2,<2020-06-11 09:53:13.39 +0400>,<she>,<DPX200>,
      <Start of raw data processing
       efp BC_mod = 2 LB = 1 FT_mod = 6 PKNL = 1 PHC0 = -262.3615 PHC1 = 70.40639 SI = 32K 
       data hash MD5: 32K
       65 9B D8 6D A0 8A A3 BB 61 3F B1 C4 04 28 62 3E>)
(   3,<2020-06-11 09:53:36.71 +0400>,<she>,<DPX200>,
      <pk PHC0 = 39.23664 PHC1 = -39.80001 
       data hash MD5: 32K
       52 62 F0 26 99 39 78 D9 84 F1 61 74 04 85 31 22>)
(   4,<2020-06-11 09:53:40.39 +0400>,<she>,<DPX200>,
      <abs ABSG = 5 
       data hash MD5: 32K
       8F 5D 09 5F 66 F3 EA 4C B6 42 B6 F6 B7 DA 97 86>)
(   5,<2020-06-11 09:53:58.07 +0400>,<she>,<DPX200>,
      <pk PHC0 = 2.584615 PHC1 = -5.4 
       data hash MD5: 32K
       39 53 4A 09 24 C6 F4 76 FC 8B 92 71 5F 0F 2D 15>)
(   6,<2020-06-11 09:54:01.92 +0400>,<she>,<DPX200>,
      <abs ABSG = 5 
       data hash MD5: 32K
       C2 76 60 36 1A 02 C2 82 1A 76 EF 64 BC 80 B2 C5>)
$$ ##END=
$$ 
$$ hash MD5
$$ 90 EF 3C 52 DA 28 19 C8 0D 2C 71 E3 97 DA CB 85
##$RELAX= 
##$RELAX= 
##$RELAX= 
##$RELAX= 
##$RELAX= 
##$RELAX= 
##$RELAX= 
##$RELAX= 
$$ Bruker specific parameters
$$ --------------------------
##$DU= <F:/spectra>
##$EXPNO= 1
##$NAME= <c13>
##$PROCNO= 1
##$TYPE= <nmr>
##$USER= <she>
##$AMP= (0..31)
100 100 100 100 100 100 100 100 100 100 100 100 100 100 100 100 100 100 
100 100 100 100 100 100 100 100 100 100 100 100 100 100 
##$AQSEQ= 0
##$AQ_mod= 1
##$AUNM= <au_zg>
##$AUTOPOS= <>
##$BF1= 50.322709
##$BF2= 200.13
##$BF3= 50.322709
##$BF4= 500.13
##$BF5= 500.13
##$BF6= 500.13
##$BF7= 500.13
##$BF8= 500.13
##$BYTORDA= 1
##$CFDGTYP= 0
##$CFRGTYP= 5
##$CHEMSTR= <none>
##$CNST= (0..31)
1 1 145 1 1 1 1 1 1 1 1 1 1 1 1 1 1 1 1 1 1 1 1 1 1 1 1 1 1 1 1 1 
##$CPDPRG= <waltz16>
##$CPDPRG1= <>
##$CPDPRG2= <waltz16>
##$CPDPRG3= <>
$$ [...]
##$SUBNAM4= <"">
##$SUBNAM5= <"">
##$SUBNAM6= <"">
##$SUBNAM7= <"">
##$SUBNAM8= <"">
##$SUBNAM9= <"">
##$SW= 239.972175391363
##$SWIBOX= (0..15)
0 1 3 0 0 0 0 0 0 0 0 0 0 0 0 0 
##$SW_h= 12077.2946859903
##$TD= 32768
##$TD0= 1
##$TE= 0
##$TE2= 300
##$TE3= 300
##$TEG= 300
##$TL= (0..7)
120 120 120 120 120 120 120 120 
##$TP= (0..7)
150 150 150 150 150 150 150 150 
##$TP07= 0
##$TPNAME0= <>
##$TPNAME1= <>
##$TPNAME2= <>
##$TPNAME3= <>
##$TPNAME4= <>
##$TPNAME5= <>
##$TPNAME6= <>
##$TPNAME7= <>
##$TPOAL= (0..7)
0.5 0.5 0.5 0.5 0.5 0.5 0.5 0.5 
##$TPOFFS= (0..7)
0 0 0 0 0 0 0 0 
##$TUNHIN= 0
##$TUNHOUT= 0
##$TUNXOUT= 0
##$USERA1= <user>
##$USERA2= <user>
##$USERA3= <user>
##$USERA4= <user>
##$USERA5= <user>
##$V9= 5
##$VALIST= <valist>
##$VCLIST= <CCCCCCCCCCCCCCC>
##$VD= 0
##$VDLIST= <DDDDDDDDDDDDDDD>
##$VPLIST= <PPPPPPPPPPPPPPP>
##$VTLIST= <TTTTTTTTTTTTTTT>
##$WBST= 1024
##$WBSW= 4
##$XGAIN= (0..3)
0 0 0 0 
##$XL= 0
##$YL= 0
##$YMAX_a= 65884656
##$YMIN_a= -116372818
##$ZGOPTNS= <>
##$ZL1= 120
##$ZL2= 120
##$ZL3= 120
##$ZL4= 120
##$ABSF1= 222.624
##$ABSF2= -17.3728
##$ABSG= 5
##$ABSL= 3
##$ALPHA= 0
##$AQORDER= 0
##$ASSFAC= 0
##$ASSFACI= 0
##$ASSFACX= 0
##$ASSWID= 0
##$AUNMP= <proc_1d>
##$AZFE= 0.1
##$AZFW= 0.5
##$BCFW= 0
##$BC_mod= 2
##$BYTORDP= 0
##$COROFFS= 0
##$CY= -3
##$DATMOD= 1
##$DC= 0
##$DFILT= <>
##$DTYPP= 0
##$F1P= 0
##$F2P= 0
##$FCOR= 0.5
##$FTSIZE= 32768
##$FT_mod= 6
##$GAMMA= 0
##$GB= 0
##$INTBC= 1
##$INTSCL= 4.134877e-10
##$ISEN= 128
##$LB= 1
##$LEV0= 0
##$LPBIN= 0
##$MAXI= 10000
##$MC2= 0
##$MEAN= 0
##$ME_mod= 0
##$MI= 0.1934396
##$NCOEF= 0
##$NC_proc= 2
##$NLEV= 6
##$NOISF1= 120.0001
##$NOISF2= 80.00006
##$NSP= 0
##$NTH_PI= 0
##$NZP= 0
##$OFFSET= 222.624
##$PC= 1.4
##$PHC0= -220.5403
##$PHC1= 25.20638
##$PH_mod= 1
##$PKNL= yes
##$PPARMOD= 0
##$PSCAL= 0
##$PSIGN= 0
##$REVERSE= no
##$SF= 50.3227315989248
##$SI= 32768
##$SIGF1= 140
##$SIGF2= 120
##$SINO= 11.81781
##$SIOLD= 32768
##$SREGLST= <13C.CDCl3>
##$SSB= 0
##$STSI= 32768
##$STSR= 0
##$SW_p= 12077.2946859903
##$SYMM= 0
##$S_DEV= 0
##$TDeff= 32768
##$TDoff= 0
##$TI= <>
##$TILT= no
##$TM1= 0
##$TM2= 0
##$TOPLEV= 0
##$USERP1= <user>
##$USERP2= <user>
##$USERP3= <user>
##$USERP4= <user>
##$USERP5= <user>
##$WDW= 1
##$XDIM= 32768
##$YMAX_p= 450579293
##$YMIN_p= -2613224
$$ End of Bruker specific parameters
$$ ---------------------------------
##NTUPLES= NMR SPECTRUM
##VAR_NAME=  FREQUENCY,     SPECTRUM/REAL,   SPECTRUM/IMAG
##SYMBOL=    X,             R,               I
##VAR_TYPE=  INDEPENDENT,   DEPENDENT,       DEPENDENT
##VAR_FORM=  AFFN,          ASDF,            ASDF
##VAR_DIM=   32768,         32768,           32768
##UNITS=     HZ,            ARBITRARY UNITS, ARBITRARY UNITS
##FACTOR=    0.368581032318806, 1,           1
##FIRST=     11203.0474431902, 0,            0
##LAST=      -874.247242800138, 0,           0
##MIN=       -874.247242800138, -2613224,    0
##MAX=       11203.0474431902, 450579293,    0
$$ Real data points
##PAGE= N=1
##DATA TABLE= (X++(R..R)), XYDATA
$$ [...]
18175 980256 1268555 1165315 1002297 953516 834425 977052 1285092 1456078 1641854 1586709
18165 1586709 1379248 1123730 1090965 947324 637438 474816 416804 388234 489682 922184
18155 922184 1141875 1314358 1431553 1212438 1132586 1209809 919590 563075 371472 31603
18145 31603 132734 347478 188943 165048 528889 871656 920740 1045018 1101773 1134914
18135 1134914 1448916 1478561 1233671 809550 538738 473272 527645 846067 1003029 863473
18125 863473 808260 718249 552645 706423 832087 778210 665266 324020 137157 156460
18115 156460 -47474 -123263 -81321 49111 151736 305060 225633 -31197 -473828 -1053491
18105 -1053491 -1005785 -366338 49538 32424 117173 376564 714721 828351 583131 501638
18095 501638 569731 621898 705677 651774 632850 455513 286453 99876 52151 44005 71503
18084 71503 197967 268588 319663 410154 600650 631001 462414 -55635 -138824 10276 27275
18073 27275 116195 -41911 -533826 -600819 -288247 -253689 -316975 -156863 -150789 -64337 -19168
18062 -19168 69940 338068 667894 794244 793899 886694 1072757 1337908 1639874 1389989 591487
18051 591487 62299 -157005 -292657 -277368 52771 654902 953698 1013480 1074060 1082651
18041 1082651 889315 576851 641714 724912 500534 509553 797766 848317 856027 861136 773163
18030 773163 726485 631584 272708 33601 -13695 -141806 -233414 -306886 -40874 192756
18020 192756 448656 367226 170835 283345 506993 615935 463543 200399 515182 945807
18010 945807 891982 409515 -234653 -318550 103365 245882 265895 134953 111203 558618
18000 558618 918557 1125152 1372576 1491913 1490195 1681579 1924998 2223664 2404803 2042979
17990 2042979 1721411 1396270 949668 576474 238683 419816 688641 953211 971546 653176
17980 653176 106637 -364822 -236950 -113033 -277367 -243974 -30819 186448 238371 167604
17970 167604 176399 75665 51171 7554 66257 87746 211360 555800 688442 571298 555743
17959 555743 540967 704664 1155594 1470457 1117275 625595 263600 72768 -286965 -829812
17949 -829812 -612568 -65804 104141 39241 309590 1145277 1743964 1803673 1315294 881998
17939 881998 562597 240259 378498 499927 370377 386539 266014 -74628 -94664 175277
17929 175277 506226 710611 315296 -29342 36422 264246 498505 353863 195493 265136
17919 265136 29000 -203832 106525 272941 269501 298988 290418 210734 300983 418326 467101
17908 467101 555459 493154 10234 -196621 -88508 37523 51901 12402 -31773 -122570 -272891
17897 -272891 -164005 87347 207145 527511 768774 913629 1187411 1653661 1704991 1210753
17887 1210753 660179 756579 1183926 1313943 1148007 1044491 894611 1016221 1174165 889369
17877 889369 766177 834249 883042 1194230 1035179 745593 866064 1037181 918983 752761
17867 752761 892551 804802 701062 441285 661340 893024 517664 51743 -65278 -167349
17857 -167349 -367417 -175017 247854 360434 310987 217930 -43481 -262654 -290855 -280429
17847 -280429 -227065 -253109 -443792 -454088 -259363 -24174 -34983 -228091 -133837 89255
17837 89255 317067 733001 954840 1090774 1188249 1141143 1057083 744501 392396 373463
17827 373463 552607 805791 1209055 1706589 2225075 3016189 3562754 3969347 4481733 5430489
17817 5430489 6661869 7988274 9548289 11500383 13966615 17056712 21632088 27797123
17809 27797123 35883273 47397825 64564625 90469048 127932883 172608523 197717160
17802 197717160 178712254 137082225 100224568 74036476 56323092 44152965 35098004
17795 35098004 28061922 23003482 19375288 16796363 14684038 13003943 11772653 10675646
17787 10675646 9325483 7821826 6854122 6245914 5561538 4849796 4468303 3954016 3290074
17778 3290074 2849460 2623207 2576595 2622720 2358476 2112703 2251651 2518916 2483532 2112763
17768 2112763 2066416 2162714 2082127 2012116 1722371 1420802 1430846 1602948 1342488 706080
17758 706080 911950 1653636 2001512 1965777 1921699 1879548 1898367 1591555 1315878 1281027
17748 1281027 1008304 683967 616884 541401 399925 151948 96369 424904 1024663 1244477
17738 1244477 1153198 1191032 896705 307707 -55371 71317 493347 630690 691716 880230
17728 880230 1227947 1388737 1140955 841888 742924 1122564 1641379 2002187 2532045 3119776
17718 3119776 3091411 2414534 1868555 1320283 1104731 1325824 1319371 1191277 1016712 714690
17708 714690 815117 1241537 1560122 1426601 872197 211153 -168194 -431481 -517617 -302927
17698 -302927 -42156 -51492 233824 357007 217001 325576 331014 408528 759772 1039992
17688 1039992 719568 -56456 -414070 -419429 -292795 28442 346552 365492 301103 634621
17678 634621 519148 104591 399006 1221630 1473151 1147976 934253 873464 390514 -111172
17668 -111172 -247851 -222027 7538 94560 245778 675681 990176 976639 1140557 1452163
17658 1452163 1554995 1945220 2157888 1837510 1446637 1207243 1104983 1268977 1463769
17649 1463769 1108729 848912 795209 713008 653744 1156184 1444369 1164295 483589 -2196
17639 -2196 89751 613656 828273 874753 844437 355440 -39468 26625 112056 200743 547471
17628 547471 1123643 1062556 686213 396955 224662 165019 306545 616214 614576 74197
17618 74197 -253163 14574 746630 740043 367575 130326 -160583 -8062 585254 996620
17608 996620 831779 412126 -191188 -257768 88040 477046 681188 834945 921205 758432
17598 758432 861741 610596 205668 74370 -189348 -288481 -118548 -6125 188890 580161
17588 580161 678136 390800 -256475 -630584 -586078 -588632 -575717 -335385 -401466 -846692 -817287
17577 -817287 -675762 -121873 221320 280952 629709 821892 1143516 1189592 1110603 1066126
17567 1066126 843610 774697 913482 828859 390823 -34810 102646 457560 251211 26546
17557 26546 -48806 -13840 -55440 -360910 -483828 165992 913873 1033776 954173 1034969 987572
17546 987572 751122 701526 418120 100534 -228221 -154755 28926 -185849 -568802 -767112
17536 -767112 -1126200 -1020946 -615724 -359472 -109659 420832 596731 530055 475177 310551
17526 310551 -31133 -131851 182963 763540 681487 494089 931012 1328106 1439044 1053819
17516 1053819 494649 434334 599050 398466 -111765 -80310 385204 734336 714569 842505
17506 842505 946880 923384 902384 1064771 965140 878036 708956 499056 564848 904076
17496 904076 1037627 914027 797100 593791 474992 854888 1034587 946183 718796 336263
17486 336263 28670 -143380 -68045 3864 -34119 -254274 -171999 -55248 -190865 -306180
17476 -306180 -427745 -620423 -681787 -373916 102628 89345 42000 88985 144078 591598
17466 591598 1207220 1519918 1216420 572885 96041 401814 916923 779063 361958 202705
17456 202705 177128 94312 132722 426912 364533 362339 316245 156031 275487 399514 555240
17445 555240 916278 1136192 808538 132266 -167202 -112512 493588 824105 831749 751672
17435 751672 400987 76099 29017 39163 -66163 -245714 -438542 -308548 254870 407489
17425 407489 -135742 -398337 -255039 -87512 25328 341065 607315 510734 254943 -59895
17415 -59895 -206346 43508 140146 -210234 -508535 -163529 297154 479172 699131 917800
17405 917800 856181 828026 1115972 1497940 1850473 1756961 1444701 1390021 1654959 2376296
17395 2376296 2876494 3596020 4227469 4885268 6040517 8054446 11532783 16096606 22646940
17386 22646940 33897604 51501289 65402760 56423871 38675532 26983459 20095853
17379 20095853 15980453 13074153 11060172 9202430 7367215 6030567 5253857 4528597
17371 4528597 3935107 3596359 3161805 2859596 2364081 1652964 1411990 1481992 1699777 1442655
17361 1442655 1173765 888425 820320 928373 930428 858545 844792 817207 877744 926505 1055003
17350 1055003 871316 686108 652141 591401 660425 844353 866633 723485 476391 224509
17340 224509 21559 -124348 -421946 -652237 -946518 -1041065 -846737 -608790 -337115 8012
17330 8012 120962 453897 694781 699276 349932 330776 566290 670251 419722 27982
17320 27982 -553360 -435129 205811 389602 113109 -12793 153475 460333 592589 565735
17310 565735 358187 92599 -89794 -224923 -260050 -121184 10111 -211639 -133828 240177
17300 240177 345313 -111230 -604940 -855348 -925288 -742429 -652849 -766779 -695823 -275699
17290 -275699 646405 1199500 1204919 1015727 1032345 1165005 978950 666522 466006 419633
17280 419633 564224 835779 973726 807806 540260 344723 263933 201108 -10181 -23024
17270 -23024 -148200 280031 533974 212909 -20693 128600 765494 1138562 881652 414287
17260 414287 216317 -40595 -281215 -379572 -666411 -570066 -180311 15811 125654 -95180
17250 -95180 -418974 -331890 29089 117382 110283 2226 -260942 -527783 -992501 -872389
17240 -872389 -665674 -577160 -264094 -348328 -363529 -280787 -388121 -288147 -151654 -92949 -316008
17229 -316008 -197790 67121 -114001 -231743 -79801 259112 208879 -268570 -536137 -464707
17219 -464707 -528385 -689917 -629677 -34454 523019 354107 -164159 -359582 -424070 -416949
17209 -416949 -567721 -521803 -102891 354953 765585 933733 603048 280856 125922 -27980
17199 -27980 -140843 -198131 -134109 -159616 -252977 -371953 -174448 219244 445991 700695
17189 700695 768055 531959 203458 42825 376224 495577 538774 400504 73111 -91660
17179 -91660 -107780 -275794 -234377 121256 263197 589308 1027648 1059804 998443 874112
17169 874112 198291 -183992 -94738 94219 -32730 -490290 -524233 -338079 -287637 -263795
17159 -263795 58917 72252 94190 54348 -74475 1089 -135586 -104153 305733 567332
17149 567332 439073 406330 431365 51411 -220178 -79134 285419 614282 516905 424597
17139 424597 190622 158078 -209311 -754291 -1031317 -1072504 -744120 -586934 -492433 -508996
17129 -508996 -683193 -842087 -885488 -1089098 -1073696 -1050182 -714742 -475882 -475830 -317360 -125212
17118 -125212 16647 235120 496607 401639 385008 820294 928985 716523 491297 343012
17108 343012 51842 -324839 -585382 -527007 -365404 -248146 44544 519243 871642 750512
17098 750512 436478 440866 596909 712617 594772 851915 1223468 1142205 655757 282617
17088 282617 232981 98878 226776 397958 405016 270885 164058 167172 22197 -394601
17078 -394601 -549226 -221155 -80283 -11581 -45083 -187625 -517816 -623409 -336869 -420572
17068 -420572 -496089 -506684 -440915 -346849 -444129 -498631 -651428 -791683 -596031 -471694 -413018
17057 -413018 -234930 -184758 -415551 -255542 -193187 -477704 -475255 -190341 -56763 -320571
17047 -320571 -470527 -377462 -264874 163732 400409 585310 598253 328291 364740 36025
17037 36025 -261174 -150648 195072 435963 470725 483897 415742 425368 538876 426616 130899
17026 130899 -64345 -106447 -1587 113842 219317 291898 412897 471706 682205 289410
17016 289410 -98473 75431 122755 -36975 -418581 -550488 -65927 469870 532891 157952
17006 157952 -145423 -136644 -242446 -179912 -272958 -424575 -378980 -132890 34893 171954
16996 171954 308157 72836 -192214 -406249 -534591 -332754 -237908 -538196 -827662 -623847
16986 -623847 -360596 -69874 458377 1084526 1360459 1434047 1401401 1046974 950454 849028
16976 849028 847175 824422 554543 311852 125925 15179 115348 423326 529677 420420
16966 420420 475510 616844 668524 288797 -109066 -18356 165307 -263643 -330163 55940
16956 55940 137036 -281489 -581184 -490102 -266170 -6926 284374 699098 1136151 1217475
16946 1217475 909999 554519 597963 394072 -223548 -698100 -606219 -455059 -452417 -528084
16936 -528084 -630625 -592374 -545458 -354778 -177149 -576628 -1015887 -784731 -401981 -473787
16926 -473787 -524991 -216828 -73892 -510188 -1081612 -1046587 -378770 44976 -142361 -411063
16916 -411063 -158081 361563 524508 525351 763546 980680 917570 408598 -43082 -271659
16906 -271659 -204815 -48794 -197957 -436094 -678746 -652554 -664599 -464027 -389374 -470824
16896 -470824 -701369 -773760 -672226 -431762 -49329 53222 197507 658080 970336 841964
16886 841964 785677 616010 296931 -199969 -351036 -254677 -288314 -361628 -464102 -415663
16876 -415663 -337128 -563083 -747314 -704600 -908237 -1112692 -989007 -743871 -319132 70178
16866 70178 -64368 -593966 -709671 -547965 -338817 -86502 126924 216439 198293 199325
16856 199325 46066 6698 -117303 -135188 -359407 -828272 -786287 -1023830 -1147431 -1038571
16846 -1038571 -1163917 -1223218 -955928 -363458 72397 461134 337585 196273 542320 611380
16836 611380 459181 151203 -192940 -380803 -731458 -1269547 -1474642 -1411524 -1035375 -408590
16826 -408590 -78388 -356397 -338999 93513 298892 389082 387375 414501 433145 281835 17765
16815 17765 -404037 -757145 -991682 -822729 -452790 -312271 -39254 -26481 115775 436528
16805 436528 206769 -110321 -32457 -65062 40740 163316 295777 394320 181991 -149875
16795 -149875 -111742 120825 128492 -173742 -572819 -735500 -556521 -489046 -403243 -617767
16785 -617767 -904014 -627337 -279276 -22232 -141772 -583231 -1048406 -1179537 -888586 -1243102
16775 -1243102 -1503580 -1398570 -1149713 -521552 -433198 -585967 -739292 -719851 -420072 -223973
16765 -223973 -436862 -435394 -297978 -467703 -586402 -565987 -834096 -867928 -455348 -122737
16755 -122737 -112805 -284333 -416204 -462532 -203565 -215251 -440985 -674495 -670500 -530405 -207163
16744 -207163 125739 427291 614652 561069 513063 500420 527275 384007 555254 917059
16734 917059 897772 860649 782125 618713 496982 280998 230500 114650 132771 599124
16724 599124 654226 515273 495130 165854 -282379 -570468 -581245 -560642 -683757 -457732
16714 -457732 -379406 -124067 337302 550812 742344 602334 348033 -80321 -390417 -873128
16704 -873128 -1762777 -1990654 -1236324 -399442 -315374 -202308 85451 208828 124655 -41358
16694 -41358 -41526 19181 84464 450442 349182 321621 492103 404691 281872 16038 -135361
16683 -135361 100400 185019 18387 46677 -31562 -264251 -367002 -519949 -453206 -254299
16673 -254299 -98679 -24235 -280426 -160929 96344 368778 360128 -14078 -192664 31337
16663 31337 537621 568699 448398 495157 316302 299995 302430 314430 -34502 -355659 -483073
16652 -483073 -482628 -209467 376109 1060745 1367962 1377232 1027786 722302 388563 172179
16642 172179 31538 -12860 -166073 -103850 222467 282776 -10840 159876 454318 835556
16632 835556 886397 707585 497543 396543 257844 -217444 -584589 -921219 -895913 -646007
16622 -646007 -563456 -419893 -50137 -287367 -427056 71640 561379 706931 563851 531661
16612 531661 580799 284925 -80297 -43822 -239887 -400243 -193281 191186 462005 449995
16602 449995 317988 182394 138706 218340 96492 -167303 -183127 -199701 -138354 -14762
16592 -14762 -161442 -400686 -599392 -838957 -979564 -1011970 -968810 -815363 -858685 -498945
16582 -498945 176403 46397 -653251 -1088378 -981213 -662084 -474622 -530719 -531052 -688769
16572 -688769 -968820 -944554 -779266 -489938 -214643 -267203 -280805 -382530 -512327 -756327
16562 -756327 -1032452 -959910 -866741 -712085 -483734 -382823 -58471 156434 -94489 -153908
16552 -153908 -294650 -230595 -215751 -278178 3069 -13441 -243288 -159835 190094 534830
16542 534830 651978 466584 250854 91371 47358 -8124 -151769 -307034 -195090 -309634
16532 -309634 -117399 496320 651964 320143 75661 -33908 -28129 -69988 289434 517048
16522 517048 52266 -309300 -203255 24459 241367 552513 735360 1029636 1150956 1130346
16512 1130346 706557 140792 -105292 -382781 -935999 -647469 -26307 -41506 -111850 52734
16502 52734 61581 -56957 349376 413903 170834 -158711 -219002 -358799 -652327 -718052 -416333
16491 -416333 -352593 -527908 -440101 -188809 -179948 -360108 -734718 -918964 -733293 -650511
16481 -650511 -767242 -792084 -818883 -1088405 -963985 -855014 -1054709 -908923 -1024218 -1143904
16471 -1143904 -988006 -1004304 -920486 -573960 -582696 -938978 -965746 -708812 -533387 -248875
16461 -248875 -84160 363836 432216 -144583 -440501 -371201 -352009 -579802 -849849 -1120705
16451 -1120705 -1023270 -739003 -774699 -848631 -916163 -1072402 -1047809 -661850 -203064 -113805
16441 -113805 66025 433164 513746 384656 448889 425820 104880 -304932 -363534 -40336
16431 -40336 122667 238002 349215 412957 472454 544752 704758 564097 266545 100155
16421 100155 322971 541011 428963 17573 -259167 -469246 -808249 -959626 -741507 -286818
16411 -286818 27227 192929 457585 510456 631412 485627 52501 -421 253901 654085
16401 654085 651543 684040 335476 -89148 -128745 29969 201161 238438 134228 57355 -77945
16390 -77945 -195549 -239592 -58076 -20394 -288733 -627589 -681119 -325672 40241 176219
16380 176219 296739 373097 362086 374117 614257 600288 338368 181508 286063 537963
16370 537963 751187 480411 184499 378468 410307 32291 -140982 -63574 -176301 -315730
16360 -315730 -107450 -176822 -634233 -443105 171875 549605 667673 530458 18414 -475624
16350 -475624 -713173 -875154 -447244 299948 675436 694089 382427 287638 324821 174789
16340 174789 -137370 -134679 -172174 -17246 105770 123126 74075 -231068 -450169 -455373 -116712
16329 -116712 431859 650585 487046 328982 318508 379140 271722 103622 116300 418170
16319 418170 723317 813292 626048 363012 -21758 -413937 -704463 -326254 569097 1120731
16309 1120731 1406858 1045750 549478 176053 -275804 -677579 -637479 -688026 -889479 -761655
16299 -761655 -269790 -128162 -42464 191866 214368 171972 162795 493654 841935 950240
16289 950240 705382 545328 607120 550857 231515 131429 255830 264559 -35168 -545341
16279 -545341 -573683 -423837 -285177 -91039 320984 473783 185988 14256 -97138 -187620
16269 -187620 -131612 -158761 -144808 -394160 -449667 -714456 -572264 -255432 -36514 237958
16259 237958 472876 633101 431331 468469 697958 767461 890917 768929 462100 -74535
16249 -74535 -701691 -895071 -610021 -248237 -40635 -52196 -99176 -66759 -194725 -228279
16239 -228279 75119 205100 229105 430918 350248 403942 341770 199898 321583 184617
16229 184617 209999 408897 289263 190871 93883 -407752 -847855 -680215 -306090 -311223
16219 -311223 -302589 -438207 -440105 -397460 -205951 133930 -71056 -282179 -596926 -701455
16209 -701455 -683329 -1150589 -1431697 -1131632 -656288 -340192 103726 412419 372841 417334
16199 417334 424750 360969 391265 530296 713625 576823 416078 380196 145121 -47526
16189 -47526 -317 -157524 -197185 40417 139041 268134 99819 207961 379729 -63577
16179 -63577 -376000 -666677 -611482 -550668 -760830 -876804 -1181179 -1323069 -1030111 -1002109
16169 -1002109 -905375 -642390 -397124 -317793 -490513 -606692 -1044135 -1263399 -1115189 -1009088
16159 -1009088 -982318 -760289 -618034 -522057 -484056 -565506 -554541 -356296 -76003 55542
16149 55542 246622 408400 211471 127622 140412 -339742 -1072444 -1312471 -1217036 -1371927
16139 -1371927 -1533063 -1206123 -629785 -466335 -626744 -809618 -752463 -703118 -739001 -565927
16129 -565927 -339010 7402 104752 155280 133287 -284621 -552856 -19202 448168 477180
16119 477180 468458 24019 -416360 -670149 -619902 -593121 -647687 -385654 82261 531097
16109 531097 710464 682336 111550 -297163 -283296 -306670 -301422 -113801 38519 42085 21859
16098 21859 -128821 -354677 -493146 -642437 -526812 -99135 176047 337890 542991 703624
16088 703624 919597 918470 602566 270021 276855 81083 -180302 -256738 -410534 -531632
16078 -531632 -356951 -55900 104505 -220823 -601305 -778930 -739585 -696293 -748730 -888919
16068 -888919 -644453 75819 510174 126729 -330049 -415970 -628808 -901538 -795817 -473388
16058 -473388 -520332 -870463 -1207222 -1347142 -1284341 -1009328 -1028694 -906232 -537155 -201317
16048 -201317 -60436 -268894 -620728 -776575 -653087 -423952 -331405 -271006 -507461 -739708
16038 -739708 -755874 -738436 -692990 -433524 -370830 -777108 -992713 -898591 -598505 -415665
16028 -415665 -722113 -722613 -356417 -289108 -675490 -908815 -515999 102304 446448 201487
16018 201487 109986 164322 -38407 -101614 404373 735863 726065 469726 -22759 -308528
16008 -308528 -61535 -46356 -304458 -568778 -789916 -1002166 -872344 -741828 -729950 -332950
15998 -332950 -24342 105329 232172 346229 225394 -392551 -562481 -499177 -840387 -1074204
15988 -1074204 -1072562 -694007 -25728 101149 -203462 -418831 -180719 -117813 -429180 -587713
15978 -587713 -522517 -704516 -835399 -731452 -762445 -626965 -125884 343942 224887 -196764
15968 -196764 -509989 -469206 -181799 -24886 69749 119281 -62158 -59862 -203791 13349
15958 13349 146349 62847 206500 458064 800829 796145 119426 -549527 -774648 -989785
15948 -989785 -1041750 -742507 -534175 -602872 -528248 -302292 -100747 151971 315933 128911
15938 128911 -354637 -875870 -983776 -812192 -886473 -1301664 -1541713 -1307720 -651457 -204304
15928 -204304 -103063 -300630 -287893 -298895 -330388 -70684 225294 183154 -153023 -738048
15918 -738048 -1211353 -926127 -499607 -659209 -838098 -693951 -394520 26854 -153193 76428
15908 76428 370265 -8799 -816304 -1229332 -857865 -139706 691641 817412 497037 410318
15898 410318 65990 -353752 -347324 -100728 -25404 -216108 -350660 -284485 -166721 -242019
15888 -242019 -171606 357651 624309 889825 940825 404554 70182 377926 660139 494179
15878 494179 244303 287597 528501 728300 562938 551393 333052 148632 221943 505412
15868 505412 674402 408939 -45462 -76876 -39037 -306587 -334587 -762136 -1291444 -1511924
15858 -1511924 -1527598 -1176991 -632430 -714026 -1001756 -1151528 -1361190 -1411912 -1157774 -803311
15848 -803311 -638253 -646968 -747081 -850198 -930078 -1103459 -1219827 -1257753 -1170022 -1223103 -1169669
15837 -1169669 -702287 -221021 406873 907513 902658 569575 498098 608498 376885 -73127
15827 -73127 -106582 -42600 -138594 -140141 67929 97728 -35797 -8148 197987 111317 -66145
15816 -66145 -58601 45681 191213 143815 -163053 -471489 -650539 -1034863 -1457540 -1655677
15806 -1655677 -1427129 -750577 -183459 68150 -128080 -652416 -803305 -721056 -700412 -792095
15796 -792095 -1090093 -935755 -569024 -310201 -354901 -546995 -485117 -426521 -364945 -324770
15786 -324770 -616074 -871769 -429366 -209796 -218951 -152087 -29088 -206441 -548900 -757124
15776 -757124 -598519 -168284 131664 77328 363841 465096 240305 187229 162254 252584
15766 252584 187811 354895 535421 511278 59306 -234936 -43037 219461 544437 428403
15756 428403 291301 250636 150816 249114 -53011 -838067 -1103320 -1021373 -813735 -471849
15746 -471849 -312882 -255707 -140807 44048 399319 354527 -265660 -656541 -553110 -565830
15736 -565830 -891231 -1135180 -892871 -622857 -531290 -166618 125225 -23854 -8677 127829
15726 127829 383742 353297 126914 251623 527470 774722 794804 792282 514443 42735
15716 42735 -238401 -655561 -570739 -161878 24914 248986 499174 749583 729833 654815
15706 654815 312850 -154935 -333851 36459 178293 260561 297126 372092 109630 -175259
15696 -175259 -295411 -555234 -621904 -581290 -663046 -573257 -340348 13597 618772 989849
15686 989849 733181 493264 369818 35032 -319429 -562092 -264419 -52308 85307 -28175
15676 -28175 -364326 -220831 152052 -79377 -565906 -1130266 -1142808 -700190 -426469 63666
15666 63666 197376 -29327 -166018 12961 -23642 -432310 -778470 -534596 -729170 -1221959
15656 -1221959 -1086686 -484354 -110139 -36757 -163313 -220438 30684 294328 291497 35235
15646 35235 -253645 -63218 498382 808626 849011 538732 440118 772757 916801 547502
15636 547502 218007 184017 148504 -60336 -340725 -449558 -627936 -740538 -570661 -305656
15626 -305656 -56496 272822 611032 499026 339803 -121991 -652638 -630259 -307513 -107571
15616 -107571 10442 -8197 250857 -87790 -814657 -1248013 -1092525 -944383 -1137300 -830936
15606 -830936 -524190 -271302 -187337 -324367 -131930 340988 542993 584372 565900 489531
15596 489531 298292 91845 143178 -17552 -461460 -544982 -619150 -749355 -386216 -329769
15586 -329769 -573591 -682776 -892016 -1069196 -1133621 -1217108 -809844 -649426 -803011 -765342
15576 -765342 -372861 -155403 88543 148209 -189455 -359321 -141274 119266 136547 -41888
15566 -41888 -446181 -612756 -535899 -625873 -718829 -379396 -89211 52752 154120 -256528
15556 -256528 -659764 -423314 142786 235555 114319 101798 220850 371088 218732 4316
15546 4316 -178930 -84682 -147874 -445717 -703163 -763262 -534121 -148688 -81536 -46485 48445
15535 48445 277302 249269 161784 50260 166736 391930 803405 1218436 1302034 979771
15525 979771 330188 109276 219257 -5573 -457701 -362490 312808 584247 354330 388184
15515 388184 774331 900993 826536 461186 129463 -306508 -583679 -520282 -271353 86743
15505 86743 198573 364870 535635 310604 -71007 -267830 -18002 -33700 -499790 -708838
15495 -708838 -620187 -475799 -550716 -842496 -1231294 -1600592 -1876182 -1326796 -697320 -832148
15485 -832148 -939915 -836179 -648736 -426632 -314193 -225818 -334625 -192195 429676 902054
15475 902054 822212 467289 356099 347233 259931 -155959 -472394 -590859 -173799 604087
15465 604087 847995 799779 212854 -516041 -763024 -580201 -305626 -228450 -194159 39968
15455 39968 418424 938367 951521 684442 436598 365989 -64969 -635820 -967046 -850190
15445 -850190 -593410 -413448 -256721 -351552 -367983 -248712 -228808 -142969 390997 476664
15435 476664 253945 37698 -65315 49172 328440 133694 -316850 -240914 102346 152162
15425 152162 178538 89408 -54053 -7614 202815 594446 728282 577929 483872 434533
15415 434533 566915 387560 188907 260127 82894 -9588 -194605 -108770 72001 368718
15405 368718 580094 712815 516341 -14437 -508742 -731089 -483172 -389178 -568544 -545425
15395 -545425 -379023 -291180 -161555 302442 601547 203051 -200914 24514 426632 596840
15385 596840 940194 1109196 692813 187563 -338937 -629107 -558344 -352846 35069 171182
15375 171182 338607 579193 728554 444202 -179512 -290622 -207807 -175419 -103749 -174673
15365 -174673 -341139 -380033 -111182 14834 -153362 -372418 -353767 -386908 -628454 -791338
15355 -791338 -740546 -581372 -262931 37029 55881 -102014 -263967 -562425 -973569 -935608
15345 -935608 -597059 -332691 -222347 -82248 69631 157523 149384 -182872 -462832 -278804
15335 -278804 -170098 -141623 165712 475370 16922 -355371 -232633 -311098 -660216 -516318
15325 -516318 -454686 -314577 -74297 27422 -384534 -502456 -432924 -619341 -787644 -756192
15315 -756192 -511940 -388371 -288500 -315093 -422393 -298006 -173147 -145292 -52830 -5462
15305 -5462 168367 88965 -79840 -393703 -392873 -193718 -493318 -618973 -635464 -654994 -556575
15294 -556575 -694145 -903920 -563731 -311275 -653255 -1017140 -1033278 -731753 -330203 12842
15284 12842 139355 59238 -224355 -134127 110931 143670 -155190 -207947 -46957 -414967
15274 -414967 -964987 -1263981 -947636 -559852 -429308 -439557 -149022 86934 272406 396149
15264 396149 259793 131536 299273 -39536 -655012 -726511 -434490 -383802 -629570 -800229
15254 -800229 -779118 -451834 -299843 -332235 -461900 -607573 -791969 -982421 -1069442 -861030
15244 -861030 -332929 63531 111213 156265 -174896 -221919 8657 334764 209009 -260134
15234 -260134 -299100 -497674 -693213 -712570 -487992 -556308 -470419 -134648 64957 266436
15224 266436 319339 147789 -53063 -187290 -504221 -793333 -1124446 -1205916 -580037 287811
15214 287811 554383 576312 518385 377418 144739 8416 -44019 -56109 -256140 -424134
15204 -424134 -662496 -675979 -431681 -136359 182401 195319 -78939 -164664 -226185 -30610
15194 -30610 446749 682913 697880 596453 528129 426962 -2537 -467147 -844225 -1301031
15184 -1301031 -1379560 -623924 44396 160865 -296910 -813681 -876402 -836938 -934169 -705316
15174 -705316 -547544 -439302 -304191 -199464 -315434 -717264 -966968 -799812 -383711 -196289
15164 -196289 -531372 -1084230 -1403150 -1618290 -1637265 -1087304 -702644 -697127 -708830 -538656
15154 -538656 -49962 330794 202030 175047 141501 -66413 -361242 -448291 -589508 -669130
15144 -669130 -767246 -749555 -539627 -363346 -279005 -490377 -563163 -642841 -690996 -486338 -520135
15133 -520135 -625997 -437892 13380 243964 223537 143320 114276 336397 673619 890896
15123 890896 682201 286622 -114362 -224031 -399479 -800438 -1041122 -822981 -214758 422827
15113 422827 770609 697562 89130 -525292 -677626 -412739 -226444 -388834 -490352 -495211
15103 -495211 -560344 -582695 -284419 178081 583661 708915 698922 635537 245871 26822
15093 26822 193577 533107 623428 450898 154418 -51076 -121937 -59759 101721 -119769
15083 -119769 -466383 -302692 -44798 55608 133842 445544 560722 318264 70069 -471891
15073 -471891 -1317105 -1568386 -1459943 -1331000 -1346963 -860099 -289080 -52259 8295 -121067
15063 -121067 -120935 242183 561445 573115 372174 -47167 -299639 -149158 -234618 -578460
15053 -578460 -319654 242570 414122 324906 134015 21828 -27446 -9250 183470 366628
15043 366628 398118 593751 664135 691010 465696 267775 423053 571832 519278 617768
15033 617768 445382 331133 431287 385792 241667 559963 835917 591139 298248 241405
15023 241405 345793 425527 459035 238937 87904 9356 358243 482704 395924 444832
15013 444832 496593 227497 -194134 -314348 77137 263658 182943 17146 -16984 -12877
15003 -12877 -159035 -173418 -72846 190232 280595 302972 212824 -89017 -286827 -147838
14993 -147838 12528 45792 260760 286454 361483 512898 163129 -452863 -645194 -399709
14983 -399709 202940 611509 766801 909008 823066 614477 363039 391526 377785 101718
14973 101718 -245092 -159096 44508 184882 255704 -76717 -394140 -577247 -716061 -508796
14963 -508796 -96276 121377 23665 219484 410190 192448 126659 167452 84441 -136922
14953 -136922 -132953 128757 409970 459819 257100 -64861 -327942 -433405 -668546 -1220329
14943 -1220329 -1388894 -938048 -676266 -882688 -1133740 -1245919 -1066188 -1001354 -1124298 -1377487
14933 -1377487 -1547154 -1239402 -1027292 -898478 -810839 -709778 -963899 -1157436 -660985 -152254
14923 -152254 71456 -28223 -238653 -122335 -228713 -540600 -651940 -556053 -431089 -226796
14913 -226796 54360 -63533 -150941 -319508 -617142 -888954 -1127964 -1280494 -1320709 -1392138
14903 -1392138 -1342228 -821619 -267801 -160697 -283981 -413913 -421817 -362856 -541753 -617380
14893 -617380 -572307 -108038 224577 386744 385060 22565 -215431 -210210 30637 252097
14883 252097 110535 -95319 -368186 -548125 -591619 -554664 -165812 91315 -99113 -661583
14873 -661583 -668524 -510705 -502616 -192027 343512 574633 505170 253553 -5872 -233232
14863 -233232 -241786 59931 4148 -99706 -140123 -158116 -124297 116600 304435 213024 -171539
14852 -171539 -523603 -406405 124518 490691 306018 -169050 -755310 -998691 -914017 -440389
14842 -440389 220548 427191 372316 19170 -335624 -799955 -1309650 -1462201 -1217856 -953201
14832 -953201 -892092 -857713 -1059413 -1224416 -1207901 -1077967 -795195 -525129 -355492 -230006
14822 -230006 -81723 35571 -362193 -673260 -885894 -722122 -278339 -86550 253667 82458
14812 82458 -289895 -471710 -592445 -332508 -138391 -366173 -651204 -777994 -806305 -696364
14802 -696364 -453725 -504223 -341213 34937 119616 279720 354144 -118699 -577692 -709853
14792 -709853 -380817 255149 530068 460661 183064 -209075 -421635 -262401 -203743 -390145
14782 -390145 -448572 -341426 187504 451827 492683 799974 836482 745711 607140 349336
14772 349336 172447 89157 195313 33159 -81206 133016 124024 -292105 -562100 -643846
14762 -643846 -476685 -278043 -35813 302673 451780 652930 764237 819111 853398 754438
14752 754438 357226 -122610 -654520 -916308 -768354 -743563 -972378 -1097517 -914633 -396319
14742 -396319 -160198 -127124 -615191 -921956 -804346 -492378 -386797 -350770 53715 263827
14732 263827 -44292 -564659 -824727 -644559 -553355 -322736 -245032 -435619 -667848 -664414
14722 -664414 -758669 -1085090 -1295442 -1303971 -1414948 -1149271 -975557 -1062436 -994645 -858914
14712 -858914 -911502 -815831 -380697 -211564 -302114 -462177 -483299 -252365 -23357 -327126
14702 -327126 -877306 -768812 -360209 -94742 201879 204392 364715 703820 538480 36862
14692 36862 -435125 -465555 -214470 17907 -125506 -579759 -907041 -725940 -26251 506287
14682 506287 920898 1023178 722649 351081 171287 138069 18168 -216577 -464686 -729159
14672 -729159 -615158 -532938 -425538 -360477 -407662 -848619 -1175551 -1092453 -530272 -106690
14662 -106690 -82104 -199989 -417355 -500408 -306037 -30140 -248330 -465165 -586267 -605423
14652 -605423 -625250 -615027 -162730 335426 453237 417138 531354 413551 287029 293204
14642 293204 107270 -2902 -66071 -241956 -392751 -704671 -882771 -813849 -748212 -537771
14632 -537771 -373723 -216384 150680 410809 444014 388178 427293 162820 94689 80668
14622 80668 -164568 -747344 -699646 -6804 427676 330074 76463 -160650 -347736 -300681
14612 -300681 -271717 -16623 -153415 -585319 -914977 -1103838 -1090517 -804979 -412247 -160795
14602 -160795 -185052 -177580 -340966 -390383 -88423 182938 97953 -232159 -309719 -72906 55531
14591 55531 -10589 -154373 -434558 -619470 -498080 -549512 -735354 -599194 -334504 -280069
14581 -280069 -205621 -479972 -738606 -403496 -155323 37735 372437 532223 117217 -314880
14571 -314880 -824395 -953881 -482052 -181430 -259516 149447 881408 852220 121562 -506824
14561 -506824 -765183 -472891 58907 -170921 -605644 -944702 -919364 -667491 -705841 -451995
14551 -451995 -311339 -493255 -249207 108796 327495 455223 463343 487239 573460 437692
14541 437692 530006 745692 915030 746227 189186 -150514 -520269 -577411 -653110 -994503
14531 -994503 -1028513 -1091575 -1231768 -1381436 -1609853 -1517632 -1410524 -1121582 -528820 -14801
14521 -14801 378954 172887 -431314 -573112 -131564 231830 560456 491001 119138 -130285
14511 -130285 250284 723739 653783 387311 232826 -62154 -404138 -521312 -339049 -140606
14501 -140606 -230641 -511163 -481122 -262970 167517 256784 -14997 -176424 -267104 -191252
14491 -191252 -231045 -319927 -543673 -624731 -534349 -566897 -865991 -942166 -923135 -943593 -805359
14480 -805359 -669939 -592673 -521545 -669225 -743960 -543961 -269098 -345748 -496826 -648759
14470 -648759 -423137 145023 130906 -87600 -319561 -629500 -621731 -238313 126189 -32738
14460 -32738 25222 276725 195847 -79165 -58663 90796 38607 -234916 -191350 -119629 -263740
14449 -263740 -520000 -525063 -166386 294947 382197 424691 547103 642920 635181 416165 292612
14438 292612 20140 -170334 -310543 -152563 283041 435512 315911 334413 172943 308817
14428 308817 323831 -188788 -1049775 -1531782 -1683932 -1306500 -304852 160281 49608 -177816
14418 -177816 -104525 286109 388498 -44192 -772495 -921043 -531591 -72825 263183 543345
14408 543345 671191 668226 721506 538350 376808 -70302 -581437 -787723 -996649 -766650
14398 -766650 -771338 -929843 -754231 -323740 -97078 -324639 -579125 -652412 -377982 -329119
14388 -329119 -159848 140215 406712 184501 -90097 -571982 -835822 -832800 -468272 164324
14378 164324 138191 104272 152455 -466 -665702 -1251910 -1307673 -923057 -526442 -410456
14368 -410456 -102901 256987 170015 -41471 -260140 -200887 -187395 -598390 -1001682 -886776
14358 -886776 -167834 523014 691559 332068 -222987 -830515 -882592 -735925 -881768 -711749
14348 -711749 -278476 -273814 -379404 -418546 -712035 -637801 -650753 -887619 -937806 -968112 -867716
14337 -867716 -956864 -1299814 -1414464 -1007772 -461365 -219962 143064 528367 383232 65914
14327 65914 -83435 -61205 -167851 -325916 -642722 -489656 -358347 -55250 33144 -311431
14317 -311431 -313659 -125045 66855 -64698 -434285 -652050 -666632 -645804 -547006 -371283
14307 -371283 -282727 -359965 -210453 87358 338764 248817 -85791 -268015 -317165 -461059
14297 -461059 -745305 -743234 -213132 373201 349585 -308964 -650042 -330801 32547 266859
14287 266859 468987 579960 374940 114913 -232162 -197997 15169 -102075 -211255 -353843
14277 -353843 -672776 -1014258 -1081192 -1042346 -1061265 -883960 -710365 -567255 -326945 -444076
14267 -444076 -824106 -796379 -535826 -360947 -333160 -477296 -206865 -317910 -583039 -755374
14257 -755374 -650339 -178108 67117 -29131 285515 291249 -96645 -402274 -686948 -634431
14247 -634431 -60835 -25425 -177588 -266510 84070 154127 -344195 -487715 -686878 -780064
14237 -780064 -585854 -501846 -892896 -1172961 -1072780 -1029187 -967591 -726460 -534619 -602360
14227 -602360 -704440 -730694 -960850 -1216361 -1144621 -933656 -867805 -654395 -392777 269067
14217 269067 959632 1308519 834668 356489 388474 274339 140603 478294 719565 930306
14207 930306 834761 380036 -237855 -581748 -382312 174299 590785 846170 1213035 1081856
14197 1081856 749859 722848 470533 -61475 -527013 -668764 -875762 -1209325 -1226823 -1612931
14187 -1612931 -1711909 -1181048 -764931 -352256 -231174 -227591 -11320 383191 798824 510993
14177 510993 -66601 -212774 -128765 -176867 -519964 -700164 -374918 -408128 -580126 -484455
14167 -484455 -492104 -730741 -1167047 -1037361 -769410 -779849 -704409 -420934 -382553 -487133
14157 -487133 -34214 206529 405 -489357 -613258 -683601 -973689 -1004443 -913325 -846871
14147 -846871 -864637 -1246139 -1387444 -1017243 -888058 -1037192 -1287458 -990216 -649650 -280264
14137 -280264 120429 155681 123541 -315463 -482657 -230614 -303827 -555759 -736772 -773181
14127 -773181 -515146 -242460 58498 178177 203482 386150 307985 155882 187477 188186 142275
14116 142275 -53706 -331621 -594256 -963301 -1178749 -1130218 -1242039 -1220773 -1095501 -916477
14106 -916477 -823331 -951869 -1078066 -954760 -827237 -718781 -558725 -455230 -605487 -566673
14096 -566673 -407123 -310826 -334684 -165135 204386 191733 -16293 12650 -222300 -537835
14086 -537835 -520945 -472488 -525314 -527667 -436345 -482712 -339536 -4949 273680 74231 -217511
14075 -217511 -329256 -317797 -360479 -485898 -520073 -495764 -367099 -323297 -462193 -279334
14065 -279334 -421972 -471011 -440244 -342299 -78752 79393 248236 231530 139580 355668
14055 355668 282438 84356 137262 450185 730912 532572 15024 -129946 76404 193825
14045 193825 219542 -160405 -467741 -294289 -49997 1815 -154677 -524547 -718882 -908607
14035 -908607 -622806 -663615 -846528 -732474 -363481 24921 137736 162009 311108 151499
14025 151499 241930 435426 509285 581788 749152 677013 150243 -113340 -414580 -816468
14015 -816468 -578655 77284 428902 525049 539686 237991 22547 -126512 -540612 -799588
14005 -799588 -706610 -493711 -491675 -605350 -574909 -449077 -541675 -923224 -1163964 -1216792 -1165908
13994 -1165908 -890543 -422345 -118752 -171297 33054 303035 288464 50725 -43161 -304283
13984 -304283 -185834 296206 833871 666715 -28399 -608553 -1043028 -1129889 -897079 -732224
13974 -732224 -724928 -717137 -681319 -747096 -759699 -508251 -347681 -254654 -150279 2255 -56509
13963 -56509 -469550 -667849 -493811 -370379 -203872 -123561 -48567 -44810 -170622 -232829 -427383
13952 -427383 -433615 19348 342204 346845 335984 169069 -449773 -1029415 -1009806 -878644 -803985
13941 -803985 -882912 -935172 -520769 -85859 -31867 -173216 -237952 -432499 -716130 -690668
13931 -690668 -503096 -165024 -69056 -281737 -336394 -189125 -215443 -390419 -629988 -696524
13921 -696524 -788060 -717002 -564923 -517196 -530193 -287966 7793 128414 109810 -155014
13911 -155014 -582820 -1031849 -914992 -573166 -637759 -638721 -702903 -651176 -489075 -316364 -521302
13900 -521302 -912365 -1186769 -874198 -495426 -187156 251103 346964 81216 100753 403115
13890 403115 464354 299549 152822 37485 270502 796290 1029100 1105657 711672 210560
13880 210560 48600 44048 120642 -139314 -582740 -986167 -1202753 -1044298 -911733 -867728
13870 -867728 -880158 -956078 -1317241 -1785293 -2045450 -1623072 -1226288 -1345478 -1100178 -574563
13860 -574563 -212031 94281 57385 -99324 -265179 -42351 186649 -12657 -212207 -50080
13850 -50080 41289 321032 563383 539980 496245 101868 -117488 -249885 -461816 -617458
13840 -617458 -383154 -278405 -356527 -191124 -241936 -559312 -757459 -716625 -204600 132645
13830 132645 276957 319870 137162 355 170354 593507 1025631 1204394 1213882 1285058
13820 1285058 1087912 1005119 977453 820769 632710 244422 98379 133883 126137 140747
13810 140747 106473 -24039 -41010 208542 675427 1236923 1189569 876090 681811 425581
13800 425581 -210282 -722455 -771058 -473353 -693038 -861222 -709236 -746839 -528167 -304920
13790 -304920 -320087 -349921 -579183 -837300 -887398 -754987 -508845 -294403 -238204 -29780
13780 -29780 69616 61866 184333 236181 343623 333999 67434 116046 376253 243500 -199633
13769 -199633 -288355 -21668 311705 402881 385319 551033 801039 893244 909060 784505
13759 784505 712851 745041 1037416 1156881 963377 657603 341599 84338 -236525 -738505
13749 -738505 -967112 -625069 -115978 -139527 -347261 -410543 -68497 244297 158742 -98652
13739 -98652 -566395 -775764 -801649 -391559 86638 241582 221155 229696 -140103 -382632
13729 -382632 -206271 -144066 -48360 199808 517825 876993 894764 665637 256209 -324010
13719 -324010 -411318 -334963 -542067 -758958 -913311 -1033453 -804420 -318847 53349 36128
13709 36128 38345 225519 313209 242626 121491 486435 647974 696264 806155 659336 313307
13698 313307 239843 175553 56139 89982 135572 26356 204199 402659 710441 1063916
13688 1063916 1103956 1044773 812932 609068 110572 -410907 -313590 -67491 31900 246335
13678 246335 536501 797710 996056 1214334 1362189 1433788 1447692 1208161 957291 741663
13668 741663 397019 317145 159571 -275141 -715860 -853017 -610649 -7403 755437 1075100
13658 1075100 732439 176740 -83329 -6860 59450 100067 324221 521774 764247 1070112
13648 1070112 860617 456916 293172 292353 359301 237293 175940 245223 29884 -530239
13638 -530239 -1115399 -1290720 -1014758 -735095 -550367 -382229 -421455 -587653 -465247 -324148
13628 -324148 -256617 -322023 -169858 156671 205305 -83207 -534719 -750884 -628434 -681749
13618 -681749 -579903 -494941 -423805 54115 482885 576584 511473 403704 213692 160474
13608 160474 406288 579686 655711 783763 816380 697611 606642 670609 522067 252356
13598 252356 300625 -5866 -290515 -348753 -53481 545577 700137 320889 -19183 -18335
13588 -18335 -97837 99560 451846 404940 254438 155795 -64771 60643 505970 712487
13578 712487 431289 476876 312971 370270 589820 116030 -152187 -393439 -584853 -294898
13568 -294898 59853 59205 -199544 -19139 258518 287775 266765 358818 678519 792066 876169
13557 876169 738820 338851 89239 63205 -51594 181250 173655 683 -276897 -511551
13547 -511551 -494178 -220742 -108914 -206848 -413113 -508442 -170582 -81379 -30419 -66454 -411554
13536 -411554 -519931 -194399 -174914 -306023 -180694 -29385 20253 326780 621678 266978
13526 266978 -363176 -734434 -1296748 -1628940 -1504817 -988197 -377079 -309533 -657286 -442430
13516 -442430 65457 505100 634127 750700 777535 579291 465655 567980 629984 486583
13506 486583 165522 -340312 -725322 -760407 -375410 -264222 -221130 -218182 -132142 274076
13496 274076 488761 307246 242014 288685 174401 225062 304323 182137 45624 -316626
13486 -316626 -503868 -210031 300928 628026 608785 495115 631231 945255 1046657 1051748
13476 1051748 962881 883645 364434 60866 213355 221748 359142 501572 473327 588332
13466 588332 445866 96058 23103 276723 468783 631697 599644 33983 -350760 -236982
13456 -236982 -274268 -409216 -307452 117628 227112 -17812 -210467 -56400 8502 -136019
13446 -136019 -171653 -185989 -391413 -600957 -522476 -78533 44385 12327 232689 641067
13436 641067 1151479 1250003 932982 451860 -453444 -1368307 -1512488 -1375119 -1067811 -710630
13426 -710630 -268592 166847 283206 171516 -38405 -46354 32017 -85744 -382334 -489554
13416 -489554 -252402 -142637 88133 261512 355032 508486 274770 -89152 -128857 182220
13406 182220 504331 616374 367591 428380 496972 173455 21605 79306 628022 952299
13396 952299 404835 -18005 157027 254172 263713 448794 916496 1219339 1269649 970403
13386 970403 673227 535412 112433 -252196 -88290 232159 317711 548710 811263 911973
13376 911973 806662 501216 300745 376652 658279 675459 559486 147886 73663 389711
13366 389711 191836 -554156 -1181457 -1430698 -1125976 -691732 -348443 132509 460715 731520
13356 731520 876566 1056944 1332750 1499093 1528877 1089578 788003 509720 204430 507140
13346 507140 881607 1212132 1048850 818647 834245 1023967 1082822 598391 23731 -152530
13336 -152530 -148417 -29068 232729 460705 667767 583832 488851 279472 -281432 -418265
13326 -418265 -63719 548860 1194804 1263096 938428 640720 524517 370206 248653 413982
13316 413982 454528 307845 487201 695083 780324 837254 681891 510553 508703 712145
13306 712145 897947 643012 538621 345599 101695 -35124 -215742 -217803 -148161 182656
13296 182656 389488 208773 205234 270042 510 -32206 62402 -12659 109983 193466 311383
13285 311383 335411 69836 -107362 -38691 -70398 1885 -13582 211874 668439 810582
13275 810582 344751 -131007 -129153 -114886 22165 16125 -106089 -171826 -90575 48607 192218
13264 192218 24502 114787 387720 466369 376552 182099 34336 -54900 -57335 -306121 -348667
13253 -348667 -490105 -455356 -45936 79977 164715 593464 804649 781260 744416 702211
13243 702211 659240 428785 249926 334432 93741 -378455 -414361 -359186 -435932 -366870 -213920
13232 -213920 -81674 79271 226245 316880 356086 172769 -328734 -420038 -157982 129861
13222 129861 442617 444390 86938 -506872 -883032 -945629 -467076 -225983 -193943 41550
13212 41550 490495 720576 326432 47776 159245 641104 972213 1080814 1152392 1198322
13202 1198322 1045140 651236 808082 1192590 1372009 1645701 1917001 1580654 988999
13193 988999 368826 238820 669073 634409 374433 614146 738121 567216 756453 730188
13183 730188 331671 -205127 -475288 -501764 -554736 -363424 186126 522703 900946 1027122
13173 1027122 820097 828888 879277 779789 810185 809213 613354 264721 -103518 -86082 177382
13162 177382 528765 682503 599465 556609 601358 627459 897160 823746 449216 301413
13152 301413 698664 1073269 985174 709600 150709 116958 578699 907738 1017859 914822
13142 914822 1047974 1274454 1120173 789605 359722 231739 340406 542436 250370 36987
13132 36987 230111 286411 441336 794546 1192981 1698884 1747636 1568075 1792810 1994264
13122 1994264 1883510 1559068 1651595 1796658 1499844 1295329 1216109 1199234 1171529 1302500
13112 1302500 1688582 1685607 1380073 1623155 1751689 1442937 1106901 999828 873622 713966
13102 713966 769686 876680 958235 778016 397030 291862 320441 343429 560956 900645
13092 900645 1001614 1120526 1358600 1387112 1479550 1650812 1424052 929786 917348 1332281
13082 1332281 1780738 2061296 2197432 2182949 1848508 1726725 2078755 2306469 2063146 1823459
13072 1823459 1830976 2016932 1981414 1646441 1266270 892060 1069358 1524568 1835894 1944467
13062 1944467 1902909 2183345 2253699 2064937 2269324 2680796 2720566 2788273 2775696 2391881
13052 2391881 2050954 1741174 1771427 1778042 2051643 2883639 2678770 2367470 2446160 2635285
13042 2635285 2841004 3189559 3379346 3361373 3577807 3204325 2742443 2972950 3473280 3613365
13032 3613365 3742220 3902078 4001441 3994780 4063559 4325949 4260590 4211061 4263071 4250857 3866284
13021 3866284 3768428 3928699 4451118 4999037 5165102 5199466 5378481 5664033 6148169 6319725
13011 6319725 6212958 6500538 6830557 7095496 7406127 7965658 8805133 9752226 10981138
13002 10981138 12371541 13565507 14743239 16294481 18546660 21230866 24586205 29110485
12994 29110485 35259630 43338488 53421105 66184894 83284322 107070272 140156077
12987 140156077 185513461 244907156 309868834 353161920 349061640 303967811 245859393
12980 245859393 193864229 153322616 123478640 101324507 84712795 71740577 61264879
12973 61264879 52851541 46053114 40285792 35697670 31780403 28429281 25462875 22845895
12965 22845895 20451696 18475715 16863250 15883778 15076702 14415387 13668426 12752019 11901409
12956 11901409 11166370 10620411 10158245 9774809 9251674 8750149 8480994 8526903 8193035
12947 8193035 7523881 7164596 6871882 6563610 6353655 6346953 6308767 6461984 6900543 6980880
12937 6980880 6865555 6944393 7128113 7644029 8070770 8241199 8814423 9689243 11023416
12928 11023416 12833892 15040422 17682646 19902388 20655093 19774142 17946759 16128576
12920 16128576 14896100 14107262 13696332 13560358 14286900 15479418 16905995 18571175 20104665
12911 20104665 21884389 24250743 27474236 31934396 37859527 45348582 55123801 68705302
12903 68705302 87127993 112111263 147014378 195766850 259408080 326732829 366673193
12896 366673193 353330426 300515529 239361011 187233799 147738590 118902794 97676719
12889 97676719 81308793 68499931 58337673 50177477 43738568 38310173 33675038 29870020
12881 29870020 26620645 23657681 21399779 19848530 18467762 17060777 15645927 14217174
12873 14217174 12720052 11651106 11061588 10471679 9681021 9261251 8959364 8531744 8014483
12864 8014483 7510856 7444643 7463665 7367021 7020431 6204864 5909713 6096717 5901013 5711450
12854 5711450 5892433 6145181 6226861 6164736 6053137 6195358 6507574 6834877 6666446 6174761
12844 6174761 5618460 5564015 6079890 7022918 7520597 7414338 7550516 7963467 8425067 8708844
12834 8708844 9077754 9386833 9787449 10414094 11063848 11632042 12667315 14246528 16414230
12825 16414230 18892036 21450326 24446613 27902043 32640979 39181018 47574939 58229647
12817 58229647 72348334 91410468 117815246 154463610 204549018 267157160 328387371
12810 328387371 358582406 339389636 286862532 228692857 179336818 141801463 114049142
12803 114049142 93511572 78121397 66047285 56006952 48025911 41621655 36145591
12796 36145591 31878835 28293190 25393423 22632983 20110372 18201495 16681865 15279891
12788 15279891 14056409 12591232 11482723 10509278 9575089 8700661 8109481 7607226 6983963
12779 6983963 6340642 6140796 5900110 5850621 5759610 5423025 4867275 4270167 4183701 4591318
12769 4591318 4908107 4694491 4219999 3535251 3377155 3201903 2761718 2717043 3089608 3287101
12759 3287101 2881066 2515927 2446330 2465151 2414280 2119259 1897571 1849522 1928621 2522831
12749 2522831 2708749 2488954 2446407 2398212 2336840 2134222 2107524 1955277 1845116 1529594
12739 1529594 1067892 857963 890591 1233001 1589214 1667816 1334856 1048877 1198050 1056141
12729 1056141 792165 998149 1194706 1406905 1530053 1412396 1183846 1032133 939042 755521
12719 755521 540818 340843 198080 224739 612392 907747 845373 855180 855802 1054023 1011160
12708 1011160 694709 913020 1600114 1694467 1306942 1234630 1210986 720472 -47773 -418615
12698 -418615 -219931 97279 43392 29205 67577 151778 178790 509299 864452 534097
12688 534097 204729 448888 644743 906504 851150 629402 514644 627500 759165 735116
12678 735116 684339 634725 882191 1162106 1320338 1366409 1477493 1411769 1015973 742654
12668 742654 680307 462437 559151 928362 732747 229933 -58987 325012 642034 547185
12658 547185 333664 158535 341357 715494 920084 1123057 1133319 909035 694306 912910
12648 912910 1064564 778296 201878 -25647 75786 203573 356761 187058 -59107 67822
12638 67822 219700 278446 410635 677586 575364 428132 1040827 1369353 1104236 947411
12628 947411 956774 904080 405274 51751 158872 169799 -208480 -19978 312207 252791
12618 252791 304000 678797 1026721 1205465 1428195 1124038 895684 550438 -39921 -330127
12608 -330127 -238800 -21037 212486 319408 414886 355755 387500 498554 575720 888351
12598 888351 983807 929700 744125 440788 702993 819422 477693 413959 397870 481800
12588 481800 550469 322870 186765 218396 420185 728471 727119 524144 425542 551409
12578 551409 753455 873572 654682 717627 738892 188568 63107 338866 528376 633656
12568 633656 584207 671868 527405 385562 280625 71062 -154947 -588793 -426993 -15544
12558 -15544 642387 1402682 1424603 1208284 1122959 860384 658405 419061 318860 438444
12548 438444 440248 347455 181402 -245465 -365680 -106691 -105938 -384192 -433483 -180669 129913
12537 129913 282681 154387 181817 242820 377177 522364 256370 45793 -55579 -236616
12527 -236616 -402968 -344268 -137674 68610 142458 490061 948014 888492 575881 412822
12517 412822 352795 300400 238407 574451 670926 650925 680988 823154 691787 452203 726314
12506 726314 1154222 1070803 691926 611841 569436 459065 508873 410115 260014 167903 -157338
12495 -157338 -125882 214185 266488 315091 627264 850835 807776 603816 163549 -314043
12485 -314043 -449439 -868741 -1080211 -769188 -231416 -219631 -330636 215986 636878 596775
12475 596775 607896 574060 604328 640191 552642 194511 105842 343854 101199 -92153 -41525
12464 -41525 -107697 -31580 76526 180370 794681 775124 513126 164701 -231936 -302805
12454 -302805 -479502 -652319 -891565 -1031948 -949983 -922823 -1152929 -1085219 -1035897 -962994
12444 -962994 -669308 -282469 -285936 -776728 -1422030 -1223813 -402620 59192 282968 140151
12434 140151 345373 574406 511841 390524 39196 150592 227651 71219 -195941 -28219
12424 -28219 373274 546092 478501 402471 235977 68880 -305893 -454351 -19348 365811
12414 365811 303014 -136330 40272 344851 330167 803140 1402205 1441521 662262 -231014
12404 -231014 -997328 -1378175 -1158120 -644280 -124487 -251315 -459602 -296149 -45169 210978
12394 210978 354126 267187 -50563 -8937 43948 136336 280909 593761 693435 378190
12384 378190 -107968 -282310 -80059 -17364 160982 240282 75545 -302280 -537052 -501301
12374 -501301 -146821 -94199 -196731 87579 584419 765851 674052 545268 413924 148537
12364 148537 173392 258340 452763 543977 590108 272985 -562538 -836478 -407976 -46767
12354 -46767 203204 620193 802033 571493 302494 43429 72900 127101 425239 662420
12344 662420 1006697 1414551 1524460 1484705 1347791 1159447 738833 337933 202263 -295227
12334 -295227 -871662 -784416 -460457 -529626 -542933 -176538 453577 928966 761054 591499
12324 591499 452558 273977 148258 189698 577679 977767 865291 461718 275122 201154
12314 201154 -154020 -395027 -338706 -174042 -337965 -663517 -500681 -37739 195344 270889
12304 270889 103770 -94685 -173775 -107839 105666 203907 324120 331130 257842 186154 -19191
12293 -19191 -308862 -193244 -114193 -453037 -586724 -276417 -25275 260676 58739 -436601
12283 -436601 -602239 -473239 -429071 -490504 -741107 -914562 -645207 -451271 -500197 -283988
12273 -283988 -100720 -112072 -201866 -156952 45582 -33529 -213157 -205845 -362052 -800348 -826766
12262 -826766 -416350 -51493 39862 -218678 -376284 -365889 -261610 -99086 -240333 -214595
12252 -214595 -366666 -571365 -774770 -840545 -842921 -854881 -914041 -770160 -758005 -568789 -168651
12241 -168651 -313059 -445412 -450978 -184072 200806 430496 156920 -265270 -308975 -369440
12231 -369440 -585790 -697462 -857041 -990910 -1161834 -1341353 -886845 -527428 -289919 -325983
12221 -325983 -469384 -271126 -119313 261514 128128 -408619 -424854 -88043 -112314 -126374
12211 -126374 -133244 -35973 -149867 -320105 94907 438837 207954 -102457 -39386 631959
12201 631959 968135 648499 262655 350960 813644 1238955 984366 413929 143870 184276
12191 184276 215090 353525 471306 233944 -117525 -373987 -579799 -742375 -792841 -686973
12181 -686973 -873810 -1393157 -1603728 -1664816 -1406543 -1090166 -642775 -228872 2939 177776
12171 177776 286978 246427 175247 -59558 -530954 -546420 14833 311685 -9653 -278790
12161 -278790 -178822 -451424 -995848 -1133854 -695881 -120877 -175622 -417016 -140370 -17933
12151 -17933 143597 250017 -103021 -266597 -85724 -179794 -523393 -591687 -150398 132960
12141 132960 48189 121542 311241 539936 485907 245316 -51749 -48725 159370 -16925
12131 -16925 -113340 -381505 -553183 -181970 -134150 -315480 -154983 -140763 -495290 -584778
12121 -584778 -856526 -1219128 -947436 -308339 -2933 -281364 -313914 153641 505360 666761
12111 666761 644799 619090 748390 517729 294651 -8589 -54956 298056 378950 105032
12101 105032 309880 697170 945812 620169 288675 -167033 -331749 -93136 436178 732018
12091 732018 818032 409593 8176 -164712 173944 483477 86797 -279918 -211335 173303
12081 173303 388192 617369 811290 885225 928208 796912 829006 826770 454026 313467
12071 313467 -49258 -801725 -1286104 -1535343 -1360745 -978359 -1133839 -1222239 -1062858 -1111699
12061 -1111699 -1025486 -654538 -292149 -345228 -419046 -199119 5791 62172 49621 16020
12051 16020 112164 295130 245303 74988 -70293 -51736 362044 611006 695900 793832 916428
12040 916428 879233 577067 391158 29418 -165635 -122700 -38278 180639 620324 1086666
12030 1086666 1317703 1279445 744988 99512 -179298 -270484 -109025 29568 -73691 -132675
12020 -132675 -212740 -289013 -358460 -346238 -187241 92508 223473 362497 570946 505167
12010 505167 544987 684371 437736 392406 767736 1446175 1945800 2251831 2467150 2649063
12000 2649063 2925091 3165015 3185536 2755389 2518711 2479084 2733396 2921613 2717435 2296513
11990 2296513 2162784 2008307 1671110 1314908 1347266 1565695 1563756 1014083 697559 656849
11980 656849 371319 112089 -6051 -165950 -277265 -54859 257407 308798 308846 366297 397540
11969 397540 535422 605974 439619 309399 201838 -128399 -447626 -228058 -74759 -195188
11959 -195188 -690105 -752097 -731529 -493908 -227026 -114192 -232251 -317603 -328802 -652289
11949 -652289 -598096 -415945 -280723 113228 577708 1010711 876061 631611 577241 495282
11939 495282 409667 365588 58365 -1593 131360 527969 1050563 1544144 1352713 902680
11929 902680 946081 962593 971125 834156 744659 526435 480368 424681 310146 219260 -34197
11918 -34197 -25415 108366 -118782 -98564 67753 -344101 -651362 -617888 -682433 -766901 -843925
11907 -843925 -579525 -133257 15154 29316 -205790 -280340 -46723 289061 90405 -251556
11897 -251556 -310216 -338141 -547923 -540261 -361671 49229 503664 820244 984741 597699
11887 597699 163783 -43110 -72174 332178 419586 132700 -49623 -369158 -473720 -257495
11877 -257495 16735 452530 815733 522931 41420 -296230 -594293 -484031 -167712 -34327
11867 -34327 -24712 -228071 -505018 -550222 -283177 -45716 -31763 -125120 412897 846378 842315
11856 842315 383254 -38474 -441896 -699578 -1065192 -1065024 -713270 -764910 -839976 -224032
11846 -224032 420005 410387 285974 273641 310995 154633 58195 63005 -42831 32237 84192
11835 84192 -84019 -206373 45165 268934 276561 -123388 -563564 -805069 -1137163 -1158439
11825 -1158439 -651111 -217353 -87847 -47719 -197352 -468838 -778941 -860968 -645970 -254333
11815 -254333 21270 -60039 -309248 -528952 -591078 -492437 -369104 -262864 146532 379149
11805 379149 606886 666655 485068 621333 784348 564544 46288 -297619 -116713 -108809
11795 -108809 -287794 -251237 -74479 -185737 -191580 -165694 -12593 275363 428171 436678 358826
11784 358826 808737 1132703 1031845 730559 427945 263556 212012 -70230 -365367 -539017
11774 -539017 -350991 -142825 -133198 -279331 -452395 -708185 -639843 -334506 19756 -30895
11764 -30895 -119008 -39372 -101291 56793 247502 264681 77045 33328 -39578 77307 214478
11753 214478 -137086 -230774 -41875 -388563 -945912 -1287258 -982827 -289918 -49721 -116559
11743 -116559 -190030 -327862 -354707 -480732 -638103 -431773 -67318 92969 -152393 -388188
11733 -388188 64624 394547 362578 179024 170246 217743 -57818 -255161 -85045 -377221
11723 -377221 -794884 -846822 -569982 -334546 -207471 -67859 -7177 -102901 30021 -155608
11713 -155608 -454480 -200715 -20664 33780 211415 310501 186720 95501 111571 88233
11703 88233 239952 529614 879242 946475 1056817 1145253 942047 438718 -37334 -326487
11693 -326487 -682503 -624122 -699789 -732087 -817684 -615649 -93587 231254 6228 -477700
11683 -477700 -802458 -953174 -695609 47196 217581 100062 -251381 -634676 -484391 -32062
11673 -32062 -77060 -54491 78587 -115312 -333312 -660586 -490230 -155009 -157178 -452906
11663 -452906 -784279 -839140 -250841 150533 203914 204565 400084 303965 -191759 -479736 -469554
11652 -469554 -105247 56641 156862 29568 -107426 -90970 -441466 -503665 -384540 -659489
11642 -659489 -1067976 -1095751 -678499 -636223 -546855 -46106 209181 -39159 -182135 -114263
11632 -114263 -401795 -636702 -862857 -1222203 -1486337 -1614492 -1573017 -1284003 -946722 -723439
11622 -723439 -739864 -903072 -563015 -41043 265672 331518 248499 194717 51729 60591 148264
11611 148264 295394 208418 -40459 -48911 131009 364179 184962 -123208 -297097 -499768
11601 -499768 -431860 -292207 -7141 -78913 -508447 -636743 -651487 -626351 -363565 535184
11591 535184 776791 529979 426003 229316 -43474 -123570 -133091 -300219 -539723 -777913
11581 -777913 -631441 -454466 -379208 -508951 -578768 -135363 326532 164200 -107602 -213333
11571 -213333 -74402 -134832 -210945 -163522 -91876 233 -17838 -160182 -8563 262203 1860
11560 1860 -295370 -483599 -573837 -427451 -133119 -224136 -592481 -772615 -383992 32116
11550 32116 -210647 -660731 -571245 -337821 -315735 -308200 -105082 -180202 -512165 -636023 69694
11539 69694 484090 267912 -102797 -223923 -545539 -630658 -448435 -375963 -409160 -323083
11529 -323083 -347633 -875389 -1250693 -1089262 -609684 -188466 -204312 -397484 -746583 -522859
11519 -522859 -240933 -550892 -500927 -316847 -475532 -643911 -473812 -262260 -231418 -285513
11509 -285513 -347630 -492071 -457855 -262280 -90123 -40863 -300643 -527676 -517366 -254764
11499 -254764 -190941 -221602 -19127 -52458 122897 556458 669608 810650 999748 843968
11489 843968 776301 689648 365107 122265 260466 524568 890278 748334 338690 78781
11479 78781 -95094 127907 593412 905806 486725 136346 90773 -151422 -613464 -1024677
11469 -1024677 -916400 -495016 -273365 -682649 -779647 -569682 -583950 -494615 -406205 -794018
11459 -794018 -1222910 -1257871 -981617 -982485 -662931 119057 294528 145320 195337 216962 -148943
11448 -148943 -661987 -548149 -573201 -729057 -772040 -604618 -516604 -467809 -314769 -237747
11438 -237747 -284414 -353130 -459559 -676173 -842483 -796701 -719099 -666376 -1114488 -1357010
11428 -1357010 -1230333 -1286430 -1260040 -1134613 -740282 -146872 295996 320221 44685 202774
11418 202774 502792 597748 386594 -32942 -477060 -654922 -864317 -931026 -494219 22733
11408 22733 339682 206560 40508 142750 633214 1043248 981762 755795 642638 589935
11398 589935 731699 759143 249499 -16327 119161 117325 365087 607930 478047 380233
11388 380233 247413 87295 -39428 -228565 -194353 -116672 -206699 -85741 108955 284119
11378 284119 440424 317348 262504 169065 -13150 -40212 80004 19501 -342632 -278985
11368 -278985 182482 425892 603662 798742 1052739 1211811 1077617 1039734 1100970 852310
11358 852310 290930 294851 792027 808793 747800 733556 491381 360972 124996 1249
11348 1249 178690 240714 266877 486860 617741 610256 311476 -3840 -347031 -845029 -996791
11337 -996791 -802879 -782145 -928034 -727579 -181034 636570 878705 727295 815435 658303
11327 658303 359925 150814 54305 240255 392452 396651 315344 352845 456250 621970
11317 621970 493120 128936 -135359 -504816 -687907 -1086553 -1251604 -1044613 -860506 -658155
11307 -658155 -697884 -871252 -1043633 -906019 -746714 -693145 -439562 -444326 -629173 -811315
11297 -811315 -819236 -561278 -306007 -37591 39784 43392 -35762 15534 60616 -129787 -474190
11286 -474190 -320158 -129439 156904 521021 573767 345777 90470 -103260 -340363 -866994
11276 -866994 -1081185 -1019239 -982762 -636739 -482764 -478742 -266810 -536173 -969827 -1008557
11266 -1008557 -1040850 -1538076 -1737560 -1388294 -977772 -778791 -689008 -548519 -64648 135886
11256 135886 -232987 -87616 316417 451641 701127 801751 755161 800807 449075 141481
11246 141481 381965 527136 528525 458638 313641 553861 895745 772612 266839 160272
11236 160272 277404 391471 206684 299889 709996 811554 347441 -189880 -171277 -134516
11226 -134516 -244401 -424592 -234899 135808 166319 -50751 -204661 112650 134131 -7019
11216 -7019 193796 153309 87303 298311 709647 1127832 1058666 462075 57614 -163381
11206 -163381 -221861 -144233 -56063 57556 291382 977624 1473495 1347245 1269384 1108945
11196 1108945 959704 1006135 899220 572125 -38049 -70870 28183 107371 141940 312224
11186 312224 479454 610612 721165 1011240 1035046 504715 101952 -107879 -301118 -182228
11176 -182228 29708 422959 817734 1098443 1150858 753623 575738 1127232 1703072 1886636
11166 1886636 1441398 586606 11972 50467 375538 319620 -49721 -20422 251284 123871
11156 123871 -228237 -401039 -251003 -18126 -190973 -635566 -686459 -311431 -117751 -400713
11146 -400713 -577987 -561266 -538462 -528754 -265689 391799 890664 1011741 1232963 1086795
11136 1086795 868764 401259 138348 558843 605002 191638 -144329 -168477 -55489 -283352
11126 -283352 -364349 -631881 -844969 -492413 -231561 -224348 -394632 -481829 -162276 167529
11116 167529 529381 826519 795722 339434 -56843 -468969 -1020132 -1335998 -1354271 -916843
11106 -916843 -334272 -211796 84119 696589 673757 271171 -28512 -373108 -430759 -129659
11096 -129659 242891 657043 687583 448706 125018 -229770 -155967 -109856 -385362 -380908
11086 -380908 -385325 -626990 -661048 -626868 -400705 162877 521947 277224 -254618 -234157
11076 -234157 -5219 -297867 -438677 -230509 -239608 -566968 -651564 -649520 -576418 -529035 -563251
11065 -563251 -469388 -66708 348749 438610 392994 85004 -272562 -666399 -926614 -976239
11055 -976239 -721041 -337257 -294450 -465213 -764530 -1166997 -1332837 -1084330 -1078354 -1230107
11045 -1230107 -962157 -608644 -417934 -247554 1249 185104 95093 -317329 -343190 107413
11035 107413 446664 596776 607087 645288 617884 152210 -177985 -143763 -287902 -207781
11025 -207781 -288466 -564025 -385840 15992 414082 374568 171693 293960 88473 -328013
11015 -328013 -639406 -1163204 -1454499 -1229014 -1088115 -1132611 -1043799 -772844 -694414 -1150717
11005 -1150717 -1798214 -2178909 -2166419 -1660863 -1023949 -533674 -621305 -895790 -1124212 -1383291
10995 -1383291 -1070547 -691336 -565837 -758380 -1106915 -1156752 -953367 -632038 -262009 -187630
10985 -187630 -363663 -841054 -1223246 -1221482 -1065854 -690880 -356925 57918 201619 162345
10975 162345 283599 73206 204202 538833 795916 787624 1073433 979396 855695 1021708
10965 1021708 1009486 791517 674564 833121 903824 1052285 769062 49674 -595151 -1221538
10955 -1221538 -1241943 -1063422 -896185 -708942 -724598 -779943 -367189 -73868 -471 -303162
10945 -303162 -271705 267464 279782 -24878 -580715 -757437 -460455 54858 206077 314088
10935 314088 385506 246990 31330 -382675 -669031 -1015972 -996094 -652732 -744465 -786130
10925 -786130 -800130 -703624 -171783 199487 148790 -463758 -835347 -577693 -289366 -108419
10915 -108419 -187620 -238043 -345227 19337 562922 387597 267258 402376 407301 240126
10905 240126 106922 243295 528786 865534 1059637 1237832 1354561 1148454 400239 -264146
10895 -264146 -273779 -57670 -251020 -480283 -490661 -259086 159994 599432 620792 500765
10885 500765 301954 -43464 -408751 -864448 -1116079 -956138 -719752 -660027 -441581 -217970
10875 -217970 -88156 -35964 -66511 54278 66197 -175260 -135497 -67593 -46056 -69637 -171528
10864 -171528 -396039 -793258 -931469 -833362 -943849 -958393 -905297 -669218 -606748 -710517
10854 -710517 -578115 -507063 -640859 -495296 -110653 10954 171299 111410 -17059 132306
10844 132306 301408 168128 17412 -46007 -122408 111213 110473 72061 90826 -136172 -203448
10833 -203448 61092 227421 172517 97729 -148489 -72271 -284432 -85970 164744 327104
10823 327104 734586 723531 495353 535367 822615 1102503 947200 82042 -492570 -639535
10813 -639535 -500904 -294047 -500711 -834439 -437928 207910 337708 118331 3647 392746
10803 392746 704699 673903 217223 -97072 -174583 -428399 -519429 -588586 -795513 -1217019
10793 -1217019 -1121790 -492300 9653 239091 -108944 -794639 -1285206 -1374957 -1212109 -1157263
10783 -1157263 -923673 -465607 -203428 -259649 -235729 703 82030 131585 259175 449989
10773 449989 -21606 -690014 -1226635 -1032390 -579709 -473074 -294050 -294772 -191476 -82763
10763 -82763 -79897 -40131 -27584 15748 85025 57951 -129941 -155828 -45184 -210499 -368666
10752 -368666 -349457 -367330 -460061 -390746 137811 456645 419427 136631 -451349 -752736
10742 -752736 -657879 -595580 -704524 -823516 -454653 38758 276251 356742 307426 345545
10732 345545 169564 -63182 29822 89033 85704 81827 -55919 200603 470752 306441 -79991
10721 -79991 -196580 -160026 -31589 38942 -112993 -233629 -87373 -110164 -411984 -46565
10711 -46565 424747 345328 49509 -248391 -262561 -500654 -646688 -619635 -532664 -229862
10701 -229862 -295822 -909459 -675149 -18793 87427 1490 -28954 -152916 -276168 -6956
10691 -6956 243030 122573 -206304 -559646 -674284 -405631 161962 152256 -382969 -971630
10681 -971630 -1137251 -928876 -836723 -727008 -343276 -468559 -621772 -558413 -337299 91963
10671 91963 127773 -52667 -324127 -560674 -796084 -1159042 -1434307 -1205855 -909879 -808909
10661 -808909 -647409 -658838 -695707 -449392 -288303 -164996 -200213 -240753 -296948 -339374 -277049
10650 -277049 164196 502296 304301 -360546 -732513 -283771 648441 844148 481838 420248
10640 420248 308781 468755 499377 291170 291708 314618 128742 279835 452197 263271
10630 263271 63646 -176885 -107755 -61159 -280420 -123391 165574 142884 268957 246482
10620 246482 276679 273267 -141561 -312910 -374646 -505587 -490817 -522437 -669790 -829187 -325665
10609 -325665 336115 574471 405943 155827 1675 -365828 -286690 225479 235384 169270
10599 169270 477129 706019 291369 -304815 -529196 -420072 -247713 -165827 5134 -68405
10589 -68405 -520171 -787992 -511363 -34586 -24707 9617 -218904 -511594 -456010 -337908
10579 -337908 -332754 -487045 -285410 -60947 -30865 -35060 -561663 -1154550 -1042959 -408172
10569 -408172 -401671 -809817 -979601 -761575 -400138 -304725 -287541 -275101 -148700 -514063
10559 -514063 -914932 -748610 -725195 -575160 -551358 -582488 -65674 102820 -388254 -940103
10549 -940103 -1066763 -975851 -1045752 -1042756 -803612 -734158 -551395 -217265 -513301 -892197
10539 -892197 -646332 -502196 -403734 -242871 -43816 237607 207386 -501312 -1051646 -1406060
10529 -1406060 -1336729 -775343 -142331 -202882 -540711 -522349 -766828 -767986 -613180 -541823
10519 -541823 -482574 -147490 304082 438921 276380 241293 315851 429706 384161 190410
10509 190410 -9065 33008 112927 34115 -287526 -319946 -214902 -479167 -873410 -761634
10499 -761634 -517688 -507140 -101179 123396 -146677 -165646 -419013 -931126 -1194567 -1109135
10489 -1109135 -584675 -459925 -606563 -371717 22781 307608 662523 964880 909188 612707
10479 612707 460154 334895 436805 451415 546671 633548 602190 364689 33549 -83399
10469 -83399 -199007 -567891 -725782 -757756 -993702 -1020772 -957022 -914372 -635244 -186066
10459 -186066 -141520 -76850 57566 -158267 -549583 -700254 -786799 -932442 -634117 -201301
10449 -201301 -169762 -40798 43942 27279 -230240 -558581 -381545 -442853 -513778 -381322
10439 -381322 -472530 -115637 432790 254523 -226856 -408222 -681069 -930405 -801201 -359386
10429 -359386 11159 381561 899583 927966 1064640 1394879 1028937 381997 193217 320300
10419 320300 575327 584403 172833 -51877 -164071 -398423 -665715 -908648 -726140 -452703
10409 -452703 -195126 -433553 -590199 -325319 -72707 -241082 -367825 -347395 -63320 426299
10399 426299 462145 156309 100578 307840 388992 87677 -383870 -913307 -1218769 -1224498
10389 -1224498 -1045240 -623117 -468976 -495794 -464996 -249057 121738 295609 221110 2494
10379 2494 -203414 -395530 -533971 -608204 -185599 479855 1065250 951953 734432 745842
10369 745842 664813 280280 410491 698540 545598 622010 708927 468914 290979 119823
10359 119823 -112325 -158411 -275973 -172565 -69161 47342 114186 -72452 -369421 -783917
10349 -783917 -771986 -541619 -248997 -35511 -35390 -399480 -917612 -992715 -852097 -824763 -888237
10338 -888237 -724741 -356022 -463686 -680917 -675196 -680888 -488312 -18607 447940 450219 415572
10327 415572 405612 124976 -324791 -641832 -775776 -1003384 -1320819 -1413772 -1210047 -1088744
10317 -1088744 -1086789 -1289673 -1401670 -1294844 -1000336 -692084 -450906 -80158 50543 -190013
10307 -190013 -595545 -453351 198695 605405 558484 286278 151149 181614 152685 -37925
10297 -37925 -132514 347642 625430 576014 214288 -266245 -574566 -368275 -163322 -156792
10287 -156792 -209953 -310540 -292580 -177898 -142090 -221214 -61881 152546 60041 123681 382248
10276 382248 345021 209466 553846 539213 433814 327784 -58708 -456681 -237356 134825
10266 134825 204697 273830 150332 -101495 -28462 125767 251299 47045 -128811 -289448
10256 -289448 -238842 254836 575647 622346 266072 -47334 -294314 -529323 -681021 -655149
10246 -655149 -629201 -703990 -701404 -538210 -377824 -155333 -215817 -402762 -386111 61649 593429
10235 593429 914695 905174 599144 309381 438633 381417 107216 66868 114332 230025
10225 230025 240694 654423 994052 831931 186917 -384664 -533207 -537728 -504947 -536335
10215 -536335 -682961 -524460 -233576 -278209 -642271 -886846 -1123499 -984777 -383494 -130225
10205 -130225 -122341 -70241 -274957 -357291 -554512 -836931 -733702 -359698 -94203 -46720
10195 -46720 200407 549087 650336 440233 213546 278466 623805 654571 -169563 -1119873
10185 -1119873 -1143927 -727074 -278417 136861 246007 264715 373492 295703 -21253 -463026
10175 -463026 -736767 -589312 -153614 208902 169918 -78143 -554994 -683641 -536352 -280322
10165 -280322 80899 155084 -80810 -363412 -642563 -920537 -714890 -298741 -544272 -801067
10155 -801067 -598968 32031 299000 94008 -56553 -195867 -236725 151903 183915 146944
10145 146944 59600 -289670 -367013 -328114 -351621 -340115 48826 151307 78118 148191 197574
10134 197574 311272 417144 200182 -98841 -8118 144923 439542 831562 1198809 1387548
10124 1387548 1340399 956080 327456 102036 -144838 -302382 -19373 122377 44461 47547
10114 47547 -25387 -155380 -75338 388216 811880 911046 709596 830583 1002330 1174909
10104 1174909 916106 383398 -114692 -401890 -86976 425847 666959 537139 -73755
10095 -73755 -443530 -382826 -504996 -532377 -580264 -480898 -396310 -569448 -576519 -523785 -593570
10084 -593570 -749760 -844321 -751643 -446027 -395569 -540627 -778652 -1141335 -1202192 -526656
10074 -526656 164522 69979 -294851 -222882 -9216 48359 -100079 -450135 -838716 -990476
10064 -990476 -794432 -371168 -67083 2810 195701 300713 97374 -24638 147240 234353
10054 234353 461919 674393 743251 616007 320606 -197699 -779178 -1060329 -1015667 -1107276
10044 -1107276 -918669 -509368 -155605 -93746 -248599 -9107 124743 76183 -224133 -386382
10034 -386382 -403308 -309206 -162258 -17748 154321 315670 363991 263396 201009 352788
10024 352788 375239 314479 259239 -10730 -398683 -604042 -612012 -465502 -163413 -143257 -686935
10013 -686935 -1453683 -1659488 -1151754 -679458 -900246 -1207321 -1178065 -1054007 -861792 -613606
10003 -613606 -733967 -881648 -536195 -126381 277556 541596 326031 252898 242020 463925
9993 463925 780475 823098 1135468 1113912 781583 632939 525031 310667 22762 -420489
9983 -420489 -484509 -317560 -338327 -349927 -317780 -102109 -14020 -294833 -731117 -600393 -195425
9972 -195425 -12523 -8934 -198686 -349476 -611716 -926942 -948178 -751716 -440102 -151029
9962 -151029 96177 294178 287818 162689 550133 713252 551644 274930 65858 -63267
9952 -63267 98268 544321 850702 759558 462759 154961 285484 405671 179591 -8378
9942 -8378 -578116 -917865 -913391 -961566 -974152 -679263 -638359 -725967 -698310 -573881 -635836
9931 -635836 -814572 -1187416 -1251389 -866300 -502915 -442519 -466837 -829934 -994818 -807707
9921 -807707 -513071 86625 611311 531527 333467 -21376 -162637 -402772 -502291 -302891
9911 -302891 -370569 -581136 -501517 -602488 -462351 -279469 -269221 -318188 -380260 -123259 -34094
9900 -34094 71532 304731 116563 -113402 -128526 -310275 -621478 -876812 -890362 -774047
9890 -774047 -511016 -342313 -794559 -1045762 -608630 -159798 -310042 -348577 -311599 -404249
9880 -404249 -6444 538717 626057 463788 299038 213452 387659 432804 -174489 -297181
9870 -297181 -45850 133389 303144 702462 999128 852995 467294 128379 -439600 -710796
9860 -710796 -800727 -805605 -729809 -701982 -575389 -303306 -211707 -444593 -588239 -587310 -423706
9849 -423706 -230219 -94864 -111933 96620 494275 1048271 1256016 1084508 1127827 1496175
9839 1496175 1295975 659490 307311 308255 99552 238487 283052 24146 -206863 -361711
9829 -361711 -289877 -22296 -26124 135229 190293 -31184 212789 392249 220777 57194
9819 57194 -81947 18467 -77403 -472817 -715635 -666389 -611576 -611606 -794542 -1147282 -1182561
9808 -1182561 -778004 -287973 -22351 121943 109951 -154265 -118947 181809 313854 20476
9798 20476 -225396 183771 372494 -142436 -459586 -619843 -673200 -818415 -936343 -824319
9788 -824319 -660113 -264381 114224 333148 242063 64377 18267 -212444 -566281 -855549
9778 -855549 -655056 -330839 -436179 -636199 -401634 -222397 -267563 -262095 17687 403435
9768 403435 267556 -220776 -325876 -283137 69617 91921 -110217 -235210 -285740 -410537
9758 -410537 -536348 -930838 -1380059 -1714981 -1965316 -1717225 -882965 -203720 147668 244442
9748 244442 -45897 -420521 -666295 -717255 -658435 -847433 -889090 -688981 -317402 200506
9738 200506 332907 352165 267583 225024 327257 157070 -337387 -944826 -1031659 -728856
9728 -728856 -462679 -235613 -245002 -609284 -872466 -586921 -164058 -141115 -241324 -239703 -242736
9717 -242736 -204707 -259237 -377252 -395494 -480105 -797021 -1006579 -716406 -270271 -40463
9707 -40463 57876 73295 -23192 -246012 -105197 299947 609610 697077 659664 375936 11153
9696 11153 84073 308878 515071 342745 70355 -110626 -128707 -205496 -88682 258702
9686 258702 240608 93538 -176159 -413969 -218285 99842 359811 113289 45291 30187
9676 30187 -63967 43533 168040 -62107 70993 352624 584281 655187 529865 302134
9666 302134 -143154 -260590 61745 262488 322390 507552 329025 166592 1955 -503130
9656 -503130 -676734 -568568 -196631 216371 539479 752422 587846 480711 570565 626154
9646 626154 219150 -43302 37213 385811 427846 125735 120032 36791 -403453 -764666 -598054
9635 -598054 -373287 -369746 -294398 -95173 201466 138712 -174355 -100158 230021 407227 565393
9624 565393 417330 454855 942214 1097655 549899 -395669 -550849 -229692 -134645 165486
9614 165486 446229 752209 1150088 1190215 901617 469576 357484 809263 1721334 2801620
9604 2801620 3640747 2881057 1629229 1193286 1169639 1115279 739342 357959 291844 732827
9594 732827 1408928 2076016 2539949 2156475 1506323 1057655 872483 748955 660575 768441
9584 768441 721548 544263 427683 600733 535127 479621 394714 98684 410282 841841
9574 841841 792077 827612 989097 1117102 1281069 1258101 1213851 1424725 1121634 719153
9564 719153 433215 365763 496371 802584 540924 238949 335850 438530 590503 1015054
9554 1015054 1396220 1161887 1041928 1280765 1052459 968664 1301643 1705069 1574948 1441815
9544 1441815 1451011 1522063 2163799 2901777 3479828 4369672 5319471 6692449 8261696 10064073
9534 10064073 11237797 12501619 13835119 15969488 20088947 26761771 36105774 50156829
9526 50156829 71714073 107128518 161493767 215351379 212704642 159847735 109711569
9519 109711569 75932095 54806804 41124916 32364501 25933586 21108187 17340810 14456945
9511 14456945 11995226 10292536 9022459 8519826 8154165 7796918 7404572 6382555 4854015
9502 4854015 3794205 3607932 3804911 3631820 3587713 3813021 4409899 4953342 4897545 3902821
9492 3902821 2808815 2216377 1888688 1565609 1343328 1444961 1585302 1449577 1066375
9483 1066375 756233 861173 1094769 1302173 1504819 1566667 1813446 1806651 1970452 2168344
9473 2168344 2114657 1722769 1369331 1365174 1493399 1381296 1225358 1083246 745624 472499
9463 472499 897290 1283644 1297935 1328105 1442324 1726931 1864937 1593329 1800400 2218519
9453 2218519 2365070 2335540 2683571 2885194 2463147 2169320 2531068 3284030 4598546 5776622
9443 5776622 6352046 6647209 6829130 6570297 6308181 6259018 6442647 6546685 7089159 8064384
9433 8064384 9635974 11861682 15436837 20324871 27017218 35171619 46713724 65240823
9425 65240823 96253259 144940614 205532200 225190019 180561670 125033564 86076085
9418 86076085 61781528 46015884 35683162 28410788 23309321 19388077 16305427 13980366
9410 13980366 12261399 10664673 9586588 8312135 7036137 6161444 5630485 4912950 4316880
9401 4316880 3731657 3500141 3218218 2687918 2165602 2072804 2266345 2490003 2787191 2663140
9391 2663140 2265274 2174237 1863994 1861340 2235076 2383752 2304414 1995371 1683974 1530581
9381 1530581 1275392 997922 749713 366883 117809 307460 473241 668257 858533 954607
9371 954607 1089202 1236515 923388 661804 520786 755285 1030339 819860 574536 568370
9361 568370 821089 661164 68381 -1937 479077 968447 1314319 1101334 330908 -151115
9351 -151115 -358439 -471160 -873067 -1060464 -763427 -365544 110836 293559 65266 -239019
9341 -239019 -501092 -906800 -1112307 -813032 -742665 -1015981 -820090 -498605 -430763 -748221
9331 -748221 -634195 -177507 223582 198789 -47639 -107740 -118061 -112366 -124806 -201070 -337653
9320 -337653 -299719 78210 105795 -179350 -41997 110951 58320 -8647 136402 309836
9310 309836 98790 8522 -86374 -72052 303127 757969 586362 240491 -178992 -202495
9300 -202495 43601 243432 90790 -139660 -1269 226045 216339 213256 49607 -108552
9290 -108552 -47518 111310 422522 500006 440812 259009 31397 -160717 255910 657391
9280 657391 598616 667479 740152 712548 50664 -466924 -284523 -258090 -490505 -353097 78647
9269 78647 135379 -11568 127430 93074 153650 483262 541737 599191 841700 937510 962965
9258 962965 691312 527678 835278 661477 248764 315120 223222 -237714 -236302 -149682 -561023
9247 -561023 -783740 -468433 68073 258786 78697 45651 125898 5715 -13455 16077
9237 16077 -486555 -800893 -734552 -459784 -179039 -160173 -416537 -501494 -71109 82419
9227 82419 101526 135482 -61193 -152987 -109103 32683 -47061 -164581 43687 447798 549434
9216 549434 429916 522221 639622 546862 512874 652346 742883 753137 681850 204401 -298948
9205 -298948 -595600 -529372 -259636 -3222 -20710 691 -196834 -522838 -646839 -722480
9195 -722480 -272585 104122 326174 231172 -186669 -597803 -382914 -140356 -359603 -459927
9185 -459927 -333631 -246913 98919 66215 -10265 -68453 71058 103333 -172220 -537564 -615223
9174 -615223 -391922 -251980 -287860 -195140 50876 100167 83513 283217 425677 692352
9164 692352 481172 -119663 -363847 -407250 -565678 -597703 -544804 -289224 -85951 -407593
9154 -407593 -719370 -803289 -820557 -899613 -789200 -537265 -511423 -584705 -529925 -601448 -538077
9143 -538077 -393865 -338005 -429589 -517078 -410551 -352476 -536588 -594822 -748568 -745536 -523100
9132 -523100 -28767 414059 163080 -333988 -352139 223155 476084 244514 135975 197011
9122 197011 243807 -102597 -261905 -156695 -351701 -562998 -754063 -798335 -666078 -462376
9112 -462376 -345620 -525911 -895833 -994048 -913671 -856249 -719600 -690111 -764597 -402072 225549
9101 225549 515230 600838 668214 486707 294400 465730 650130 817434 867890 474695
9091 474695 52550 -37552 -38697 193172 462989 81808 -65464 304400 272476 -199099
9081 -199099 -491564 -644018 -788535 -814853 -746057 -732393 -340380 96229 -30573 -539827
9071 -539827 -687341 -500109 -417513 -271028 17729 188753 276246 369066 448878 203704
9061 203704 -384480 -618374 -611348 -709209 -850660 -910474 -465333 -32570 -37653 -220447 -685171
9050 -685171 -783681 -412334 -175589 -418173 -635691 -380013 -304023 -131440 67550 134165
9040 134165 -95523 -268398 -158917 -21018 227699 421621 278553 -254073 -691524 -630830
9030 -630830 -647045 -581155 -562199 -1089728 -1249921 -663977 -330758 -227553 -198399 -455094
9020 -455094 -829929 -968625 -633574 -362064 -249680 -451978 -774997 -832426 -639418 -440215
9010 -440215 -314600 -60957 172591 307268 245749 198526 417289 144062 -514656 -734102
9000 -734102 -524489 -346145 -346970 -130578 -103145 -41752 32490 -159168 -218865 -373407 -297890
8989 -297890 -170409 115284 515038 596206 135019 273111 574698 670580 500221 89113
8979 89113 -279226 -443625 -226834 86354 17724 -425477 -753929 -562795 -360130 -479673
8969 -479673 -642454 -632152 -427973 -7497 230391 1631 -108116 -138410 -320798 -357748
8959 -357748 -488086 -539816 -619634 -732038 -534501 -240508 143288 72956 -620766 -1037464
8949 -1037464 -701893 -113547 361278 820767 805859 427478 -59442 -402691 -607452 -729143
8939 -729143 -900681 -1104038 -1277850 -1358144 -1277706 -1269488 -965746 -549442 -672397 -963327
8929 -963327 -931706 -655020 -560287 -524042 -355951 -405297 -720083 -845472 -743742 -892021
8919 -892021 -1299533 -1625937 -1285926 -853362 -492180 -130896 -40123 282624 428146 278497
8909 278497 109784 376791 673336 509540 -4387 -642690 -728168 -580710 -511121 -809738
8899 -809738 -960782 -788008 -449687 -172909 -816927 -1609109 -1480598 -1323062 -1516069 -1053960
8889 -1053960 -528273 -531273 -610664 -523581 -485226 -253734 -212548 -409725 -481333 -645248 -703852
8878 -703852 -600566 -686470 -414020 -27406 132386 406107 605981 404908 254705 191509
8868 191509 169417 412610 207918 -252896 -446843 -116856 302420 294399 108437 -346757
8858 -346757 -532507 -594980 -594971 -404742 -523793 -556702 -635465 -473928 -59883 19729 -167676
8847 -167676 -94858 -309820 -718121 -892702 -785364 -530239 -97603 411770 825691 937201
8837 937201 489502 220717 151977 -50955 13442 268730 227941 6319 -249754 -449861
8827 -449861 -416343 -579282 -916667 -1191062 -1026980 -703932 -653747 -354020 133659 251785
8817 251785 19855 -104402 -333954 -263760 49719 117568 65524 254071 458660 359793
8807 359793 115370 23544 27215 -274785 -677684 -612002 -275407 -88696 175256 197564 302053
8796 302053 626711 879540 986338 472240 -439220 -975055 -987658 -670459 -574480 -633893
8786 -633893 -375658 -274064 -305259 -262904 -67733 224940 409881 594968 656093 298046
8776 298046 -187850 -403715 -371707 -584226 -763167 -776606 -516337 -295435 -230915 131991
8766 131991 80819 -506223 -879867 -829476 -678322 -530635 -106071 231648 383654 464209
8756 464209 315492 231231 36487 55454 157381 123501 -531 -4940 -32417 -195595 -250213
8745 -250213 -55983 91441 69355 200270 516516 623274 466034 180936 -21708 -104114
8735 -104114 -125108 -33287 244824 342805 270993 34013 86574 223689 98236 -80548 -571213
8724 -571213 -1089298 -1283961 -1547634 -1498712 -882590 -703945 -621742 -406134 -159638 245086
8714 245086 374904 200750 87796 1055 -371183 -437969 -14843 294360 165795 301919
8704 301919 148682 -374642 -818616 -648064 -365095 -349871 -310125 -450468 -958376 -1519721
8694 -1519721 -1716799 -1411460 -1091628 -1188107 -974506 -954803 -880387 -743772 -906031 -1057672
8684 -1057672 -1123259 -851154 -363814 -223996 72307 671697 856167 740814 695747 582300
8674 582300 625566 673494 868207 1073516 714951 273314 132999 -66402 -426796 -683399
8664 -683399 -271082 4738 -218112 -478291 -506810 -492561 -409558 -126228 61801 90000
8654 90000 -191865 -534499 -1007553 -1446910 -1782929 -1694953 -1426226 -1368431 -909018 -362682
8644 -362682 150807 13076 -259344 -217622 -142952 -336819 -544637 -446204 -163981 48097
8634 48097 48943 -8399 78509 34730 -220343 -404138 -661501 -599334 -766973 -703675 -156176
8623 -156176 182419 94917 72892 -803 -188567 -342381 -421194 -331317 -168037 -179093 -175926
8612 -175926 64316 377084 445081 365944 268480 255333 224213 -164849 -625799 -492282 -42950
8601 -42950 318210 417198 -33065 -430294 -319550 119097 663161 1133949 1165551 798333
8591 798333 483877 409219 624768 492972 85897 -254919 -298602 -136183 -249459 -260734
8581 -260734 21148 220535 24187 -399022 -459296 -99540 363499 659432 350409 -41666
8571 -41666 -242892 28715 363692 504260 557193 606770 582089 359716 166191 239679 578529
8560 578529 596344 593379 826629 956877 1280406 1433476 1063443 1218299 1472222 1171056
8550 1171056 813179 812432 787167 1039924 1370653 1425387 1560969 1591708 1583808 1519668 1221500
8539 1221500 964654 878637 977483 1111601 1318247 1289613 839853 843442 1002772 728308
8529 728308 570768 730992 839594 942406 1120601 1059597 408605 -16473 24448 226958
8519 226958 353969 542136 393341 264859 189726 5738 55558 241412 422049 660532
8509 660532 1014953 1341459 1162200 735348 364750 -264402 -524334 -445967 -83341 490866
8499 490866 774550 701590 439934 664826 975963 1203905 1141575 1012738 1142904 933483
8489 933483 655710 743706 832515 505590 73908 8205 248257 404564 476015 646241
8479 646241 873187 1328743 1686958 1537382 1094512 789605 683437 706792 889975 1071654
8469 1071654 1351978 1542477 1299681 1181822 1453664 1542582 1733987 1622067 1766555 2125632
8459 2125632 2365140 2057087 1491227 1184331 1405099 1643022 1450977 1100813 1028853 826326
8449 826326 457009 337361 503997 910917 1194215 1495537 1772224 1760389 1461447 1137383
8439 1137383 935249 928671 1008766 1070500 1068728 989080 992439 611111 174886 -370798 -750121
8428 -750121 -685049 -607150 -104873 -126555 -345660 -263664 152376 466382 600627 600001 472107
8417 472107 372554 522581 524770 414610 575548 462295 309127 218059 45140 40417 68788
8406 68788 102627 57947 -11344 -30287 -63606 -109709 -155080 -264493 -146865 -68470 134670
8395 134670 508261 553542 712676 881324 759246 250553 -79495 339509 577966 379523
8385 379523 118689 -219370 -362289 -155474 202572 380878 549341 683816 424779 37930
8375 37930 -42829 -118840 -245182 -159281 36361 -165418 -324334 -373561 -158610 -97217 -369362
8364 -369362 -219263 73579 -92645 -197829 -116492 101772 529972 698587 662746 481731
8354 481731 295838 231043 326399 430611 509843 541376 775122 1050119 1517386 1746517
8344 1746517 1344077 858541 901851 1074139 739086 308974 192124 90171 880 41596
8334 41596 194978 222287 355781 175904 -184347 -191849 -63463 -116773 -54732 76907 206446
8323 206446 320880 353511 433431 358586 343370 492530 816960 1339674 1590378 1646592 1506016
8312 1506016 1386702 1045918 684407 360662 132075 524641 817128 254521 -395228 -537787
8302 -537787 -79256 390399 373203 91314 -161695 -362080 -511640 -505786 -460402 -187890
8292 -187890 362025 486299 47220 -141407 -62922 72353 25107 159079 394253 390699
8282 390699 72835 -382430 -604751 -753936 -836826 -843325 -665449 -251600 -321856 -218225
8272 -218225 179223 189814 -1326 -260713 -246132 33001 224442 581312 764702 526473
8262 526473 252458 86866 -376985 -667066 -587260 -578943 -614345 -609123 -409222 -158045 -86690
8251 -86690 100792 34981 -147732 -405070 -666590 -823337 -745523 -530625 -400173 -350700
8241 -350700 -560548 -518732 -558020 -577314 -774858 -844480 -781957 -698255 -421031 -182046 -160322
8230 -160322 -301339 -125457 221320 336818 178077 141384 94127 224583 151915 156818 438655
8219 438655 531463 704843 1048428 1093163 1048652 1229456 1217911 928516 908467 795102 614235
8208 614235 429828 488461 581909 390258 268049 192600 206959 312359 438125 302949
8198 302949 56324 -80571 165204 615369 1019931 1061264 557404 495852 770903 608235
8188 608235 373732 388546 403203 676033 905832 1204607 1432788 1496393 1536180 1635994 1559838
8177 1559838 1600348 1688739 1509213 1408721 1428443 1270429 821079 667369 650213 269669
8167 269669 76778 -73335 -260501 -337338 125955 601738 725423 737114 699859 836440
8157 836440 473866 95642 -175504 -299762 -494092 -475716 55625 421288 402938 378283
8147 378283 584078 613206 442201 273314 180282 17801 -159061 36001 41893 -78024
8137 -78024 -118304 81457 441321 612420 976444 1122621 1011290 776422 603932 445918
8127 445918 309153 434051 386064 141198 4802 100847 248408 541045 780931 757211
8117 757211 890196 961875 575184 180304 347521 683237 700256 606600 734887 858461
8107 858461 1017728 1249928 1597544 1674036 1148972 792350 692690 592394 691782 910234
8097 910234 1095675 735063 -45674 -559536 -651848 -425242 -147785 339584 181757 -408722
8087 -408722 -623468 -516699 -181345 -155025 -472460 -748807 -734288 -142001 122067 173306
8077 173306 276121 342575 27931 -278292 -477377 -317756 -31506 -77154 -353584 -633989
8067 -633989 -816329 -619160 -186470 -5538 128300 248577 361662 445765 408598 206622
8057 206622 377515 467624 199377 -227001 -381528 58459 236664 151648 233495 166950
8047 166950 120003 -20690 -195250 -337904 -322213 -182832 58235 191411 9008 -162114
8037 -162114 -215552 -83814 21703 -137200 -256800 82422 324843 298072 275738 203865
8027 203865 449225 897722 1113894 1077138 795618 794705 1190596 1268281 955033 798111 761621
8016 761621 706796 765511 329371 -116492 -65889 149276 175899 137620 415419 141976 -363076
8005 -363076 -404247 -311447 -370804 -405082 -285147 -263556 -138846 113084 168044 -171736 -170450
7994 -170450 -51437 -202093 -617359 -745656 -513463 -528050 -690686 -810192 -841555 -744125
7984 -744125 -800193 -876626 -622851 -429638 -498920 -814983 -901574 -985233 -1247165 -1479796 -1422315
7973 -1422315 -1396709 -1048136 -534884 -468932 -862035 -823090 -549893 -650869 -761297 -1065387
7963 -1065387 -1085241 -748515 -563272 -502786 -339014 195181 799682 700582 293262 77692
7953 77692 -258126 -527301 -304488 -17928 191045 405101 784394 810619 669474 450654
7943 450654 110665 7274 167158 354055 482541 267079 -77871 16814 -101406 -309958
7933 -309958 -22305 137818 -163679 -572898 -671666 -448826 -330372 -245173 -94866 -154166
7923 -154166 -200390 1738 455561 697398 463845 86095 -73143 68627 164850 46348
7913 46348 -188757 -377831 -591902 -613587 -540616 -353767 -179127 165572 538777 635160
7903 635160 541708 229919 234794 618294 890951 561529 -155396 -412925 -585399 -325607
7893 -325607 -194182 -409218 -562489 -595146 -754869 -791162 -599132 -64010 382397 565468
7883 565468 680948 893061 885461 882309 708963 530342 494490 203999 -212520 -380701 -129619
7872 -129619 68194 362310 720830 825969 690069 363628 -114398 -617886 -914417 -821109
7862 -821109 -757408 -882429 -1091655 -1413602 -1564954 -1378335 -1273706 -1074890 -495287 -345831
7852 -345831 -691182 -889485 -798880 -229867 217519 205263 -248030 -265164 203653 523605
7842 523605 477006 347857 309829 600341 912351 647732 -4946 -682176 -755899 -593936
7832 -593936 -534857 -263035 112252 47735 -182737 -463492 -758233 -795339 -559129 -445842
7822 -445842 -217268 292757 575226 835447 542241 81727 -318309 -89043 377607 397269
7812 397269 292762 30656 -147848 -216787 -245511 -291456 -200855 213340 249276 88331 -185852
7801 -185852 -409240 -250496 130060 660134 800243 687071 998975 1392556 1370050 995324
7791 995324 295458 -154557 -361713 -210524 239577 40739 -341534 -290830 -113908 -133394
7781 -133394 -101655 -332403 -839783 -1023088 -650051 103435 483272 576045 523006 97321
7771 97321 -10624 212382 528247 824258 954935 1017335 1151374 1051387 640212 287153
7761 287153 274494 560214 553246 433477 683760 1131971 1011229 394937 448785 505282 586067
7750 586067 380151 171210 409545 763383 825008 785026 813243 787249 677741 510198
7740 510198 466403 343953 190195 145983 -42060 -165358 -87253 -95480 32503 322339 432948
7729 432948 647665 506349 402067 144221 -45271 -25405 -295118 -205126 -182074 -251062
7719 -251062 -14161 -5064 -310517 -445259 -732080 -608340 -177401 42681 75019 165572
7709 165572 386295 422498 44296 44566 66350 135711 559090 697816 313020 -16282 -141904
7698 -141904 -356295 -649316 -692314 -519696 -596100 -668566 -583309 -753138 -931941 -1142793
7688 -1142793 -1262337 -1051977 -981844 -964799 -511623 -194032 -25985 -41612 -10652 164848
7678 164848 400557 344261 195033 174684 -7427 -2709 194558 209148 359360 720534 813603
7667 813603 592826 267141 238092 312529 74977 -141444 44910 489573 627227 489673
7657 489673 485250 13944 -351675 17551 442438 426205 182299 -144091 -197766 -57682
7647 -57682 301748 488899 487749 629913 523001 462439 372510 93277 -254910 -374992 -485485
7636 -485485 -791985 -1013625 -898787 -367621 69149 29055 -75336 -17020 172664 721443
7626 721443 579552 120135 -382078 -907349 -973129 -1031824 -1256554 -1280519 -1117178 -847898
7616 -847898 -861039 -724490 -575825 -603505 -417877 -241819 -484317 -700501 -632126 -311241
7606 -311241 -19721 -134267 -324470 -250175 -247711 -140993 -57758 -201909 -281810 -555520 -733380
7595 -733380 -753350 -496990 20446 378330 242411 35162 -6297 115036 -67913 -109504
7585 -109504 -151777 -314618 -379743 -705117 -1201695 -1537133 -1456195 -1214027 -1241268 -722640
7575 -722640 12247 512654 1029646 1375707 1136130 546798 147543 -129500 -283041 -394899
7565 -394899 -449015 -263859 -201906 -218249 -82650 278184 361752 73589 -320615 -635349
$$ [...]
##END NTUPLES=NMR SPECTRUM
##END=
