##TITLE=C13_SA_4.152
 D2O, 23000 sc

 13.11.2019
##JCAMPDX= 6.0         $$ Bruker NMR JCAMP-DX V2.0
##DATA TYPE= NMR SPECTRUM
##DATA CLASS= NTUPLES
##ORIGIN= UXNMR, Bruker Analytische Messtechnik GmbH
##OWNER= root
$$ XWIN-NMR		Version 3.5
$$ Thu Nov 14 13:48:51 2019 Russian Standard Time (UT+4h)  she@DPX200
##.OBSERVE FREQUENCY= 50.327896
##.OBSERVE NUCLEUS= ^13C
##.ACQUISITION MODE= SIMULTANEOUS
##.ACQUISITION SCHEME= undefined
##.AVERAGES= 18780
##.DIGITISER RES= 17
##SPECTROMETER/DATA SYSTEM= spect
##.PULSE SEQUENCE= zgpg30
##.SOLVENT NAME= CDCl3
##.SHIFT REFERENCE= (INTERNAL, CDCl3, 0, 222.624)
##AUDIT TRAIL= $$ (NUMBER, WHEN, WHO, WHERE, WHAT)
$$ ##TITLE= Audit trail, XWIN-NMR		Version 3.5
$$ ##JCAMPDX= 5.01
$$ ##ORIGIN= Bruker BioSpin GmbH
$$ ##OWNER= she
$$ F:/spectra/data/she/nmr/c13/1/pdata/1/auditp.txt
$$ ##AUDIT TRAIL=  $$ (NUMBER, WHEN, WHO, WHERE, WHAT)
(   1,<2019-11-14 09:48:26.53 +0400>,<she>,<DPX200>,
      <created by zg, POWCHK disabled, PULCHK disabled
       terminated by command 'halt'
       configuration hash MD5:
       00 E9 B6 7A A2 85 ED C7 34 08 36 98 17 FE 4E 26
       data hash MD5: 32K
       D1 7B EC 9C 96 4E 66 61 62 E2 19 62 F5 7F C8 65>)
(   2,<2019-11-14 13:45:11.59 +0400>,<she>,<DPX200>,
      <Start of raw data processing
       efp BC_mod = 2 LB = 1 FT_mod = 6 PKNL = 1 PHC0 = -239.9142 PHC1 = 33.80636 SI = 32K 
       data hash MD5: 32K
       1A 7A 79 97 67 C3 EB 8F 6C 9A 17 76 B9 F3 8A DC>)
(   3,<2019-11-14 13:45:14.31 +0400>,<she>,<DPX200>,
      <abs ABSG = 5 
       data hash MD5: 32K
       34 5B 56 BA 0C D1 59 04 F8 F9 10 40 6B E0 0F C7>)
(   4,<2019-11-14 13:45:39.87 +0400>,<she>,<DPX200>,
      <pk PHC0 = -4.342022 PHC1 = 0.5999998 
       data hash MD5: 32K
       C8 DE 59 71 55 52 25 80 38 36 40 56 98 D6 CF BD>)
(   5,<2019-11-14 13:45:43.93 +0400>,<she>,<DPX200>,
      <abs ABSG = 5 
       data hash MD5: 32K
       9E 3B 21 52 27 9B 23 57 27 40 73 70 B2 B0 75 41>)
$$ ##END=
$$ 
$$ hash MD5
$$ 36 35 DB B2 88 38 D2 C5 82 F4 DD 9A 05 26 7A D4
##$RELAX= 
##$RELAX= 
##$RELAX= 
##$RELAX= 
##$RELAX= 
##$RELAX= 
##$RELAX= 
##$RELAX= 
$$ Bruker specific parameters
$$ --------------------------
##$DU= <F:/spectra>
##$EXPNO= 1
##$NAME= <c13>
##$PROCNO= 1
##$TYPE= <nmr>
##$USER= <she>
##$AMP= (0..31)
100 100 100 100 100 100 100 100 100 100 100 100 100 100 100 100 100 100 
100 100 100 100 100 100 100 100 100 100 100 100 100 100 
##$AQSEQ= 0
##$AQ_mod= 1
##$AUNM= <au_zg>
##$AUTOPOS= <>
##$BF1= 50.322709
##$BF2= 200.13
##$BF3= 50.322709
##$BF4= 500.13
##$BF5= 500.13
##$BF6= 500.13
##$BF7= 500.13
##$BF8= 500.13
##$BYTORDA= 1
##$CFDGTYP= 0
##$CFRGTYP= 5
##$CHEMSTR= <none>
##$CNST= (0..31)
1 1 145 1 1 1 1 1 1 1 1 1 1 1 1 1 1 1 1 1 1 1 1 1 1 1 1 1 1 1 1 1 
##$CPDPRG= <waltz16>
##$CPDPRG1= <>
##$CPDPRG2= <waltz16>
##$CPDPRG3= <>
##$CPDPRG4= <mlev>
##$CPDPRG5= <mlev>
##$CPDPRG6= <mlev>
##$CPDPRG7= <mlev>
##$CPDPRG8= <mlev>
##$CPDPRGB= <>
##$CPDPRGT= <>
##$D= (0..31)
$$ [...]
##$SUBNAM4= <"">
##$SUBNAM5= <"">
##$SUBNAM6= <"">
##$SUBNAM7= <"">
##$SUBNAM8= <"">
##$SUBNAM9= <"">
##$SW= 239.972175391363
##$SWIBOX= (0..15)
0 1 3 0 0 0 0 0 0 0 0 0 0 0 0 0 
##$SW_h= 12077.2946859903
##$TD= 32768
##$TD0= 1
##$TE= 0
##$TE2= 300
##$TE3= 300
##$TEG= 300
##$TL= (0..7)
120 120 120 120 120 120 120 120 
##$TP= (0..7)
150 150 150 150 150 150 150 150 
##$TP07= 0
##$TPNAME0= <>
##$TPNAME1= <>
##$TPNAME2= <>
##$TPNAME3= <>
##$TPNAME4= <>
##$TPNAME5= <>
##$TPNAME6= <>
##$TPNAME7= <>
##$TPOAL= (0..7)
0.5 0.5 0.5 0.5 0.5 0.5 0.5 0.5 
##$TPOFFS= (0..7)
0 0 0 0 0 0 0 0 
##$TUNHIN= 0
##$TUNHOUT= 0
##$TUNXOUT= 0
##$USERA1= <user>
##$USERA2= <user>
##$USERA3= <user>
##$USERA4= <user>
##$USERA5= <user>
##$V9= 5
##$VALIST= <valist>
##$VCLIST= <CCCCCCCCCCCCCCC>
##$VD= 0
##$VDLIST= <DDDDDDDDDDDDDDD>
##$VPLIST= <PPPPPPPPPPPPPPP>
##$VTLIST= <TTTTTTTTTTTTTTT>
##$WBST= 1024
##$WBSW= 4
##$XGAIN= (0..3)
0 0 0 0 
##$XL= 0
##$YL= 0
##$YMAX_a= 109786831
##$YMIN_a= -34858046
##$ZGOPTNS= <>
##$ZL1= 120
##$ZL2= 120
##$ZL3= 120
##$ZL4= 120
##$ABSF1= 222.624
##$ABSF2= -17.3728
##$ABSG= 5
##$ABSL= 3
##$ALPHA= 0
##$AQORDER= 0
##$ASSFAC= 0
##$ASSFACI= 0
##$ASSFACX= 0
##$ASSWID= 0
##$AUNMP= <proc_1d>
##$AZFE= 0.1
##$AZFW= 0.5
##$BCFW= 0
##$BC_mod= 2
##$BYTORDP= 0
##$COROFFS= 0
##$CY= -3
##$DATMOD= 1
##$DC= 0
##$DFILT= <>
##$DTYPP= 0
##$F1P= 0
##$F2P= 0
##$FCOR= 0.5
##$FTSIZE= 32768
##$FT_mod= 6
##$GAMMA= 0
##$GB= 0
##$INTBC= 1
##$INTSCL= 4.134877e-10
##$ISEN= 128
##$LB= 1
##$LEV0= 0
##$LPBIN= 0
##$MAXI= 10000
##$MC2= 0
##$MEAN= 0
##$ME_mod= 0
##$MI= 0.1934396
##$NCOEF= 0
##$NC_proc= 1
##$NLEV= 6
##$NOISF1= 120.0001
##$NOISF2= 80.00006
##$NSP= 0
##$NTH_PI= 0
##$NZP= 0
##$OFFSET= 222.624
##$PC= 1.4
##$PHC0= -244.2562
##$PHC1= 34.40636
##$PH_mod= 1
##$PKNL= yes
##$PPARMOD= 0
##$PSCAL= 0
##$PSIGN= 0
##$REVERSE= no
##$SF= 50.3227315989248
##$SI= 32768
##$SIGF1= 140
##$SIGF2= 120
##$SINO= 11.81781
##$SIOLD= 32768
##$SREGLST= <13C.CDCl3>
##$SSB= 0
##$STSI= 32768
##$STSR= 0
##$SW_p= 12077.2946859903
##$SYMM= 0
##$S_DEV= 0
##$TDeff= 32768
##$TDoff= 0
##$TI= <>
##$TILT= no
##$TM1= 0
##$TM2= 0
##$TOPLEV= 0
##$USERP1= <user>
##$USERP2= <user>
##$USERP3= <user>
##$USERP4= <user>
##$USERP5= <user>
##$WDW= 1
##$XDIM= 32768
##$YMAX_p= 397776373
##$YMIN_p= -4485169
$$ End of Bruker specific parameters
$$ ---------------------------------
##NTUPLES= NMR SPECTRUM
##VAR_NAME=  FREQUENCY,     SPECTRUM/REAL,   SPECTRUM/IMAG
##SYMBOL=    X,             R,               I
##VAR_TYPE=  INDEPENDENT,   DEPENDENT,       DEPENDENT
##VAR_FORM=  AFFN,          ASDF,            ASDF
##VAR_DIM=   32768,         32768,           32768
##UNITS=     HZ,            ARBITRARY UNITS, ARBITRARY UNITS
##FACTOR=    0.368581032318806, 1,           1
##FIRST=     11203.0474431902, 0,            0
##LAST=      -874.247242800138, 0,           0
##MIN=       -874.247242800138, -4485169,    0
##MAX=       11203.0474431902, 397776373,    0
$$ Real data points
##PAGE= N=1
##DATA TABLE= (X++(R..R)), XYDATA
$$ [...]
##PAGE= N=2
##DATA TABLE= (X++(I..I)), XYDATA
9111B8204510q03218m57226l79031o48072j84923R75882J329437K87123m08165
9102B7916317P7006o1949k0636K75877M74321l4778j07851o99109o55250r2244
9092B7071704q5588L5276j32688J59644L22449J826M45653J085859M53006l13295
9082B9043846n30571n33583j06652m92993k00348J08334q24644L44154Q95826
9073B7703369K99311Q0774j22544k95792k12390J73958O14500J75391j25515j162
9063B8289900O03132N69126o10845o29135K39678N84742l19308p36268m83619
9054B7507403k62192o6506L24144O6439k50868j74313O42231J81172J07118P11035
9044B8785663R51434M9176k24460r17538j402603m78879O79820O77689L25289
$$ y = [28204510, 27401292, 26944066, 26565035, 25916963, 25732040, 26707922, 28037359, 28324482, 27916317, 27993323, 27931374, 27910738, 28186615, 28660936, 28626158, 28518307, 27819198, 27163948, 27071704, 26986116, 27021392, 26888704, 27048348, 27370797, 27372623, 27818276, 28904135, 29357141, 29043846, 28513275, 27979692, 27873040, 27380047, 27179699, 27288033, 26463389, 26807543, 27703369, 28002680, 28083454, 27960910, 27665118, 27452728, 27626686, 28241186, 28416577, 28291062, 28289900, 28893032, 29462158, 28851313, 28222178, 28461856, 29046598, 28727290, 27991022, 27507403, 27245211, 27178705, 27502849, 27569288, 27318420, 27144107, 27786338, 27967510, 28074628, 28785663, 29737097, 29786273, 29561813, 28644275, 27241672, 26762793, 27442613, 28120302, 28445591]
9035B8445591K35716O20802m9330n76987l57644l95409p1429l94095j03760J31767
9025B7485222N82668m1301l48029J60424L71612O7300n89778k74601p0554n53258
9015B6789705Q11832J221531n7494m62138m73915r95954p18541L00026O33095
9006B7048147J77044n38471l78182J24801K63141R05539P43938J60910Q1238p1503
8996B8516602l36487j56108m09388q41827n59859k11366K83696R84579N10746
8987B7780588p823P7602L16996j21009j241641m54084K44317P3346P12945J058990
8977B8440227M47410N58631N1626o14478j810996j337954K70455j95677p0348
8968B5738896L27333l68344N0876J029653M11517m6855l60864o6608M82345R55540
$$ y = [28445591, 28681307, 29302109, 29252779, 28675792, 28318148, 27922739, 27851310, 27457215, 27353455, 27485222, 28067890, 28026589, 27678560, 27838984, 28210596, 28277896, 27688118, 27413517, 27342963, 26789705, 27601537, 28823068, 28765574, 28303436, 27829521, 26833567, 26115026, 26415052, 27048147, 27225191, 26686720, 26308538, 26433339, 26696480, 27602019, 28345957, 28506867, 28588105, 28516602, 28180115, 28024007, 27614619, 26772792, 26212933, 26001567, 26285263, 27269842, 27780588, 27772765, 27850367, 28167363, 28046354, 26804713, 26350629, 26594946, 26668292, 27381237, 28440227, 28887637, 29446268, 29497894, 28883416, 27072420, 25734466, 26004921, 25809244, 25738896, 26066229, 25697885, 25748761, 26778414, 27189931, 27143076, 26782212, 26715604, 27197949, 28153489]
8958B8153489P82044r4957l15034r79637o95359K62614R63279N47838M50708L43350
8948B9418335L0234m3141k12580k31663m35379j177631n04712O31029N35565N2872
8938B8062929Q2642n8465K51670K8980j61718M3553k35862m81810l77605l21305
8928B6833009o3457J130535J343162k10434j196863k40223L31316J59899K06433
8919B8293377N4004o34442n04946N63816L62019p802L93094k58262q38558n96230
8909B6826070m90048q4663K66985q0216j03863M04825L47786N78842J68749n03430
8899B7331037o31256J44810K81596n34238q35753k97499L31256P78878R65240
8890B7534071M93338N71261K47730M74795Q02386K52171l65065n06128l0169K84805
$$ y = [28153489, 28935533, 28840576, 28525542, 27545905, 26850546, 27113160, 28076439, 28624277, 29074985, 29418335, 29448569, 29405428, 29192848, 28961185, 28525806, 27348175, 26843463, 27474492, 28010057, 28062929, 28145571, 28087106, 28338776, 28367756, 28206038, 28249591, 28013729, 27531919, 27154314, 26833009, 26769552, 27900087, 29243249, 29032815, 27835952, 27595729, 27927045, 28086944, 28293377, 28347381, 27712939, 27207993, 27771809, 28133828, 28126026, 28519120, 28260858, 27422300, 26826070, 26336022, 26251359, 26518344, 26438128, 26334265, 26739090, 27086876, 27665718, 27834467, 27331037, 26699781, 26844591, 27126187, 26591949, 25756196, 25458697, 25789953, 26568831, 27534071, 28027409, 28598670, 28846400, 29321195, 30123581, 30375752, 30010687, 29504559, 29474390, 29759195]
8880B9759195M17676J30312j67253q62838j786344n89821L00066O36261M63624
8871B8300878j43192m23215j76522J04732M65151l3278k80391n62201o78691r69602
8861B5603669K08849R98973Q55722L24634j25419j6360L949P40805P23287K39808
8851B9557917k4348k24034k00319k38457j261382M9411J111825K82844R5403o92779
8841B8456081o49064K16609J80738L6370J6558M8605j90221n13626L38839O00519
8831B8541408m83519n55837k64340N30462J132216M60191L46239K35125o32329
8822B9309616k34184L95826J01427J60659L90622k61853m29281m80886p68767
8813B8183179J5996j46253m67006N626L88763M78043j95884j74381O68751O98132
$$ y = [29759195, 30176871, 30307183, 30139930, 29277092, 27490748, 26900927, 27200993, 27837254, 28300878, 28157686, 27734471, 27557949, 27662681, 28127832, 28094554, 27814163, 27251962, 26573271, 25603669, 25812518, 26811491, 27667213, 27991847, 27866428, 27850068, 27854017, 28594822, 29318109, 29557917, 29533569, 29309535, 29109216, 28870759, 27609377, 27658788, 28770613, 29053457, 29148860, 28456081, 27807017, 28023626, 28204364, 28240734, 28257292, 28305897, 28115676, 27602050, 27940889, 28541408, 28057889, 27502052, 27237712, 27768174, 28900390, 29360581, 29706820, 29941945, 29309616, 29075432, 29471258, 29572685, 29733344, 30123966, 29862113, 29432832, 28951946, 28183179, 28199175, 28052922, 27585916, 27591542, 27980305, 28458348, 28262464, 28088083, 28756834, 29454966]
8803B9454966L0939M05516L5857j059900m97403J92298J00296P149n09771o14357
8793B7545590N98881J260176K24613r7374n9595K43999J98390q81302j38780P17117
8783B9611715l70513p42876K44969O4723m22540k44969q0649J02775L90480k76415
8773B8276700q71672n642N91524j16120k88134j50756R9399m50756m32590k91419
8763B6360534K04464O00469R08177M84419l14193j049148o33121K12575K02391
8754B6976567L36805j48849k85692K54705K86120O88714r946m09567K85273R31856
8744B8905986K9003j058693j142148k27172O80853N24524J67643j50980n61759
8735B7167257m20132k73247M19501Q12756N38402J21276n61748n50685j12330
$$ y = [29454966, 29485905, 29891421, 29927278, 28867378, 28369975, 28562273, 28662569, 28669718, 28159947, 27545590, 28144471, 29404647, 29629260, 29531886, 29472291, 29716290, 29914680, 29033378, 28894598, 29611715, 29241202, 28498326, 28743295, 28808018, 28385478, 28140509, 28059860, 28162635, 28553115, 28276700, 27405028, 27399386, 27990910, 27874790, 27586656, 27435900, 27535299, 27084543, 26651953, 26360534, 26564998, 27165467, 28073644, 28558063, 28243870, 27194722, 26561601, 26774176, 26976567, 27313372, 27164523, 26878831, 27133536, 27419656, 28108370, 28098424, 27688857, 27974130, 28905986, 28934989, 27876296, 26734148, 26506976, 27187829, 27712353, 27879996, 27729016, 27167257, 26747125, 26473878, 26893379, 27706135, 28244537, 28365813, 27804065, 27253380, 27141050]
8726B7141050j93731J8938J45736K79805M52778N50622L07954j60826J87819R49074
8716B9679219L45046p95502n78755l65161Q9636L19102J97673l26447l5458K27503
8706B8756856J84204P4104j062705n46803M47567J83777j54900m45223m60926
8697B6975951L26199J288308J485221J92984r84967j20030j28643m11426N4498
8688B8678095m80664q1713P32037p3090o77380m45649n4926o66813j45013N91691
8678B7376575J014078P23195K18955L56435K49509j45823n70363q19440j027852
8669B7375269l93028N76672J405k71703m22605m54049J12668O4503o51524m35080
8659B5502528O59466J117053K77240o20852J96698J349740J75377p60908k12292
$$ y = [27141050, 26947319, 26966257, 27111993, 27391798, 27844576, 28395198, 28703152, 28542326, 28730145, 29679219, 30024265, 29228763, 28650008, 28284847, 28374483, 28693585, 28891258, 28564811, 28529353, 28756856, 28941060, 29015164, 27952459, 27405656, 27853223, 28037000, 27882100, 27436877, 26975951, 27302150, 28590458, 30075679, 30268663, 29283696, 29163666, 29035023, 28623597, 28678095, 28197431, 28115718, 28847755, 28774665, 28097285, 27651636, 27596710, 26929897, 26784884, 27376575, 28390653, 29113848, 29332803, 29689238, 29938747, 29792924, 29222561, 28403121, 27375269, 26982241, 27558913, 27560318, 27288615, 26866010, 26411961, 26524629, 26589132, 25937608, 25502528, 26161994, 27279047, 27556287, 26935435, 27132133, 28481873, 28657250, 27896342, 27684050]
8650B7684050L74065P5281K96457L60850l29622n12501j094296j278913o02687
8641B4972684L31254P14840P60726J027998R35870R23241M30813K065o74639n16327
8631B8908525k14247l57221k54189K0176O88779j55960n90435p60191l94643N68923
8621B7459517O53516n3811K4832P08864N40020M6784o43748j164114o17824k50194
8611B6703842J18227o50548N1190P76322N20855J147281R14037l24010j063791
8602B8193405o12129J57634L11025m52150l2327N53897n88122j081218J16110
8593B6566125J096996M30954R4085K46248L62297K50292l22306l12224n1453J28448
8583B8489462j29891m16437P63035J241659K56885K01141j16948j58360J89113
$$ y = [27684050, 28058115, 28133396, 28429853, 28790703, 28461081, 27948580, 26854284, 25575371, 24972684, 25303938, 26018778, 26779504, 27807502, 28743372, 29666613, 30097426, 30099491, 29424852, 28908525, 28694278, 28337057, 28082868, 28103044, 28791823, 28635863, 28045428, 27285237, 26890594, 27459517, 28113033, 28059222, 28084054, 28792918, 29332938, 29379722, 28735974, 27571860, 26954036, 26703842, 26822069, 26171521, 26222711, 26999033, 27519888, 28667169, 29581206, 29257196, 28193405, 27581276, 27738910, 28049935, 27597785, 27565458, 28119355, 27531233, 26450015, 26566125, 27663121, 28094075, 28188160, 28434408, 28796705, 29046997, 28724691, 28412467, 28361014, 28489462, 28359571, 27943134, 28706169, 29947828, 30204713, 30405854, 30288906, 30130546, 30319659]
8574C0319659N9410j17312k73733l47236o3249K55123j3652j90059K91428p9639
8564B9840740r50037o41703Q8546L21555j9825j64778p35382o21635M6469J99364
8554B7363314k31918j8375L94581J70352m68683j36464P65333L49247n54570r77131
8544B6655686J81752M66479K87675O64416M47682J27559n75098k1333R56361L43190
8534B9534369l2126K40157J36355l11758Q8055j76058m83878m29524n36793k48327
8524B7780472N57910M41323K54368l28691k88159r03733k77719Q17027J94024
8515B8246822m8236N6804n9121o16563l38872K30887k57626j35281O32153L48990
8505B8059957l81676j33292K55264M42577L98739j32610J73543P57912M04837
$$ y = [30319659, 30379069, 30261757, 29988024, 29640788, 29577539, 29832662, 29819010, 29628951, 29920379, 29840740, 28890703, 28249000, 28337546, 28659101, 28639276, 28474498, 27739116, 27117481, 27163950, 27363314, 27131396, 27113021, 27507602, 27677954, 27209271, 27072807, 27838140, 28187387, 27632817, 26655686, 26837438, 27303917, 27591592, 28256008, 28703690, 28831249, 28256151, 28234818, 29191179, 29534369, 29502243, 29742400, 29878755, 29566997, 29655052, 29478994, 28995116, 28565592, 28028799, 27780472, 28338382, 28779705, 29034073, 28705382, 28417223, 27513490, 27235771, 28052798, 28246822, 28198586, 28255390, 28196269, 27579706, 27240834, 27471721, 27214095, 27078814, 27710967, 28059957, 27678281, 27544989, 27800253, 28242830, 28641569, 28508959, 28682502, 29440414, 29845251]
8496B9845251M53368Q4709m01900l11581l77054n419j79174k558Q24487o0495
8486B9869634q56484p62073M4337N2979J30367J37083J59047Q1162l33768r0415
8476B8431869L11363J99687l840m9687q2485L23470L42842m10513n52203m12185
8466B8098318l92889k8037Q92385J268729O42865l64696j065031j45455K15563
8457B9121752J59626k03799n85184k99447N72365N76675n99683k99697P04180
8448B9146788M03728l29648j29655k11338o93353o00860K38599M81078L57788
8439B8663127p92467j235174l11397r8702M45921N2785n47869K87957J58642K71694
8429B6894517O17641P39394N01769N37531L23342m44274n97984o96005l67732
$$ y = [29845251, 30298619, 30383328, 29981428, 29669847, 29292793, 29287374, 29108200, 29105642, 29930129, 29869634, 29013150, 28251077, 28295414, 28348393, 28478760, 28615843, 28774890, 28856052, 28522284, 28431869, 28743232, 28942919, 28939079, 28889392, 28806907, 29130377, 29473219, 29062706, 28510503, 28098318, 27705429, 27677392, 28569777, 29838506, 30481371, 30116675, 29051644, 28906189, 29121752, 29281378, 29077579, 28492395, 28192948, 28765313, 29341988, 28742305, 28442608, 29146788, 29550516, 29220868, 29091213, 28879875, 28186522, 27585662, 27824261, 28305339, 28663127, 27870660, 26635486, 26324089, 26225387, 26671308, 26724093, 26176224, 26464181, 26622823, 26894517, 27512158, 28251552, 28753321, 29290852, 29614194, 29169920, 28571936, 27875931, 27508199]
8420B7508199o17680k21527N93141j17385m46507N16271M27825J83950Q47907
8411B8674194L56447O8342L34123m16661m76483L73954J81008j09221n44114o72095
8401B7769494l11012j95291k53944N32741Q44450J1869m52009j10219J33390K31980
8391B8201449J82953Q87972R72707N3003p70639j33675L86803J61438L53147j19952
8381C0175206N2309O9678N37034N52497M23699m41748o35057K96106o87106j498952
8371B8843666L60333L78729o67899k98218L16143o202j75491J11299M46063N35811
8361B9844234L87556l19801m79326l22819j26006j87688o31516m95681P15933
8352B8384886M27914j34536L42045J323691R87002l73805L6528r2488j112479
$$ y = [27508199, 26890519, 26668992, 27262133, 27144748, 26698241, 27214512, 27642337, 27826287, 28674194, 29030641, 29098983, 29433106, 29016445, 28539962, 28913916, 29094924, 28985703, 28441589, 27769494, 27458482, 27263191, 27009247, 27541988, 28386438, 28398307, 27946298, 27836079, 27969469, 28201449, 28384402, 29272374, 30245081, 30298084, 29527445, 29393770, 29780573, 29942011, 30295158, 30175206, 30227515, 30297193, 30834227, 31386724, 31810423, 31368675, 30733618, 31029724, 30342618, 28843666, 29203999, 29582728, 28914829, 28616611, 28932754, 28926552, 28751061, 28862360, 29308423, 29844234, 30231790, 29911989, 29432663, 29109844, 28983838, 28796150, 28164634, 27668953, 28384886, 28812800, 28678264, 29020309, 30344000, 31331002, 30957197, 30993725, 30901237, 29788758]
8343B9788758p87812J11548P80228P6957n68750L46589M15982n2754k8677M62878
8333C0544947J47150l85485j97239N14125N73962j12437k94398l97389m51662
8324B9941574l50823o50884k42533n03784j118760k49666N13141M08555K85685
8315B8032505P57030J044367Q69602n6924q49730j531127k43160O91773K49264
8306B8963600K75035J3036M26012l6512j269795j346594K64059R28424K73651
8297B8490916o23577k35239L77407K49457K19784L94993R77631N55091q9711k57031
8287C0059721r039j74928o5407n53788l73158J60524n4077n37295j30743j62867
8277B8158943r55628k92583R56635O14241M05026j25626o28110k86863N22870
$$ y = [29788758, 29000946, 29112494, 29892722, 29969679, 29400929, 29747518, 30163500, 30110746, 30082069, 30544947, 30692097, 30306612, 30109373, 30623498, 31197460, 31085023, 30790625, 30393236, 29941574, 29590751, 28939867, 28697334, 28193550, 27074790, 26825124, 27338265, 27746820, 28032505, 28789535, 29833902, 30703504, 30646580, 29796850, 28265723, 28022563, 28714336, 28963600, 29238635, 29251671, 29677683, 29641171, 28371376, 27024782, 27288841, 28217265, 28490916, 27867339, 27632100, 28009507, 28258964, 28478748, 28873741, 29851372, 30406463, 30316752, 30059721, 30050682, 29875754, 29810347, 29256559, 28883401, 29043925, 28989848, 28452553, 28321810, 28158943, 27203315, 26910732, 27867367, 28481608, 28886634, 28761008, 28132898, 27846035, 28368905]
8268B8368905M34331J47485K47753j742n0501j6139N80784L4233M53493M41607
8258C0640209n90738l70518j07049m46268j20124J35480l86170l31888O83232
8249B9106166J019293P7797n49579q38080K95245M8827K64333K93669K9743N72989
8239C0320403P5632n63102k34907m39564n45123q58518k86163O21177L55849J51944
8229B8597628L67256K85045o16448o70302k30388J09993L72636N69910Q45466
8220B9630796O96083K75071m23103q53468q0408M91497l3186q79847q80511l09943
8210B7632981J34940K90472Q04567P56572j60023n17140K75327N25884K18858
8201B9962438n48258k47032M81417L70392l01480r34912p81078O26935M70601
$$ y = [28368905, 28803236, 28950721, 29198474, 29196732, 29146231, 29130092, 29710876, 29745109, 30198602, 30640209, 30049471, 29678953, 29571904, 29125636, 29005512, 29140992, 28754822, 28422934, 29106166, 30125459, 30203256, 29653677, 28815597, 29110842, 29159669, 29424002, 29717671, 29747414, 30320403, 30396035, 29832933, 29598026, 29158462, 28613339, 27754821, 27468658, 28089835, 28445684, 28597628, 28964884, 29249929, 28633481, 27963179, 27732791, 27842784, 28215420, 28785330, 29630796, 30326879, 30601950, 30178847, 29325379, 29244971, 29736468, 29703282, 28823435, 27942924, 27632981, 27767921, 28058393, 28862960, 29619532, 29459509, 28942369, 29217696, 29743580, 29962438, 29414180, 29167148, 29648565, 30018957, 29717477, 28782565, 28001487, 28628422, 29099023]
8192B9099023Q9074M19715K53915N06978L121k01668N29418K78944m25205r16625
8182B9636690k07279L444k05292J5899o09058k76121Q29539q1315J2134L90761
8172B9509402J88562J57652o07629j039229l99810p2603J25012J426946O61087
8163B9949390p50116n85819Q04516L79769m63672l32182n27674m14308M16451
8154B8476355n04520j169222p89402K7316J164314J360758R16997O00249K70872
8145C0353717L82182M14700k58091n69865P4991L94539m34618m32267L55323P48115
8135C1028726K99866k03026q03965j223633p36626K2774q56367j307316K87965
8126B6508398M35925M86400M92801R07776P73618k63979p04849l99157M99971
$$ y = [29099023, 29188097, 29607812, 29861727, 30368705, 30371826, 30170158, 30699576, 30978520, 30553315, 29636690, 29429411, 29432855, 29227563, 29243462, 28634404, 28358283, 29187822, 29106507, 29118641, 29509402, 29697964, 29855616, 29247987, 28208758, 27808948, 27736345, 27861357, 29288303, 29949390, 29199274, 28613455, 29417971, 29797740, 29334068, 29001886, 28474212, 28059904, 28476355, 27971835, 26802613, 26013211, 26040527, 27204841, 28565599, 29482596, 30082845, 30353717, 30735899, 31150599, 30892508, 30322643, 30397634, 30792173, 30357555, 29925288, 30280611, 31028726, 31328592, 31125566, 30321601, 29097968, 28361342, 28384116, 27527749, 26220433, 26508398, 26944323, 27430723, 27923524, 28831300, 29604918, 29340939, 28636090, 28236933, 28736904]
8117B8736904R57092J1297m76589P89073K13547j519704j952002p79778P59798
8108B6739638J224067K33306k70176o0569n49104l09438L27040n49948j87500
8099B6597316O71071P13014P53301K61817n5014j67035n81183k14030q9094k22217
8089B7667946M52195N81571J89321l73538N4986J67313j28716M80046R63452N72610
8079C0627186k7471q13800l52852N33403J69363k67837r29408o33754M12040L13868
8069B9030738N80247J46726q2655L47604o4168l92656m5902o80604n59058P3924
8059B8354196Q2143R056j08175l77277m07629J70759J16573Q58181P2765j143830
8049B7626762p01136O50372Q25846P22743L49574K30409J32407r9358k29119o67190
$$ y = [28736904, 29693996, 29705293, 29228704, 30017777, 30231324, 28711620, 26759618, 25979840, 26739638, 27963705, 28197011, 27926835, 27866266, 27317162, 27007724, 27334764, 26784816, 26597316, 27268387, 27981401, 28734702, 28996519, 28941505, 28774470, 28193287, 27979257, 27890163, 27667946, 28120141, 28701712, 28891033, 28517495, 28572481, 28739794, 28611078, 29091124, 30054576, 30627186, 30599715, 29785915, 29433063, 29966466, 30135829, 29867992, 28938584, 28304830, 28716870, 29030738, 29610985, 29757711, 29675056, 30022660, 29958492, 29565836, 29519934, 28839330, 28280272, 28354196, 28436339, 28445395, 28337220, 27959943, 27552314, 27723073, 27839646, 28697827, 28770592, 27626762, 26925626, 27575998, 28401844, 29124587, 29474161, 29704570, 29836977, 29737619, 29508500, 28841310]
8039B8841310r39716N1904Q71757O69647M20904L81564r3259q9002j06079o967
8029C0002063n26367j242846o96746K17190J041077J073187k29474k8304M7528
8020B9657308O5449O09023M14810n97268q74731L30005J114122O89065K49874
8011C1657657N65193j52355q88180r99068j420309j425917m84785M63393R28322
8002B8243951N33537J09088K86184J054745j16026r26321J30538M36985o27518
7993B9125163q9628N17969n30921L8770N39064j6533m97699O83582J152352k81503
7983C0640616q87404K38351J51335k21917L43988L00631j131451p48665j44814
7974B8540670k09143l62453J295201J210130M09304n94967j324422j038788l27985
$$ y = [28841310, 27901594, 27953498, 28825255, 29494902, 29915806, 30297370, 30204111, 30115109, 30009030, 30002063, 29475696, 28232850, 27536104, 27753294, 28794371, 29867558, 29638084, 29609780, 29657308, 29722757, 30331780, 30746590, 30149322, 29274591, 29604596, 30718718, 31407783, 31657657, 32222850, 32070495, 31182315, 30183247, 28762938, 27337021, 26852236, 27315629, 28243951, 28777488, 28886576, 29172760, 30227505, 30111479, 29185158, 29315696, 29752681, 29125163, 29035535, 29553504, 29022583, 29061353, 29600417, 29583884, 29086185, 29769767, 30922119, 30640616, 29753212, 29991563, 30142898, 29920981, 30264969, 30565600, 29434149, 28685484, 28540670, 28331527, 27969074, 29264275, 30474405, 30883709, 30288742, 28964320, 27925532, 27597547]
7965B7597547J46814N18087N99453n68335n10259J10590J97780P08247O9637j17758
7955B8751803n97090k43347P72411M32315k396k74560L74505J36206l7781n4173
7945B9257893j88825J38782P99623j55067o71284J18706K8134l30015k10801l11588
7935B8475558k94O94058N57857L41076J60373J26027m69769o09406J0476Q25064
7925C0111020R76061N46136q4745p29628j82541N11476k96331r19093l132K70215
7915C0199438M95272J33272N44856K54350K13188J21086Q5044L86075p0534j059360
7905C1302687j174879l86617K43134J69717k35708m8392n16554r91374j21144
7896B8240870M41465J293925J161444K65236p62202r81117j026815k56486P83341
$$ y = [27597547, 27744361, 28262448, 28861901, 28293566, 27783307, 27893897, 28091677, 28799924, 28869561, 28751803, 28154713, 27911366, 28683777, 29116092, 29113696, 28839136, 29213641, 29349847, 29312066, 29257893, 29069068, 29207850, 30007473, 29852406, 29181122, 29299828, 29327962, 28997947, 28787146, 28475558, 28475264, 29169322, 29727179, 30068255, 30228628, 30354655, 29884886, 29275480, 29285956, 30111020, 31087081, 31633217, 31548472, 30818844, 30636303, 31147779, 30851448, 29932355, 29929223, 30199438, 30694710, 30827982, 31372838, 31627188, 31840376, 31961462, 32046506, 32432581, 32362047, 31302687, 30127808, 29741191, 29984325, 30154042, 29918334, 29869942, 29353388, 28362014, 28240870, 28682335, 29976260, 31137704, 31402940, 30640738, 29659621, 28632806, 28376320, 29159661]
7887B9159661M04223q71521j157404j88334L72475L72672Q102N81767P25948L32319
7877B9739908o81284j505994p91753K80866N85097P54297J003700L80181m03998
7868B9361020k61297j16571j21026L24341N82648J89028m46603n58459N95169
7859B9548250N38124l97682j61802n09562r38468j99563N07484K9932N56059J294107
7849C0266879L97912J1220j1060m10945j23431k7795m01360q81999j005795j09085
7839B7704541J375977J234553M04608j65173p22367K85010Q42419J28949M09695
7830C1498212N2459q26352r72400l31723p52484q67117J01863O9034j72313q2927
7820B7716252K80204L62805J84555N04744K91404j18261M39669N21300J04964
$$ y = [29159661, 29563884, 28692363, 27534959, 27346625, 27719100, 28091772, 28099874, 28681641, 29407589, 29739908, 29058624, 27552630, 26760877, 27041743, 27626840, 28381137, 29384837, 29765018, 29361020, 29099723, 28983152, 28862126, 29186467, 29769115, 29958143, 29511540, 28953081, 29548250, 30086374, 29688692, 29526890, 29017328, 28078860, 27879297, 28386781, 28416713, 28972772, 30266879, 30664791, 30676011, 30664951, 30254006, 30130575, 30102780, 29701420, 28819421, 27813626, 27704541, 29080518, 30315071, 30719679, 30554506, 29832139, 30117149, 30959568, 31088517, 31498212, 31550671, 30724319, 29751919, 29420196, 28667712, 27800595, 27902458, 27971492, 27799179, 27716252, 27996456, 28359261, 28543816, 29048560, 29339964, 29221703, 29661372, 30182672, 30287636]
7811C0287636q79543o32951k86859O0753L79258j13530l58800K55550O30881R3062
7801B9435457j34779m60980n23830n26655l17619K32196O58441Q26723Q14964
7792C0003918N12121L28375k90305k17056n51229j000473k69033M17384J80087
7783B9113789m74086M51703J353201O71292N41870j94456m05171p80804m96510
7774B9780828J1271l71038k99382K36385m377l88695j07744M75252M16951L0116
7764B9779567J73717j61583l98568l8154J21709N05209j76277q24071k08046K22039
7754B8995542M92244K26535Q6306l65808j15985O85846J99748O3731j46413M96721
7744C0618467P22775O91438j9467q94541m56338k85931k83011m91467p01949j11317
$$ y = [30287636, 29408093, 28775142, 28488283, 28549036, 28928294, 28814764, 28455964, 28711514, 29342395, 29435457, 29300678, 28839698, 28315868, 27789213, 27471594, 27703790, 28362231, 29188954, 30003918, 30516039, 30844414, 30554109, 30337053, 29785824, 28785351, 28516318, 28933702, 29113789, 28639703, 29091406, 30444607, 31115899, 31657769, 31463313, 31058142, 30277338, 29780828, 29792099, 29421061, 29121679, 29358064, 29353687, 28964992, 28857248, 29332500, 29749451, 29779567, 29953284, 29791701, 29393133, 29354979, 29476688, 29981897, 29805620, 28981549, 28773503, 28995542, 29487786, 29714321, 29800627, 29434819, 29318834, 30004680, 30204428, 30268159, 30121746, 30618467, 31341242, 32032680, 32013213, 31118672, 30662334, 30376403, 30093392, 29601925, 28899976, 28788659]
7734B8788659O35115O69553j56234o03703k39880n3530k4683M87937L43607K98532
7724C0145373M83695m93264j16789K69775K73240m65791j015718J47297N26947
7715B9754765M74265N08542J17085n22791k32617l44074j098804p55163k79031
7706B7622177j12177K89048O20236M88597M43188j89861p65788p20101n22148
7697B7153171K22483P21255O93868K09042L14601R74107O87672j79671k39229
7688C0557299j32417R8333l61905j098712j62550L71485M115M7847P74177J87043
7678C0284715m95296o42150l53939m57899l47764N38413L79195J38715J1182N7232
7668B9112404j53926o66188m47045J73439K26812J89128Q9136j89263j32597Q51378
$$ y = [28788659, 29423774, 30093327, 29937093, 29333390, 29093510, 29039980, 29015297, 29503234, 29846841, 30145373, 30629068, 30135804, 30019015, 30288790, 30562030, 30096239, 29080521, 29227818, 29754765, 30229030, 30737572, 30854657, 30331866, 30099249, 29755175, 28656371, 27901208, 27622177, 27510000, 27799048, 28419284, 28907881, 29351069, 29161208, 28395420, 27675319, 27153171, 27375654, 28096909, 28790777, 28999819, 29314420, 30288527, 30976199, 30796528, 30557299, 30424882, 30523215, 30161310, 29062598, 28900048, 29271533, 29275648, 29323495, 30097672, 30284715, 29789419, 29147269, 28793330, 28335431, 27987667, 28526080, 28905275, 29043990, 29055172, 29112404, 28958478, 28292290, 27845245, 28018684, 28245496, 28434624, 28523760, 28334497, 28201900, 29053278]
7658B9053278J492682P61294j31928l66600o30628p30961K7525M44185l02255
7649B9616592j72796Q31348N97876N66864O73019J78095p14744r57517m57373
7640C0161364l43451n28816m34533J38621O08718j78182m16653J55404N67643
7631B9730115J63433j44611l37264j06680K7871l796Q973M76776l90355q30702
7621B8593760j75806K74047K27852N8941m35828n34802k24505j1409N15674J479938
7611B9767862J026404N09q66352r10822M7863J41043Q96299J244821M10802l72172
7601C1386257n81199q14637r32858q78615l21319L11015Q69993J154792Q09136
7592C1002565J07080j3703j96625j4129L03701l15436p48495m60946K8777K65321
$$ y = [29053278, 30545960, 31307254, 31175326, 30808726, 30178098, 29447137, 29474662, 29918847, 29616592, 29443796, 30275144, 30873020, 31439884, 32112903, 32290998, 31576254, 30618737, 30161364, 29817913, 29289097, 28854564, 28993185, 29601903, 29423721, 29007068, 29162472, 29730115, 29893548, 29748937, 29411673, 29304993, 29332864, 29329068, 29338041, 29814817, 29424462, 28593760, 28417954, 28692001, 28919853, 28978794, 28542966, 28008164, 27783659, 27772250, 28287924, 29767862, 30794266, 30794775, 29928423, 29017601, 29065464, 29206507, 30102806, 31347627, 31758429, 31386257, 30805058, 29990421, 29057563, 28178948, 27857629, 28168644, 29038637, 30193429, 31002565, 31109645, 31095942, 30899317, 30885188, 31188889, 30873453, 30124958, 29664012, 29692789, 29958110]
7582B9958110l67683j73006J67880m10477n94535K14136O88703N19133j37824
7573B9864437k55226k72717O46387J243111L53948j055610j380784j191262n27494
7564B7424790N63822L56862K50117n38J57320O10014N02876l3529j3764O35445
7554C0453415K05853J63077j8583j03183J82729m50703j13105O3608K83372K39698
7544C0906178K15984r8797p89534n7361J42903j14553q2648J38097K94152L08910
7534C0863331J29306l28339o40122l20230j73269J37614q0705o28300m12162k70760
7524B8276364j93382P77079J108948K99998o04585l70760k20008j2609J22982
7515B9184027l07335K9468N115j03882j35107j92284L16857L37797J51692K320
$$ y = [29958110, 29590427, 29417421, 29585301, 29174824, 28580289, 28794425, 29483128, 30002261, 29864437, 29609211, 29336494, 29982881, 31225992, 31579940, 30524330, 29143546, 27952284, 27424790, 27988612, 28345474, 28595591, 28595053, 28752373, 29362387, 29865263, 29831734, 29817970, 30453415, 30659268, 30822345, 30803762, 30700579, 30883308, 30432605, 30319500, 30383108, 30666480, 30906178, 31122162, 31023365, 30233831, 30176470, 30319373, 30204820, 30122172, 30260269, 30554421, 30863331, 30992637, 30664298, 30024176, 29703946, 29530677, 29668291, 29587586, 28959286, 28547124, 28276364, 28082982, 28860061, 29969009, 30269007, 29664422, 29293662, 29073654, 29061045, 29184027, 28876692, 28906160, 28911275, 28807393, 28672286, 28480002, 28796859, 29134656, 29286348, 29288668]
7505B9288668j38637O28689Q96625k36710p69378n59471n50726l99528j59398
7496B8000134M9589j68857J24672J70073J03151Q7382o4905l89602l54916m25594
7486B7131127L75005J229903P03935K69360n80743j596788r86199j29694J179707
7477B7595613J179175J16162n09939J6779M88731J23651k73626O75709Q03826
7468C0216081J087237M17181p56509k91688J212955J27268n76421o88607o84764
7459C0062733j77581j79321L26455N7017q82495j17519N10776P54732L93477R3695
7449C0841969Q07487O45568N579j141844j041810J20067K72997J135750R67811
7440C2613574R23278l06970j232978q77843n36820k3169l27261n5222k83846M66790
$$ y = [29288668, 29150031, 29778720, 30675345, 30438635, 29669257, 29109786, 28559060, 28159532, 28000134, 28049723, 27880866, 28005538, 28175611, 28278762, 28366144, 28301239, 27911637, 27556721, 27131127, 27506132, 28736035, 29439970, 29709330, 29128587, 27531799, 26545600, 26415906, 27595613, 28774788, 28890950, 28381011, 28397790, 28886521, 29010172, 28736546, 29412255, 30216081, 31303318, 31720499, 30963990, 30672302, 31885257, 32012525, 31436104, 30747497, 30062733, 29885152, 29705831, 30032286, 30089303, 29206808, 29089289, 29600065, 30354797, 30748274, 30841969, 31649456, 32295024, 32300603, 31158759, 30116949, 30237016, 30510013, 31645763, 32613574, 33536852, 33229882, 31996904, 31119061, 30582241, 30559072, 30231811, 30176589, 29892743, 30359533]
7430C0359533L886j231240p04540k09962n88319j80775L36963O53552M57875M24394
7420B9321367Q9530M01642K51641p4043Q4102L92833k6405M21807M72515j16898
7410C1218091k34237o50685m9274P53416L81353k80998N237M6625k78513r7165
7400C0813850K96879L87994J84245l89558p68038o9812p1610k56509N51343R5462
7390C0774246n91219J21646J16412k66256M00846N48031N21583j83445m53054
7381C0988790l55249l00758J95589J173570J65615j433701j72089R6705o7534
7372C0290938L94334K92555M42750r8664p5702o70499l92654p0121L73488K8950
7362C0515375P65828L73887q63266j008585r61850o5781O23206M52218K42309
$$ y = [30359533, 30363419, 29132179, 28427639, 28217677, 27629358, 27448583, 27785546, 28439098, 28896973, 29321367, 29410897, 29812539, 30064180, 29990137, 30074239, 30467072, 30440667, 30862474, 31334989, 31218091, 30983854, 30333169, 30283895, 31037311, 31418664, 31137666, 31142903, 31189528, 30911015, 30813850, 31110729, 31498723, 31682968, 31293410, 30525372, 30455560, 30383950, 30127441, 30678784, 30774246, 30183027, 30304673, 30421085, 30154829, 30555675, 31103706, 31625289, 31441844, 30988790, 30633541, 30332783, 30528372, 31701942, 31867557, 30433856, 30261767, 30358472, 30290938, 30685272, 30977827, 31420577, 31321913, 31246211, 30575712, 30183058, 30112937, 30486425, 30515375, 31281203, 31655090, 30791824, 29783239, 28821389, 28755608, 29378814, 29831032, 30073341]
7353C0073341l18615k89111M56326O63393O04532K08285l58327n64965o80460
7344B9794399k22550O39944K06360j43567m17245k94196L50565J072469M87436
7335C1473615O11463K27977j39288J45848R46706M70108m31400o76438P3472M67969
7325C3170032P03739O95610j65324r83720q87216p71643m77636M49050L06209
7316C2039101l9688K06545M9266L72926M80961k71519o40977n19874p59640m35720
7306C0481381J179663J495231J36071j22627n05635j25801K71588j03494n36116
7297C2170261k54383K25909O045j34606P89975J065910k98026p58937o20017r40921
7287C1251210k38624O13974j41749j902652j356969K69286J930867R92935J87312
$$ y = [30073341, 29754726, 29465615, 29921941, 30585334, 31189866, 31398151, 31039824, 30474859, 29794399, 29571849, 30211793, 30418153, 30274586, 29857341, 29563145, 29913710, 30986179, 31473615, 32085078, 32313055, 32173767, 32319615, 33266321, 33736429, 33305029, 32628591, 32702063, 33170032, 33873771, 34569381, 34404057, 33420337, 32533121, 31761478, 31283842, 31732892, 32039101, 31999413, 32205958, 32255224, 32628150, 33109111, 32837592, 32196615, 31676741, 30917101, 30481381, 31661044, 33156275, 33292346, 33169719, 32664084, 32538283, 32809871, 32706377, 32170261, 31915878, 32141787, 32147832, 32013226, 32803201, 33869111, 33571085, 32812148, 32192131, 31251210, 31012586, 31626560, 31484811, 29582159, 28225190, 28494476, 30425343, 31418278, 31605590]
7278C1605590J143765R40793P69391J22500K35699M5116O2018m54238j256305
7269C3214329j584520l90943J07854p21305M5525L61593L05210k34594M37217
7260C1540366N98154J25783j82896K32110J49130J19264l88339q75947j309794
7251C0007831l10321P6146K13667O77603R80742L89393j34581o87311k38900P44935
7241C1719204N02259r0878j27417o67194K39566J189538J901352J603210l07331
7232C5962309j569691j835950j269331k50760L50383J102775J653322Q75609n80612
7223C4438054r94593K04901Q71552L92808n26369j92405l4638l58681n60362j528633
7213C1711634r45594Q08346R87714J89983J34972K41698N13857M7160n07457m90583
$$ y = [31605590, 32749355, 33690148, 34459539, 34582039, 34817738, 34862854, 34924872, 34470634, 33214329, 31629809, 31238866, 31346720, 30625415, 30670940, 31032533, 31337743, 31103149, 31540366, 32138520, 32264303, 32081407, 32313517, 32462647, 32581911, 32193572, 31317625, 30007831, 29697510, 29773656, 29987323, 30664926, 31645668, 32035061, 31900480, 31213169, 30974269, 31719204, 32221463, 32130585, 32003168, 31335974, 31575540, 32765078, 34666430, 36269640, 35962309, 34392618, 32556668, 31287337, 31036577, 31386960, 32489735, 34143057, 35018666, 34438054, 33443461, 33648362, 34519914, 34912722, 34386353, 34193948, 34159310, 33800629, 33240267, 31711634, 30766040, 31574386, 32562100, 32752083, 32887055, 33128753, 33642610, 33689770, 33182313, 32691730]
7203C2691730R0457O89171M05711O8003j71569j83270J10173K21709r4726n84502
7193C3242887k362J82844m27330J81873J74244Q2248l58430L61886J84842Q63
7183C3623565O69945Q63175K25907l13339q2203M0927M22106j97968q73566k96338
7173C4082211j60303n95451l58257O37929N27263n0631m04275j7870R37444J090045
7163C5688105K53515K66735n03748N36117J636720P13668R3177N90801L2988n86268
7153C8721810J82926M75503l61159m17999N15400J301906P20035N62013M2922
7144D1743357M10091J642411O52144k2196J652094J837957J529017J510040J844387
7135E2799302K081432K341322K286297L592854M012914M691386M811925N494516
$$ y = [32691730, 32782187, 33471358, 33877069, 33945072, 33773503, 33590233, 33700406, 33922115, 33827389, 33242887, 33240525, 33423369, 32996039, 33177912, 33352156, 33434404, 33075974, 33437860, 33622702, 33623565, 34293510, 35156685, 35382592, 35069253, 34987050, 35027977, 35450083, 35252115, 34378549, 34082211, 33921908, 33326457, 32968200, 33606129, 34133392, 34082761, 33678486, 33660616, 34598060, 35688105, 35941620, 36208355, 35704607, 36240724, 37877444, 38591112, 38684289, 39275090, 39308078, 38721810, 38904736, 39380239, 39019080, 38601081, 39116481, 40418387, 41138422, 41700435, 41743357, 42153448, 43795859, 44448003, 44425807, 46077901, 47915858, 49444875, 50954915, 52799302, 54880734, 57222056, 59508353, 63101207, 67114121, 71805507, 76617432, 82111948]
7127H2111948K776933j1307714m4055709m2085853r412562K092096M376197M660886
7119a0843778M543411K812081L475066K702026K777509K484944K153767K164461
7111A2269487J772736J004769J137627J074562J327359J101962M87696K82774
7103B0458972K22038L17801M37523N96771M81781J04000R09l59885N6917K42883
7093B2559710J098805J219718P9669l84846k48378L12963N33085L82943P8952
7084B5632621L04536M39255L9388Q2352M37172m84149k30137J03120o5833K46125
7074B6504450j26143k31235m09088j15065L54300K55314k84645p23748l3924R20123
7064B6110339R83153M16589J3667K59886Q7993j067015l89820Q88972N99168q4478
$$ y = [82111948, 84888881, 73581167, 29525458, -12560395, -21972957, -19880861, -15504664, -10843778, -6300367, -3488286, -13220, 2688806, 5466315, 7951259, 10105026, 12269487, 14042223, 15046992, 16184619, 17259181, 18586540, 19688502, 20176198, 20458972, 20681010, 20998811, 21436334, 22033105, 22514886, 22618886, 22619795, 22259910, 22316827, 22559710, 23658515, 24878233, 24957902, 24573056, 24324678, 24637641, 25170726, 25553669, 25632621, 25937157, 26376412, 26415800, 26498152, 26935324, 26451175, 26221038, 26324158, 26258325, 26504450, 26378307, 26147072, 25737984, 25622919, 25977219, 26232533, 25947888, 25224140, 25190216, 26110339, 27093492, 27510081, 27523748, 27783634, 27871627, 26804612, 26414792, 27303764, 27902932, 27818454]
7054B7818454o43511l42162O17034M55284N89015N10843J31403m39439o79149
7045B8017772p0092M22002N83585L03366q44522l46466Q1943M10467Q6370l64087
7035B8280338O2506K26704O50930J90367k23391K01197P35658J100730L06267
7026C1531306m66284j340046j166145l74904J66664O83623k49340n54282J17927
7017B8348519j53826k71178J6614P91326K47269j89424j36249K90162Q10963Q03887
7007C0558063o61323j585331p16161M17142O57687o1310O4238N18236K69869K62045
6997B9723155M95006M48456J98039j61674M970J36692k20255n33683q45631l07993
6987B8937082P27092R83596M41306o04209l80616p21741j417168j058624o39941
$$ y = [27818454, 27174943, 26832781, 27449815, 27905099, 28494114, 29004957, 29136360, 28696921, 28017772, 27947680, 28369682, 28953267, 29256633, 28412111, 28065645, 28147588, 28558055, 28644425, 28280338, 28342844, 28569548, 29220478, 29410845, 29187454, 29388651, 30124309, 31225039, 31531306, 31065022, 29724976, 28558831, 28183927, 28350591, 29034214, 28784874, 28230592, 28348519, 28194693, 27923515, 27940129, 28731455, 28978724, 28789300, 28653051, 28943213, 29754176, 30558063, 29896740, 28311409, 27595248, 28012390, 28670077, 28608767, 28673005, 29191241, 29461110, 29723155, 30218161, 30666617, 30864656, 30702982, 30707952, 30844644, 30624389, 30090706, 29245075, 28937082, 29664174, 30647770, 31089076, 30484867, 30104251, 29382510, 27965342, 26906718, 26266777]
6978B6266777J1896O66783R44133N88885l95415R2571N88997P13587M55261N90720
6968C0524195j77781r87397o96876K09749R13702P55001l38342l69100N01400
6959C0334551L22399K61416L17746K2291q86588o81214k93293P25038P21397j55660
6949C0688083K69743L8663o70831J6367Q71221j92489n46932k40078n19140K86875
6939C0001482J263960M42064m55902l01900K48011j37445p30633j203154j141023
6930B7985460N9885J146771R99008Q45084M94695k11168m00749J32885p7154N53805
6920C1528522P29022j0647j44252l2217o91575q35617o25184m48758L70617k41328
6910B9598583L61765P70332L07098k59456p33826m01910J67695K71488J41933
$$ y = [26266777, 26278673, 26945456, 27889589, 28478474, 28083059, 28175630, 28764627, 29478214, 29933475, 30524195, 30346414, 29359017, 28662141, 28871890, 29785592, 30540593, 30202251, 29833151, 30334551, 30656950, 30918366, 31236112, 31258403, 30371815, 29690601, 29397308, 30122346, 30843743, 30688083, 30957826, 30996489, 30325658, 30342025, 31213246, 31020757, 30473825, 30233747, 29714607, 30001482, 31265442, 31707506, 31251604, 30949704, 31197715, 31060270, 30329637, 29126483, 27985460, 28045345, 29192116, 30191124, 31036208, 31530903, 31319735, 30918986, 31051871, 30974717, 31528522, 32257544, 32246897, 32102645, 32070428, 31378853, 30543236, 29918052, 29469294, 29839911, 29598583, 29960348, 30730680, 31037778, 30778322, 30044496, 29642586, 29810281, 30081769, 30223702]
6901C0223702n27886r25021Q4301M02548K11979j047247j46959O16036J39982
6892B9031435L36172N5113O1226K66970N05752m5945o48848K9448O10719l843
6882C0198199k84566J74377P57926Q06884m6063n80661K50821N59195J84809p52513
6872C1268408j273324m24527r514M61408L64755k02801k91928L80284Q17130J19573
6862C1209464p20194q35311p26647o45968J18297O89333L40004R57699J228515
6853C1615192J208355L49542r50247p96017r07335p39504L7127o9581l40853K70434
6843B9677113Q22876m4532p24379o38170J01993J580556J189929k66097o29101
6834C1070188p1440J8370n25239r2887N56707K39824j67193K17847N2250j375109
$$ y = [30223702, 29695816, 28770795, 28855096, 29257644, 29469623, 28422376, 28275417, 28891453, 29031435, 29367607, 29422720, 29483946, 29750916, 30256668, 30210723, 29561875, 29591323, 30202042, 30198199, 29913633, 30088010, 30845936, 31652820, 31606757, 31026096, 31276917, 31836112, 32020921, 31268408, 29995084, 29570557, 29561043, 30022451, 30387206, 30184405, 29892477, 30272761, 31089891, 31209464, 30489270, 29653959, 28927312, 28281344, 28399641, 29088974, 29428978, 30386677, 31615192, 32823547, 33173089, 32222842, 31426825, 30519490, 29779986, 29817113, 29747532, 29406679, 29677113, 30499989, 30455457, 29731078, 29092908, 29194901, 30775457, 31965386, 31699289, 31070188, 30998748, 31017118, 30491879, 30398992, 30955699, 31195523, 31028330, 31246177, 31298427, 29923318]
6824B9923318n44925K23920j59024K88309Q08279N16762K61373O24698K23937
6815C2166647j30339l42589l11817j97710k93443j38397K8594J08610R8623k41589
6805C0746590k94193N6155K39967J111085k31520k9235M10203o87305o24937M45820
6795C1142630L45587K53507N97831k11949r87907q76888p1027J83939j32424P96321
6785C1039620J281141N42539J03744o47654r19897K66391R21449o5570o63201
6776C1858562q70192m68933J562086J275719J91713l00436l84606J26734L68256
6767C3358903J39916l85014r96978l87375M04979K15996Q6775l26686n85434j79278
6757C1345804L53263J27342j56347o52760O03869J410210O33187J3464k84699
$$ y = [29923318, 29378393, 29602313, 29443289, 29731598, 30539877, 31056639, 31318012, 31942710, 32166647, 32036308, 31693719, 31381902, 31184192, 30890749, 30752352, 30780946, 30889556, 30988179, 30746590, 30452397, 30508552, 30748519, 31859604, 31628084, 31598849, 32009052, 31321747, 30696810, 31142630, 31488217, 31741724, 32339555, 32127606, 31139699, 30262811, 30191784, 30375723, 30243299, 31039620, 32320761, 32863300, 32967044, 32319390, 31399493, 31665884, 32587333, 32521763, 31858562, 30988370, 30519437, 32081523, 33357242, 33548955, 33248519, 32863913, 32990647, 33358903, 33498819, 33113805, 32116827, 31729452, 32134431, 32350427, 32437202, 32110516, 31525082, 31345804, 31699067, 31826409, 31670062, 31017302, 31621171, 33031381, 33664568, 33678032, 33393333]
6748C3393333Q1666m4022m05561m34314p79799k48551Q3134K00284k51773N4728
6738C1649125M80712J43002o86737j104945r83579k55107P32879R43419M74978
6729C1393747n88958l00830M14065N91638J214287J112301L87790O28278K46946
6720C5099264J54427J04833o8175l51297p72846n45973k16684J78561r9547k64045
6710C3218518M09632N41498n5969J97246q22425r09783L83300R96064L24425j97322
6700C4085184l70134l51472J59251P7242m16672k00333l03541r688o6536q65528
6690C1737773l17551L02204Q75609J030995j39033K9155k40378K82470L39162
6681C3900406m12426m78729j79932M00262R55440J214957N07123j36484R9233
$$ y = [33393333, 33474999, 33430977, 33025416, 32591102, 31811303, 31562752, 31645886, 31846170, 31594397, 31649125, 32129837, 32272839, 31586102, 30481157, 29497578, 29242471, 29975350, 30918769, 31393747, 30804789, 30503959, 30918024, 31509662, 32723949, 33836250, 34224040, 34852318, 35099264, 35253691, 35358524, 35290349, 34939052, 34166206, 33620233, 33403549, 33582110, 33482563, 33218518, 33628150, 34169648, 34113679, 34310925, 33488500, 32578717, 32962017, 33958081, 34282506, 34085184, 33715050, 33363578, 33522829, 33600071, 33183399, 32983066, 32679525, 32669837, 32603301, 31737773, 31420222, 31722426, 32598035, 33629030, 33489997, 33519152, 33278774, 33561244, 33900406, 33487980, 33009251, 32829319, 33229581, 34185021, 35399978, 35907101, 35770617, 35869850]
6672C5869850j70948N04791P08596p8487p94498r80648L0028J119797R57878N7056
6662C7223415k58463l86232p84311m94720J17659k37789k72517k36357l63537
6653C4307148M55235J63497n77066l8003P22708L86638j446k88098p51660L60285
6643C4739238M92427L23866l84529j43081P77704O18598K86145K71235N9043p31044
6633C6309602o39565k78198n18058N98793P22843n44437j98838Q71491R31066
6624C7254699M07441k70108m46094J42109j8183l13809N59448J82321j6831K25402
6614C7706395K43785O8738l0596j75849n34472n12494K6215o29989n95001M91366
6604C6058098Q85611J010785O07965J70744N62067L05304K74892K79044K25211
$$ y = [35869850, 35698902, 36203693, 36912289, 36833802, 36039304, 35058656, 35088684, 36208481, 37166359, 37223415, 36964952, 36578720, 35794409, 35299689, 35417348, 35179559, 34907042, 34670685, 34307148, 34762383, 34925880, 34348814, 34310811, 35033519, 35420157, 35418711, 35130613, 34378953, 34739238, 35231665, 35555531, 35171002, 35027921, 35805625, 36424223, 36710368, 36981603, 37040646, 36309602, 35670037, 35391839, 34873781, 35472574, 36195417, 35650980, 35452142, 36323633, 37254699, 37662140, 37392032, 36945938, 37088047, 37069864, 36756055, 37315503, 37497824, 37480993, 37706395, 37950180, 38018918, 37988322, 37812473, 37278001, 36765507, 36791722, 36161733, 35566732, 36058098, 36943709, 37954494, 38562459, 38733203, 39295270, 39600574, 39875466, 40154510, 40379721]
6595D0379721P2042k08374m45155L27228J29069n54197l03134M12542J91465l61328
6585C9639879n10323n32810j69270N83609P07639L1768M3406J86849j03084m25343
6575C9452320k69536K18048Q75161m8402j08305Q80974L23932j33566J134790
6566D2325416P78805O12864M07541j54012L12097K33291j08999m61762m23318
6557D3521923Q99837N69447p88976m61936N85030O00736k8822K12469J177419
6548D6287127Q38195n3448K70322O65264L18056K54412L80076L02142l9867J41229
6538D9363508N63828m30974r16891P2003L8153l82425k32007P11752J106720J097411
6528E0991078O45266O79396p6531L81850J494507J416289P31543O04100J19564
$$ y = [40379721, 40451763, 40243389, 39798234, 40125462, 40254531, 39700334, 39397200, 39809742, 40001207, 39639879, 39129556, 38596746, 38427476, 39011085, 39718724, 39750492, 39793898, 39980747, 39877663, 39452320, 39182784, 39400832, 40275993, 40227591, 40119286, 41000260, 41324192, 41190626, 42325416, 43104221, 43717085, 44124626, 43970614, 44282711, 44516002, 44407003, 43945241, 43521923, 44421760, 44991207, 44202231, 43740295, 44325325, 44926061, 44897239, 45109708, 46287127, 47125322, 47071874, 47342196, 48007460, 48325516, 48579928, 48960004, 49262146, 49222279, 49363508, 49927336, 49496362, 48579471, 48651474, 48689627, 48307202, 48075195, 48786947, 49893667, 50991078, 51636344, 52315740, 52239209, 52621059, 54115566, 55531855, 56263398, 56867498, 56987062]
6519E6987062k52703l69930l67879J83817M06045R91822J304186J139830J017321
6510F1039571J252830J675889K078134K024555J766798J619102J219577M26823
6502G3103279L70335R64169K394829K741762J473139O89097J329811L556538M287566
6493I0910525M864334N353234N875775O689561O760180P273516R405780J1968497
6485A49101402J3818282J5054565J7301073J8195961J6297589M707931l1432066
6478B03044737r9159118j41815885r8954149l3569003J097445J3885784J6651178
6471a38819011J5621062J3919966J2042784J0873162R544104Q189987N990847
6464f2637099N324737O462918O290757M796279L744334L480810K842580K754032
$$ y = [56987062, 56734359, 56364429, 55996550, 56180367, 56586412, 57578234, 58882420, 60022250, 61039571, 62292401, 63968290, 66046424, 68070979, 69837777, 71456879, 72676456, 73103279, 73473614, 74437783, 76832612, 79574374, 81047513, 81736610, 83066421, 86622959, 90910525, 95774859, 101128093, 107003868, 113693429, 120453609, 127727125, 137132905, 149101402, 162919684, 177974249, 195275322, 213471283, 229768872, 234476803, 203044737, 103885619, -37930266, -136884415, -170453418, -169355973, -155470189, -138819011, -123197949, -109277983, -97235199, -86362037, -76817933, -68627946, -62637099, -57312362, -50849444, -44558687, -39762408, -36018074, -32537264, -29694684, -26940652]
6456b6940652K952925K776071K590915J592294N61800J175464J352700J175679
6448a2762804J348035J652785R78241O49578O91943N65410J308325J554802J107034
6439b906651J324421N18044k6548P88351J073870M54442M83412J287698J676726
6430D673765R12587J30091k11173l08288K15780Q18717P96433j73107K2090M21993
6420G298888N09235J07478K21862O74434R70097O73750J84705J57587M98374J252382
6410A2548792J127201O6894n20336p40698p80518o94355K25000P06852Q42893
6401A2781725R59690M03793M73560M31525J44925P62386O29092J35805M36759
6392A7159260L62416L75162p70465j314329k61793M77595K73958n6761Q37468
$$ y = [-26940652, -23987727, -21211656, -18620741, -17028447, -16466647, -15291183, -13938483, -12762804, -11414769, -9761984, -8783743, -8134165, -7442222, -6876812, -5568487, -4013685, -2906651, -1582230, -1064186, -1090734, -302383, 771487, 1225929, 1709341, 2997039, 4673765, 5586352, 5716443, 5505270, 5196982, 5412762, 6231479, 7027912, 6854805, 6876895, 7298888, 7808123, 7915601, 8137463, 8811897, 9781994, 10455744, 10640449, 10798036, 11296410, 12548792, 13675993, 13742887, 13222551, 12481853, 11701335, 11006980, 11231980, 11938832, 12781725, 13741415, 14145208, 14618768, 15050293, 15195218, 15957604, 16586696, 16722501, 17159260, 17521676, 17896838, 17126373, 15812044, 15550251, 16027846, 16301804, 16245043, 17082511]
6383A7082511K33117r27930n95023k4971j81724R89031J604527L43913k20627
6374A8302824o03387q53549o67810n57644L29747J25319L6567O72852J95002k0396
6364A6959525N5130P49317J336233J339508R70217P1533l85221n62741p1954j38282
6354B0323265p37780m85627o14486O7208N73733P04162m65762o73415L5693K57785
6344A8984776M44395N20319K23511M72847J237557N56506J50022O62972J60072
6335B3412977p38641m02384K61719m68813J0785m40995k62281j50725P4536L51832
6325B1648010k62468J28381P33854M09021L03930q6402k12039J06838j79457l51415
6315B2238253M8407N33497j55288j15213o06763n32016l48916M33796J126303
$$ y = [17082511, 17315628, 16387698, 15792675, 15767704, 15585980, 16575011, 18179538, 18523451, 18302824, 17699437, 16845888, 16178078, 15620434, 15950181, 16075500, 16112067, 16784919, 16979921, 16959525, 17014655, 17763972, 19100205, 20439713, 21409930, 21481463, 21096242, 20533501, 20461547, 20323265, 19585485, 19099858, 18485372, 18552580, 19126313, 19830475, 19364713, 18691298, 18726991, 18984776, 19429171, 19949490, 20173001, 20645848, 21883405, 22439911, 22589933, 23252905, 23412977, 22674336, 22271952, 22533671, 22064858, 22075643, 21634648, 21372367, 21221642, 21296178, 21648010, 21385542, 21513923, 22247777, 22656798, 22960728, 22874326, 22662287, 22769125, 22589668, 22238253, 22286660, 22820157, 22664869, 22549656, 21942893, 21410877, 21061961, 21495757, 22622060]
6306B2622060O35905m88120q50933p13297r0547J033114J234077Q37785j24669
6297B4095375o66574n43659l3096M27839l02561J69598M03708j86697m84145k20369
6287B2659419m69408q4589N03065L84409M33578J94424L92466Q1538n67778l97349
6277B3129775P63605K72855m8412m75106m64706l50831l23076M23032M85845L80799
6267B3793780L44898l11515p22923p29869J23484o16002q47590k70896L25137
6258B1088504J32099N79801Q35942M87525P57679J130662n1095m06998Q3513M42196
6248B5079828K28719l86698l54629j95196J18512P5268p1209O4993r2174k55900
6238B4211514J7932j54477j15349K81080M03789K65579K33562M63877J32357o99494
$$ y = [22622060, 23257965, 22769845, 21918912, 21205615, 21115068, 22148182, 23382259, 24220044, 24095375, 23428801, 22885142, 22852046, 23279885, 22977324, 23146922, 23550630, 23363933, 22879788, 22659419, 22190011, 22105422, 22608487, 22992896, 23426474, 23620898, 24013364, 24094902, 23527124, 23129775, 23893380, 24166235, 24117823, 23642717, 23178011, 22827180, 22504104, 22927136, 23412981, 23793780, 24138678, 23827163, 23104240, 22374371, 22497855, 21881853, 21034263, 20763367, 21088504, 21220603, 21800404, 22636346, 23123871, 23881550, 25012212, 24961117, 24554119, 24637632, 25079828, 25308547, 24921849, 24567220, 24372024, 24490536, 24565804, 24494595, 24559588, 24467414, 24211514, 24229446, 24074969, 23959620, 24240700, 24644489, 24910068, 25143630, 25607507, 25739864, 25040370]
6228B5040370j080648n39744K82858M35317K849k27221N26337J53081n5203o22362
6218B3915634m64078J82289o2909j58463k1807N32350j17184q0838M94168l07940
6208B3911222l95157K90933J45110j065892n29163m51844J42952O1657J49476
6199B2259294L94835K50672K28474P46368J09286o17343j67088l8676L81839l1148
6189B3516513m65656M48673Q82175Q13184J061655P0902p53108q37418k28539
6180B4508381J69671P0964O07765P16790J80599l35326K14470L00959l74169o06806
6170B5453298L122N32063j91536j004219o14927O9687K04606L21685J64784P58809
6160B5697372Q26484N5978m58102j55871k42707j82494l25329R2882J38808l51318
$$ y = [25040370, 23959722, 23419978, 23702836, 24138153, 24141002, 23913781, 24440118, 24593199, 24537996, 23915634, 23451556, 23633845, 23570936, 23412473, 23390666, 23923016, 23805832, 23724994, 24219162, 23911222, 23516065, 23806998, 23952108, 22886216, 22357053, 21905209, 22048161, 22109818, 22259294, 22654129, 22904801, 23133275, 23879643, 23988929, 23371586, 23204498, 23165822, 23547661, 23516513, 23050857, 23499530, 24381705, 25194889, 26256544, 26327446, 25574338, 24736920, 24508381, 24678052, 24749016, 25356781, 26073571, 26254170, 25918844, 26133314, 26434273, 26060104, 25453298, 25456420, 25988483, 25796947, 24792728, 24177801, 24247488, 24452094, 24773779, 24938563, 25697372, 26523856, 26579834, 26121732, 25965861, 25723154, 25540660, 25215331, 25308213, 25447021, 25095703]
6150B5095703M7354j94438l0942Q85089J590166J076490k76478j093689m25495
6141B6673760k78175n56568n76045n18210J11691L71361N497J88909K84521L8786
6131B5745527n04922l19801P13122N68408P72693N54553o7549J02545m43714m22468
6121B6698394n96538o88165M29686L25658l69561k63686p12722l03412M58864
6112B4978518O81946M54838n06040j97253p2082R1663R0062N06203j77342m32312
6102B5418201P31824R91761N55375K15734K07334J82442p70629j674600j085638
6093B4771804P32656Q16796O72516j68189J36824P57000O27151N25138r12117
6084B7959579o12303N14172p0860m90474j3790O97298l51160j175423k92022L3329
$$ y = [25095703, 25143057, 24948619, 24917677, 25802766, 27392932, 28469422, 28192944, 27099255, 26673760, 26395585, 25839017, 25262972, 24744762, 24856453, 25227814, 25233311, 25422220, 25706741, 25745527, 25240605, 24920804, 25633926, 26202334, 26975027, 27529580, 27462031, 27564576, 27120862, 26698394, 26101856, 25413691, 25843377, 26169035, 25799474, 25535788, 24823066, 24519654, 24978518, 25660464, 26115302, 25609262, 25412009, 25339927, 25431590, 25521652, 26027855, 25850513, 25418201, 26150025, 27141786, 27697161, 27912895, 28120229, 28302671, 27532042, 25857442, 24771804, 25504460, 26321256, 26993772, 26825583, 26962407, 27719407, 28346558, 28871696, 27959579, 27347276, 27861448, 27790588, 27300114, 27286324, 27983622, 27632462, 26457039, 26165017, 26198346]
6074B6198346N58436K10749m72721L78307L93616P13611Q63542q706k83276q11615
6064B7740289j352780j258120l27599L08816K277q5644k74266m76585J42596J191944
6054B5610928J490040K61003p18113k75338K46295J83594n92317j345940j45168
6045B4714984P18364L99211j84499o43565l90976L95580O48884L31243N45631
6036B6534857l70299P7860K10916l05438k59487N05679P71092K73947j81094k15876
6026B7042157J71900J12939o86990j88557M1078l25528m46518p23419l63450O64496
6016B5298108N83086K795K94646N17068Q38527P12364M19449r26211n27814l86548
6006B6825470k2237P6615k22133J10375N55496J68255m98412r4078J06499r64477
$$ y = [26198346, 26756782, 26967531, 26494810, 26873117, 27266733, 27980344, 28843886, 28835180, 28551904, 27740289, 26387509, 25129389, 24801790, 25110606, 25112883, 25027239, 24752973, 24276388, 24418984, 25610928, 27100968, 27361971, 26643858, 26368520, 26614815, 26798409, 26206092, 24860152, 24714984, 25433348, 25832559, 25648060, 25004495, 24613519, 25009099, 25657983, 25989226, 26534857, 26164558, 26242418, 26453334, 26147896, 25888409, 26394088, 27165180, 27439127, 27258033, 27042157, 27214057, 27326996, 26640006, 26451449, 26492527, 26166999, 25720481, 24997062, 24633612, 25298108, 25881194, 25883989, 26178635, 26695703, 27534230, 28246594, 28666043, 27739832, 27212018, 26825470, 26803233, 26879848, 26657715, 26768090, 27323586, 27491841, 26993429, 26899351, 27005850, 26041373]
5996B6041373l16406M72365N74391J25591J11580N82862M24372o36720r16823
5987B6462585j41184n1877m55899j14338O82308N95211N18102q5594k43637L82614
5977B7548291m95884m98836j74324M4259P89005J148968O55363k65054n72012
5968B8179776q64930q82235k41366n02458O64648J593839J19573q01097n1409
5959B7214341M2668q03672l85434M39580K26073j74308J00660N7213J91950L78663
5949B7287734L2294q02359p17905K7106k72907N0480M98239Q49540Q38611J187687
5939B8978520K48565N86564N09141r06558r86304p21065p65515n16758m85386
5930B5941204l90878m29831l97170j30011O52196R69553L41955L14003J64955
$$ y = [26041373, 25724967, 26197332, 26771723, 26897314, 27008894, 27591756, 28016128, 27379408, 26462585, 26321401, 26269524, 25813625, 25699287, 26381595, 26976806, 27494908, 27409314, 27165677, 27548291, 27052407, 26553571, 26379247, 26423506, 27212511, 28361479, 29016842, 28751788, 28179776, 27314846, 26432611, 26191245, 25688787, 26353435, 27947274, 28066847, 27265750, 27214341, 27257009, 26453337, 26067903, 26507483, 26733556, 26559248, 26659908, 26717121, 26909071, 27287734, 27320028, 26517669, 25799764, 25826870, 25553963, 25604443, 26102682, 26952222, 27790833, 28978520, 29227085, 29813649, 30322790, 29416232, 28429928, 27708863, 26943348, 26426590, 25941204, 25550326, 25120495, 24723325, 24593314, 25245510, 26215063, 26557018, 26871021, 27035976]
5921B7035976r7048l09647J672L24699m01098r19663l19117N53713O05357L41563
5911B6816407k30126k17944O20704K84744Q0648l68054j77673j58613j23981L58583
5901B6884695l46481K40342R49741K54611L37547K10407O7800J77416j33473q98252
5891B7744353o98088p8157L8275J23440l92151K2481K74731Q5468M98302K48278
5881B7866932L51530J00188l72040Q6632O28798M65939p7569l29623m55168l95762
5871B7869857L12846M46318N0218r52358q72198N0637P67197L62091K2302L86024
5861B8442934M86342L10334k6820K83039N17787j41591n83859n24620R9390P09331
5851B9572267k88959q50270j025867r91580P8962J257968R20420n29301p81381
$$ y = [27035976, 26938928, 26629281, 26630953, 26955652, 26554554, 25634891, 25315774, 25869487, 26474844, 26816407, 26586281, 26368337, 26989041, 27273785, 27354433, 26986379, 26808706, 26650093, 26526112, 26884695, 26538214, 26778556, 27728297, 27982908, 28320455, 28530862, 28598662, 28776078, 28642605, 27744353, 27046265, 26968108, 27006383, 27129823, 26737672, 26760153, 27034884, 27120352, 27618654, 27866932, 28218462, 28318650, 27946610, 28033242, 28662040, 29127979, 29050410, 28720787, 28265619, 27869857, 28182703, 28629021, 28679239, 27726881, 26854683, 26905320, 27672517, 28034608, 28056910, 28442934, 28929276, 29239610, 29212790, 29495829, 30013616, 29872025, 29288166, 28763546, 28862936, 29572267, 29283308, 28433038, 27407171, 26415591, 26494553, 27752521, 28672941, 28143640, 27362259]
5842B7362259l97457k30125O5158Q39565R72774L5371l84711J43370P24082R0841
5832B9221127m33697p26500n56364l04500k18834J82589R53742Q01758k74159
5823B8645162l86534J15462J97574j75384o50639p00451o87580r76741n62555
5814B4818314J40617J251446J062170J86813K84383P5889l13557P0210N2292o5031
5804B7563546k9202J05354L79587M93957k49764q00632m09635K78139k7452m76434
5794B6827464k66424k05730K97741O17757P94545N72049O8520o64791o65659m2532
5784B7332940J334423J337351M21234j19810m20352l6323k07489l4413k53068
5775B9354493r78977l84672l52051o43873K16722j61107j03219N89426L10025
$$ y = [27362259, 26964802, 26734677, 26799835, 27639400, 28612174, 28647545, 28262834, 28406204, 29130286, 29221127, 28787430, 28060930, 27504566, 27200066, 26981232, 27163821, 28117563, 28919321, 28645162, 28258628, 28374090, 28571664, 28396280, 27745641, 27045190, 26357610, 25380869, 24818314, 24958931, 26210377, 27272547, 27459360, 27743743, 27819632, 27506075, 27576285, 27628577, 27563546, 27534344, 27639698, 28019285, 28513242, 28263478, 27462846, 27053211, 27331350, 27303898, 26827464, 26561040, 26355310, 26653051, 27270808, 28065353, 28637402, 28705922, 28041131, 27375472, 27332940, 28667363, 30004714, 30425948, 30306138, 29885786, 29849463, 29641974, 29607561, 29354493, 28375516, 27990844, 27638793, 26994920, 27211642, 27050535, 26947316, 27536742, 27846767]
5766B7846767L91325P34803J238448R41090L61132j030787p17430m72170q59538
5757B8433640p2015p7643J78083O66282P12702j49406p19245p38368r02017l97027
5747B6934986J20024L55121J32075l05313r8564O787J100437J035761L38599J43514
5737B9763427o54385m97963n05043n44145K83709Q546j91485K85835N92442O36129
5727B9177067L98954K83280K60894K72428J36106m10720m34663r54515j91313
5718B8537518L19415j52697n80373m7331M53723n02000k72294M58791j32351k71635
5708B7810766L181m03146j020241j22910N48065L09609n39916N6752R8229O0846
5698B6801235K94693q01673m36703K29876P91849Q73467N08171Q85646J313495
$$ y = [27846767, 28238092, 28972895, 30211343, 31152433, 31513565, 30482778, 29765348, 29293178, 28433640, 28361625, 28283982, 28462065, 29128347, 29841049, 29691643, 28972398, 28234030, 27332013, 26934986, 27055010, 27410131, 27542206, 27236893, 27138329, 27145116, 28245553, 29281314, 29619913, 29763427, 29109042, 28611079, 28106036, 27561891, 27845600, 27854146, 27662661, 27948496, 28540938, 29177067, 29576021, 29859301, 30120195, 30392623, 30528729, 30118009, 29683346, 28728831, 28537518, 28856933, 28704236, 28123863, 28076532, 28530255, 28028255, 27755961, 28214752, 28082401, 27810766, 27813947, 27410801, 26390560, 26267650, 26815715, 27125324, 26585408, 26642160, 26740389, 26801235, 27095928, 26294255, 25857552, 26087428, 26879277, 27752744, 28260915, 29146561, 30460056]
5689C0460056N73560n62512q75272n79236r79645q33763J80601K66506j57667
5680B7492628M07770P5763l09596J03574O96981P06264O24704q8578P4320j10631
5670B9673199n70969k61893Q8498l10233j66776L21150Q5364J07454k03884l9660
5660B8722250N27354J77543J90870P72446K79730m26760j248852n09367L21186
5651B8806400l84042p20378R6686L14770M92322L19162o28456k95874O09743N8810
5641B8669143J13297M66145m75703o07485K92688o15772j198620K35324R66318
5632B7845335N31279P18612L72226k99420o50546l99558J43035M20619J76595
5623B8858177p7901K64395J83764k12223o18249m36543j30592k42687l81830m185
$$ y = [30460056, 31033616, 30471104, 29595832, 29016596, 28036951, 27203188, 27383789, 27650295, 27492628, 27900398, 27976161, 27666565, 27770139, 28467120, 29173384, 29798088, 29709510, 29783830, 29673199, 29102230, 28840337, 28928835, 28618602, 28451826, 28772976, 28858340, 28965794, 28761910, 28722250, 29249604, 29427147, 29618017, 30390463, 30670193, 30243433, 28994581, 28485214, 28806400, 28422358, 27701980, 27798666, 28113436, 28605758, 28924920, 28296464, 28000590, 28610333, 28669143, 28782440, 29248585, 28772882, 28165397, 28458085, 27842313, 26643693, 26879017, 27845335, 28376614, 29095226, 29467452, 29168032, 28517486, 28117928, 28260963, 28681582, 28858177, 28780276, 29044671, 29228435, 29016212, 28397963, 27961420, 27830828, 27588141, 27206311, 27202126]
5613B7202126O72311J62038j93734K63919M82396r71202n93146J70630p8842M47197
5603B7563693J032114P44495O63246J211297J159723k607o59221j515380j273271
5594B8924089k24791Q37639J073112P18460n99388j260391j21312j70373m37295
5585B8739750J46769M16127M24706K10936k35546q73645o09927J26472K88499
5576B8634141M66100Q69964m06781j476973j041884o08648K27961Q97583K17099
5567B7778562j265295m95524R88244J417591K76576m87289l2674M91142O89117
5558B9360450L55609J18578n9060Q4535m16124p56828k34006k40264l90307m50990
5548B7371593p90376m09739L00379L02146N17883O22410O33162o37560l58568
$$ y = [27202126, 27874437, 28036475, 27842741, 28106660, 28589056, 27617854, 27024708, 27195338, 27116496, 27563693, 28595807, 29340302, 30003548, 31214845, 32374568, 32371961, 31712740, 30197360, 28924089, 28699298, 29536937, 30610049, 31328509, 30729121, 29468730, 29347418, 29177045, 28739750, 28886519, 29302646, 29727352, 29938288, 29702742, 28829097, 28219170, 28345642, 28634141, 29100241, 29970205, 29563424, 28086451, 27044567, 26435919, 26663880, 27561463, 27778562, 26513267, 26017743, 27005987, 28423578, 28700154, 28212865, 28180191, 28671333, 29360450, 29716059, 29834637, 29775577, 29860112, 29443988, 28687160, 28453154, 28212890, 27822583, 27371593, 26581217, 26171478, 26471857, 26774003, 27291886, 27914296, 28547458, 27909898, 27551330]
5539B7551330K79530O45619P77729P63924k57894q1928j94871k83699j14935P963
5529B9092768P0349J92345L72805k17119k02386L78705L71644p51436j420349
5520B7887326l77785M67313O30404K53587P351L77085M01118l63211j021076o63703
5510B7598409j24029N94606J304937L15212l67513o51048o26961o1354L3704Q5
5500B8016048K48229K85763R32286J143221O41509l70705j356582j014614K39747
5491B8764902P94481o10920n42200l21148l62704P05575R88758l20l02460m73485
5481B8640479n6086P3477Q21915L18072L8183J5434q0770k65130o46308m59638
5471B8399628O7131j44313j34143M22418M75857O63125J70361o77172j016394
$$ y = [27551330, 27830860, 28476479, 29254208, 30018132, 29760238, 29678310, 29483439, 29199740, 29084805, 29092768, 29163117, 29355462, 29728267, 29511148, 29308762, 29687467, 30059111, 29307675, 27887326, 27509541, 27976854, 28607258, 28860845, 28868196, 29245281, 29646399, 29283188, 28262112, 27598409, 27474380, 28068986, 29373923, 29689135, 29321622, 28670574, 28043613, 27982259, 28015963, 28016048, 28264277, 28550040, 29482326, 30625547, 31267056, 30896351, 29539769, 28525155, 28764902, 29559383, 28948463, 28406263, 28085115, 27722411, 28427986, 29416744, 29416424, 29113964, 28640479, 28584393, 28657870, 29479785, 29797857, 29836040, 29851474, 29770704, 29505574, 28859266, 28399628, 28466759, 28322446, 28188303, 28610721, 29086578, 29749703, 29920064, 29242892, 28226498]
5462B8226498m13576j65664M6137k50938J97446O90889L50016j50636l42164o44689
5452B7543319j4966M21397p2704R3656J55022K22295M75691l46130k07493L81967
5442B8652054N9665K78272L63624K4643L24380m51130p14289J00766P8570k8360
5432B8688195K06677M86058N72336M20829j33767n78084l2691L75508l33011r72443
5422B8699607k49934L81054N08558p6844M90508J22524r50579p21675K11925Q56873
5412B9272017P57405O48560P63111j97725k98485j39454m34001o71169J18778
5403B9819037J61475l61625j34170k15548n35030M54387O96786k81830N13759
5394C0117241L15405J72195O36275L99918q66j08107m59827p92436k36405r2822
$$ y = [28226498, 27812922, 27647258, 27693395, 27442457, 27639903, 28330792, 28680808, 28530172, 28188008, 27543319, 27528353, 27949750, 27877046, 27970702, 28125724, 28348019, 28823710, 28477580, 28270087, 28652054, 28711719, 28989991, 29353615, 29378258, 29702638, 29251508, 28537219, 28637985, 28716555, 28688195, 28894872, 29380930, 29953266, 30374095, 30240328, 29662244, 29629553, 30005061, 29672050, 28699607, 28449673, 28830727, 29339285, 29262441, 29752949, 29875473, 28924894, 28203219, 28415144, 29272017, 30029422, 30677982, 31441093, 31243368, 30944883, 30805429, 30371428, 29700259, 29819037, 29980512, 29618887, 29484717, 29269169, 28734139, 29188526, 29885312, 29603482, 30117241, 30432646, 30604841, 31241116, 31641034, 31640168, 31532061, 31072234, 30279798, 30043393, 29950571]
5384B9950571J6790J42333J57082l17598M03261Q40707J08295m7585k71005k89386
5374C0693465N24695m0238m48576r49487r75682l3905k31599r65114j072186n2775
5364B6448598Q91009J528803N80202l9206L22819P32417O45642M55841l32440
5355C1233685j59232k80330m74801L70870N32692L34093M67678L32748j43026
5346C2214377r01634j026627j145255j072387n66360Q2627M01477L53299P80250
5337B9119767j6739q03346o49060m4561k30050J84853O70857L75989j19815j95229
5327B8292666J5912j09667P89198Q06355J90743k04357n4371p75842q64336k78086
5317B7808215J99513Q62403J380979N50456l84529J37426J57325k8205J51049
$$ y = [29950571, 29967361, 30109694, 30266776, 29949178, 30352439, 31193146, 31301441, 31253856, 30982851, 30693465, 31218160, 31177922, 30729346, 29779859, 28804177, 28770272, 28538673, 27573559, 26501373, 26448598, 27339607, 28868410, 29448612, 29409406, 29732225, 30464642, 31110284, 31566125, 31233685, 31074453, 30794123, 30319322, 30690192, 31222884, 31556977, 32024655, 32357403, 32214377, 31312743, 30286116, 29140861, 28068474, 27502114, 27584741, 27986218, 28339517, 29119767, 29103028, 28299682, 27650622, 27606061, 27376011, 27560864, 28231721, 28607710, 28487895, 28292666, 28308578, 28198911, 28988109, 29794464, 29985207, 29780850, 29726479, 28950637, 28086301, 27808215, 28007728, 28870131, 30251110, 30801566, 30417037, 30554463, 30711788, 30683583, 30834632]
5308C0834632K6195p64974m1312L61763j023098k45967Q53168P17716L24808j85961
5298C0856970p83778p94349l89530l73379M43907P86457N51010N08973M58409
5289C1264690M08264M38142j35458r66361r35233n39740K58066R312L01168Q24395
5279C0927245J41801n84609n39250l1963P95842R28736k55365n34272l86092r96142
5269B9465931j006731j38292P5837m51153k50873K61793J26572Q27559J629499
5260C0540142L30786o91340m01750J32906Q7665j82869O61881L93689l63911N4346
5250C0561545M24017L03693k47503j30280O6490m28469o1052M45071k82457m4397
5240C0606658L1824n03046l35347n01850l71049Q31679P69582K94940N83743O76838
$$ y = [30834632, 30860827, 30095853, 30054541, 30416304, 29393206, 29147239, 30000407, 30718123, 31042931, 30856970, 30073192, 29278843, 28889313, 28515934, 28959841, 29746298, 30297308, 30806281, 31264690, 31672954, 32111096, 31975638, 31009277, 30074044, 29534304, 29792370, 29801682, 30102850, 30927245, 31069046, 30484437, 29945187, 29913224, 30709066, 31637802, 31382437, 30848165, 30462073, 29465931, 28459200, 28320908, 28396745, 27945592, 27694719, 27956512, 28083084, 28910643, 30540142, 30870928, 30179588, 29777838, 29910744, 29998409, 29815540, 30477421, 30871110, 30507199, 30561545, 30985562, 31289255, 31041752, 30911472, 30977962, 30549493, 30488441, 30933512, 30651055, 30606658, 30638482, 30135436, 29800089, 29298239, 28927190, 29758869, 30528451, 30823391, 31407134, 32083972]
5230C2083972O36282J38083k153k31540o71693k09732J22717K16417K75495J45844
5220C2503692j009833p26974m55119p76423k41586N02601J45813J47356j37263
5211B9952264N09325J065133n4627o16179N8465J78996K32877m82391r51673j90656
5201B9701534j92232L60185P82603m5012o57776o91734N50355N72724R3776j19701
5191C0354722j11413J198378J736392L81350j436312j180927j24244J15660L80812
5182C1314418M86704j5119q16551l41388J36211N23875O71150l91839l96788L16519
5172C1487192k16013j077137l73654N66998K96952k95512M91229N35663K15347
5163C1631065K35992J48991l81373l39868L2552J87043K89915K69553m4629j155674
$$ y = [32083972, 32720254, 32858337, 32856184, 32624644, 31952951, 31743219, 31865936, 32082353, 32357848, 32503692, 31493859, 30766885, 30311766, 29535343, 29293757, 29796358, 29942171, 30089527, 29952264, 30461589, 31526722, 31472095, 30855916, 30914381, 31093377, 31326254, 30843863, 29892190, 29701534, 29509302, 29869487, 30652090, 30607078, 29949302, 29257568, 29807923, 30380647, 30474423, 30354722, 30243309, 31441687, 33178079, 33559429, 32123117, 30942190, 30817946, 30933606, 31314418, 31801122, 31786003, 30969452, 30628064, 30764275, 31288150, 31959300, 31567461, 31170673, 31487192, 31271179, 30194042, 29820388, 30387386, 30684338, 30388826, 30880055, 31415718, 31631065, 31867057, 32016048, 31634675, 31294807, 31327359, 31514402, 31804317, 32073870, 32029241, 30873567]
5153C0873567j018071K18063O34286o39929j327874K55181R30137L04938N45117
5144C0775415L89007K75309L38953K389N60653J094973M00079j16826P59713O82591
5134C5162256p66132j068689r20713l31093L42844L18324K236j67636J74792M85535
5124C3231724K22436k89769K20284N49385N84458l8405n74555k92743r8119p7449
5114C3437247n95611p87444j47083N04115Q49292O56096P8824o2207L35577J93514
5104C4462320j88207k77570o27030r76N54224j49929L5358N90394Q60754L89889
5094C5649227j86235j216130k92140J430101O29534j040025p23532O55382N89767
5085C5495949L38809O02091k61801p56197l05525q527J45346J323658J646326
$$ y = [30873567, 29855496, 30073559, 30707845, 30067916, 28740042, 28995223, 29925360, 30230298, 30775415, 31164422, 31439731, 31778684, 31781073, 32341726, 33436699, 33836778, 33719952, 34479665, 35162256, 34396124, 33327435, 32406722, 32075629, 32418473, 32736797, 32739033, 32571397, 32746189, 33231724, 33454160, 33164391, 33384675, 33934060, 34518518, 34480113, 33905558, 33612815, 33514696, 33437247, 32841636, 32054192, 31907109, 32411224, 33260516, 33916612, 33995436, 33933229, 34268806, 34462320, 34274113, 33996543, 33369513, 33368537, 33922761, 33772832, 33808190, 34398584, 35259338, 35649227, 35462992, 34246862, 33954722, 35384823, 36014357, 34974332, 34250800, 34906182, 35495949, 35834758, 36436849, 36175048, 35418851, 35113326, 35104799, 35250145, 36573803, 38220129]
5076C8220129N39296O18150N54976P22945R15671k12257o64719o55045j69170
5067C9869976J36407j31479M52181O83656J01858K51O604J249633J087992Q38879
5057D4295958N89857o53294m68427N31736P78235J092018J582483J679884J399832
5048E0828282J574988K524194K078318J472187K031274J274305K158563M400462
5040F8342573O484230O441162O812420P444765P358349K018680j6309090n1598072
5032C6995017n5824719k2106781j177675N369594N721098N494832N235543M567133
5024a5725958M599366N612958M245621K562601J270163J693072J298420Q68383
5016F424626K151360J365419n14748l60068J145453J781208J288388J040036J046411
$$ y = [38220129, 38759425, 39377575, 39932551, 40655496, 41571167, 41358910, 40694191, 40039146, 39869976, 40006383, 39874904, 40327085, 41010741, 41112599, 41112850, 41119454, 42369087, 43457079, 44295958, 44885815, 44232521, 43764094, 44295830, 45074065, 46166083, 47748566, 49428450, 50828282, 52403270, 54927464, 57005782, 58477969, 60509243, 61783548, 63942111, 68342573, 74826803, 81267965, 88080385, 95525150, 102883499, 104902179, 88593089, 36995017, -18829702, -40936483, -42114158, -36744564, -31023466, -25528634, -20293091, -15725958, -11126592, -5513634, -1268013, 1294588, 2564751, 4257823, 5556243, 6424626, 8575986, 9941405, 9426657, 9066589, 10212042, 11993250, 13281638, 14321674, 15368085]
5007A5368085L25698K500o9515n7928m64069M34538O47262m2961J232578J647194
4997A9023382P25850m53691o82930Q40249J310739J280810J081742N24389k92489
4988B3358051j74198K49014m61328m49691n13657p89365K04610J051430J138958
4979B3613824J116918L35680J6328p20626n60939R8483O22799Q66311m96150q18716
4969B4073912N4646N04321n29469j102237j57014K96815l3795j53038j21615n78766
4959B2253760m15374M86561Q0695o74565o09608l55260R94271J393358Q26368
4950B3980206p0548o9469K99425k87885j210230k57947J100691M95434M70080
4941B4449757L72076Q5781k70220n01216O90810J149992P7194r15096q53838J95
$$ y = [15368085, 15693783, 15696283, 15626768, 15568840, 15104771, 15539309, 16186571, 16143610, 17376188, 19023382, 19749232, 19295541, 18612611, 19452860, 20763599, 22044409, 23126151, 23650540, 23358051, 23183853, 23432867, 22971539, 22521848, 22008191, 21218826, 21423436, 22474866, 23613824, 24730742, 25066422, 25082750, 24362124, 23801185, 23899668, 24522467, 25388778, 24892628, 24073912, 24128558, 24632879, 24103410, 23001173, 22844159, 23140974, 23107179, 22954141, 22832526, 22253760, 21838386, 22324947, 22405642, 21731077, 21121469, 20766209, 21760480, 23153838, 23980206, 23909658, 23840189, 24139614, 23851729, 22641499, 22383552, 23484243, 23979677, 24449757, 24821833, 24907614, 24637394, 24136178, 24826988, 25976980, 26054174, 25139078, 24285240, 24285435]
4931B4285435P27148N55419P9686j098984r96583r1626N77533Q78800Q72530M0757
4921B5830115J36689R28661M51631k39614j19759J46306L37160L56355j02078
4912B7725466q93574q93744r56508l59355R27487J193690K28684q43022j096915
4903B5032209k42584R50479N29123n90167R7775J004849k6704q82278o49766m22334
4893B4800602k51423L96177P13023k57567l19570P26260Q93507N54941M84734
4884B7740684O52918J52602J24320l12102n65256Q3296L54883J03331j86945j42332
4874B8005399K23430L2201l11548m70558R6948P7270K34220k36269r98960p15843
4864B5936290j72457K25886N58481P82526Q19306L22514q7411l83509n53948p43591
$$ y = [24285435, 25012583, 25568002, 25647688, 24548704, 23552121, 23460495, 24038028, 24916828, 25789358, 25830115, 25966804, 26895465, 27347096, 27107482, 26987723, 27134029, 27471189, 27827544, 27725466, 26831892, 25938148, 24981640, 24622285, 25549772, 26743462, 26972146, 26129124, 25032209, 24789625, 25740104, 26269227, 25679060, 25776835, 26781684, 26754980, 25872702, 25222936, 24800602, 24549179, 24945356, 25658379, 25400812, 25081242, 25807502, 26701009, 27255950, 27740684, 28393602, 28546204, 28670524, 28358422, 27793166, 27876462, 28231345, 28334676, 28147731, 28005399, 28228829, 28261030, 27949482, 27478924, 27575872, 27653142, 27887362, 27651093, 26652133, 25936290, 25763833, 25989719, 26548200, 27330726, 28150032, 28472546, 28385135, 28001626, 27447678, 26704087]
4854B6704087j33583R42895R97784L36466o83101n89598o2483m11310l67106J9776
4844B6753827k62095j67118K81594R380k20081K35994L22445M76268M83752k56637
4834B7657329l39344j44691p4231Q1499k61736q20588l18761N74812R8941L6574
4824B6489804J93531O4714K99410P67706N82940j99041o5964L02124K35737o4130
4814B8606831j95678k80486k43215k08903m27167q54972N811O01311R97787k01293
4804B7800026l76187J109807P21133m6676K0760k6706o11074j234738j090364
4795B6265981J82904O42592O94960R06702L68619n01169k00250k68784J59641
4786B8251196r22983o33019M92538J121845R84632j55410n78979K23717M26067
$$ y = [26704087, 26570504, 27513399, 28511183, 28847649, 28164548, 27574950, 27512467, 27101157, 26734051, 26753827, 26491732, 26324614, 26606208, 26615588, 26395507, 26631501, 26953946, 27430214, 27913966, 27657329, 27317985, 27173294, 27099063, 27180562, 26918826, 26098238, 25779477, 26354289, 26453230, 26489804, 26683335, 26748049, 27047459, 27815165, 28398105, 28199064, 28133100, 28435224, 28670961, 28606831, 28411153, 28130667, 27887452, 27678549, 27251382, 26396410, 26402221, 27003532, 28001319, 27800026, 27423839, 28533646, 29254779, 29208103, 29228863, 29202157, 28591083, 27356345, 26265981, 26448885, 27091477, 27786437, 28693139, 29061758, 28560589, 28360339, 28091555, 28251196, 27328213, 26695194, 27187732, 28309577, 29294209, 29138799, 28559820, 28783537, 29209604]
4777B9209604j09680N66818R18766R16570l81845j761705j314699p16598k89126
4768B7038105M39772p2925K75276P33607R3736j93575l87382J33076R15913M20788
4758B9396391l24784n91314r71956m06027K87147L21988J74372M38181K98536
4749B8622534J56607K40108o58862q28571L41721L99018Q28299J47099r35201
4740B8312752k22240J4133L49741K79839N24478J67162q57277o18473l61479M61774
4730B8050410P29719J76545O75698L41503m84001o91644m29766l58745J39557
4721B8149276l84317n63979O42994J012705o49201p59537k07186J44674l3890
4712B7351539m08780o47594j87314J118832J050883M88585j66704j21535m76914
$$ y = [29209604, 29099924, 29666742, 30585508, 31502078, 31120233, 29358528, 28043829, 27327231, 27038105, 27477877, 27404952, 27680228, 28413835, 28507571, 28313996, 27926614, 28059690, 28975603, 29396391, 29071607, 28480293, 27508337, 27102310, 27389457, 27711445, 27885817, 28323998, 28622534, 28779141, 29019249, 28360387, 27531816, 27873537, 28272555, 29100854, 29247953, 28312752, 28090512, 28104645, 28454386, 28734225, 29258703, 29425865, 28568588, 27950115, 27588636, 28050410, 28780129, 28956674, 29632372, 29973875, 29489874, 28798230, 28368464, 28009719, 28149276, 27764959, 27200980, 27843974, 28856679, 28207478, 27447941, 27240755, 27385429, 27351539, 26942759, 26295165, 26107851, 27226683, 28277566, 28766151, 28599447, 28477912, 28000998]
4703B8000998m15628M43602k5391j48650P74077K78538o78010n28990l59095J67321
4693B7508772R80758O15242j45681l16682Q7518N10666J52357k34012q19108q37232
4683B7502598o16049n9269N32346K5272J92911O69457J77957k09372L56409J07343
4673B8679603l77551j44504K40732L14363Q02472R85102K94496j392021j683234
4664B7719458m37006L61086N06914K42006J73740K32294K15968l91262k56543
4655B8366655k66613O9123M17788L61617P45458K48182j13631q08234o80900J15498
4645B8454943N26876K1318j29005K007j80317k13113m46p0133j14138J26506K24433
4634B8648931L22241M7082o90917r03948P6273L69087K51194o42742Q0960N18661
$$ y = [28000998, 27585370, 28028972, 28003581, 27854931, 28629008, 28907546, 28229536, 27700546, 27341451, 27508772, 28489530, 29104772, 28959091, 28642409, 28729927, 29240593, 29392950, 29158938, 28339830, 27502598, 26886549, 26827280, 27359626, 27384898, 27577809, 28247266, 28425223, 28215851, 28572260, 28679603, 28302052, 28157548, 28398280, 28712643, 29515115, 30500217, 30794713, 29402692, 27719458, 27282452, 27643538, 28150452, 28392458, 28566198, 28798492, 29014460, 28623198, 28366655, 28100042, 28169165, 28586953, 28948570, 29694028, 29942210, 29828579, 29020345, 28339445, 28454943, 28981819, 29003137, 28874132, 28876139, 28695822, 28482709, 28482263, 28412130, 28297992, 28424498, 28648931, 28971172, 29018254, 28327337, 27423389, 27499662, 27868749, 28119943, 27477201, 27558161, 28076822]
4624B8076822K65985M55203M28992j32401j37131k24745n5898K8139o41747k95273
4614B7767946k92340k38844O59734J05203k88855K9501m33341n55728J78498P75753
4604B7707527J5065n26675m1341N12242Q26730Q78373L77049m03278p07836n36983
4594B8100873J41652J19278m25672o69620l98784J41198k43031l63291j817K70305
4584B6671091L24479M08477M8213k53676N25139P46188k37337k59648N72938K56815
4574B8802679O18622k51194j081581j14719N9998k57959m94755q3610O02531R01893
4564B8701905P19957L21768K86178j69140o96404j406643j515477m36191N47099
4555B6353052M79340N52175N73119j39595K06943L58601O72839K21667l53690
$$ y = [28076822, 28342807, 28798010, 29227002, 29094601, 28957470, 28732725, 28676827, 28704966, 28063219, 27767946, 27475606, 27236762, 27896496, 28001699, 27712844, 27742345, 27309004, 26753276, 26931774, 27707527, 27722592, 27195917, 27154576, 27666818, 28493548, 29371921, 29748970, 29345692, 28637856, 28100873, 28242525, 28361803, 27936131, 27266511, 26867727, 27008925, 26765894, 26402603, 26400786, 26671091, 26995570, 27404047, 27452260, 27198584, 27723723, 28469911, 28232574, 27972926, 28545864, 28802679, 29421301, 29170107, 28088526, 27973807, 28033805, 27775846, 27281091, 27197481, 27800012, 28701905, 29421862, 29743630, 30029808, 29860668, 29164264, 27757621, 26242144, 25805953, 26353052, 26832392, 27384567, 27957686, 27818091, 28025034, 28383635, 29056474, 29278141, 28924451]
4546B8924451k85809l08834n72541J17343J107360M61744L87355P95253L64158
4537C0990480m33970l30040L40199M17099J07142n74273p00057q6199k72315p71465
4527B8686601m89298j29936K15706J92637p5580o34253j97571J09093N92089P02289
4517B8971777l28738q77496m30639J96803M80086r7433P1473Q29872K85568l29417
4507B8771856k83892L67724N59221m89696o53832m72225r43398m28763K72663
4498B6699658J057486O93553k40915R9092L70556O89860L715o78782k79596J19529
4488B8534156M911k68509m62066k68310P48567J004659K13762m44420m66542N00369
4478B9096577Q06271O48303K79762j233588j136896j31052L58067O67371O1517
$$ y = [28924451, 28638642, 28329808, 27757267, 27874610, 28981970, 29443714, 29831069, 30626322, 30990480, 30556510, 30226470, 30566669, 30983768, 31090910, 30516637, 29816580, 29730381, 29458066, 28686601, 28197303, 28067367, 28283073, 28475710, 28400130, 27765877, 27568306, 27677399, 28269488, 28971777, 28643039, 27765543, 27334904, 27531707, 28011793, 27914360, 27985833, 28815705, 29101273, 28771856, 28487964, 28855688, 29414909, 28925213, 28271381, 27799156, 26855758, 26426995, 26699658, 27757144, 28450697, 28209782, 28308874, 28679430, 29369290, 29373005, 28694223, 28414627, 28534156, 28539067, 28270558, 27808492, 27540182, 28288749, 29293408, 29507170, 29062750, 28596208, 29096577, 29902848, 30551151, 30830913, 29597325, 28460429, 28329377, 28687444, 29354815, 29416332]
4469B9416332N51626L80999n38577j657455p99713k5622L80100j42149o83431
4460B6882110k49099O5521M54813J08899K33767J32712K9911L94206M45587N38819
4450B9037246M92200L22523O74278Q06831j17503q40589m94961l7261p13140p42943
4440B8386681m63367L17941R87483L26680o55454l84374J44768K79283M52030
4431B9391671J42909N8758O29987O22029M76302p48162o01311K81948K22730j45032
4421C0331829l64116l43681O34287J243411J81238O1864m73498r13269J19970
4412C0478035M89074N3875M1653n08933n11468q9189L63562k69252K97651m6577
4402C0298431j040959q1272k35134l96887o75148n95986j05826M11226Q63108
$$ y = [29416332, 29967958, 30348957, 29810380, 28152925, 27353212, 27327590, 27707690, 27565541, 26882110, 26633011, 26698532, 27153345, 27262244, 27496011, 27628723, 27658634, 28052840, 28498427, 29037246, 29529446, 29851969, 30526247, 31333078, 31215575, 30374986, 29880025, 29842764, 29129624, 28386681, 27923314, 28241255, 29228738, 29555418, 28899964, 28515590, 28660358, 28939641, 29391671, 29534580, 29593338, 30223325, 30845354, 31321656, 30573494, 29972183, 30254131, 30476861, 30331829, 29967713, 29624032, 30258319, 31501730, 31682968, 31744832, 31271334, 30358065, 30478035, 30967109, 31020984, 31062637, 30553704, 30042236, 29953047, 30316609, 30047357, 30345008, 30298431, 29257472, 29176200, 28941066, 28544179, 27869031, 27273045, 27167219, 27578445, 28441553]
4393B8441553N03412m8618n08376m42562k31905R0025J21034k73837J82801J50585
4383B7984112r44339n07613R96697J339630J27496l13202r10638q90541J18509
4374B7000111P79935j79308q78421m72490J135859J750683R13485k72832n5487
4365B9721535M9957o16287K6836n1131L1461j49897l90046J582l01197K83684
4355B8606497N03652L24404N86784l63429j151046J2378Q14227J77896p18938
4346B8792425l73838O78915J103600N25775p3779Q0622k09943o57609j96970O86531
4336C0355729M27266o69295k70209M18459N73886q35136r34677M96056O64521
4327C0226600k08476m27905K78472M98601p60468j133023j93832K73666j0934
$$ y = [28441553, 28944965, 28896347, 28387971, 27945409, 27713504, 27803529, 27924563, 27650726, 27833527, 27984112, 27039773, 26532160, 27528857, 28868487, 28995983, 28682781, 27772143, 26881602, 27000111, 27780046, 27600738, 26722317, 26249827, 27385686, 29136369, 30049854, 29777022, 29721535, 29771492, 29155205, 29182041, 29130910, 29162371, 29012474, 28622428, 28624010, 28322813, 28606497, 29110149, 29434553, 30021337, 29657908, 28506862, 28519240, 29333467, 29511363, 28792425, 28418587, 29097502, 30201102, 30726877, 30653098, 30733720, 30523777, 29866168, 29669198, 30355729, 30782995, 30113700, 29843491, 30261950, 30835836, 30000700, 29066023, 29562079, 30226600, 30018124, 29590219, 29868691, 30367292, 29606824, 28473801, 28279969, 28553635, 28542701]
4318B8542701l47597k72389k01996N42979L10936l2178J14173l10008o85192O0900
4308B7722329O68664P9354L67715L39473M10588O14488k21257m2566N37704M06866
4298C0883358L79903n05913n01640j47937q50065p12296L67030Q23193k37745
4289B9497888k36478L92275J40116j67526j474195j771434k88739P2891k24742
4280B5940056Q55488J164918K88073Q56830N61960j49628M97374j50915m51176
4271B9412980J69463L86283j06068k85342M03762M40319n6115K96346M36077M01349
4261C1499054J59806k6749l70260m34509o22048k54214N86799L89412l11370n23601
4251C0092320l17260l22339j67712l60036m70195k57259L6276L14353j938K58826
$$ y = [28542701, 28195104, 27922715, 27720719, 28263698, 28574634, 28542456, 28656629, 28346621, 27661429, 27722329, 28390993, 28470347, 28838062, 29177535, 29588123, 30202611, 29981354, 29938788, 30476492, 30883358, 31263261, 30757348, 30255708, 30107771, 29257706, 28545410, 28912440, 29735633, 29497888, 29261410, 29653685, 29793801, 29626275, 28152080, 26380646, 26091907, 26164798, 25940056, 26795544, 27960462, 28248535, 29105365, 29667325, 29517697, 30015071, 29864156, 29412980, 29582443, 29968726, 29862658, 29577316, 29981078, 30421397, 30365282, 30661628, 31097705, 31499054, 31658860, 31632111, 31261851, 30827342, 30205294, 29951080, 30537879, 30927291, 30615921, 30092320, 29775060, 29452721, 29285009, 28924973, 28454778, 28197519, 28233795, 28548148, 28546210, 28805036]
4241B8805036O84236P70310P02966j45801J99823P75821m0157p17212l30953j14832
4231C0589237J64094K65772R9895l982p21933k04850m26340m55304N7397K77594
4221B9641580L88483J65836r884j74981k0933l75066o77957m70487J95847M36934
4211B9099372R8439M4804n6803j41325k04977k19924m11261J69745J115100L47709
4201B9840879k84042l41684n31690l53490L05116J237357M87969j007642r12452
4192B8440321J69355O26779n15472j11457J099032Q10256K24742k51900n55453
4183B9936203J34962m868r59406n85091p10854K30255J078412J40496n91225n05349
4173B8163535P01096K08856J6370N40413J64233J28199K44864n0604K30689m651
$$ y = [28805036, 29489272, 30259582, 30962548, 30816747, 31016570, 31792391, 31752234, 31035022, 30704069, 30589237, 30753331, 31019103, 31118998, 31115016, 30393083, 30188233, 29761893, 29306589, 29363986, 29641580, 30030063, 30195899, 30186015, 30011034, 29990101, 29615035, 28937078, 28466591, 28662438, 29099372, 29197811, 29242615, 29185812, 29044487, 28839510, 28619586, 28208325, 28378070, 29493170, 29840879, 29556837, 29215153, 28683463, 28329973, 28635089, 29872446, 30360415, 29352773, 28440321, 28609676, 29236455, 28720983, 28609526, 29708558, 30518814, 30743556, 30491656, 29936203, 30071165, 30066297, 29106891, 28521800, 27810946, 28041201, 29119613, 29260109, 28668884, 28163535, 28864631, 29073487, 29089857, 29630270, 29794503, 29922702, 30167566, 30116962, 30347651, 30343000]
4163C0343000k44726O0572m47249j42630L06685K4492l68568q2508R8536j38822
4153B9408782K81419L26128k51539m08767k34295j93410n45981j53221M02861
4144B8631977R12392R91070O43304P48598Q574p66763r32353r24922r63307k52857
4134B8095713N59246P87741M39374n47400p86698l68004l56925k73917M53313
4125B8002443Q76692M79645N55601R7469m55391m89149j103782m70917J8818j4867
4115B7496562N74394Q76169O23879R0420O68057O8667r56851m47546J26718Q61689
4105B9982158M06931r74482q83852k86374j079m22464m73297N43610O23273n85899
4095B7928525l6026N22998P68798Q56714K19248N1751P50933N81817P2086J25061
$$ y = [30343000, 30098274, 30158846, 29711597, 29568967, 29875652, 29900144, 29531576, 29449068, 29547604, 29408782, 29690201, 30016329, 29764790, 29356023, 29121728, 28928318, 28382337, 28229116, 28631977, 29544369, 30535439, 31178743, 31927341, 31935915, 31169152, 30236799, 29311877, 28348570, 28095713, 28654959, 29442700, 29882074, 29334674, 28547976, 28179972, 27823047, 27549130, 28002443, 28879135, 29358780, 29914381, 30011850, 29556459, 29067310, 27963528, 27492611, 27511429, 27496562, 28070956, 28947125, 29571004, 29661424, 30329481, 30398148, 29441297, 28993751, 29120469, 29982158, 30389089, 29414607, 28530755, 28244381, 28243302, 27820838, 27347541, 27891151, 28514424, 27928525, 27892499, 28415497, 29184295, 30041009, 30260257, 30312008, 31062941, 31644758, 31716844, 31841905]
4085C1841905r08457j293831n42680j71421o11365k83494M56305K79114N96889
4076B9362965M46340n71987k96973M10849J57734J82665J9385m3291N28185J116201
4066C1312073J50639M39738K85346k53985l97220j039969p34113J64521l4500
4057B9892530j09916j77311P6576O49840j36306p25779p21226l79686L38742L43933
4047B9051397J63298j64999L22542k29121m33018q2379j45223j48345J13456J27662
4037B8575270P6309m56132k40016P86075R33347j46988k57397Q3653j40401o49983
4027B8563737m55528n4821k4216J16787K57367L14537O06524j44282o76828k26915
4017B8276362J075936R84647r75493q77098j00689K23568L28868M11245k4359
$$ y = [31841905, 30933448, 29639617, 29096937, 28925516, 28314151, 28030657, 28486962, 28766076, 29362965, 29809305, 29237318, 28940345, 29351194, 29508928, 29691593, 29710978, 29667687, 30195872, 31312073, 31462712, 31902450, 32187796, 31933811, 31536591, 30496622, 29762509, 29927030, 29892530, 29782614, 29605303, 29681879, 30331719, 30195413, 29469634, 28748408, 28368722, 28707464, 29051397, 29214695, 29049696, 29372238, 29143117, 28710099, 28627720, 28482497, 28334152, 28447608, 28575270, 28651579, 28195447, 27955431, 28741506, 29674853, 29527865, 29270468, 29354121, 29213720, 28563737, 28108209, 28053388, 28029172, 28145959, 28403326, 28717863, 29324387, 29180105, 28503277, 28276362, 29352298, 30336945, 29361452, 28484354, 28383665, 28607233, 28936101, 29347346, 29322987]
4008B9322987K19013q02744l44979P87917p8146p37500o6744N81248J50841j13453
3998B8918440l48305r20561j72315K52821P7199J72092R2265J96406P10027L36926
3988B9314995r2289k16776M15596J020139M05389j141580r34126K66019M23099
3979B9460466K12348N13676K05769n00844p84633J42318O06284K14646L38618
3970C0408648o50688o503M98096k96421p948n05362J83415K13599n39906J34661
3960B9431591N54887O33002L48727N9757m03281j59808r57387j211536k52902
3951B8043050N77231J093972O00029k50895n19983m87462l5345N5295p22032L71807
3941B8725667P98657L14753k41522o75268n28059K98880j87584J8510M15847P32093
$$ y = [29322987, 29542000, 28739256, 28394277, 29182194, 29104048, 28366548, 28299804, 28881052, 29031893, 28918440, 28570135, 27649574, 27477259, 27730080, 27807279, 27979371, 28071636, 28268042, 28978069, 29314995, 29222706, 29005930, 29421526, 30441665, 30847054, 29705474, 28771348, 29037367, 29460466, 29672814, 30186490, 30392259, 29891415, 29106782, 29249100, 29855384, 30070030, 30408648, 29757960, 29751457, 30249553, 29953132, 29945184, 29439822, 29623237, 29836836, 29296930, 29431591, 29986478, 30619480, 30968207, 31027964, 30624683, 30464875, 29507488, 28295952, 28043050, 28620281, 29714253, 30314282, 30063387, 29543404, 29055942, 29020597, 29075892, 28353860, 28725667, 29524324, 29839077, 29597555, 28922287, 28394228, 28693108, 28505524, 28524034, 28939881, 29671974]
3931B9671974J16006l53155M57963P05120J71040r0238J4839K94558J98318l10575
3921C0875850M3251J23910L3665N06851j231510j622176n25450K05959N56593
3912B8966943k9282L81286J6919N31577Q11315K6095J06726O2817j75540L24657
3902C1023513O42622N31190M77848k03482m06432R941p57235l73770O19769L19774
3892C1883738L57274p18134j630015k96224M38209o23736r19528M67328j53613
3883B8805299m02421N44295P17980j45898o89803l96156L46723N99547l0872m73572
3873B8875122M44947J240285J17466k6051O92958p08626j185579P3055K86661
3864B9810238P51952J251878P08573p96957j349390q50003k24669L77452J26730
$$ y = [29671974, 29787980, 29434825, 29892788, 30597908, 30768948, 30678710, 30693549, 30988107, 31186425, 30875850, 30919101, 31043011, 31076676, 31583527, 30352017, 28729841, 28204391, 28410350, 28966943, 28937661, 29318947, 29335866, 29867443, 30678758, 30704853, 30811579, 30874396, 30698856, 31023513, 31666135, 32197325, 32675173, 32471691, 32065259, 32075200, 31317965, 30944195, 31563964, 31883738, 32241012, 31522878, 29892863, 29596639, 30034848, 29411112, 28491584, 28958912, 28805299, 28402878, 28947173, 29665153, 29519255, 28829452, 28433296, 28780019, 29379566, 29348694, 28875122, 29320069, 30560354, 30677820, 30651769, 31344727, 30636101, 29450522, 29523577, 29810238, 30562190, 31814068, 32522641, 31725684, 30376294, 29526291, 29301622, 29679074, 29805804]
3855B9805804P49825J149349L42547l54642q932m486o1089j07260J29609N65640
3845C2206365m08829l18060q70381j163995m54730Q50292J239270j33134j42025
3836C0804773M59971k56274p59083k95602k30025l74903n13779o10564p3161M55426
3826B8606779M53032J141273L62947j55914o63655r26729p35954Q03932J358176
$$ y = [29805804, 30555629, 31704978, 32047525, 31692883, 31683951, 31679465, 31618376, 31511116, 31640725, 32206365, 31797536, 31479476, 30609095, 29445100, 28990370, 29840662, 31079932, 30946798, 30804773, 31264744, 31008470, 30249387, 29953785, 29723760, 29348857, 28835078, 28224514, 28151353, 28606779, 29059811, 30201084, 30564031, 30408117, 29744462, 28817733, 28081779, 28885711, 30243887]
$$ [...]
##END NTUPLES=NMR SPECTRUM
##END=
