##TITLE=C13_SA_39.143
 CDCl3, 22300 sc

 23.10.2019
##JCAMPDX= 6.0         $$ Bruker NMR JCAMP-DX V2.0
##DATA TYPE= NMR SPECTRUM
##DATA CLASS= NTUPLES
##ORIGIN= UXNMR, Bruker Analytische Messtechnik GmbH
##OWNER= root
$$ XWIN-NMR		Version 3.5
$$ Thu Oct 24 13:52:46 2019 Russian Standard Time (UT+4h)  she@DPX200
##.OBSERVE FREQUENCY= 50.327896
##.OBSERVE NUCLEUS= ^13C
##.ACQUISITION MODE= SIMULTANEOUS
##.ACQUISITION SCHEME= undefined
##.AVERAGES= 18306
##.DIGITISER RES= 17
##SPECTROMETER/DATA SYSTEM= spect
##.PULSE SEQUENCE= zgpg30
##.SOLVENT NAME= DMSO
##.SHIFT REFERENCE= (INTERNAL, DMSO, 0, 222.624)
##AUDIT TRAIL= $$ (NUMBER, WHEN, WHO, WHERE, WHAT)
$$ ##TITLE= Audit trail, XWIN-NMR		Version 3.5
$$ ##JCAMPDX= 5.01
$$ ##ORIGIN= Bruker BioSpin GmbH
$$ ##OWNER= she
$$ F:/spectra/data/she/nmr/c13/1/pdata/1/auditp.txt
$$ ##AUDIT TRAIL=  $$ (NUMBER, WHEN, WHO, WHERE, WHAT)
(   1,<2019-10-24 10:38:24.26 +0400>,<she>,<DPX200>,
      <created by zg, POWCHK disabled, PULCHK disabled
       terminated by command 'halt'
       configuration hash MD5:
       00 E9 B6 7A A2 85 ED C7 34 08 36 98 17 FE 4E 26
       data hash MD5: 32K
       3B 70 4C A8 9E 22 C0 F6 EE EE 7B 8B 52 DA 2D 0C>)
(   2,<2019-10-24 13:48:59.70 +0400>,<she>,<DPX200>,
      <Start of raw data processing
       efp BC_mod = 2 LB = 1 FT_mod = 6 PKNL = 1 PHC0 = -381.5037 PHC1 = 32.20636 SI = 32K 
       data hash MD5: 32K
       0A 1E 69 6E 33 42 D1 F2 5F 97 C3 4E CA BD C1 7B>)
(   3,<2019-10-24 13:49:20.68 +0400>,<she>,<DPX200>,
      <pk PHC0 = 4.538208 PHC1 = -7 
       data hash MD5: 32K
       05 F9 DC E3 8F 75 B9 2E 30 98 11 12 AF 7E 64 E4>)
(   4,<2019-10-24 13:49:24.18 +0400>,<she>,<DPX200>,
      <abs ABSG = 5 
       data hash MD5: 32K
       66 91 A1 8B 7A D3 01 14 B4 D7 DF 47 24 A1 DE 2C>)
$$ ##END=
$$ 
$$ hash MD5
$$ 4F BB CF D8 5B 74 9A 03 92 3E 1A 72 2B 58 3F 17
##$RELAX= 
##$RELAX= 
##$RELAX= 
##$RELAX= 
##$RELAX= 
##$RELAX= 
##$RELAX= 
##$RELAX= 
$$ Bruker specific parameters
$$ --------------------------
##$DU= <F:/spectra>
##$EXPNO= 1
##$NAME= <c13>
##$PROCNO= 1
##$TYPE= <nmr>
##$USER= <she>
##$AMP= (0..31)
100 100 100 100 100 100 100 100 100 100 100 100 100 100 100 100 100 100 
100 100 100 100 100 100 100 100 100 100 100 100 100 100 
##$AQSEQ= 0
##$AQ_mod= 1
##$AUNM= <au_zg>
##$AUTOPOS= <>
##$BF1= 50.322709
##$BF2= 200.13
##$BF3= 50.322709
##$BF4= 500.13
##$BF5= 500.13
##$BF6= 500.13
##$BF7= 500.13
##$BF8= 500.13
##$BYTORDA= 1
##$CFDGTYP= 0
##$CFRGTYP= 5
##$CHEMSTR= <none>
##$CNST= (0..31)
1 1 145 1 1 1 1 1 1 1 1 1 1 1 1 1 1 1 1 1 1 1 1 1 1 1 1 1 1 1 1 1 
##$CPDPRG= <waltz16>
##$CPDPRG1= <>
##$CPDPRG2= <waltz16>
##$CPDPRG3= <>
##$CPDPRG4= <mlev>
##$CPDPRG5= <mlev>
##$CPDPRG6= <mlev>
##$CPDPRG7= <mlev>
##$CPDPRG8= <mlev>
##$CPDPRGB= <>
##$CPDPRGT= <>
##$D= (0..31)
0 2 0.00345 0 0 0 0 0 0 0 0 0.03 2e-05 3e-06 0 0 0 0 0 0 0 0 0 0 0 0 0 
0 0 0 0 0 
##$DATE= 1571836588
##$DBL= (0..7)
120 120 120 120 120 120 120 120 
##$DBP= (0..7)
150 150 150 150 150 150 150 150 
##$DBP07= 0
$$ [...]
##$SUBNAM4= <"">
##$SUBNAM5= <"">
##$SUBNAM6= <"">
##$SUBNAM7= <"">
##$SUBNAM8= <"">
##$SUBNAM9= <"">
##$SW= 239.972175391363
##$SWIBOX= (0..15)
0 1 3 0 0 0 0 0 0 0 0 0 0 0 0 0 
##$SW_h= 12077.2946859903
##$TD= 32768
##$TD0= 1
##$TE= 0
##$TE2= 300
##$TE3= 300
##$TEG= 300
##$TL= (0..7)
120 120 120 120 120 120 120 120 
##$TP= (0..7)
150 150 150 150 150 150 150 150 
##$TP07= 0
##$TPNAME0= <>
##$TPNAME1= <>
##$TPNAME2= <>
##$TPNAME3= <>
##$TPNAME4= <>
##$TPNAME5= <>
##$TPNAME6= <>
##$TPNAME7= <>
##$TPOAL= (0..7)
0.5 0.5 0.5 0.5 0.5 0.5 0.5 0.5 
##$TPOFFS= (0..7)
0 0 0 0 0 0 0 0 
##$TUNHIN= 0
##$TUNHOUT= 0
##$TUNXOUT= 0
##$USERA1= <user>
##$USERA2= <user>
##$USERA3= <user>
##$USERA4= <user>
##$USERA5= <user>
##$V9= 5
##$VALIST= <valist>
##$VCLIST= <CCCCCCCCCCCCCCC>
##$VD= 0
##$VDLIST= <DDDDDDDDDDDDDDD>
##$VPLIST= <PPPPPPPPPPPPPPP>
##$VTLIST= <TTTTTTTTTTTTTTT>
##$WBST= 1024
##$WBSW= 4
##$XGAIN= (0..3)
0 0 0 0 
##$XL= 0
##$YL= 0
##$YMAX_a= 126286150
##$YMIN_a= -33637320
##$ZGOPTNS= <>
##$ZL1= 120
##$ZL2= 120
##$ZL3= 120
##$ZL4= 120
##$ABSF1= 222.624
##$ABSF2= -17.3728
##$ABSG= 5
##$ABSL= 3
##$ALPHA= 0
##$AQORDER= 0
##$ASSFAC= 0
##$ASSFACI= 0
##$ASSFACX= 0
##$ASSWID= 0
##$AUNMP= <proc_1d>
##$AZFE= 0.1
##$AZFW= 0.5
##$BCFW= 0
##$BC_mod= 2
##$BYTORDP= 0
##$COROFFS= 0
##$CY= -3
##$DATMOD= 1
##$DC= 0
##$DFILT= <>
##$DTYPP= 0
##$F1P= 0
##$F2P= 0
##$FCOR= 0.5
##$FTSIZE= 32768
##$FT_mod= 6
##$GAMMA= 0
##$GB= 0
##$INTBC= 1
##$INTSCL= 4.134877e-10
##$ISEN= 128
##$LB= 1
##$LEV0= 0
##$LPBIN= 0
##$MAXI= 10000
##$MC2= 0
##$MEAN= 0
##$ME_mod= 0
##$MI= 0.1934396
##$NCOEF= 0
##$NC_proc= 3
##$NLEV= 6
##$NOISF1= 120.0001
##$NOISF2= 80.00006
##$NSP= 0
##$NTH_PI= 0
##$NZP= 0
##$OFFSET= 222.624
##$PC= 1.4
##$PHC0= -376.9655
##$PHC1= 25.20636
##$PH_mod= 1
##$PKNL= yes
##$PPARMOD= 0
##$PSCAL= 0
##$PSIGN= 0
##$REVERSE= no
##$SF= 50.3227315989248
##$SI= 32768
##$SIGF1= 140
##$SIGF2= 120
##$SINO= 11.81781
##$SIOLD= 32768
##$SREGLST= <13C.CDCl3>
##$SSB= 0
##$STSI= 32768
##$STSR= 0
##$SW_p= 12077.2946859903
##$SYMM= 0
##$S_DEV= 0
##$TDeff= 32768
##$TDoff= 0
##$TI= <>
##$TILT= no
##$TM1= 0
##$TM2= 0
##$TOPLEV= 0
##$USERP1= <user>
##$USERP2= <user>
##$USERP3= <user>
##$USERP4= <user>
##$USERP5= <user>
##$WDW= 1
##$XDIM= 32768
##$YMAX_p= 298921272
##$YMIN_p= -1142271
$$ End of Bruker specific parameters
$$ ---------------------------------
##NTUPLES= NMR SPECTRUM
##VAR_NAME=  FREQUENCY,     SPECTRUM/REAL,   SPECTRUM/IMAG
##SYMBOL=    X,             R,               I
##VAR_TYPE=  INDEPENDENT,   DEPENDENT,       DEPENDENT
##VAR_FORM=  AFFN,          ASDF,            ASDF
##VAR_DIM=   32768,         32768,           32768
##UNITS=     HZ,            ARBITRARY UNITS, ARBITRARY UNITS
##FACTOR=    0.368581032318806, 1,           1
##FIRST=     11203.0474431902, 0,            0
##LAST=      -874.247242800138, 0,           0
##MIN=       -874.247242800138, -1142271,    0
##MAX=       11203.0474431902, 298921272,    0
$$ Real data points
##PAGE= N=1
##DATA TABLE= (X++(R..R)), XYDATA
$$ [...]
23198B6576k67834k24861P256L3633K0263r2479r9101J92608J85225K14234J77460
23187A72980j14830l16014j42574J5738m8006m9203Q4722J2585k4169P9663N2554
23176b76554Q6039P6747K0564M2406m2517l9228j0115J24480M6854m3422M4059
23165B9313Q1377l2099j14268l0237r352k62833k13200M9387O9224J99509P1369
23154a61810k6954n5634j05980o3629K7814J3981J43696J31916k4319o3718K1226
23143a63411R2397O3699l7071n8403l3613M0745k3995r2325j29053L6752L34664
23132C0386K42398N350j23852j08053J9414K5265k21873k60400m9980J21294J11805
23121b08246P8766N4971J93120K78305k3084j84437j07418J65443R8905l7590
$$ y = [26576, -241258, -466119, -458863, -425230, -404967, -497446, -596547, -403939, -218714, -4480, 172980, 58150, -257864, -400438, -384700, -432706, -481909, -397187, -384602, -408771, -329108, -276554, -190515, -113768, -93204, -50798, -93315, -132543, -142658, -18178, 28676, -14746, 29313, 110690, 78591, -35677, -65914, -75266, -338099, -551299, -501912, -432688, -233179, -161810, -188764, -244398, -350378, -414007, -386193, -372212, -228516, -96600, -120919, -184637, -163411, -71014, -7315, -44386, -102789, -136402, -95657, -119652, -211977, -341030, -304278, 30386, 272784, 278134, 154282, 46229, 65643, 90908, -130965, -391365, -441345, -320051, -208246, -129480, -74509, 118611, 396916, 373832, 189395, 81977, 247420, 346325, 308735]
23111C08735Q0728N5705q4756k59966k29866p0281q7447q0269j81159j6714M3391
23100e21899K05051R4849p8274m2461Q2917M8120J08616q9358k19075J08596R9850
23089b03068J4200R9401m7716l0904J4967L1578R821j3179m0933j97148j57525
23078e20506J37967J66784P8449K3609M8517m1574k48319j54117n2132R0998K01909
23067b68415j9719j77229J94967M33972K48239L3714n3347k15483j1532J68708
23057C33875N6007j3724P580J5859j231O1164R9858o0020k14507p3819J2443j92325
23045C1160j80070J84018J15582p9555l4583m1221L3162m7788o825n2424o941
23034h5485K9779N5328j25420j01231K8605J03797M3372j22034L7545K39573K16054
$$ y = [308735, 389463, 445168, 360412, 100446, -129420, -199701, -287148, -367417, -548576, -565290, -521899, -316848, -221999, -300273, -342734, -259817, -211697, -103081, -192439, -411514, -302918, -203068, -188868, -89467, -137183, -168087, -153120, -121542, -111721, -124900, -165833, -362981, -520506, -382539, -215755, -137306, -113697, -65180, -106754, -355073, -509190, -561322, -470324, -268415, -288134, -465363, -270396, 163576, 411815, 445529, 392182, 176699, 165167, 333875, 389882, 376158, 383738, 399597, 398366, 459530, 559388, 499368, 284861, 211042, 223485, 31160, -148910, 35108, 150690, 71135, 36552, -4669, 28493, -19295, -26120, -78544, -85485, -55706, -378, -125798, -227029, -198424, -94627, -51255, -173289, -135744, 103829, 319883]
23023C19883Q33k40389j52882j3897J14573p8042j76062j08210l259R9364O5509
23012a72579R6767J1624l9941o3414j78533n9828k7780o029L1189J8341J88659
23001b01524K09292Q5811K08030J41715j80437k10180k05113k25414q9600l662
22991d71082J7641L9115k1873J18318J52467p4211p1765K7055R6200k058j35617
22980c25810q5206L7882p314K6759J59655J46197p7968j19832o976J7656N9170
22969a75787K9402k00611n3734K19243K12216J54996J33011K4690j784m3381j26576
22958A71685p1626J41282M8458k39711j03347L2301j06955Q1773J56183p401L0023
22947A32665j54563j41294M131N8599M0649R6045J09981J60601J85362J9613l6386
$$ y = [319883, 320716, 80327, -72555, -86452, 28121, -49921, -225983, -334193, -337452, -238088, -172579, -75812, -64188, -104129, -167543, -346076, -405904, -433684, -439713, -408524, -390183, -201524, 7768, 93579, 301609, 443324, 262887, 52707, -152406, -377820, -467420, -471082, -453441, -414326, -436199, -317881, -165414, -239625, -311390, -284335, -188135, -190193, -325810, -411016, -373134, -380448, -353689, -194034, -47837, -125805, -245637, -252613, -234957, -175787, -146385, -346996, -400730, -181487, 30729, 185725, 318736, 343426, 341642, 298261, 171685, 100059, 241341, 289799, 50088, -53259, -20958, -127913, -46140, 110043, 102642, 132665, -21898, -163192, -159061, -100462, -59813, 36232, 146213, 306814, 492176, 511789, 475403]
22936D75403j3264r1382k7946j88425k76355k89312j41770r819K03490O9481k28965
22925e18864l1129J44220J35052J86622J38755q8374j49454j41744j40733p7166
22915e42815M5929k6676J17244K59209K50065m6521j93761L9324K8253j13528
22905a83277r6867J05762J88189P9849j73644j43004k9595o5785j07043J17521
22895c07894M8892p5522j8727j38992q0778M5964L8834M8145J01188R9631K23323
22884a5936J62365P3988L2188k324j58822l0952R7104r0870j87209k34028l2582
22873c87078J56425K34957P0499j18444k15792j63534o9263r922j3882j90565
22863g06599j20377K33792M45198K92735J07593j49594k62599o5662J46485K5660
$$ y = [475403, 462139, 370757, 342811, 154386, -121969, -411281, -553051, -562870, -359380, -289899, -518864, -549993, -405773, -270721, -84099, 54656, -33718, -183172, -324916, -465649, -542815, -496886, -523562, -406318, -147109, 102956, 56435, -137326, -98002, -69749, -183277, -280144, -174382, 13807, 93656, -79988, -222992, -252587, -318372, -425415, -307894, -259002, -334524, -353251, -492243, -573021, -527057, -488223, -440078, -338890, -239259, -15936, 146429, 220417, 252605, 250281, 91459, 60507, 157611, 66741, -120468, -354496, -387078, -230653, 4304, 74803, -43641, -259433, -422967, -492230, -502152, -516034, -706599, -826976, -593184, -147986, 144749, 252342, 102748, -159851, -225513, -79028, -53368]
22853e3368k05134j88207l2820J26519R2658N3394R5561J05979J07655J61040
22843B63277M397o6733N7353J49552j68127k81188J3497J63613m833q29L913k59929
22831a26037k90487q2057J41987K46956K6611Q1532J3902o6405r439m4347l3732
22820a41516P0876K133M1292K24398R7907R172j08739j22347j40525j85867j22546
22809c75762N6383K4308j9299k8059j0727K4002l1732j9285l0107K1057N1285
22798c37936K3406J71800J22741q8151q1448J8875r7278j76060J09384P7149j0014
22787b67532L5227L4488j37700J23460J56412o9490O7586o9735j6768m9391j39368
22776c32811K1923J14746K58216L13889j67597k66913j69934j15880L6807J2353
$$ y = [-53368, -258502, -446709, -479529, -353010, -260352, -206958, -111397, -5418, 102237, 263277, 267674, 200941, 258294, 407846, 239719, -41469, -27972, 135641, 130808, 129979, 133892, -126037, -416524, -498581, -356594, -109638, -83027, -1495, 12407, -53998, -63437, -107784, -141516, -70640, -68507, -27215, 197183, 295090, 304262, 195523, 73176, -67349, -253216, -375762, -319379, -295071, -314370, -342429, -353156, -329154, -360886, -380171, -410278, -389221, -337936, -314530, -142730, -19989, -108140, -189588, -170713, -267991, -444051, -334667, -257518, -267532, -232305, -197817, -335517, -212057, -55645, -125135, -57549, -127284, -144052, -193443, -332811, -310888, -196142, 62074, 375963, 208366, -58547, -228481, -344361, -307554, -295201]
22766b95201K4483j0293j67541O5604L48622J75101Q3707J96967J92982j00220
22756E14211k48038k75119j31661J13023j1409k17309p2014K0647M9195Q6661
22746a71813J73087J49060J2025l5908j06260j89509m6384p0748j27054p6968
22736d90472j36358j12646L7067J20978J44158R9559K09760L19914M6104J13904
22726C51968Q5985n1386j70236O2923J82674m8738n688j04661n1469n7702j97866
22715d196L112K35029Q0172j26439k12240k30J23762J39633l4958k51604k38035
22704b85994m3158k4465K3284R995J7600O304Q6972m3784n9179J35657R2880J900
22692h1988N7079K63088K03174p5987j27878j78289q6565J5436K8357O7469j33780
$$ y = [-295201, -270718, -281011, -448552, -382948, -34326, 140775, 224482, 421449, 614431, 514211, 266173, -8946, -140607, -27584, -38993, -256302, -328316, -307669, -258474, -171813, 1274, 150334, 162359, 126451, 20191, -169318, -215702, -286450, -413504, -490472, -626830, -739476, -702409, -581431, -437273, -337714, -127954, 191960, 238064, 351968, 437953, 386567, 216331, 279254, 461928, 413190, 407502, 302841, 251372, 193670, -4196, -1084, 233945, 314117, 187678, -24562, -24792, 98970, 238603, 203645, -47959, -285994, -329152, -353617, -330333, -320338, -302738, -296434, -209462, -253246, -312425, -176768, -83888, -81988, -24909, 238179, 441353, 365366, 237488, 59199, -27366, -11930, 16427, 83896, -49884]
22681d9884o0894J34470k7429o2675n2713J0723n7261j39516j03272J93482L78225
22670A63256l3867j18796Q8923J04824n5975n5615P9336k1145j79966j29127J270
22659a56882K88310n2420l77543k74179n4439L2700j15889j61391J4057J58772
22649f98904J09767K65825K25011q1559L8310J31979r2758k36433j40185J5661
22639d63286J71440J03414j3056j73621o8534P9360J25656K7060l4696r3027j09019
22628d48309J7308Q3897L6526N8433L9323J23812J36378R0105Q9488N8466K5755
22617C11182p650n5636n2254Q9272J80945j57901k99574k01440q9539j28028j51410
22606e62033J78932K33977K48721J96594J62729L1805k1640L3663r2450k14061
$$ y = [-49884, -110778, 23692, -3737, -66412, -119125, -108402, -165663, -305179, -408451, -214969, 163256, 129389, 10593, 99516, 204340, 148365, 92750, 172086, 150941, -29025, -158152, -156882, 131428, 79008, -298535, -572714, -627153, -594453, -710342, -871733, -857676, -698904, -589137, -323312, -98301, -179860, -141550, -9571, -102329, -338762, -478947, -463286, -291846, -188432, -201488, -375109, -443643, -364283, -238627, -211567, -246263, -339290, -448309, -431001, -347104, -310578, -252145, -212822, -89010, 47368, 137473, 226961, 285427, 311182, 303532, 247896, 195642, 284914, 465859, 307958, 8384, -193056, -282595, -410623, -562033, -383101, -149124, 99597, 296191, 458920, 490725, 469085, 502748, 410298, 196237]
22596A96237q4412j37273p6405J31060Q0330k77662l06238n8910N0799J40390
22586c42084R6915n9092J07071K01056j3739m9427j09323j50264r6019O2147P1410
22575b81349J62098J51461Q5384O1703M6785n8384q3544j06815p584J45121P5066
22564A89942M990o9523k10005j75124Q1845K12824J78098N4904j95479r7030r4762
22553a19320N6578L80464K9915j34237q5604o7659O4057J35269L5459L3269N9094
22542C87285r2254k09963j33367J31291N9244j65531j17483L2495j4176M3047
22532g9412k3152r8792O5367K00839N073k30595k29840J5519J51293J25720r2204
22521a90184j94380K2060J45013O3683L9455J86979K34145O1843k00963j33676
$$ y = [196237, 111825, -25448, -101853, 29207, 109537, -168125, -474363, -533273, -482474, -342084, -245169, -304261, -197190, 3866, -9873, -59300, -168623, -318887, -414906, -352759, -281349, -119251, 32210, 117594, 179297, 226082, 167698, 84154, -22661, -30245, 114876, 189942, 194932, 125409, -84596, -259720, -177875, 34949, 213047, 267951, 72472, -24558, -119320, -62742, 317722, 347637, 213400, 127796, 60137, 124194, 259463, 294922, 328191, 387285, 295031, 85068, -48299, 82992, 142236, -23295, -140778, -108283, -122459, -79412, -102564, -201356, -135989, 64850, 69923, -160672, -390512, -374993, -223700, -97980, -190184, -384564, -362504, -217491, -153808, -114353, 72626, 306771, 368614, 167651, 33975]
22511C3975n0498J6854M8407j14605j69875n6543L6120r1138j74290r4741O028
22500f10306J20320R7657J00145J45052J7022M6491l0264k15276l10219k26684
22490h66062J24546K40924J72143J33954L7347n631O439J60050J41592R8602K7896
22479B71800Q251L9237j00436k65769l1572M4705r668K08856K9930k75262K472
22468g7456K98092P3517n7045j17260k43722j29280j8235K911P860P224j46139
22457c99533l2062K08287R3500j19732j19896p8257O9644J49199P334J0496K4289
22446a86731J09649Q6258p0642M012L419k70331n28960r9235J91388K01170K05556
22435c54447J22907J25947J3491n1438K56814K80148r0091l32733j63384l4897
$$ y = [33975, -16523, 331, 48738, -65867, -235742, -292285, -256165, -347303, -521593, -616334, -610306, -489986, -392329, -292184, -147132, -130110, -83619, -113883, -329159, -639378, -866062, -741516, -500592, -328449, -194495, -157148, -162779, -156340, 3710, 145302, 243904, 271800, 280051, 319288, 218852, -46917, -78489, -33784, -43452, 165404, 195334, -79928, -77456, 220636, 294153, 237108, 119848, -123874, -253154, -271389, -268478, -260618, -253394, -399533, -431595, -223308, -129808, -249540, -369436, -447693, -378049, -228850, -221516, -211020, -186731, -77082, 9176, -61466, -57454, -54035, -324366, -853326, -952561, -761173, -560003, -354447, -231540, -105593, -92102, -143540, 113274, 393422, 303331, -29402, -192786, -227683]
22425b27683Q5594P2238J2650R3722J42962R1056q0848o2431Q9831J61383q8569
22414B89905o4197K7602L3621j35445k9688M5744l5935l8391l6655j58286J0700
22403i1025N8461Q3989o5292q3437j6051Q6043M4701q3965k07298n6593k1022
22392c51489j78131j30725j87677m7777K36249L12275K05617J06873J34293n3131
22382D6377l10181r3780R4197l4859j07015K38747K72446J27332J28708k7133
22372C34839j71444j88496j6463J48478J7485K1484J294M5818K17349J35155R392
22361E54891k2765N5175J53239m1762r5003J16273l4391k98162k07127p94j30428
22350D9146j46314J07301Q8117q4160Q838J38859Q5782Q4341M5884j7757n8443
$$ y = [-227683, -142089, -69851, -57201, 36521, 179483, 270539, 189691, 127260, 217091, 378474, 289905, 225708, 253310, 286931, 151486, 121798, 167542, 131607, 93216, 56561, -101725, -91025, -32564, 51425, -13867, -97304, -113355, -27312, 17389, -66576, -273874, -330467, -351489, -529620, -660345, -848022, -895799, -659550, -347275, -141658, -34785, 99508, 46377, -263804, -357584, -263387, -298246, -405261, -166514, 105932, 233264, 361972, 334839, 163395, -25101, -41564, 106914, 124399, 145883, 147177, 192995, 410344, 545499, 554891, 532126, 587301, 740540, 698778, 603775, 720048, 685657, 387495, 180368, 179574, 49146, -97168, 10133, 98250, 14090, 22928, 161787, 247569, 331910, 377794, 360037, 301594]
22339C01594j89735j70970P5864p4446j06725J6705p265q2895q8955k8823r9959
22328d55610j62149k8675O4490K29232K06534j6116J3648J05196J2457k87194
22318c18187j02943K46464M1427j51600o5167O2795L9562n8701q0761j77012l2033
22307e96156P2497J27153N6969N0963J31187K8162n4036P4535p5198n0648J01192
22296a33380q912j5056R0703o6600j41907L5872K00474J00747P2662r452J224
22285A26375l4986k34819j43606J65319J70826N5252j13837k27265j21266N3102
22275c04905L0554N9657J9622q7910n5767Q9679J93214L28432R7321k5263p4357
22264B70277j58251L5860L9619m3088L1566n062j77814j08807n9180L7938J55960
$$ y = [301594, 111859, -59111, 16753, -57693, -164418, -147713, -154978, -237873, -326828, -355651, -455610, -617759, -646434, -581944, -352712, -146178, -162294, -148646, -43450, -30993, -318187, -421130, -174666, -133239, -284839, -350006, -287211, -247649, -306350, -387111, -564123, -596156, -523659, -396506, -339537, -288574, -157387, -129225, -183261, -108726, -183924, -234572, -133380, -142292, -157348, -66645, -133245, -275152, -239280, -38806, 61941, 134603, 125151, 126375, 91389, -143430, -287036, -121717, 49109, 104361, -9476, -236741, -358007, -304905, -274351, -214694, -195072, -282982, -338749, -249070, -55856, 272576, 369897, 344634, 270277, 112026, 147886, 187505, 144417, 175983, 170921, -6893, -115700, -174880, -136942, 19018]
22253A9018O0736o6857q8776j1257J8368r4134r5909Q6917K58409J66346J98701
22242D51562k3268j24063l8926p8337l7982P8302J41971J33697M3779j19415k83798
22231A43522k10547n508J2235j25015n0151J26069J05349m408k4413j5498k8907
22220g7272n0753O6782N9176J08826J49010p664J18807R6258j6274k85396k93767
22209a32267r3070j75442j3982J00883K2839n4012n6707Q6821J13660J57248J866
22198d2163p5518k22873n6063k2957l9955q8543K59J37429J39669J10062M1094
22187a19559N9940K525n8662K04052K00754J29718O7654p991j10298j516K0424
22176C87041p4449r9470q6761j57512j58684p8001J50255K15310O1939M8597O0314
$$ y = [19018, 79754, 12897, -75879, -87136, -68768, -162902, -258811, -171894, 86515, 252861, 451562, 428294, 304231, 265305, 186968, 148986, 227288, 369259, 502956, 546735, 427320, 143522, -67025, -72533, -60298, -185313, -235464, -109395, -4046, -8454, -32867, -48365, -77272, -128025, -61243, -2067, 106759, 255769, 248105, 366912, 463170, 446896, 161500, -132267, -225337, -400779, -414761, -313878, -291039, -345051, -401758, -314937, -201277, -44029, -42163, -117681, -340554, -396617, -419574, -459529, -548072, -547813, -410384, -270715, -160653, -119559, -59619, -57094, -115756, 88296, 289050, 418768, 486422, 478431, 368133, 366617, 387041, 312592, 213122, 126361, -31151, -189835, -267836, -117581, 97729, 159668, 208265, 268579]
22165B68579J25806o7523k79637k59340j31899O265J94005L9318k9850J45762
22155A1486K06004l3302m8843j05111n5672L0921J46178l3636k05997l6683r8907
22144b23562k18754R5398J37532j9129P6061J64074J71918p7259m4904K35483
22134B96858L07445J30344k3974j12209k07877k16109j35311N4519P4049q3241
22124H4494o3995n6855j64582k90212j92210K36965L23913J43016O1097j09337
22114b7706j70276j45382j67036o0237J30172J67371L3927J94510J42638q238
22104H9743L884j32628j86150o034J44283J07354Q125Q8785o7245j89538k45837
22093c85258m9115J70392N3050J10313K83383J7466o4500j09865j48656o5724
$$ y = [268579, 394385, 326862, 47225, -212115, -344014, -337749, -143744, -104426, -134276, 11486, 217490, 184188, 135345, 30234, -25438, 5483, 151661, 118025, -87972, -124655, -223562, -442316, -346918, -209386, -228515, -152454, 11620, 183538, 106279, 61375, 296858, 604303, 734647, 710673, 598464, 390587, 174478, 39167, 93686, 167735, 84494, 20499, -36356, -200938, -491150, -683360, -446395, -122482, 20534, 81631, -27706, -197982, -343364, -510400, -570637, -440465, -273094, -239167, -44657, 97981, 89743, 93627, -39001, -225151, -231185, -86902, 20452, 28577, 117362, 50117, -139421, -385258, -434373, -263981, -210931, -100618, 182765, 200231, 135731, 25866, -122790, -188514]
22083a88514m8626L8602m9861j26330J20413J57633J19979K6900L6045O7345j4986
22072A38600j18281n4201P2340P4099j1885Q8886N021j58041j38451j82489j27001
22061d11403J4311M1997P8830r4686j45213J10902J87230J54077k287k20744j51038
22050d38024n2334Q8300J02700R329K897O472p4619K220J78436J33405o0724j6667
22038a18609q0075p8041M0658Q6862q9617p8393J99041J78448j70880j58642J01669
22027a67579J96175O5891J13320O1376k21130j08669N3856P5720J31437n4474
22017A45923k52949J35454K11487p1826j14605m7571l9059j16629j24736r6362
22007c70873j16434q5428N1598J57639K47713J91287P6784P3j80357k09890k8755
$$ y = [-188514, -237140, -198538, -248399, -374729, -254316, -96683, 23296, 50196, 86241, 153586, 138600, 20319, -33882, 38458, 112557, 100672, 189558, 194579, 36538, -101913, -284402, -411403, -397092, -355095, -276265, -370951, -516164, -405262, -218032, -63955, -66242, -286986, -438024, -490358, -402058, -299358, -290029, -287132, -280660, -355279, -353059, -174623, -41218, -101942, -118609, -198684, -276725, -236067, -149205, -238822, -317215, -118174, 60274, -110606, -269248, -167579, 28596, 94487, 207807, 269183, 48053, -60616, -6760, 68960, 200397, 145923, -107026, 28428, 239915, 168089, 53484, 5913, -33146, -149775, -274511, -370873, -487307, -572735, -521137, -363498, -115785, 75502, 152286, 152359, -27998, -237888, -266643]
21996b66643P1037p565m125n4163P0937J24935R5974j7569q6735j74860q6135
21985c34912J1158L842L9372O1648J17385j34007j84835j44017J60008K83134
21975a21224N1671l7504M1450O5640k83693k61238J04650J18988J11116M4784
21965a65360M9955J78350N4009j5881r1235o8555P1075J76897j1189j82138m06
21954d478m4130j02507l6532J2538j2660o271K683p715J27070J34278l650L5J21932
21941A80593M2307J23964j05762j37432j0633J40683R1564k66279l99923q5942
21931d26860J00238J70351O6638o234j14915k52222j25966j60673j21843K38113
21921f33373L92244J88260r2324r1920J3321Q4759q1046j62390j6106k3235R8086
$$ y = [-266643, -195606, -203171, -207296, -261459, -190522, -65587, 30387, 12818, -73917, -248777, -334912, -323754, -319912, -280540, -218892, -101507, -235514, -420349, -564366, -404358, -121224, -69553, -107057, -65607, 33, -283660, -544898, -440248, -321260, -210144, -165360, -115405, 62945, 116954, 101073, 9838, -58717, 12358, 189255, 178066, -4072, -4478, -48608, -151115, -187647, -175109, -187769, -194040, -191357, -199072, -72002, 62276, 58626, 58661, 180593, 222900, 346864, 241102, 103670, 93037, 233720, 325284, 59005, -340918, -426860, -326622, -156271, -89633, -95867, -210782, -463004, -588970, -749643, -871486, -633373, -241129, -52869, -145193, -237113, -223792, -139033, -220079, -382469, -398575, -421810, -323724]
21910c23724J32401p0502r8493o8766k1969N3767J26804j4232j26496K578Q5637
21899c22995J27375O3105J35229J85447J09167j34899j545q9280j79274p0654
21889a78324M927O5350K39342L50130J29747j28495k70321k69298j77771j64050
21879c98763j60920m2201K0076J56315J18915k862k148j94196j56948n9292K2745
21868f99279j18835K172P4693J11340K29373M9135n9700J07672K63855J44901
21858A05327M1934k6251j45794n3322Q0698J08116J20087q426j72373j25920O6167
21847i757L9089K6782l0028o8874J05634l2605j41626j73209j97572p1668L6163
21836e17671J56765L15197K20108Q8217m5262k69334N4491K90523J27923j38218
$$ y = [-323724, -191323, -261825, -360318, -429084, -451053, -397286, -270482, -284714, -411210, -408632, -322995, -195620, -132515, 2714, 188161, 297328, 162429, 160884, 71604, -107670, -178324, -173397, -108047, 131295, 481425, 611172, 482677, 212356, -56942, -234713, -398763, -559683, -601884, -581808, -425493, -306578, -309440, -311588, -505784, -662732, -722024, -699279, -818114, -815942, -741249, -629909, -400536, -351401, -411101, -303429, -39574, 105327, 147261, 121010, -24784, -78106, 2592, 110708, 230795, 222369, 49996, -75924, -9757, 29332, 56114, 26086, -42788, 62846, 30241, -111385, -284594, -482166, -553834, -517671, -360906, -45709, 174399, 262616, 217354, -51980, 2511, 293034, 420957, 282739]
21826B82739j67365J3967J10178o2875n8356J6981P7217j12270j51753N5795J81023
21815A85281K30189J21613j95678k85666p3723k25359k53263p6792J36257K73749
21805a63392J3824J47461J41594k06982j59636j36517j10321M7798K08401P4434
21795a43336l2093L3629M4627j9435J5681k1238j25168q7469P5878J3818k1372
21784b66478Q724J5980O6424J50007J97720M8700q241r5514k3784j89938q4165
21773a80565Q2779l7353j71075q0994m0755j15445j23453N1059J28827J63400
21763c23575J16678Q8418j42424n8362K83704K90446N6407j19927q7565P4854
21753A78654k10388l10176j59520J1499P7040K23134K25116P8071k10555j90493
$$ y = [282739, 115374, 129341, 239519, 176644, 118288, 135269, 212486, 100216, -51537, 4258, 185281, 415470, 537083, 341405, 55739, -17984, -243343, -496606, -573398, -437141, -163392, -149568, -2107, 139487, -67495, -227131, -363648, -473969, -426171, -217770, -143336, -175429, -141800, -97173, -116608, -100927, -122165, -247333, -334802, -258924, -245106, -266478, -257754, -241774, -175350, -25343, 172377, 221077, 212836, 117322, 93538, -96400, -180565, -97786, -135139, -306214, -387208, -427963, -543408, -666861, -615802, -486975, -323575, -206897, -118479, -260903, -319265, -35561, 254885, 311292, 191365, 103800, 178654, -31734, -341910, -501430, -489931, -412891, -189757, 35359, 113430, -97125, -287618]
21743b87618k7324j39043k6477K21676K96292J79882j07409m1691J30023J17542
21733C15853P0481j35090M011P8899m5437r3729K6525N9016j56730k83819j12159
21722b72179p1684J7666K1041J46620Q0161p4954m0544Q8251j37088j0089K52772
21711b7p5821j07983O1492j472J41242J31865R124j21728q0652J39875J20958
21700B16873R643Q8988J10743j56250j28086j42820L0201R3200m5315m7013J12681
21689A42845j44737k85863l2583R9396J32299j156M4516J56022J32517j1419m3986
21678A87851j8116J5121m7034N0915J01845j68292j19257m6082o8110p114J56698
21667C8425J74649L8432P0654Q3459R6419j32788j59223k00354j99081j01835
$$ y = [-287618, -314942, -453985, -480462, -258786, 37506, 217388, 109979, 68288, 198311, 315853, 386334, 251244, 255255, 334154, 288717, 194988, 221513, 280529, 123799, -160020, -272179, -343863, -326197, -305156, -158536, -78375, -153329, -193873, -105622, -242710, -252799, -27, -75848, -183831, -122339, -123811, 17431, 149296, 158420, 36692, -43960, 95915, 216873, 226516, 315504, 426247, 269997, 141911, -909, 29292, 122492, 77177, 30164, 142845, -1892, -287755, -320338, -220942, -88643, -89799, -45283, 110739, 243256, 231837, 187851, 169735, 184856, 137822, 188737, 290582, 122290, 3033, -43049, -111159, -118273, 38425, 213074, 251506, 322160, 405619, 502038, 369250, 210027, 9673, -189408, -291243]
21657b91243p0288r5372M6972Q7044k289P4907j42863p0592J18047L28274K42564
21646B25161N0000j77746j47108k0431P5559J62001N1381J20424L13962R6943
21636G50146J50806M87054J45932n14502p14579k25092N2991J7436P4964j0562
21626B14594L5762k46836k41519P6941L02640K07668J12610J30520p3293j42045
21616C77042m5192N0004N146j04526l6441P6337L1569j03706j40602o2836j27637
21605h0842j08113O229j0021p7796q4648k2016K7458P6505p606J7719J15343o063
21593a53851o9281J10439J03003k23n0129l9870n5397L0294L6212r751o9273l02672
21581d70499j69755l5463k44L3032J87330K18303J54683J22271J97567P8945r3698
$$ y = [-291243, -361531, -456903, -409931, -322887, -325176, -250269, -393132, -463724, -345677, -17403, 225161, 275161, 97415, -49693, -70124, 5435, 167436, 218817, 339241, 653203, 750146, 900952, 1388006, 1533938, 1019436, 304857, 79765, 132756, 150192, 225156, 214594, 250356, 3520, -237999, -161058, 141582, 349250, 461860, 592380, 519087, 377042, 331850, 381854, 387000, 282474, 246033, 322370, 353939, 250233, 109631, 46795, -80842, -188955, -182726, -192747, -270543, -355191, -377207, -349749, -273244, -280850, -263131, -147788, -153851, -223132, -112693, -9690, -9913, -60042, -99912, -155309, -125015, -88803, -98554, -167827, -470499, -640254, -675717, -675961, -642929, -455599, -237296, -82613, 39658, 237225, 316170, 222472]
21570B22472l76224k75520J12349K09928j76977k78403j35534o1814k5745o9308
21560h54776R6619L45548K81235j5663j87799j2583L3110k1389J23167K44760
21550C2229K1765j07298q2751l507k7893n7390L2449J6347n9697j01665J10528
21539b26883J82429O0892J79192K5686m8841N3832r3224k96800l20539k81479
21529g65735r3358J10435K30206J7075O5214K54609K12834n0658m3437l938l7086
21518a03839K1919j193o7624k52886j32252J87964J89513j49151l01954o9903
21508f79406J71462R9132J31897R0819j3465j5709p4449j63469j78933k4632R5519
21497e61234N6592r2168j19481j7231L3647K11502K34654O2777J12642Q0250p4479
$$ y = [222472, -153752, -429272, -316923, -106995, -283972, -562375, -697909, -759723, -785468, -854776, -758157, -412609, -131374, -147037, -334836, -347419, -314309, -335698, -212531, 32229, 53994, -53304, -136055, -139562, -167455, -224845, -192396, -176049, -235746, -337411, -226883, -44454, 16438, 195630, 221316, 172475, 226307, 133083, -163717, -484256, -765735, -859093, -748658, -518452, -501377, -436163, -181554, 31280, -19378, -62815, -66753, -103839, -81920, -83113, -150737, -403623, -535875, -347911, -158398, -307549, -609503, -679406, -507944, -408812, -276915, -186096, -199561, -215270, -289719, -453188, -632121, -656753, -561234, -504642, -596810, -716291, -733522, -699875, -488373, -253719, -190942, -78300, 1950, -72529]
21486g2529q1Q2359j1409R7778k4569N191J2028l14306l18723j12246N2646R7687
21474e06174j6707P3110K22601J67516q2974J80345M10075N4098k65819o5482
21464A70589K5615k6671k00703o7222k0129p9804L977K3742j16119k25145o6456
21453e78326M0702J32423J85404K07664O4533n3714r7874p6288R9084K03721m3512
21442H3817j07781k5803p648k8977O5691M3971r289j26560j99477o4347p3798
21431d50201J9610J71050L34504J49482l4502j6880q7647j38051p8494q4889J95174
21420b0844J76486q9280r5664j32219P447J56030r1578j30023N4515J27939N9446
21409B2255R3091n9553k64218k08135j72486k15205m2627n5380J15876R0593P7634
$$ y = [-72529, -72610, 9749, -1660, 96118, 71549, 76740, 88768, -225538, -544261, -656507, -603861, -506174, -522881, -449771, -227170, -59654, -142628, 37717, 447792, 501890, 236071, 170589, 196204, 169533, -31170, -98392, -118521, -198325, -194348, -170606, -286725, -511870, -578326, -537624, -405201, -219797, -12133, 52400, -1314, -99188, -175476, -76392, 127329, 83817, -23964, -49767, -57415, -86392, -20701, 23270, 13981, -112579, -312056, -376403, -450201, -430591, -259541, 74963, 224445, 189943, 173063, 85416, -52635, -131129, -216018, -20844, 155642, 66362, -29302, -161521, -154074, 1956, -89622, -219645, -165130, -37191, 22255, 115346, 55793, -208425, -416560, -589046, -804251, -846878, -902258, -786382, -695789, -618155]
21398f18155K16430K07456M6067j5030R6040M2921j27884j2585n126r4843J70331
21387i4378K28425J82292K8452N4144j5828J3447Q6308m1504l36404l22145j52724
21376c69915k2899J17325K03360K00365J18449M501R5044Q6954j53487k26619
21366E3078J241j12885j73816n7755J06710J68169R7116o5934j72460l36460j76716
21355f69712R5685J95618L9648R6714J23626r0452j41535M9990K24862L30766
21345B55210J93916m0196j69486k07620j14795L6414J7081n7322k51J65082K47945
21334C25978J51821j79836k67026j12756j84919j50281j15976k84489J20408M49361
21324b47715J97706J17106p6109j56842k226Q6173P5324M4164J27608j9147k18762
$$ y = [-618155, -401725, -194269, -148202, -163232, -67192, -24271, -152155, -164740, -169866, -264709, -94378, 134047, 316339, 344791, 398935, 383107, 396554, 482862, 441358, 104954, -217191, -369915, -392814, -275489, -72129, 128236, 246685, 251186, 346230, 433184, 279697, 53078, 54319, -58566, -232382, -290137, -183427, -15258, 81858, 15924, -156536, -492996, -669712, -574027, -378409, -338761, -242047, -118421, -208873, -350408, -300418, -75556, 255210, 449126, 408930, 239444, 31824, -82971, -46557, -29476, -86798, -87049, 78033, 325978, 477799, 297963, 30937, -81819, -266738, -417019, -532995, -817484, -697076, -247715, -50009, 67097, -9012, -165854, -168080, -81907, -6583, 37581, 165189, 146042, -72720]
21313g2720k75946k47022j02020K1915J44153P7687Q0581J00985M6404r9824j40900
21302d66707j18407K84826M20979L4563l0421l9832K693p660J16223K12645O5695
21291D74597q3310k61581l13495j58971O4319J51649P3904q1352l3966j12427
21281b80633r889N5859r0889P5326l7161M8259N5037j79274j55499j0999l9782
21270e69645J24938Q4238M1454J13493J41882J17720J50234P8062p3256j91881
21260A7239j02832n9732K2784O3023k0016m2733J88014K51781J55463j26506l14339
21249C2146j83309Q6449J82798M7606O7067n8808J8921n5983j09243l36744m22605
21238g31705n1260o98K1113K20929J83569J912L7779R9078O3825L9028j1213K838
$$ y = [-72720, -348666, -595688, -697708, -675793, -531640, -453953, -373372, -272387, -225983, -325807, -466707, -585114, -300288, 120691, 155254, 124833, 85001, 87694, 80034, 196257, 408902, 474597, 391287, 129706, -183789, -342760, -278441, -126792, -52888, -134240, -168206, -280633, -290522, -234663, -325552, -250226, -287387, -239128, -184091, -363365, -518864, -529863, -569645, -444707, -360469, -319015, -205522, -63640, 54080, 204314, 282376, 209120, 17239, -85593, -145325, -122541, -59518, -79534, -122267, 65747, 317528, 472991, 346485, 32146, -151163, -64714, 118084, 165690, 232757, 173949, 192870, 136887, 27644, -309100, -731705, -782965, -783663, -762550, -541621, -358052, -356140, -318361, -219283, -155458, -116430, -127643, -124805]
21226a24805k5900O819L461L6368J765j56580J9676P5929K1993J0487j9122J3982
21214a35927J19267K06958l1395k32757l2898J20091K8912j23183k04210r8783
21204c83925M9492p2073M294J40346K0003j60975J384J85392J37816J06755Q8503
21193A17012k5883M287n9322j7692p7973j28818P5601P4124k41088j06512J07368
21182b78896K11128J90876q2833j92384Q9277K24740N0715r8358m9389J0559J19084
21171A94519P8913j67726l3830J2722j00204j11003q521l6893j45204J3766P482
21160b95979j11932k9966k7110j01j12983j42722J23196J29700Q9427N0803J40386
21149a87281K24561n9313j34316q3399j20888L295L0849J02195N5319j0342N355
$$ y = [-124805, -150705, -143886, -140425, -104057, -102292, -258872, -239196, -163267, -141274, -130787, -149909, -135927, -16660, 190298, 158903, -73854, -106752, 13339, 42251, -80932, -285142, -383925, -334433, -406506, -402212, -261866, -241863, -402838, -401454, -216062, -78246, 28509, 117012, 91129, 95416, 36094, 18402, -59571, -188389, -112788, -38664, -279752, -386264, -278896, -67768, 123108, 40275, -152109, -62832, 161908, 212623, 114265, 64876, 75435, 194519, 273432, 105706, 71876, 84598, -15606, -126609, -135130, -172023, -317227, -303461, -295979, -407911, -437877, -464987, -465088, -578071, -720793, -597597, -467897, -378470, -327667, -187281, 37280, -22033, -156349, -239748, -360636, -357341, -326492, -224297, -168978, -179320, -173965]
21138a73965q5574k48298j28645j34905K8375K34006k2203p5737l8234J21095
21128e24085K07834J50218J02752j14358o1338Q1306Q6085Q5700k6228J3888j13641
21117a11867k84189j41097R28K87059K68637l5446j88737P070J7181O2522J22582
21106D643J60589J00550o6061n1945j02458j36068R0471R8878J06921O5266j30711
21095A40075j61489K309M0540j35459k74774j85370l6094J73737K38973K00867
21085C315N5194j55550k42294q1190K92672K38817q7898k01895R1414L29950K90455
21074E32990j14300k32081k81565j12724p8010r0426m2434p4344j82490N9419
21064f15965L6621J25107K40902K07224l5195j53187q7756o1419k5830J4908M9379
$$ y = [-173965, -259539, -507837, -636482, -771387, -743012, -509006, -531209, -606946, -645180, -524085, -316251, -166033, -63281, -177639, -238977, -157671, -71586, 14114, -12114, 1774, -111867, -396056, -537153, -536225, -249166, 19471, -15975, -204712, -197642, -180461, -117939, 4643, 165232, 265782, 199721, 147776, 45318, -90750, -279, 98599, 205520, 270786, 140075, -21414, -19105, 21435, -114024, -388798, -574168, -610262, -436525, -197552, 3315, 58509, -97041, -339335, -420525, -127853, 110964, 23066, -178829, -87415, 242535, 532990, 418690, 186609, -94956, -207680, -285690, -376116, -418550, -492894, -675384, -615965, -579344, -454237, -213335, -6111, -41306, -194493, -282249, -343668, -369498, -354590, -305211]
21053c05211J57668k9258j21325M3637n3145j32452K06425K5465j87604j16093
21043e11893j3534J71051L07168K49880p984j96075P764j30364j5420J04791J26370
21032I1754J04734k0468p6102j50903m9110m1639Q126P078J10216M8030P3707
21021A05423K42158M8327j51422j61746j29944j69981n2725J46432K59739K41435
21011C77696P1808K692R586j6158r1873k48411j62674P6914Q0607l4866K7886
21000I3207K5752R144J01900n824j67358k13885j60008J08957L73322K93169l601
20989D54775j59339k35164k1690Q905l9057R0390Q525o6972j25667j4845J83005
20978H2866J76736J3265j00089m5832M6871M5497J03972J28968N4008M6091j20300
$$ y = [-305211, -147543, -176801, -298126, -254489, -307634, -440086, -233661, -208196, -395800, -511893, -525427, -354376, -47208, 202672, 194688, -1387, 6377, -123987, -139407, -34616, 91754, 196488, 176020, 99918, -50985, -100095, -141734, -133608, -126530, -16314, 31716, 105423, 347581, 395908, 244486, 82740, -47204, -217185, -269910, -123478, 136261, 377696, 449504, 452196, 461782, 445624, 353751, 105340, -57334, 19580, 100187, 65321, 93207, 118959, 128103, 230003, 224179, 56821, -157064, -317072, -208115, 165207, 458376, 454775, 295436, 60272, 38582, 47487, 8430, 98820, 107345, 40373, -85294, -100139, 82866, 259602, 272867, 172778, 126946, 173817, 219314, 323286, 452254, 506262, 552353, 432053]
20967D32053j06008j50383j66222j06589O2608M5405j41009r6595K6303J20670
20957g9767J25991R4998O7933m5061r2589m1239O1428o0948k0013l2817r5695
20946a17779k14292j13626Q0366K52271N8289m9520o3467j6448O1098J90378O0003
20935A27273j78699m5561K1896K17502L02571Q4283j30232j79139j01265L4928
20925A53557J96041K92626L31547J25248j6692p8569m9074j46262l00461n21126
20915a3165l32468k02116p3594J15109J80197K60189J23102m3067L4145P877q9311
20904c3102j61220j50255J28205K23467J01972J55030M3895Q845R8199l14817
20894A00219m01722q0331P5996L8191O2721Q2346Q9390l9088n6738J62577J22627
$$ y = [432053, 326045, 175662, 9440, -97149, -34541, 10864, -130145, -226740, -200437, -79767, 46224, 141222, 209155, 164094, 71505, 30266, 91694, 30746, 10733, -22084, -117779, -332071, -445697, -365331, -113060, -54771, -104291, -167758, -184206, -123108, 67270, 127273, -51426, -96987, -75091, 142411, 444982, 529265, 399033, 219894, 118629, 153557, 349598, 642224, 973771, 1099019, 1082327, 1003758, 954684, 808422, 507961, -13165, -345633, -547749, -621343, -506234, -326037, -65848, 57254, 14187, 48332, 56209, -33102, -194322, -344577, -216372, 7095, 109067, 264097, 307992, 316837, 415036, 100219, -301503, -381834, -305838, -267647, -204926, -122580, -33190, -72278, -129016, 33561, 156188]
20883A56188K6167l5470o0438j40211k36665j0844L6371p517J79954K69486L6800
20872B13821j67609j13096m8660j69364P758P5089J35778Q0418j6652k87905l41865
20861f32287j79040m2693L5087J44623K94914J78963k7153j50710r3704L0018
20851d41982L27156Q2485l12411o7322J46267J14413K7936j83515k91595j12200
20841g10768L4340J81519M09511J36344j29657j39446N6266J46648j46195k31699
20831c93137m7269J20349J01400K08905l6824k58508p0102Q8953K3126j9692L3777
20820b49022Q1353J68930J91104m0553j36421J7174J28446l6499J57529Q3967
20810C66008p6888j92891k08735j329M0347m6290m4197R2092M2048j33238j6511
$$ y = [156188, 182355, 146885, 86447, -53764, -290429, -301273, -264902, -272419, -92465, 177021, 213821, 46212, -66884, -115544, -284908, -277150, -202061, -66283, 14135, -2517, -290422, -632287, -811327, -854020, -818933, -674310, -379396, -200433, -227586, -378296, -472000, -441982, -114826, -32341, -344752, -412074, -265807, -151394, -123458, -306973, -598568, -710768, -676428, -494909, -85398, 50946, -78711, -218157, -161891, -15243, -161438, -393137, -440406, -320057, -218657, -9752, -46576, -305084, -375186, -286233, -263107, -282799, -249022, -167669, 1261, 192365, 151812, 15391, 32565, 161011, 124512, 282041, 366008, 289120, 96229, -112506, -113835, -73488, -119778, -163975, -71883, -29835, -163073, -179584]
20799a79584M9545k4246k77m6735J6095J7322J89479J09789j61861k15475j84468
20788d30416j28681n8632j3685J24M4811J51770J06671n9385J7547O7557J32662
20777a69657O6665j13833j26973N6663p081M6436L1631J21095j7427P842J3585
20766i1054P3036L2036O2744N325j60940k86548r8030n4861l8101J45721K24423
20755a86249q3585k2282j564J652K29333J18444q5313n9046k4642Q1934Q5915
20744E4597Q4157j8960j14005j39824K3026J2115l6632l0312o8571j53332L5266
20733c52475K71953L55217P0347j85885O032j944j00061j07748R5522J39633j47536
20722D3055k49361r1212N0946m743j63372m0596P9241J69763k8889m8052K00742
$$ y = [-179584, -130039, -154285, -154562, -201297, -185202, -167880, 21599, 131388, -30473, -245948, -430416, -559097, -617729, -631414, -631290, -586479, -434709, -328038, -387423, -369876, -302319, -169657, -102992, -216825, -343798, -287135, -294216, -247780, -216149, -95054, -112481, -104639, -91054, -18018, 14018, 76762, 82087, -78853, -365401, -463431, -518292, -556393, -410672, -186249, -269834, -292116, -293680, -292028, -62695, 55749, -29564, -88610, -113252, -31318, 54597, 138754, 119794, 5789, -134035, -111009, -98894, -135526, -165838, -234409, -387741, -352475, -80522, 274695, 345042, 159157, 165189, 163245, 63184, -44564, 50958, 190591, 43055, -206306, -297518, -246572, -251315, -414687, -455283, -376042, -206279, -235168, -283220, -82478]
20711h2478J34116J03924J09744J02398j53043r8873p2850R5663j4359j1370P6761
20700A89633K18333J16021K4157j85212j75585m6201p0861J36077L49967L45978
20690I02307J17366l05137m54199l05294o7526o5708j9652K28886J5666k36777
20680a90068j08168J312K26353M237N8349Q2315j88931j76584Q958m4529o0291
20669c87047k7632N5217J3382n6212o2141N0722P9893O6298J15715K05233q5853
20658c2425k53883k40226j55718j0703L71741J57249j96692p1003J33701N7961
20648b39998L4736K80813L80130K77245K30108k5576j94697j11644M9823o7102
20638F13838J08301L48477K21376p8366j93542k07278j55995j84101M3386K50060
$$ y = [-82478, 51638, 155562, 265306, 367704, 214661, 115788, 42938, 138601, 124242, 112872, 189633, 407966, 523987, 548144, 362932, 187347, 141146, 70285, 206362, 556329, 902307, 1019673, 714536, 260337, -44957, -112483, -178191, -197843, 31043, 46709, -190068, -298236, -296924, -70571, -66334, -7985, 74330, -114601, -291185, -282227, -326756, -387047, -414679, -359462, -346080, -402292, -464433, -413711, -333818, -267520, -151805, 53428, -32425, -286308, -526534, -682252, -692955, -321214, -163965, -360657, -431660, -297959, -239998, -205262, 75551, 455681, 732926, 963034, 937458, 742761, 631117, 680940, 613838, 722139, 1070616, 1291992, 1213626, 1020084, 812806, 656811, 472710, 516096, 766156]
20628G66156L25170L1532k318r5104j58926j26017j00584K0699J68984J94682
20618A024274K9243L98618N33638L06361K99489L55035M62169R38379J940596
20609F287802K601397L425010N095779Q442317J4421077K2692149J7891112j3068578
20601F7788065k3101799j4175907q830690n273754l578522k412058j836956j211877
20593G366502r47651n84301o22051m57119o93691o19174n68055k19053k74075
20584B381332k73107k65909P9676K04897J42227P421k04531l36849l49437k85216
20574A100504o9179p1185K6809P4867J91925K91151K55442j27199j34550j40286
20564A398299j45915o5068Q9938K5731L2494m1516K26589L93100O40082N43614
$$ y = [766156, 1091326, 1122858, 1120540, 1025436, 866510, 740493, 639909, 660608, 829592, 1024274, 1053517, 1452135, 1985773, 2292134, 2591623, 2946658, 3408827, 4347206, 6287802, 8889199, 12314209, 17409988, 25852305, 40273382, 62965531, 80856643, 67788065, 44686266, 30510359, 21679669, 16405915, 12827393, 10415335, 8578379, 7366502, 6418851, 5834550, 5212499, 4755380, 4061689, 3442515, 2874460, 2655407, 2381332, 2108225, 1842316, 1921992, 2126889, 2269116, 2276537, 2072006, 1735157, 1385720, 1100504, 1031325, 960140, 986949, 1061816, 1253741, 1544892, 1800334, 1673135, 1538585, 1398299, 1252384, 1187316, 1277254, 1302985, 1335479, 1293963, 1520552, 1913652, 2553734, 3097348]
20554C097348P37319J285127J615072J755182K746149M551755O921619J0719710
20546C3429281J6513583J2264500r671860j6652705j0708817o802156m061054
20539A4310772k874090k162654j705252r13094n28273n51746q50957r13128p58130
20530C053448m87261j69691l6339k45897j71646n8421m2691k71704k69993k48858
20520A050947j81156p1568j16942k06200O6949j910L8961n1435M2598P1169Q546
20509F49959M3606j5754n9083J0473k04810n1783J45391L22098K76431K06280
20499A322808J10532j27044l56931k15433j11234j27729L3837J19532J10569J02387
20489H61294P351p0629j42714p402J54128J3236k70143j24893q9575j20249k2143
$$ y = [3097348, 3834667, 5119794, 6734866, 8490048, 11236197, 15787952, 22709571, 33429281, 49942864, 62207364, 52535504, 35882799, 25173982, 18371826, 14310772, 11436682, 9274028, 7568776, 6655682, 6127409, 5575663, 4724706, 3811578, 3053448, 2566187, 2396496, 2360157, 2114260, 1942614, 1884193, 1841502, 1569798, 1299805, 1050947, 869791, 798223, 681281, 475081, 542030, 540120, 579081, 527646, 570244, 641413, 649959, 693565, 677811, 618728, 629201, 424391, 372608, 517999, 840097, 1116528, 1322808, 1433340, 1306296, 949365, 733932, 622698, 494969, 528806, 648338, 758907, 861294, 868645, 798016, 655302, 647900, 802028, 815264, 545121, 420228, 330653, 210404, 188261]
20478A88261R3134L9416k3655r6430J9630J35315J97537M65051L43887K55308
20468A617454P6960J66467N21891M41450K94309J96889M08047N71775Q29523J186105
20458F310870J426934K022619L090932M665171P022466J1516443J6997716J7547481
20450G0600632q84692j7784216j5511168j0205737o608791m335181k916204k421320
20442I933323j677614j271129r19596p73639n09905n56768m65046m68192l27617
20433B963817k05305j48518j27804p6061m97401m62344r9152J24875j10016k07002
20423A155089m735M2947k8334m7651j06089q6316J08261K7203r2551J09733k0663
20412A056894j24400n4293r6381k7773N7863m1721j495j50260m6152J33766P1167
$$ y = [188261, 281395, 320811, 297156, 200726, 220356, 355671, 553208, 1018259, 1362146, 1617454, 1694414, 1860881, 2382772, 2824222, 3118531, 3315420, 3723467, 4295242, 5124765, 6310870, 7737804, 9760423, 12851355, 17516526, 24538992, 36055435, 53053151, 70600632, 69715940, 51931724, 36420556, 26214819, 19606028, 15270847, 12354643, 9933323, 8255709, 6984580, 6064984, 5291345, 4781440, 4224672, 3759626, 3291434, 2963817, 2758512, 2609994, 2482190, 2406129, 1908728, 1446384, 1347232, 1472107, 1362091, 1155089, 1150354, 1193301, 1164967, 1117316, 1011227, 924911, 1033172, 1060375, 967824, 1077557, 1056894, 932494, 878201, 781820, 754047, 811910, 770189, 768694, 618434, 572282, 706048, 777215]
20401G77215r9501Q7603J46920J37137n741j02465j15517m1780j52678q3261m1201
20390E06731k04366l44639k53424L1533J25643R9274O5744Q5487L7410O7823J66880
20379C84096J14233q102k3073p5898r18J60941K5577M2293K9121K5800p9502k12293
20367C82275k16020Q6384J11178j03330J40257N3963n6039p0121q1811N5941J21989
20356D24666p5645p3043M5980o0886k81416j92253K7971K01357n4194l0937J98274
20345A29874K8912k0468J16483J16464N1609R4818r6714k90434q3551J20793J30370
20334B98156n612L4254R4490K6355r8810k84696k02944J6149k3554j11985n9875
20323c18072n1725J4241J30920L1035P6014K40209J98908J6973n9330j9586q7402
$$ y = [777215, 677714, 765317, 912237, 1049374, 1043633, 941168, 825651, 783871, 631193, 547932, 506731, 302365, -42274, -295698, -264165, -138522, -39248, 26496, 111983, 149393, 217216, 384096, 498329, 490227, 467154, 391256, 390338, 551279, 576856, 619149, 648270, 674070, 594568, 382275, 166255, 252639, 363817, 260487, 400744, 454707, 398668, 328547, 246736, 302677, 424666, 349021, 275978, 321958, 261072, -20344, -212597, -184626, 16731, -37463, -68400, 129874, 158786, 138318, 254801, 371265, 422874, 517692, 420978, 130544, 46993, 167786, 298156, 292544, 326798, 421288, 447643, 348833, 64137, -138807, -122658, -146212, -258197, -318072, -369797, -355556, -224636, -193601, -117587, 122622, 321530, 338503, 279173, 259587, 172185]
20312A72185p7367j71051j25758r1887L252l4252j22841J61908K55443k9278o0531
20301a20177Q8841J73621J00149n0407j53374k40331j60556R7371J74726K16500
20291A26363K31237O4098j14141j63773j34327l093K49361K40788R7124l3326
20281E60311j69037o567K27050O8956j51267k76717N7630K29662N8816j36765
20271D62072k10936r9451n2357p7934j51191L1448N6545q6877p24l0728j36128
20260b96261j4491K07764J88948O4005J24058J48660O6652j24918K7041J2266
20250D03724j47123j7133r9147q9635j13153Q0260N6093m4172m1856j17527J9390
20239a10279L5560j1147N1812L0506J01395J240p0995P3094J87689N0449M6595
$$ y = [172185, 94818, -76233, -201991, -293878, -290626, -324878, -447719, -285811, -30368, -59646, -120177, -31336, 142285, 242434, 192027, 38653, -201678, -362234, -264863, -90137, 126363, 357600, 421698, 307557, 143784, 9457, 6364, 255725, 496513, 593637, 560311, 391274, 384707, 611757, 680713, 529446, 252729, 310359, 540021, 598837, 462072, 251136, 151685, 99328, 21394, -129797, -98349, -41804, -128681, -129405, -160133, -296261, -310752, -102988, 85960, 149965, 274023, 422683, 489335, 364417, 391458, 403724, 256601, 239468, 140321, 50686, -62467, 17793, 73886, 29714, -12142, -129669, -110279, -74719, -85866, -34054, -3548, 97847, 99087, 28092, 101186, 288875, 339324, 385919]
20228C85919n4447n5472r455O9788K64271J41446j31486k05583k12980k33158
20218d1157k2150O5121l7825J82246K41175O4018k9678O3231J24351q9994k92258
20207B27080P8J25281k18556j27879L4488K6839K31447K25183j37466j07134m2186
20196B37175m9256j1194m6549k708J58768M7765j70456k16614J39754K58934k4824
20185C20795k04928k797R0295l1987O1446R6172J53371J07686R0611l2057k55953
20174C92654k7889k7761M7488J24464J85776l1475k13224L3585K3157j144o9752
20163D35879J9849M49790N94297L11423k14395j51878K68373N40463J10547m53402
20153A910946l52934j21740k49445l79028k96335L49J20551J88007R3873j76552
$$ y = [385919, 331472, 276000, 266545, 336333, 600604, 742050, 610564, 404981, 192001, -41157, -63307, 1814, -36011, 146235, 387410, 451428, 421750, 484981, 609332, 519338, 227080, 227158, 352439, 133883, 6004, 40492, 67331, 298778, 523961, 386495, 279361, 237175, 187919, 176725, 130176, 127468, 286236, 334001, 163545, -53069, 86685, 345619, 320795, 115867, 113070, 203365, 171378, 232824, 328996, 482367, 590053, 680664, 648607, 392654, 364765, 337004, 384492, 508956, 694732, 663257, 450033, 483618, 506775, 505631, 435879, 455728, 905518, 1499815, 1811238, 1596843, 1444965, 1713338, 2253801, 2364348, 1910946, 1558012, 1436272, 1186827, 807799, 511464, 511813, 632364, 820371, 914244, 737692]
20143G37692j58201j20553j44187M7108K20287p178k07786j78504q3737R8214
20133B03155J38602j01437j75040M312K08512K30056n9015j15647L02803M24721
20123A061022J99046O2193m3302P3334K1599M6718R0350P5420J00972K56729L14484
20112B258565M40485L27962O9928J61023M50066O48397Q30248J226881J289423
20103G702978J188471J502110K042701K970098M623535O648870R910298J5255264
20095E1844325K2952069L4428771N3192026P5417147N4877148l3151425p4211717
20088A85348344n4991532l6275307k4276703j6771515j0861801p977260n609572
20081B8584654m099311k704078k612416k568463k410207j700900j491668j344828
$$ y = [737692, 579491, 458938, 314751, 361859, 582146, 574968, 367182, 188678, 104941, 203155, 341757, 240320, 65280, 69592, 278104, 508160, 449145, 333498, 636301, 1061022, 1260068, 1322261, 1278959, 1352293, 1373892, 1420610, 1510960, 1586380, 1687352, 1944081, 2258565, 2699050, 3027012, 3096940, 3257963, 3708029, 4356426, 5186674, 6413555, 7702978, 8891449, 10393559, 12436260, 15406358, 20029893, 26678763, 36589061, 51844325, 74796394, 109225165, 162417191, 237834338, 292711486, 259560061, 185348344, 130356812, 94081505, 69804802, 53033287, 42171486, 34194226, 28584654, 24485343, 21781265, 19168849, 16600386, 14190179, 12489279, 10997611, 9652783]
20073I652783j284444r86712r24370n02316o39088l25156l60805l52654m57233
20064C820005k12295j32034k6934l17990j87796l49223l23902k94999L3610J32774
20054B141216P3993k14293k33244k05601n2550j35264R0811J48538K41481O7886
20044A922973J30704J49056L19890L68227N62694K99747k03859n70500j74900
20035B804032k39611j36100l33565k72074j40419J5742N0286R9551k43409m2851
20025A561582k1148j54730k59821j37822K0568J35699o4100m5453R3762N4745
20015A183282j71741J02161J64116J09639p7413J81259J7488J24294K7445L9966
20005A700496j851J32905K36103L18246K41213N54940K89831n1161k06521M05661
$$ y = [9652783, 8368339, 7381627, 6457257, 5954941, 5315853, 4990697, 4629892, 4277238, 3820005, 3607710, 3475676, 3448742, 3130752, 2942956, 2593733, 2269831, 1974832, 2008442, 2141216, 2215209, 2000916, 1767672, 1562071, 1509521, 1374257, 1465068, 1613606, 1855087, 1922973, 2053677, 2202733, 2522623, 2890850, 3453544, 3753291, 3549432, 2978932, 2804032, 2564421, 2428321, 2094756, 1822682, 1682263, 1698005, 1748291, 1847842, 1604433, 1561582, 1540434, 1385704, 1125883, 988061, 1008629, 1144328, 1080228, 1034775, 1128537, 1183282, 1011541, 1113702, 1277818, 1387457, 1310044, 1491303, 1508791, 1633085, 1660530, 1700496, 1698645, 1831550, 2067653, 2385899, 2627112, 3182052, 3471883, 3420722, 3214201, 3619862]
19995C619862N45146O87108O37912P61399J373064K233632L020842M402327O434752
19986B3716044J0566735J5634520J6418793J28123j6050356j5050115j0009483
19979B5354261o300341l931032k607810j787201j326398j281641r63946n25476
19971F630416l22900m20404o97131p50290o09007k09235o2686j1570M432k17874
19961C333751m41997k81185l1874J82110K11737L65385K99271L89099N51446M26294
19951E004037p3252m10717m45319k11406J38392M62225P15669K10913p53093o09665
19941D027784m85380l55204j95835j43316K6590J96146J96625K07636M56632O48903
19931D580581L86484N25959Q15574J359269K083760K955079L812821N609026P886041
$$ y = [3619862, 4165008, 4852116, 5490028, 6251427, 7624491, 9858123, 12878965, 17281292, 23716044, 34282779, 49917299, 66336092, 66464215, 50413859, 35363744, 25354261, 19053920, 15122888, 12515078, 10727877, 9401479, 8119838, 7155892, 6630416, 6307516, 5887112, 5189981, 4439691, 3830684, 3621449, 3558763, 3547193, 3551625, 3333751, 2891754, 2610569, 2578695, 2760805, 2972542, 3337927, 3637198, 4026297, 4577743, 5004037, 4930785, 4520068, 4074749, 3863343, 4001735, 4463960, 5179629, 5390542, 4637449, 4027784, 3542404, 3187200, 2991365, 2848049, 2874639, 3070785, 3267410, 3475046, 3931678, 4580581, 4967065, 5493024, 6308598, 7667867, 9751627, 12706706, 16519527, 22128553, 30014594]
19922C0014594J2058718J9220147K9524364J6018588k0435716k3640418j3711566
19915D9048711q005528m155941n76757K657051O956782J1871789J9262708L0364747
19907A07423562M9646339P4260975O7590396j8888539p7350498o2608658m0985227
19900I9088350k5192463j6709271j1371697q578585n830457m714102l500041k979769
19892B0211965k055758k076707j838978j897163j242982j113631q07460q04940
19884H374346n44422o28537m65998n08972l60308m01653N3037L20391O43217L75670
19874F856771L8649o45884q02864p92308m37620j92629o7346j05790N5121L3408
19864C939508L42664L40070M52105N42403L06044j39475k99698m49178j38557
$$ y = [30014594, 42073312, 61293459, 90817823, 106836411, 86400695, 62760277, 49048711, 41043183, 36887242, 36310485, 38967536, 45924318, 57796107, 77058815, 107423562, 157069901, 231330876, 298921272, 280032733, 202682235, 140073577, 99088350, 73895887, 57186616, 45814919, 37236334, 31405877, 26691775, 23191734, 20211965, 18156207, 16079500, 14240522, 12343359, 11100377, 9986746, 9179286, 8374346, 7829924, 7201387, 6735389, 6226417, 5866109, 5464456, 5517493, 5837884, 6481101, 6856771, 6895420, 6249536, 5446672, 4654364, 4216744, 4024115, 3956769, 3850979, 3906100, 3939508, 4282172, 4622242, 5074347, 5616750, 5922794, 5783319, 5483621, 5034443, 4895886]
19855D895886J28685O5822k48333L2945K73845M97459N50532P23283P59306Q13003
19845H492433J065980J635489K207090L534586N437247P708350J0903338J6558615
19837E7543128K4641383L1225215J9833473j2721363k9799876k5237330j7452444
19830D8032186j1683586q059153n443606l869234k913229k415554j712534j473306
19822A0461984j055363q50191o60694p58071p05845o26678l36029l86809m99347
19813D582957n38524l45712k90982j43574k53705j57274l65829k41685k46314
19804A999358j79617K8090O4751O5085K76056K81841J59959k53297l72537l31112
19794A738577j85427k25030j26549o4564P2185n1382l4633j38237j03778j51943
$$ y = [4895886, 5024571, 5090393, 4842060, 4875005, 5148850, 5646309, 6196841, 6920124, 7679430, 8492433, 9558413, 11193902, 13400992, 16935578, 22372825, 30081175, 40984513, 57543128, 82184511, 113409726, 133243199, 120521836, 90721960, 65484630, 48032186, 36348600, 28289447, 22845841, 18976607, 16063378, 13647824, 11935290, 10461984, 9406621, 8556430, 7895736, 7137665, 6431820, 5805142, 5469113, 5082304, 4582957, 4044433, 3698721, 3407739, 3264165, 3010460, 2853186, 2487357, 2245672, 1999358, 1819741, 1847831, 1912582, 1977667, 2253723, 2535564, 2695523, 2442226, 2069689, 1738577, 1553150, 1328120, 1201571, 1137007, 1209192, 1157810, 1123177, 984940, 881162, 729219]
19784G29219j34185J14898K56966L2049Q4027K14000J64641J6433k03028l67182
19774I07838j16425J20063J97197Q3731J48114R3709O2063j48580j29540q1373
19764A136797m6083M4880N0878j36562j26583j27491l9774n6583L4644J47070
19754H81193J79701j05859o5559P5883R5829O0258k08268l35962k54765p0054
19744B52397R412k5004L9112o2869M1949o9658K3557J7460J40483K16972O0722
19733F44533M8516l3482N3309J50852o065j98640r6320J50167l5861l31266k01426
19722A44317m4358J67056Q2985j00989k3411K02454R5449p0956o9275q4416m2647
19711B56209J64901K14253K4081l5289O045M0797j06989q0936M9878K0493m8259
$$ y = [729219, 595034, 709932, 966898, 998947, 1082974, 1296974, 1461615, 1478048, 1275020, 907838, 791413, 911476, 1108673, 1192404, 1340518, 1434227, 1496290, 1347710, 1218170, 1136797, 1090714, 1135594, 1186472, 1049910, 923327, 795836, 756062, 699479, 734123, 881193, 1060894, 955035, 889476, 965359, 1061188, 1121446, 913178, 577216, 322451, 252397, 261809, 236805, 275917, 213048, 254997, 185339, 208896, 226356, 366839, 583811, 644533, 693049, 659567, 712876, 863728, 857663, 659023, 562703, 712870, 677009, 345743, 144317, 99959, 267015, 350000, 249011, 225600, 428054, 523503, 452547, 383272, 298856, 256209, 421110, 635363, 659444, 624155, 630200, 670997, 564008, 483072, 532950, 553443, 505184]
19700E05184L9433J62781N6875k61482j18191L6241O02o5402o6003Q7693j1535
19689C66196r6885O484N9889r1308m2327r7424j50023J10798K94998L06343L999
19678F70740j53664q2020k42536j78192Q1344J85384R2396r9247k14098k06688
19668a46581J68743J92860J34662J74792L7183j69652j18200m0873j05716J00436
19658B27654p801j9870l7814M1449P5945J6455k60842q3961Q2912R1413N4731
19647A80271J64024N5279k2456J76145J28888j71080j25665j5106j9372m7255
19637C03673R1025L5039j9202n5109j2593j00465M0860J44899j10210j68445L1375
19626A80847N6031Q3211Q4514N803J5063J40201M1148j08477r3434n9920j4164
$$ y = [505184, 544617, 707398, 764273, 502791, 384600, 420841, 421443, 356041, 290038, 377731, 366196, 269311, 275795, 335684, 244376, 202049, 104625, -45398, 65400, 360398, 666741, 670740, 517076, 435056, 192520, 14328, 95672, 281056, 373452, 274205, 60107, -146581, 22162, 215022, 349684, 524476, 561659, 392007, 273807, 232934, 127218, 227654, 219853, 199983, 162169, 203618, 279563, 296018, 35176, -48785, 34127, 125540, 180271, 344295, 399574, 377118, 553263, 682151, 511071, 385406, 370300, 350928, 303673, 394698, 429737, 410535, 355426, 342833, 242368, 283228, 428127, 317917, 149472, 180847, 236878, 320089, 404603, 410406, 425469, 565670, 606818, 498341, 404907, 344987, 330823]
19615C30823K5550K1627q28j98753j21318o37J03789K12884K42192R4782j12473
19604E97638l21471j46189m8408j7718M2644P4895L397J48970K7384r0287P9295
19593C50150R8414j9963q1463K6051J88794k06432l70251j65567N8225J63454
19583D1412J26102J22333J43792l9452j85236k01241k3364P6314j32155j15330
19573a86825M2508N6281J2918n3290J76089J5043j21948L3595J41898J28632J5498
19562B60399l2975j78915k25657M6094R2424J00522J05096J73992J62709n4660
19552D49029N906L7816J2303r2190l2849K6133k6454Q981L0908R7923L7185r9106
19540D55585k9827l6267q8281J68430J90216n6313m0734K3885k298r0178j56674
$$ y = [330823, 356373, 378000, 377172, 178419, 57101, 56464, 160253, 373137, 615329, 710111, 597638, 276167, 129978, 81570, 63852, 106496, 181391, 184788, 333758, 361142, 270855, 350150, 448564, 428601, 347138, 373189, 561983, 355551, -14700, -180267, -122042, 41412, 167514, 289847, 433639, 394187, 208951, 7710, -15654, 60660, -71495, -186825, -144317, -88036, -75118, -128408, 47681, 62724, -59224, -25629, 116269, 244901, 260399, 227424, 48509, -177148, -131054, -38630, 61892, 166988, 340980, 503689, 449029, 454935, 492751, 505054, 412864, 380015, 406148, 379694, 388675, 419583, 517506, 554691, 455585, 425758, 389491, 301210, 469640, 659856, 603543, 562809, 586694, 584396, 494218, 337544]
19529C37544j25142j41318J15669K30501P0691n4074k33738k01518j7144L490
19519a5039j0978j14881L5456J41002Q3192l8225R846j8288j37165j23252q1015
19508b69347L3505o9062k6811L3344J53543J34421K4792P6008k4134m0792o7088
19497d1621J11115K96670J17049J10221J6912l2954J08861J09986K67812J63061
19487A227112p5935j63197j29899k48890j90051r863K05720J18457O0669R8037
19477H92160k23825k88282q9836Q569j325K9569J34154j74381k17919J38405L03996
19466E11285J30399j26555O6895J45996Q0678J18880J62218l355o1844r097Q108
19455A023608r2974o3332K14519K48578o3174j19661n627j43331j65429o024j1423
$$ y = [337544, 212402, 71084, 186753, 417254, 487945, 433871, 200133, -1385, -18529, -15039, -26017, -140898, -105442, 35560, 118752, 80527, 90373, 72085, -65080, -188332, -269347, -235842, -304904, -331715, -298371, -144828, -10407, 14385, 90393, 66259, 25467, -41621, 69494, 366164, 483213, 593434, 610346, 577392, 686253, 796239, 1064051, 1227112, 1151177, 987980, 858081, 609191, 419140, 409277, 614997, 733454, 794123, 892160, 668335, 380053, 290217, 298786, 297461, 327030, 461184, 286803, 68884, 207289, 511285, 641684, 515129, 582024, 728020, 808698, 927578, 1089796, 1086441, 1024597, 1015500, 1023608, 930634, 867302, 1081821, 1330399, 1267225, 1147564, 1141937, 998606, 833177, 827153, 815730]
19444H15730j44417j47187l00074j22751p4082j53653n7954j9803J28547K58242
19434A82598K01345M90p5727N4252N8070o0101k18508k05658M1065K03635K45644
19423D27105r4763k26124R7571L75060R9955m821P423R4313J92769J19940k7376
19412A061052j50298k3025j19832k23122J08125K45656Q2882L3296K8384J08409
19402A151527p5466l3501J17560J29301L43460M92449K32368J47949K47852L19003
19392C072502P89874P70535O19759R36618J325360J652023K577241L836152N386967
19383B0967031P486323J0161698J5015932K2890692K9356260K1435938o960287
19376A20353587k6611842k5246701j8099186j2175019q425996o322064m790533
$$ y = [815730, 671313, 524126, 224052, 101301, 27219, -126434, -184388, -204191, -75644, 182598, 383943, 384433, 308706, 362958, 421028, 360927, 142419, -63239, -22174, 181461, 427105, 332342, 106218, 203789, 578849, 678804, 673983, 681406, 775719, 968488, 1088428, 1061052, 910754, 887729, 767897, 544775, 652900, 898556, 981438, 1014734, 1043118, 1151527, 1076061, 1042560, 1160120, 1289421, 1632881, 2125330, 2357698, 2505647, 2753499, 3072502, 3862376, 4632911, 5252670, 6189288, 7514648, 9166671, 11743912, 15580064, 20967031, 28453354, 38615052, 53630984, 76521676, 105877936, 127313874, 120353587, 93741745, 68495044, 50395858, 38220839, 29794843, 23472779, 18682246]
19369A8682246l345971k352981j733123j477404j385035j275247q60333o04194
19361E647958n61914m09571l91172m02261l87451k39340j73094l63040l68907
19352B351208j33739r0806j45913p8372j89160k2185Q8997j25277j86151j62936
19342A305666J8471O0509o550M8815N0104l3371n5558j55420L3482J87909k7586
19331A426471m3194p5307j86552j40897r636K34549J33155J50660K49710J55280
19321A894239O127L57082P39085R82340J014246J337911J650375K340372L620442
19312A3942219N957564R009594R925789L56224r544333q582505n529194l233603
19304A2301755k355110j697978j135535p07224p65648p25178p50809m97048l55237
$$ y = [18682246, 15336275, 12983294, 11250171, 9772767, 8387732, 7112485, 6252152, 5647958, 5086044, 4676473, 4285301, 3883040, 3495589, 3256249, 3083155, 2720115, 2351208, 2217469, 2126663, 1980750, 1902378, 1713218, 1691033, 1780030, 1654753, 1468602, 1305666, 1324137, 1384646, 1378096, 1426911, 1477015, 1443644, 1388086, 1232666, 1266148, 1454057, 1426471, 1383277, 1307970, 1121418, 980521, 970885, 1205434, 1338589, 1489249, 1738959, 1894239, 1900366, 2257448, 2996533, 3978873, 4993119, 6331030, 7981405, 10321777, 13942219, 19899783, 28909377, 38835166, 39191390, 29647057, 21064552, 15535358, 12301755, 9946645, 8248667, 7113132, 6405908, 5640260, 4915082, 4164273, 3667225, 3311988]
19295C311988k41163k26991j34862j84660k81922p7522P5361j09926l20990k43140
19285A566173j08473j03638k3143P7170l460L506j42943j54094j30021o3971O0831
19274I77937j00396q0303j59523M0789J71550l2n0353p1471j55321j24960K0953
19263D68870K30179J27775l5790q2215J54659K18375j26730l87077j60320K25379
19253F33105J63609j31896l0264o223k5417R8026K5187J06643P0858j42770p6640
19242F84218p6810O9727N8029r2556j23436n7452j60889r6708j40494l43613j53496
19231d33480N7206L7915J71148L40600L68961L0213m750P6774j2969q2534n3129
19220D95955M294k6066J52956J62791n421N728K7505R8271q9519k25652k16261
$$ y = [3311988, 3070825, 2843834, 2708972, 2524312, 2242390, 2164868, 2240229, 2130303, 1809313, 1566173, 1457700, 1354062, 1330919, 1408089, 1404629, 1408135, 1265192, 1111098, 981077, 917106, 977937, 877541, 797238, 637715, 678504, 850054, 850022, 799669, 728198, 572877, 447917, 468870, 699049, 826824, 791034, 708819, 863478, 1081853, 955123, 568046, 407726, 633105, 796714, 664818, 634554, 628331, 602914, 700940, 726127, 832770, 903628, 760858, 684218, 607408, 677135, 735164, 642608, 519172, 461720, 300831, 204123, 63629, -279984, -433480, -376274, -338359, -167211, 173389, 542350, 572563, 567813, 644587, 631618, 549084, 495955, 500249, 474183, 627139, 789930, 784509, 790237, 817742, 916013, 826494, 600842, 384581]
19209C84581j34450l0070J09736j6141j92667j77610m3239j86507o0299L9254
19199c07412J21294P1496j45635k42729q6800K30198K87810J36448K84324J70728
19189E19722k8462O6114J45343L5162m3318L2135R6982J75710L49746L84648M20149
19178B153931J72952J91527M35275Q63988J302189J931368K836733M572591P373991
19169B1834545J1873223Q687144p670068j1528104o888115m320030k702035k090243
19161G196317j489818j085554o71799n95371n30004m48954m42924l93309k34920
19152A303664p9899J9930j01074j7863K17947K42325j82947m22588k27103n7907
19142F94485j92507k76048j51822p2000k3479J82715M3218m3249L4096r9117j57060
$$ y = [384581, 250131, 220061, 329797, 313656, 120989, -56621, -99860, -286367, -346666, -307412, -186118, -114622, -260257, -502986, -589786, -359588, -71778, 64670, 348994, 519722, 491260, 557374, 702717, 737879, 694561, 726696, 823678, 999388, 1349134, 1733782, 2153931, 2326883, 2518410, 2953685, 3817673, 5119862, 7051230, 9887963, 14460554, 21834545, 33707768, 42394912, 34724844, 23196740, 16308625, 11988595, 9286560, 7196317, 5706499, 4620945, 3949146, 3353775, 2823771, 2374817, 1931893, 1538584, 1303664, 1223765, 1243695, 1142621, 1124758, 1342705, 1585030, 1402083, 979495, 752392, 694485, 501978, 225930, 74108, 2108, -21371, 161344, 204562, 161313, 195409, 96292, -60768]
19131f0768j02503J97298J97091j06834k97814j92985R4692k665P128J5228R403
19120b42729Q5624J25313J03180k8230R1439J98869M4185m6852j51034j13218
19110F6547R2199J35873J130J0239J3308q712L0415l9279j13104r7425p7213J45838
19098A59816L322k25246m0560J40016J18221k0795J65508L4421j04361k01398
19088B8944k45038r0504K9931L16716N1026j63754n0357J58047K59791J59057
19078D53859m2013o3680j77503l6908J23569K02953q5942k36426k0965J41123
19068B58067q922j25461R052K09811J96897p1690j1156K5703m9679n0827j39290
19057B42505M7679J50145k6459j13969L1340J40685L2775p7504K9122O3754k7941
$$ y = [-60768, -163271, 34027, 231118, 124284, -173530, -366515, -271823, -274488, -267360, -252132, -242729, -157105, -31792, 71388, 43158, 134597, 333466, 377651, 330799, 179765, 66547, 158746, 294619, 295749, 305988, 319296, 310584, 340999, 301720, 188616, 91191, 13978, 159816, 163138, -62108, -102668, 37348, 155569, 134774, 300282, 334703, 230342, 28944, -216094, -306598, -276667, 40049, 91075, -72679, -123036, 35011, 294802, 453859, 411846, 348166, 170663, 133755, 257324, 460277, 374335, 137909, 116944, 258067, 249145, 123684, 132736, 342547, 539444, 467754, 456598, 482301, 432622, 381795, 242505, 290184, 440329, 413870, 299901, 331241, 471926, 504701, 427197, 456319, 520073, 492132]
19046D92132j40506j38480j4983M0132k57599j66111n6181r8100N6970L87262
19036A04536L61745K47656k9968j15211k23316k38841L196N0921r2108l2677j713
19025C4220p084R958j01164q30J47277K20721K32499j11939j22602P9513o5868
19014C14701P516N8226r0691j4176O084l2112M4008K8372j00745q0914j01692
19003C8577J2523J28235P6937p9547j62715n0451M140q0848R392K34472K31981
18992C62696J14150J5550P7044Q1823j09979j59656n6646n9997k28090k33324
18982a96429k00810j68006L4865J94912Q6289P7213N7261J54032Q9398k07003
18972g8278j10141M119q337n4006O9123J59300O2174j12163o5757K2337M5908
$$ y = [492132, 351626, 213146, 198163, 238295, -19304, -185415, -241596, -339696, -282726, 104536, 466281, 713937, 683969, 568758, 345442, 106601, 109797, 160718, 68610, 35933, 34220, 27136, 37094, -64070, -64900, 82377, 303098, 535597, 423658, 301056, 380569, 314701, 322217, 380443, 289752, 275576, 281660, 249548, 293556, 321928, 221183, 140269, 38577, 51100, 179335, 256272, 176725, 14010, -36441, -32301, -113149, -103757, 130715, 362696, 476846, 492396, 569440, 651263, 541284, 381628, 324982, 264985, 36895, -196429, -397239, -565245, -530380, -335468, -249179, -171966, -114705, 39327, 128725, -78278, -188419, -184300, -192637, -246643, -177520, -18220, 43954, -68209, -133966, -111629, -65721]
18961f5721j22321p7873K16997K91748J7030k45365j99333j43471j2385J23675
18951b17019J37536J21183J20628j02982j35175M9153K04206J17746k2139k07239
18941F5898k23785p0378m7149J47736J54404O8796k4413O695J58392J84859L71367
18930G92422L67904R8778k69616k75434k24655l09891l73245k66327m5515N7298
18920d48281K19109L34200n3545j73149K0579J11730J1917k80442l44966j75145
18910g77993J96533M03080O1060k41222j18440k7952j9348J20462K10119K30767
18900C7066L7827m0951j04479j30163q3875J72043L30183j8046j52951j4877J49590
18889A81367J63808O3375m4554N7363J14620J7772j45775r4064j18871k73881
$$ y = [-65721, -188042, -265915, -48918, 242830, 259860, 14495, -184838, -328309, -340694, -217019, -79483, 41700, 162328, 59346, -75829, -26676, 177530, 295276, 273137, 65898, -157887, -228265, -275414, -127678, 26726, 95522, 71109, 77804, 236196, 421055, 792422, 1160326, 1259104, 989488, 714054, 489399, 179508, -193737, -460064, -505579, -448281, -229172, 105028, 51483, -121666, -101087, 10643, 22560, -257882, -602848, -777993, -581460, -178380, -117320, -358542, -476982, -504934, -524282, -403820, -193701, 37066, 74893, 33942, -70537, -200700, -284575, -112532, 217651, 199605, 46654, 31777, 181367, 345175, 408550, 363996, 421359, 535979, 553751, 407976, 313912, 195041, -78840]
18879g8840n5191j4619L7047r4373r0420J84139J14806J126r1677j2580J0254
18868i0328L5718j49488j58751J12826J5840j40664k8J87664J04729J5675o8148
18857a34955q7843l5519j27918k23340j77144o2220J9360J02651K49533J58956
18847c18439J55881K29947P2704N4237j10433q9635J25396J89839K892P6319q4539
18836C04169j58215j19337O6309O5388j90852r9079J34382P9482O5528N3163r2333
18825A08605q8709j4663k7589r1688j08101P2299R4789L24126K94604J2679k02199
18814C74153j66447R1584J38868j2122j55267q8037J32229r0827j84428J97563
18804B37269J19886n7309j37419j77956r3514q8201q7341j04119M971Q7610K05643
$$ y = [-78840, -134031, -148650, -111603, -205976, -296396, -112257, 2549, 3675, -88002, -100582, -90328, -54610, -204098, -362849, -250023, -234183, -374847, -374875, -187211, -82482, -66807, -134955, -222798, -258317, -386235, -609575, -786719, -848939, -829579, -726928, -477395, -318439, -162558, 67389, 140093, 194330, 83897, -5738, 119658, 309497, 312389, 388708, 304169, 145954, 26617, 92926, 158314, -32538, -131617, 2765, 82247, 147775, 200938, 108605, 19896, 5233, -22356, -114044, -222145, -149846, -55057, 269069, 563673, 576352, 374153, 207706, 299290, 438158, 426036, 270769, 182732, 314961, 224134, 39706, 237269, 357155, 299846, 162427, -15529, -109043, -197244, -284585, -388704, -383733, -296123, -90480]
18793i0480K32314J9742l1988k00621j09023r053l9769P1328P6571j87659j23199
18782c91837J40846L8384r8037j87041j47325o8431K11551M99579K41381j96759
18772D2311j80950J30100J7406k15728k15390N67O0089J00539J54812k5124K4022
18761a07346O9379l5378m6159m6180P207O9953J39662J38558K9179J96738K10267
18750F25880N1010j04902k57604k61520r2129j03566j34278j51822j36473J50178
18740d15226K54167J09072J12155J33794j57442o0595K48739J31627M6908j32575
18730B70624k59292j52849K5655l370K13178K64725K2757j71807k23404n9052
18720g2835l3716Q3753Q3977o0281j77669P6358K72101l7794j07984p4286M3308
$$ y = [-90480, 141834, 161576, 129588, -71033, -180056, -189109, -228878, -157550, -80979, -268638, -391837, -250991, -212607, -310644, -497685, -645010, -713441, -501890, -2311, 239070, 42311, -138639, -8539, 8867, -206861, -422251, -421684, -361595, -261056, -106244, -131368, -107346, -37967, -73345, -119504, -165684, -158477, -88524, 51138, 189696, 218875, 415613, 625880, 676890, 571988, 314384, 52864, -39265, -142831, -277109, -428931, -565404, -415226, -161059, -51987, 60168, 193962, 36520, -24075, 224664, 356291, 403199, 270624, 11332, -141517, -115862, -119232, 93946, 358671, 381428, 209621, -13783, -72835, -106551, -22798, 61179, 898, -176771, -100413, 171688, 133894, 25910, -48376, -5068]
18709e068R4423N9515j2425L5969r4480k54403j89879J25051K18130J94350l1520
18698A39663o6J94470k3961R8421R5226j29557Q813O6965M8615r5015j44028k2434
18686B37112j2695p1866K0340j11126j87874N7119J0331J18309Q1828j00742j56587
18675a15851j55661K16117K75360J43929m1703k54824k15568p725n6499j23192
18665c35617P7642J61475R2485r244J24562J75358M8171m0365J05095K149k96248
18654A05463l19169o8837O7343J01347N4934Q7712P1628j8838j04717J59224K21919
18643C58009L8873O9644j36864k39209k11999M8823K20381K14079J42007q4586
18633D19158k00252k12893j45319R7956J66691K21230Q2156r0930j44917j14274
$$ y = [-5068, 89355, 148870, 136445, 172414, 77934, -176469, -366348, -241297, -23167, 171183, 139663, 139597, 334067, 310106, 408527, 503753, 374196, 383009, 449974, 498589, 403574, 259546, 237112, 224417, 152551, 172891, 61765, -126109, -68990, -58659, 59650, 141478, 40736, -115851, -271512, -55395, 219965, 363894, 322191, 67367, -148201, -155926, -212425, -335617, -257975, -96500, -4015, -13259, 111303, 286661, 334832, 294467, 399562, 401711, 105463, -213706, -282543, -215200, -113853, -58919, 28793, 100421, 81583, -23134, 136090, 358009, 396882, 466526, 329662, 90453, -121546, -72723, 147658, 361737, 503744, 419158, 218906, 6013, -139306, -41350, 125341, 346571, 428727, 337797, 192880, 78606]
18623G8606L7896n9875m766L8418P2309n3352j70726n2433j17815n0025J13033
18612a68730j05213j74145l9146N2133J99863L79232L52390J79257O1830j16830
18602F20641k35832l713m1326j72129k34373j28467J72492K84387Q1772k62077
18592H1375p7554K54865O6832j21490r9355N2183M4804P4585k5153J13993J42382
18581E07467N2989m1981k32809j39964J43952K36874n198k86810L1921L17422
18571E83863O3280k04338j04868j39550k7610o1487j32642Q3757J02321L4220
18561A96946N0910O6654K0329l7674j51887k64993q5916J33855l1453J155j19227
18550b21301m6838Q9292O0279R9072Q8951J04520J47312J16345r3628k44059j40899
$$ y = [78606, 116502, 56627, 51861, 90279, 162588, 109236, -61490, -113923, -231738, -281763, -168730, -273943, -448088, -487234, -435101, -235238, 143994, 496384, 675641, 737471, 620641, 384809, 381096, 339770, 167641, -66732, -195199, -22707, 261680, 343452, 81375, 3821, 258686, 325518, 204028, 104673, 156856, 201660, 276245, 251092, 365085, 507467, 560456, 518475, 285666, 145702, 289654, 526528, 521330, 234520, 266441, 583863, 647143, 442805, 337937, 198387, 170777, 109290, -23352, 60405, 162726, 196946, 247856, 314510, 334839, 297165, 145278, -119715, -205631, -71776, -103229, -102074, -221301, -268139, -178847, -118568, -19496, 69455, 173975, 321287, 437632, 344004, 99945, -40954]
18539d0954l3337j09761K1431J26857J05205K6058m136J12611J09728O5097l7416
18528C41383k02810l5862R5454J6291Q1928R9286j30147j73058L8676k6785k28798
18517a24442p0490J35672J64246j4247j4164J6844M0987m3140k28815q5275J39620
18506h3204J27846n2007j37272m681O4415j75813k00300K9626P9239K05616J18502
18495b8033o6031M2255J93905K13141J91094q887j71444j52635j54224n6115J12188
18484A15214J06174J079L5386r162l6176o38K56115J77316j82036l15958r5908
18473E1406N1438J0454R3576m1684p0386K747o5301l44956k89077M8566Q1720
18462d71497R0329J28685P2980o2051n7957N6960K7506n5766J9773j7888j8491
$$ y = [-40954, -74291, -184052, -162621, -35764, 69441, 95499, 91363, 203974, 313702, 378799, 341383, 138573, 102711, 198165, 214456, 296384, 395670, 265523, 92465, 131141, 104356, -124442, -194932, -59260, 104986, 90739, 76575, 93419, 134406, 91266, -137549, -222824, -83204, 44642, -7365, -144637, -149318, -84903, -260716, -461016, -431390, -352151, -146535, -28033, -94064, -51809, 142096, 355237, 546331, 537444, 366000, 213365, 59141, 3026, 115214, 221388, 222467, 257853, 248691, 212515, 211877, 467992, 645308, 463272, 147314, 51406, 102844, 113298, 206874, 165190, 94804, 97551, 32250, -312706, -601783, -553217, -471497, -381168, -252483, -179503, -241554, -299511, -242551, -215045, -270811, -251038, -268926, -287417]
18451b87417R3030N7755N3508R0494Q1517K39995K17420n1720n2740o5690j99477
18440A76675j40687j6693O1257p9797n2022K91888Q6223l2147o7598l10259j43910
18429b27070J73847R6898m7697J10057K85225J61734k38017l30334l62905k41904
18419f20166k8764J53576N4005k0261m1544N4589K44928K73239J17980k110Q449
18408A93921k2737p4884j41936k25417n6308M3856o3773q6884R8352J92186J39466
18397d158J51934J44122o1484J1421q1840j88314K2877J88838K42951Q4194M4413
18386E54954m7899r0302q0583r5187O9714j78160k66109q4652M4798J77868J26402
18375A30844L1366j00331o0629K7497q37P1059J7783p353J77675K64981J53679
$$ y = [-287417, -194387, -136632, -83124, 7370, 88887, 328882, 546302, 494582, 441842, 376152, 176675, 35988, 19295, 80552, 755, -51267, 240621, 326844, 294697, 227099, -83160, -227070, -53223, 43675, -4022, 106035, 391260, 552994, 314977, -15357, -378262, -620166, -648930, -495354, -441349, -461610, -503154, -448565, -203637, 69602, 187582, 185472, 193921, 171184, 96300, -45636, -271053, -327361, -283505, -347278, -434162, -335810, -143624, -4158, 147776, 291898, 230414, 241835, 159995, -28319, -5442, 183396, 426347, 510541, 554954, 507055, 416753, 336170, 240983, 310697, 132537, -133572, -218224, -173426, 4442, 130844, 162210, 61879, 1250, 28747, 27910, 98969, 116752, 109399, 287074, 552055, 705734]
18364G05734r5646n1914M7880J20173m7746j71110K1188J64545Q389k97406k56799
18353A47288P178r7081k33247O894J18133L56857M35835J03283o5043p7317l6121
18342F66659j15307k44748j60629J5036J49981K60657J48221L5581J8447j32617
18332F41281j66205j35707p0077N5786O1434j20329k47669j20051l9801m640N5785
18321i0193J40856J69921O7318j41667j03144J4143J0325k3255k8713j34557p2903
18310a91869P2690J14588J09784K71847k4197j77390J24154R1184O7964Q7162
18300E45917J7482k08996q2513J30824K77759J77816L0766M6196N571M3186q3331
18289I00677J29228Q9575o2466j5531l9455L8165O2760K8910K47674K53424L93082
$$ y = [705734, 610088, 558174, 606054, 726227, 678481, 507371, 528559, 693104, 701493, 404087, 147288, 154466, 57385, -175862, -168968, -50835, 306022, 741857, 845140, 780097, 702780, 666659, 551352, 306604, 145975, 161011, 310992, 571649, 719870, 755451, 773898, 641281, 475076, 339369, 269292, 325078, 386512, 266183, 18514, -101537, -141338, -145978, -90193, 50663, 220584, 287902, 146235, 43091, 57234, 67559, 44304, 15591, -118966, -191869, -119179, -4591, 105193, 377040, 352843, 175453, 299607, 390791, 458755, 545917, 563399, 354403, 271890, 402714, 680473, 858289, 889055, 935251, 940822, 984008, 900677, 1029905, 1119480, 1057014, 1041483, 1002028, 1040193, 1102953, 1131863, 1379537, 1632961, 2026043]
18278B026043O53471O29961L89387K86998M14824P30074J002728J413694J692186
18269I239366K415179L631744N196644P130047J0267311J5297497K2031414K7751699
18261A02960901K0859630n380214k5094870k4731185j8311846j2590716q507291
18254B9204409n804050m385460l302120k429372j765155j666197j492326j158858
18246G200871p32223m86001n41371p08715o65422n35544k26546l77105k55591
18237B672353j74278q9367j51599k70455j85223j73085k86485j94224M4900J63549
18227A356086O0711J6694j97709k46970j41851r5789p6500o7335L6170m9962J8765
18216F12310M09753K22356j08181k48030k62579r2287n612j92047k76277j45729
$$ y = [2026043, 2679514, 3309475, 3698862, 3985860, 4400684, 5130758, 6133486, 7547180, 9239366, 11654545, 15286289, 20482933, 27612980, 37880291, 53177788, 75209202, 102960901, 123820531, 118440317, 93345447, 68614262, 50302416, 37711700, 29204409, 23400359, 19014899, 15712779, 13283407, 11518252, 9852055, 8359729, 7200871, 6468648, 5982647, 5441276, 4732561, 4067139, 3531595, 3305049, 2927944, 2672353, 2498075, 2408708, 2257109, 1986654, 1801431, 1628346, 1341861, 1147637, 1192537, 1356086, 1416797, 1433491, 1235782, 988812, 846961, 751172, 674672, 607337, 643507, 593545, 612310, 1022063, 1244419, 1136238, 888208, 625629, 533342, 527730, 335683, 59406, -86323]
18206h6323J00194K32097J12042m8990k7804L1344n8717j22805n5088l8860M2748
18195G9838k5604j04280L8778Q2859O5100J36487O5655j54274j9599J12618M6649
18184C24227M4560l74r6372q8038j4978K53541J65623Q7772j23408j08027J27313
18173E71839l371r3963J0083J91564J85717J8653j08430O1262J16996j8922j62007
18162G69421k14087j17252P2475m8341k15921r6238J12358J06511M0782j910k3411
18151C84387j25545r6007j08828k4459j8954J84629K44148L4116k82700k42698
18141e1911r7846j02544J47756J29788J87288J44223J9484J40M678j38769j49685
18130I2602K8735J22176Q3633q3118j13911K8804l7685n8551n3763K34916K90319
$$ y = [-86323, 13871, 245968, 358010, 309020, 281216, 312560, 253843, 131038, 75950, 37090, 79838, 54234, -50046, -11268, 71591, 136691, 273178, 338833, 184559, 164960, 277578, 324227, 368787, 368413, 272041, 184003, 169025, 422566, 588189, 675961, 552553, 444526, 571839, 568468, 474505, 484588, 676152, 861869, 880522, 772092, 833354, 950350, 931428, 769421, 555334, 438082, 510557, 462216, 246295, 150057, 262415, 368926, 409708, 407798, 384387, 258842, 162835, 54007, 29548, 10594, 195223, 439371, 473487, 190787, -51911, -149757, -252301, -104545, 25243, 212531, 356754, 376238, 376378, 381056, 242287, 92602, 121337, 243513, 327146, 244028, 130117, 158921, 121236, 62685, 8922, 243838, 534157]
18119E34157K3519k29040k38196k1650R5179j6343j1108n6500k12890n4746M7571
18108a40047N778j02876k22329j65388r404P0627J77967J42477K3718o4726k0279
18097c04482J2259J45562L6159j9674K9185j3998m0685j47862j59483q0883O86
18086e43216J87462K50141J06096J15172J00764p7217j56930l4106Q8547N6363
18076I3076q8741l7970J72052j0560k65477j7374k8016m0227M9883P1586J77121
18065G5353K54858J20986N1149j5273j26059q5595j23004j02793j37077K867J08396
18054B3808O6595j4811j17095J4049N2335q644J2428P2251R5946L9037J67461
18043D03360J17001k41272k25553j32529l1341J05386m2503j63789J6340L45917
$$ y = [534157, 557676, 328636, 90440, 68790, 163969, 147626, 136518, 80018, -132872, -187618, -140047, -134269, -237145, -459474, -624862, -634266, -563639, -385672, -243195, -219477, -284203, -304482, -292223, -146661, -110502, -130176, -100991, -114989, -155674, -303536, -463019, -543902, -543216, -355754, -105613, 483, 115655, 216419, 139202, -17728, -51834, 36713, 93076, 4335, -33635, 138417, 127857, -137620, -154994, -183010, -223237, -173354, -101768, 75353, 330211, 451197, 502346, 487073, 361014, 275419, 152415, 49622, -87455, -84588, 23808, 90403, 75592, -41503, -27454, 24881, 16237, 28665, 100916, 196862, 235899, 403360, 520361, 279089, 53536, -78993, -110334, -4948, -47451, -211240, -194900, 151017]
18033A51017K48243k06553l36395p5760N3465j1417N4331K66272K77411J42744
18023E63358n6692j05173m6174p6710r1282j78381k02708j73336m8620R6412J78568
18012a40738J18673m9392q8289j1741K91342K98874J99762l8917k22142p4064
18002B83368J20612K32909K01790L33620R7432l00996k35344L8821k9354j23639
17992F19219j22627j09833m1828M3115j63526j20194R6707P2519j23701j77890
17982b8039r9946n0834r8448j77057J72006K73833K0386j7414M4019o402J00766
17971A32870J42210O2153O7796p5889k99611r574K42624R960j69292l49172k40643
17960d86568O9018Q5303N9010J20469K16600K68963J21904Q170K4934j1264k59743
$$ y = [151017, 399260, 192707, -143688, -219448, -165983, -177400, -123069, 143203, 420614, 563358, 506666, 401493, 355319, 278609, 187327, 8946, -193762, -367098, -415718, -319306, -140738, -22065, -71457, -159746, -171487, 119855, 418729, 618491, 579574, 357432, 283368, 403980, 636889, 838679, 1172299, 1269731, 968735, 733391, 772212, 742858, 619219, 496592, 386759, 344931, 388046, 224520, 104326, 201033, 273552, 149851, -28039, -127985, -178819, -277267, -454324, -282318, -8485, 11901, -5513, 38506, 32104, 132870, 275080, 337233, 405029, 329140, 29529, 19955, 262579, 272539, 103247, -245925, -486568, -417550, -332247, -273237, -152768, 63832, 332795, 454699, 462869, 487803, 476539, 216796]
17949B16796j77495k12149L103K13969J04290r543J18243K44472J55172O1995
17939G18853j23657k98606k10262m0692q611J29308J61530P3607L5568j78463
17929B58575k19488n5148Q7205K3750o2527J03613R2748l8111O0111K0628K442
17918B73798j09130r2356j03074l2495O6537l5631M9065q6236J80742J89820n545
17907B95495k999J52670L885q2993P2600r5543O3069O9759n5755p304K06698O8343
17895F87925R9548R2468m3879r4679j95935k48907m1826K34277L23409L25502
17885A137903Q5380n1663k53624k22771j33693p9610j72931r8040j08137j31392
17875b8578J08543K72387K00964l183l5567j25147m3903M5518N2992m0156j29305
$$ y = [216796, 39301, -172848, -169745, 44224, 148514, 138971, 257214, 501686, 656858, 718853, 595196, 296590, 86328, 45636, 37025, 166333, 327863, 401470, 437038, 258575, 39087, -16061, 71144, 94894, 32367, 135980, 228728, 190617, 250728, 271356, 273798, 164668, 72312, -30762, -63257, 3280, -32351, 16714, -69522, 111220, 301040, 295495, 292496, 445166, 449051, 366058, 438658, 343115, 406184, 475943, 420188, 412884, 619582, 687925, 787473, 879941, 836062, 741383, 545448, 296541, 254715, 488992, 812401, 1137903, 1223283, 1171620, 917996, 695225, 561532, 481922, 308991, 210951, 102814, -28578, 79965, 352352, 553316, 550133, 514566, 389419, 345516, 391034, 444026, 403870, 274565]
17864B74565j42001j28868j32394p8938Q4191R0370K8808j76683o284J90797J71136
17853A74699J46277j72517k09964K61723J63075l913K5659n2705j11652l312J09670
17842C27040j02058k94913r3632J09059J95437J71963j8424N0788J25168J80171
17832F50599K05427J04036P5079J09662l8097j16165j54761j94922M5051K36738
17822I22647R2566l6036J8068N1117N0502J85937L37207L20019L72889M14777
17812B729693M37466N83886O55376Q34440J334181J738742K003965K461163L428034
17803A6206946M875404P142328J0642515J5807381K3108876K9089109J9799583
17796A26672142r136463k6945278k4355665j7382034j1760295q051074n568667
$$ y = [274565, 132564, 3696, -128698, -207636, -123445, -33075, -4267, -180950, -187234, 3563, 174699, 320976, 148459, -61505, 200218, 363293, 359380, 385039, 332334, 220682, 217370, 327040, 224982, -69931, -163563, -54504, 140933, 312896, 294472, 345260, 470428, 650599, 856026, 960062, 1035141, 1144803, 1106706, 990541, 835780, 640858, 685909, 922647, 1015213, 979177, 997245, 1048362, 1098864, 1284801, 1622008, 1942027, 2314916, 2729693, 3167159, 3751045, 4406421, 5240861, 6575042, 8313784, 10317749, 12778912, 16206946, 21082350, 28224678, 38867193, 54674574, 77783450, 106872559, 126672142, 117535679, 90590401, 66234736, 48852702, 37092407, 29041333, 23472666]
17789B3472666m057333k891894k294675j829254j713168j632678j396653j080933
17781F576078j015811q37960m84899l61216k61532l50504l10282l45990k77454
17772B330430j92090j21245L6638l25000k90561M5153L5933q6265o9336j73986
17762A189671k0824j5707j84747p6742j283J19341k8300j85606j83172j40353
17752D72278M7643J91381J35241k4813K08831J31398J64200K974k87514l28680
17742G12939k21251J02422K07032j56336j60795l5603j00955p6787J70659K68711
17732G10036m9127m2049j6553j38272j29471n055k3949k43558j91074j438M9991
17721h0519n3726K2358M7959K57607L12886j0443k20489l7328O5842P8690O5972
$$ y = [23472666, 19415333, 16523439, 14228764, 12399510, 10686342, 9053664, 7657011, 6576078, 5560267, 4722307, 4237408, 3876192, 3614660, 3264156, 2953874, 2607884, 2330430, 2138340, 2017095, 2053733, 1728733, 1438172, 1483325, 1519258, 1432993, 1363657, 1189671, 1168847, 1153140, 968393, 891651, 890368, 1009709, 981409, 795803, 612631, 472278, 519921, 711302, 846543, 821730, 1030561, 1161959, 1326159, 1329133, 1041619, 712939, 491688, 594110, 801142, 644806, 484011, 448408, 347453, 270666, 441325, 710036, 660909, 618860, 602307, 464035, 334564, 329509, 305560, 62002, -129072, -130510, -80519, -134245, -111887, -63928, 193679, 506565, 496122, 275633, 238305, 304147, 382837, 448809]
17710D48809m7211j28779L191k8239j4878L7943Q9802J1842M1256K30905L06137
17699I50778l0979j35491j12734k04290p9666j44160q1117L0665N4715j29466
17689A18255q2312L3245J60589J50873L1823q8750j06403J12741J65549M0696
17679E36306j43715l7938L3475Q5573K9824p2919r8239m5938j10880k2532M1997
17668A95014K3326O835J13818J89201Q380q7772q0726r5901n2410P242J8373J70935
17656D16315K49579j237k45833k03618J25470J86268J75140J44590r0818j2858
17646G42998J39603q0298j93074j38385j34867r4899j191O8768m5008j38224r699
17635A15724m6647j45142m1240J30114K00609J56118J00533K6258j14572j41162
$$ y = [448809, 401598, 272819, 276010, 247771, 232893, 270836, 360638, 372480, 413736, 644641, 950778, 919799, 784308, 671574, 467284, 387618, 243458, 162341, 193006, 247721, 118255, 35943, 69188, 229777, 380650, 412473, 323723, 217320, 330061, 495610, 536306, 392591, 354653, 388128, 473701, 503525, 430606, 332367, 286429, 175549, 153017, 195014, 218340, 225175, 338993, 528194, 536574, 448802, 368076, 272175, 219765, 227007, 245380, 416315, 665894, 664657, 418824, 215206, 340676, 526944, 702084, 846674, 755856, 742998, 882601, 802303, 609229, 470844, 335977, 241078, 239887, 308655, 263647, 125423, 115724, 69077, -76065, -117305, 12809, 213418, 369536, 470069, 496327, 381755, 240593]
17625B40593m2997J21074p4461j02860M5244p5436j51561k4572Q9538J39802L3322
17614A97686j07951j81403m9900K27410J88725p0517j94744j07632n4698j205
17604a54229J1336N7578K71916K56934K1905j46778k16026o817J0087L0379l441
17593A32844k45036k92941j06963J46163K37506L6184k10933j03532J48617L21806
17583F3715J25471k64181k60195L0988P7321l9944o466m7824K0192m0900j17455
17572d59278o0158J75981J76970P6434N900J2104L09514K87128q5880l29291p1209
17561C8215J88561J31613q3074j93150O1411l3731k44058l8757P2417n5615j6982
17550a73150o4240k0492J72877K00579R7639J59027J33196q6756l39140m08790
$$ y = [240593, 197596, 318670, 244209, 141349, 186593, 111157, -40404, -64976, 24562, 164364, 197686, 89735, -91668, -141568, 85842, 274567, 204050, 9306, -98326, -153024, -154229, -142893, -85315, 186601, 443535, 465440, 318662, 102636, 95819, 105906, 136285, 132844, -112192, -405133, -512096, -365933, -128427, -92243, -303176, -406708, -258091, 63715, 189186, -74995, -335190, -304202, -226881, -266825, -273291, -321115, -300923, -341823, -459278, -519436, -343455, -166485, -90051, -84151, -72047, 237467, 524595, 438715, 109424, 38215, 226776, 358389, 275315, 82165, 143576, 109845, -134213, -172970, -100553, -156168, -173150, -237390, -257882, -85005, 115574, 213213, 372240, 505436, 418680, 79540, -329250]
17540c29250k23894O6486J09952O289j12651k9820N7920K87487R2465j86896j47674
17529d09586O9508J66448J53659J10808J8688Q4245O4913j4239J05197N7275p2592
17518C34324l1348K2600l425r2636K9945r4796j53020o2965L2771j08000j18928
17507b45478J84462J29202N5270m8294q7725N1103p0104o6069J75983K29482K72331
17496E80163K21106q1297o3336k89874k58413l6996Q4427J81833j5554j4132J5664
17485C23591O3103N0300R1026L700p7737k12014m4301j08050j70834J28692J89711
17474B37187m984j10105k40064o8651J31497J19927O7340j0580o4562n3930J97185
17463B00260K41767J2683j5975k94030l86696k37879K6294J92679N1312O3983
$$ y = [-329250, -553144, -486658, -376706, -370417, -483068, -512888, -454968, -167481, -75016, -261912, -409586, -340078, -173630, -19971, 90837, 109525, 193770, 258683, 244444, 349641, 406916, 334324, 302976, 325576, 322151, 229515, 259460, 164664, 11644, -51321, -18550, -126550, -245478, -61016, 68186, 123456, 75162, -12563, 38540, -31564, -97633, 78350, 307832, 580163, 801269, 719972, 656636, 366762, 108349, 71353, 155780, 337613, 322059, 307927, 323591, 386694, 436994, 528020, 531720, 453983, 241969, 197668, 89618, -81216, 47476, 237187, 232203, 122098, -117966, -186617, -55120, 64807, 132147, 121567, 57005, 3075, 200260, 442027, 454710, 438735, 144705, -241991, -479870, -453576, -260897, -209585, -145602]
17453a45602N7043m7285N3082N2297K32225L19942K30502p7707j01998j79251
17443C93248k55946k2715J51876J2450j82029q9509P4661K8513j13418q7938m7091
17432a37898O0763J74527J23061M2158K1410o2222o2937m2945p512J41756O3060
17421C13221k5863k27780j39831J16276J80109O2412o8543j29717m3891n324J00966
17410A32035L14835R3399Q5115K89308J10214Q3994j39490k95298k59223j06448
17400C08441m9856L0375L0826J10785k1558p7938J26843M47887N74902O61871
17390B142578P17634J008171J585874K340140L195124M858823P926128J2282911
17382C6057383Q151381q170436j1985073p213977m373557k807806k213522j594110
$$ y = [-145602, -88559, -135844, -82762, -30465, 201760, 521702, 752204, 674497, 572499, 393248, 137302, 114587, 266463, 278913, 96884, 7375, 82036, 110549, -2869, -90807, -137898, -77135, 97392, 220453, 262611, 284021, 221799, 158862, 115917, 108405, 250161, 313221, 287358, 59578, -80253, 36023, 216132, 278544, 210001, 80284, 36393, 31069, 132035, 446870, 540269, 625384, 914692, 1024906, 1108900, 969410, 674112, 414889, 308441, 258585, 288960, 319786, 430571, 409013, 331075, 457918, 905805, 1480707, 2142578, 2860212, 3868383, 5454257, 7794397, 10989521, 15848344, 23774472, 36057383, 44208764, 36038328, 24053255, 16839278, 12465721, 9657915, 7444393, 5850283]
17374E850283j182104r53728p76700o64068l48276J0732J7270j50619k80462o9036
17364A453292l4822k9059r3055m4922j14118k11154j35846K0366j29692k54711
17354D26279j42119P4019m753n1264k28144j17318M6418J00984J15048J08671
17344C27821j67531j59451J06506Q8761j00174j191L7081R8010M8895j74020j54705
17333d9998J22869Q2293j01355l8707J00848J53238L06649j7941j92115j75638
17323A90143k81787k4106P8882K0646o6722k39012k71239k8049K43904L56050
17313b1290K36578j4104J2330R2278J9843M0773J7947k25075k26021j04041L7165
17302a33617Q5700J24429J58776O8761l4244j90388j50575j5774L8109R3485K73341
$$ y = [5850283, 4668179, 3714451, 2937751, 2273683, 1925407, 1936139, 1953409, 1802790, 1522328, 1453292, 1418470, 1389411, 1296356, 1251434, 1137316, 926162, 790316, 810682, 680990, 426279, 284160, 358179, 353426, 302162, 74018, -43300, 3118, 104102, 219150, 327821, 160290, 839, 107345, 196106, 95932, 94741, 131822, 229832, 278727, 104707, -49998, 72871, 155164, 53809, 15102, 115950, 269188, 575837, 557896, 365781, 190143, -91644, -115750, -36868, -16222, -82944, -321956, -593195, -621244, -377340, -21290, 215288, 201184, 213514, 305792, 325635, 366408, 384355, 159280, -66741, -170782, -133617, -47917, 76512, 235288, 304049, 269805, 79417, -71158, -86932, -48823, 44662, 318003]
17291C18003K24774m0795j19951j20086n8997j4134J57303J62366o807j64079
17281C37597p8662N0143j38702j00905k7264j40882q5612n6210K1965R5153k3261
17270a46640l12511k39106M5501K52923Q3445o035J85472J8843J4099L62596K29085
17259D87672k32191l61612j41278M8072K08308J00300M1224O2082l0143L5501
17249B17935l5365o2897j9552r4123r7595j64991j23326p5560l1154O3228K30152
17238a93248K67954p0017j53976L2982J91950N3058r4846j06653j95534l3121
17228c01451M8186P3700J04981o5851j81082j25868J19797K77643l6928o5975
17218a52848p9070r5665o6627J21924l7523j47971k7005K00486K03619j79290
$$ y = [318003, 542777, 501982, 382031, 261945, 202948, 188814, 346117, 508483, 501676, 337597, 258935, 309078, 170376, 69471, 42207, -98675, -184287, -240497, -218532, -123379, -146640, -459151, -698257, -652756, -399833, -316388, -322423, -136951, -118108, -104009, 258587, 487672, 255481, -106131, -247409, -199337, 8971, 109271, 150495, 212577, 182434, 217935, 182570, 119673, 100121, 5998, -91597, -256588, -379914, -455474, -486628, -423400, -193248, 74706, 4689, -149287, -116305, 75645, 128703, 33857, -72796, -268330, -301451, -253265, -179565, -74584, -140435, -321517, -447385, -327588, -49945, -86873, -152848, -231918, -327583, -394210, -272286, -309809, -457780, -484785, -284299, -80680, -259970]
17208b59970j70319Q5028J07200J39279K39510J45135J5155q4321m7449J69454
17198C38702K01123p2990k54257j37833j7029j54965j92221p5919J32934J04586
17188a27869n648j31090l1901n6590N3673R9561o338J8718J41759n7291j65731
17177b68747q727J45269J83617P9367l1994k22563q5811J52701Q7208J84441k8490
17166A86271k16316j04577n6129j12753r8902j59090m2819J58782K30977J56953
17156e7603k6327k4052J8097k4733j0304N3390J73894J10687j07742N9922J37937
17145C03166j45153j39264Q1101Q1130Q7479R8559o6005k45247k28702j13151
17135b86087O1833M7698m73J65345K36741J12408j46986j76193j35847R654M7961
$$ y = [-259970, -430289, -345261, -238061, -98782, 140728, 285863, 301018, 216697, 169248, 338702, 539825, 466835, 212578, 74745, 57716, -97249, -289470, -365389, -232455, -127869, -133517, -264607, -296508, -353098, -299425, -199864, -206202, -187484, -45725, -103016, -268747, -277474, -132205, 51412, 130779, 98785, -123778, -209589, -56888, 30320, 214761, 186271, -30045, -134622, -190751, -303504, -402406, -561496, -604315, -445533, -214556, -57603, -83930, -107982, -89885, -114618, -124922, -71532, 102362, 213049, 105307, 165229, 303166, 158013, 18749, 99850, 180980, 268459, 367018, 301013, 55766, -172936, -286087, -224254, -176556, -177029, -11684, 225057, 337465, 190479, 14286, -121561, -111907, -63946]
17124f3946j07694j4351J77633J72132j2442l9202j54346j68720k5051P7161r350
17113a68176p3039J74945P8131o780P669M5319p9559M9779R4950j33392j30723
17102a40876q0414j60451j52272O1377M76J08811K27820m8325j26436J94948L21721
17091B06379P3616r3271j21984k65121l30685j29885j4036L9330J50864L01504
17081a83289K40923K6032N3399J1311P19M3313k1868q703o3337o8326l4446J48692
17069A44420p9307n1365K01579J99447n7441k99846j45962K8472J21591K7604
$$ y = [-63946, -171640, -185991, -8358, 163774, 151332, 112130, -42216, -210936, -235987, -158826, -168176, -241215, -66270, 11861, 5081, 12750, 58069, -21490, 28289, 123239, -10153, -140876, -221290, -381741, -534013, -472636, -472160, -363349, -135529, -183854, -310290, -115342, 206379, 279995, 186724, 64740, -200381, -531066, -660951, -674987, -635657, -484793, -183289, 57634, 83666, 137065, 148376, 149095, 192408, 170540, 161837, 98500, 30174, -4272, 144420, 65113, 13748, 215327, 414774, 357333, 57487, -88475, -60003, 61588, 89192]
$$ [...]
##END NTUPLES=NMR SPECTRUM
##END=
