##TITLE=C13_SA_38.140'
 CDCl3, 22300 sc

 22.10.2019
##JCAMPDX= 6.0         $$ Bruker NMR JCAMP-DX V2.0
##DATA TYPE= NMR SPECTRUM
##DATA CLASS= NTUPLES
##ORIGIN= UXNMR, Bruker Analytische Messtechnik GmbH
##OWNER= root
$$ XWIN-NMR		Version 3.5
$$ Wed Oct 23 13:45:14 2019 Russian Standard Time (UT+4h)  she@DPX200
##.OBSERVE FREQUENCY= 50.327896
##.OBSERVE NUCLEUS= ^13C
##.ACQUISITION MODE= SIMULTANEOUS
##.ACQUISITION SCHEME= undefined
##.AVERAGES= 22300
##.DIGITISER RES= 17
##SPECTROMETER/DATA SYSTEM= spect
##.PULSE SEQUENCE= zgpg30
##.SOLVENT NAME= DMSO
##.SHIFT REFERENCE= (INTERNAL, DMSO, 0, 222.624)
##AUDIT TRAIL= $$ (NUMBER, WHEN, WHO, WHERE, WHAT)
$$ ##TITLE= Audit trail, XWIN-NMR		Version 3.5
$$ ##JCAMPDX= 5.01
$$ ##ORIGIN= Bruker BioSpin GmbH
$$ ##OWNER= she
$$ F:/spectra/data/she/nmr/c13/1/pdata/1/auditp.txt
$$ ##AUDIT TRAIL=  $$ (NUMBER, WHEN, WHO, WHERE, WHAT)
(   1,<2019-10-23 13:44:12.62 +0400>,<she>,<DPX200>,
      <created by zg, POWCHK disabled, PULCHK disabled
       terminated by command 'halt'
       configuration hash MD5:
       00 E9 B6 7A A2 85 ED C7 34 08 36 98 17 FE 4E 26
       data hash MD5: 32K
       A4 2F 55 B4 D6 B3 15 60 89 0D D5 7E E3 2B 94 3C>)
(   2,<2019-10-23 13:44:14.40 +0400>,<she>,<DPX200>,
      <Start of raw data processing
       efp BC_mod = 2 LB = 1 FT_mod = 6 PKNL = 1 PHC0 = -385.382 PHC1 = 37.40636 SI = 32K 
       data hash MD5: 32K
       C5 B4 25 06 08 C3 76 F1 D4 BC 76 D6 46 1B 58 40>)
(   3,<2019-10-23 13:44:32.06 +0400>,<she>,<DPX200>,
      <pk PHC0 = 3.878272 PHC1 = -5.2 
       data hash MD5: 32K
       12 A2 C4 22 02 51 26 C0 C6 49 E7 78 3B 09 70 51>)
(   4,<2019-10-23 13:44:35.59 +0400>,<she>,<DPX200>,
      <abs ABSG = 5 
       data hash MD5: 32K
       72 39 5B A2 97 7C FE 05 71 BF 8D E4 FA 5D DA 27>)
$$ ##END=
$$ 
$$ hash MD5
$$ AE F8 56 F8 D7 95 89 50 77 74 05 FF AD 4D 18 27
##$RELAX= 
##$RELAX= 
##$RELAX= 
##$RELAX= 
##$RELAX= 
##$RELAX= 
##$RELAX= 
##$RELAX= 
$$ Bruker specific parameters
$$ --------------------------
##$DU= <F:/spectra>
##$EXPNO= 1
##$NAME= <c13>
##$PROCNO= 1
##$TYPE= <nmr>
##$USER= <she>
##$AMP= (0..31)
100 100 100 100 100 100 100 100 100 100 100 100 100 100 100 100 100 100 
100 100 100 100 100 100 100 100 100 100 100 100 100 100 
##$AQSEQ= 0
##$AQ_mod= 1
##$AUNM= <au_zg>
##$AUTOPOS= <>
##$BF1= 50.322709
##$BF2= 200.13
##$BF3= 50.322709
##$BF4= 500.13
##$BF5= 500.13
##$BF6= 500.13
##$BF7= 500.13
##$BF8= 500.13
##$BYTORDA= 1
##$CFDGTYP= 0
##$CFRGTYP= 5
##$CHEMSTR= <none>
##$CNST= (0..31)
1 1 145 1 1 1 1 1 1 1 1 1 1 1 1 1 1 1 1 1 1 1 1 1 1 1 1 1 1 1 1 1 
##$CPDPRG= <waltz16>
##$CPDPRG1= <>
##$CPDPRG2= <waltz16>
##$CPDPRG3= <>
##$CPDPRG4= <mlev>
##$CPDPRG5= <mlev>
##$CPDPRG6= <mlev>
##$CPDPRG7= <mlev>
##$CPDPRG8= <mlev>
##$CPDPRGB= <>
##$CPDPRGT= <>
##$D= (0..31)
0 2 0.00345 0 0 0 0 0 0 0 0 0.03 2e-05 3e-06 0 0 0 0 0 0 0 0 0 0 0 0 0 
0 0 0 0 0 
##$DATE= 1571747706
##$DBL= (0..7)
120 120 120 120 120 120 120 120 
##$DBP= (0..7)
150 150 150 150 150 150 150 150 
$$ [...]
##$SUBNAM4= <"">
##$SUBNAM5= <"">
##$SUBNAM6= <"">
##$SUBNAM7= <"">
##$SUBNAM8= <"">
##$SUBNAM9= <"">
##$SW= 239.972175391363
##$SWIBOX= (0..15)
0 1 3 0 0 0 0 0 0 0 0 0 0 0 0 0 
##$SW_h= 12077.2946859903
##$TD= 32768
##$TD0= 1
##$TE= 0
##$TE2= 300
##$TE3= 300
##$TEG= 300
##$TL= (0..7)
120 120 120 120 120 120 120 120 
##$TP= (0..7)
150 150 150 150 150 150 150 150 
##$TP07= 0
##$TPNAME0= <>
##$TPNAME1= <>
##$TPNAME2= <>
##$TPNAME3= <>
##$TPNAME4= <>
##$TPNAME5= <>
##$TPNAME6= <>
##$TPNAME7= <>
##$TPOAL= (0..7)
0.5 0.5 0.5 0.5 0.5 0.5 0.5 0.5 
##$TPOFFS= (0..7)
0 0 0 0 0 0 0 0 
##$TUNHIN= 0
##$TUNHOUT= 0
##$TUNXOUT= 0
##$USERA1= <user>
##$USERA2= <user>
##$USERA3= <user>
##$USERA4= <user>
##$USERA5= <user>
##$V9= 5
##$VALIST= <valist>
##$VCLIST= <CCCCCCCCCCCCCCC>
##$VD= 0
##$VDLIST= <DDDDDDDDDDDDDDD>
##$VPLIST= <PPPPPPPPPPPPPPP>
##$VTLIST= <TTTTTTTTTTTTTTT>
##$WBST= 1024
##$WBSW= 4
##$XGAIN= (0..3)
0 0 0 0 
##$XL= 0
##$YL= 0
##$YMAX_a= 164051759
##$YMIN_a= -46558615
##$ZGOPTNS= <>
##$ZL1= 120
##$ZL2= 120
##$ZL3= 120
##$ZL4= 120
##$ABSF1= 222.624
##$ABSF2= -17.3728
##$ABSG= 5
##$ABSL= 3
##$ALPHA= 0
##$AQORDER= 0
##$ASSFAC= 0
##$ASSFACI= 0
##$ASSFACX= 0
##$ASSWID= 0
##$AUNMP= <proc_1d>
##$AZFE= 0.1
##$AZFW= 0.5
##$BCFW= 0
##$BC_mod= 2
##$BYTORDP= 0
##$COROFFS= 0
##$CY= -3
##$DATMOD= 1
##$DC= 0
##$DFILT= <>
##$DTYPP= 0
##$F1P= 0
##$F2P= 0
##$FCOR= 0.5
##$FTSIZE= 32768
##$FT_mod= 6
##$GAMMA= 0
##$GB= 0
##$INTBC= 1
##$INTSCL= 4.134877e-10
##$ISEN= 128
##$LB= 1
##$LEV0= 0
##$LPBIN= 0
##$MAXI= 10000
##$MC2= 0
##$MEAN= 0
##$ME_mod= 0
##$MI= 0.1934396
##$NCOEF= 0
##$NC_proc= 3
##$NLEV= 6
##$NOISF1= 120.0001
##$NOISF2= 80.00006
##$NSP= 0
##$NTH_PI= 0
##$NZP= 0
##$OFFSET= 222.624
##$PC= 1.4
##$PHC0= -381.5037
##$PHC1= 32.20636
##$PH_mod= 1
##$PKNL= yes
##$PPARMOD= 0
##$PSCAL= 0
##$PSIGN= 0
##$REVERSE= no
##$SF= 50.3227315989248
##$SI= 32768
##$SIGF1= 140
##$SIGF2= 120
##$SINO= 11.81781
##$SIOLD= 32768
##$SREGLST= <13C.CDCl3>
##$SSB= 0
##$STSI= 32768
##$STSR= 0
##$SW_p= 12077.2946859903
##$SYMM= 0
##$S_DEV= 0
##$TDeff= 32768
##$TDoff= 0
##$TI= <>
##$TILT= no
##$TM1= 0
##$TM2= 0
##$TOPLEV= 0
##$USERP1= <user>
##$USERP2= <user>
##$USERP3= <user>
##$USERP4= <user>
##$USERP5= <user>
##$WDW= 1
##$XDIM= 32768
##$YMAX_p= 332154151
##$YMIN_p= -1340125
$$ End of Bruker specific parameters
$$ ---------------------------------
##NTUPLES= NMR SPECTRUM
##VAR_NAME=  FREQUENCY,     SPECTRUM/REAL,   SPECTRUM/IMAG
##SYMBOL=    X,             R,               I
##VAR_TYPE=  INDEPENDENT,   DEPENDENT,       DEPENDENT
##VAR_FORM=  AFFN,          ASDF,            ASDF
##VAR_DIM=   32768,         32768,           32768
##UNITS=     HZ,            ARBITRARY UNITS, ARBITRARY UNITS
##FACTOR=    0.368581032318806, 1,           1
##FIRST=     11203.0474431902, 0,            0
##LAST=      -874.247242800138, 0,           0
##MIN=       -874.247242800138, -1340125,    0
##MAX=       11203.0474431902, 332154151,    0
$$ Real data points
##PAGE= N=1
##DATA TABLE= (X++(R..R)), XYDATA
$$ [...]
25222 -167545 -92723 -243791 -334866 -275464 -64461 179407 180615 79621 52702 134058 275053
25211 275053 394279 377776 318487 263966 370367 227855 -125938 -284999 -318897 -45312
25201 -45312 191252 119220 156181 313824 319603 400307 579954 573526 425267 207974 130977
25190 130977 115265 65296 71754 28985 87156 247609 125268 -205571 -478733 -490239 -216722
25179 -216722 -68523 -115556 -175513 -182876 -239134 -225539 -209729 -89157 133131 298732 588300
25168 588300 695720 594964 545215 513220 395180 134356 -184430 -473024 -523407 -480022
25158 -480022 -302959 -118210 -40316 183723 233229 97872 96664 31623 -146117 -173523 -117388
25147 -117388 -239288 -604077 -735189 -693433 -502497 -212555 -146574 -283711 -575018 -603052
25137 -603052 -451676 -423263 -356255 -366192 -413206 -192108 -21753 -30101 -39712 19648 121942
25126 121942 252332 466203 482165 325380 86548 11012 18839 -24487 134020 68868 -46870
25115 -46870 -71193 -159569 27081 16655 32963 334205 520335 489645 294429 41048 -151132
25104 -151132 -107103 -197738 -454813 -469216 -324079 -400697 -443181 -201572 -107125 -156948 -260739
25093 -260739 -225102 -100717 -154230 -224399 -119840 55720 290974 491259 377295 175986
25083 175986 124921 92716 -34432 -103277 -97583 -41546 -44531 -17833 -69223 -82782 139777
25072 139777 66397 -21972 -63209 -35277 119608 410553 523578 469408 276569 44485
25062 44485 28229 -11718 -121614 -371082 -550712 -577850 -515879 -581941 -734481 -588852 -308975
25051 -308975 -175002 10507 99946 41802 43051 19756 16822 161201 135027 -23893 2344
25040 2344 44247 -130467 -392124 -376267 -134347 84096 271873 272371 230449 215393 204093
25029 204093 161735 279293 472349 320072 -8901 -168946 -116099 -46486 156181 293523
25019 293523 277274 310992 164416 19386 -34273 71607 198208 411592 436228 88028
25009 88028 -135374 -90156 141996 407138 408450 274520 41219 -267374 -432238 -267268
24999 -267268 -73892 -225842 -368016 -324708 -394128 -480056 -548254 -606666 -629207 -432194 -212739
24988 -212739 -211055 -304989 -504557 -580448 -585398 -612625 -468622 -354689 -327778 -374136 -480768
24977 -480768 -642971 -780630 -685988 -552415 -486635 -283353 -38029 -129226 -299321 -528376
24967 -528376 -684647 -617616 -456972 -386636 -460094 -526656 -435083 -334348 -318414 -250137 -126539
24956 -126539 -269653 -310077 -172104 41512 167371 144213 213375 276340 135636 -68964
24946 -68964 -302804 -381326 -209235 -64772 54449 -25175 -389765 -665243 -582504 -409829
24936 -409829 -170720 -84652 -80579 -21076 -110184 -338877 -567450 -523891 -252809 -144673 -245391
24925 -245391 -332634 -468927 -501661 -306956 -208965 -265631 -136453 37355 74179 183127
24915 183127 266644 236273 170211 181021 -29928 -159282 -149484 -56669 90067 145609 36988
24904 36988 -43777 15507 -9408 -133401 -291167 -317458 -342371 -449473 -538417 -378640 -477649
24893 -477649 -493657 -218440 115142 314071 574178 525599 166978 -11074 982 99260
24883 99260 25711 -60307 -52431 -149175 -312277 -227261 73705 158483 19651 -153516 -209294
24872 -209294 -300491 -148564 70150 38484 123208 205266 275350 295075 274915 286253 223284
24861 223284 3149 551 109941 156221 -44964 -102153 -13391 171 35816 47528 -113186
24850 -113186 -330362 -348558 -572444 -733919 -756236 -615258 -462598 -399888 -324410 -385931
24840 -385931 -282836 156078 349768 109949 -209282 -445594 -361197 -230479 -235900 -166515
24830 -166515 -76861 -15374 -3586 -289391 -464183 -408412 -339804 -211042 -138904 -269157 -508855
24819 -508855 -427879 -291360 -307384 -321867 -201526 145011 167256 -104049 -444102 -502840
24809 -502840 -360477 -279639 -277586 -459527 -563822 -568778 -374579 -168350 -86798 -129805 -135390
24798 -135390 -88847 -21987 61365 -17417 -48007 -70422 -194347 -468226 -528692 -378610 -45336
24787 -45336 363710 514324 312372 234315 131656 47886 -57986 -203840 -93926 70393
24777 70393 89999 123439 120630 -85222 -221497 -134579 42534 -19987 -200450 -262938 -336843
24766 -336843 -212024 -192086 -102067 -78204 -297585 -233085 -92705 -175977 -201039 -184264 -260565
24755 -260565 -515403 -649581 -586966 -577558 -379499 -108962 -52480 -104618 -103959 -138633 -91471
24744 -91471 -9956 223018 247495 69773 -32520 59643 35337 4324 -74354 -65650 130171
24733 130171 162722 141661 248458 171896 -24493 -196709 -341001 -365260 -286464 -11219
24723 -11219 -112738 -425666 -369537 -240152 -110125 -44279 -59554 -199222 -183604 -92873 -167411
24712 -167411 -401455 -611548 -452119 -358096 -442074 -470354 -535253 -610490 -632666 -364886 1148
24701 1148 -52853 -321696 -485885 -363638 41897 377097 489775 483780 573169 638864 388767
24690 388767 127018 22738 -70464 -131991 -91437 -52647 -39799 -191003 -417858 -315601
24680 -315601 -240212 -417727 -540322 -634125 -637408 -703065 -849353 -698002 -583439 -586057 -533563
24669 -533563 -387052 -397938 -551939 -641544 -632628 -538506 -449740 -325258 -130481 -153177 -37600
24658 -37600 162433 61303 73646 6847 100664 346065 448836 379707 144398 13715
24648 13715 -34454 -91100 -76318 -120756 -231021 -44599 261614 283779 229358 332669 342518
24637 342518 147280 -46042 -29263 152735 330402 516650 584888 397625 218085 170986
24627 170986 9540 -57452 -24713 -54241 103933 393695 429419 284262 101247 63117
24617 63117 4987 -167564 -261072 -216135 -209761 -287928 -118305 167221 467526 500246 347035
24606 347035 400827 557651 639885 550809 381204 250164 -22061 -169648 -133742 -141906 -233870
24595 -233870 -367140 -431606 -552620 -631035 -556178 -418278 -173423 184114 271628 -117865
24585 -117865 -417801 -450078 -346600 -261998 -335980 -257546 -70478 -46073 47048 -138453 -354413
24574 -354413 -374230 -392790 -455920 -520904 -458188 -350064 -396273 -561452 -512432 -329109 -93872
24563 -93872 2950 79234 126453 90919 132227 200643 264578 291804 -45059 -390760 -471315
24552 -471315 -489232 -482191 -309832 -319736 -395564 -116575 79512 -85912 -240543 -447815 -668557
24541 -668557 -690078 -566352 -347882 -213132 -291220 -263362 -215831 -279228 -615677 -671835 -349019
24530 -349019 -177402 -186547 -51364 181411 528969 747806 810535 848200 557594 203713
24520 203713 -4631 911 9853 -67775 -109813 -53973 33473 -48137 -210227 -204003 16299
24509 16299 -14987 -132642 66417 287401 347754 183271 35687 -168956 -417670 -513933
24499 -513933 -399925 -257189 -159976 -219100 -430902 -467557 -223977 22082 30956 -225682
24489 -225682 -326367 -204580 -137485 -455852 -543319 -320507 -188192 31873 111841 166878
24479 166878 321193 457308 562695 476480 356746 252722 186035 -25223 -141164 -105387
24469 -105387 -294073 -621456 -850492 -816562 -561690 -212202 -97336 -324803 -290033 -75310
24459 -75310 -61964 -35155 4439 -120986 -242759 -159646 -198214 -119902 47198 -19537 -193964
24448 -193964 -386348 -568832 -695543 -757754 -761212 -646709 -418433 -51545 125727 26425
24438 26425 -67082 -52329 163601 248131 534554 571723 203712 -49107 -152618 -109452 -321859
24427 -321859 -542689 -513721 -337559 -366951 -541253 -414674 -241712 -9873 146769 78968
24417 78968 -114465 -344101 -445749 -478654 -405901 -355378 -304288 -228129 -234216 -218237 3740
24406 3740 105781 -103776 -102554 201111 372098 503960 337090 57059 -64322 -164104
24396 -164104 -151397 -205353 -327995 -375871 -287056 -134910 -122843 -129592 -133177 150752 414579
24385 414579 462234 675734 776961 502212 177990 -203902 -471036 -315242 55039 253723
24375 253723 104845 -60557 16384 98639 31049 -65077 -266363 -382067 -399168 -334489 -328969
24364 -328969 -322797 -338531 -394520 -327764 -377314 -347439 -286774 -352384 -378514 -367275 -275131 -211715
24352 -211715 -259105 -358927 -440148 -509820 -396854 -261583 -225823 -167933 -87387 -257935 -250405
24341 -250405 -38307 23760 -92454 -132239 -92508 25835 148270 318636 544786 508928
24331 508928 726369 1085938 1260085 1522274 1774287 1587492 1208979 860201 579628 564848
24321 564848 431297 3385 -105094 -36726 -89232 -194854 -263329 -131477 63400 92856
24311 92856 16213 -81834 15759 55323 -47225 -179705 -218696 -48496 165067 272824 162568
24300 162568 127493 260418 205697 26665 -226457 -404982 -226139 -151869 -290192 -350756
24290 -350756 -289345 -367352 -363561 -278418 -176545 -88490 -60977 -138525 -171394 -109517 63158
24279 63158 148051 39175 -28518 -127363 -4770 146380 107897 159939 178898 145938 63398
24268 63398 -80374 -220269 -273213 -308407 -254831 129716 341293 428699 411631 367446 146599
24257 146599 -75528 -110847 -165577 -298393 -298444 -82365 -131958 -324885 -360239 -360015 -426741 -362575
24245 -362575 -278190 -219810 -145235 -60052 23222 112715 157418 -40430 -86650 -5130 -98510
24234 -98510 -236580 -259226 -142935 -387924 -750672 -685327 -416005 -308199 -297033 -249454
24224 -249454 -327929 -290457 -139198 -53928 -48393 95072 307340 295641 228145 119766 17917
24213 17917 -21318 -7698 -171287 -180165 -77561 -89120 -67245 -4344 49207 104340 -31455
24202 -31455 -225826 -254060 -57474 -123690 -137636 182776 191427 -79140 -145474 -12835 29392
24191 29392 -37981 38563 -114180 -282192 -330117 -338939 -241975 -25981 122899 -78696 -222719
24180 -222719 -344715 -303436 -67291 154031 186978 278205 286766 171403 -2522 796 20645
24169 20645 196828 327350 278679 153113 -58767 -209234 -134937 160479 54426 -27855
24159 -27855 30389 -106751 -253534 -123305 45628 -63627 -193348 -327058 -457819 -414518
24149 -414518 -379077 -250548 -10601 194113 344289 484188 237733 51332 113888 267398
24139 267398 247455 54559 -190099 -241624 -138136 -15949 253483 265642 293773 470650
24129 470650 499540 335914 234373 60954 -75078 -85132 74202 44307 -9074 28633
24119 28633 74810 180353 124584 -276591 -493715 -163855 92399 -36904 -93763 34550
24109 34550 118938 142089 93171 -78407 -101531 22392 -37391 -19246 -16639 -139147 -271716
24098 -271716 -275488 26126 352040 487051 525741 320698 187476 156205 254775 160900 20960
24087 20960 261704 306529 35205 5000 -23282 -225062 -253163 -209957 -144592 103391 263577
24076 263577 344431 300905 124840 35695 -65675 -14478 31388 -16020 102388 282860 234534
24065 234534 69604 -27159 -59274 -71939 -97825 -116677 48844 137689 -20673 -166251 -74300
24054 -74300 -231422 -297060 -391732 -565012 -551431 -445060 -551812 -675106 -520366 -138568
24044 -138568 12327 -182059 -497326 -574241 -481570 -644938 -676352 -376678 -37889 6040
24034 6040 -110378 -77937 -91986 -61122 132569 297666 106845 -56031 134419 293611
24024 293611 152422 -22740 -134169 -178412 -226568 -260321 -351786 -243896 6839 111051
24014 111051 191152 214080 111576 -4019 -136692 -368416 -518601 -606825 -522143 -459301
24004 -459301 -614089 -536060 -286780 -153619 -15785 174285 363716 448778 269328 78902
23994 78902 101050 265476 614598 651483 607300 636736 482812 170118 -142665 -282019
23984 -282019 -474555 -476631 -136058 123405 230436 317686 265619 179049 238198 247322 237813
23973 237813 78999 -56483 -36414 33632 235438 278237 367601 294638 -64282 -230295
23963 -230295 -319975 -229737 -146600 -229790 -264711 -153208 -196944 -248571 -131526 -52351 99130
23952 99130 262071 304176 233819 253938 300451 257898 85304 26611 117698 10463 -76145
23941 -76145 -173370 -78141 145000 150501 91591 -18748 -511340 -648938 -470013 -264062 -260810
23930 -260810 -377005 -331198 -341572 -288623 -236296 -148988 108741 212060 204178 272426 161164
23919 161164 106115 -78750 -90044 5320 -74716 -166188 -169811 -138758 34272 105853 29721
23908 29721 -77610 -217811 -136866 -72457 9599 117509 209148 28632 -169685 -267537 -226835
23897 -226835 -199270 -151917 14866 106690 92368 -68426 -155179 -275200 -226173 200739 297171
23886 297171 310338 214049 -13072 -58570 211818 323558 230568 107643 182589 251546 -25973
23875 -25973 -238595 -303922 -388946 -378654 -75211 71644 -79482 -246035 -402815 -539133
23865 -539133 -430971 -93267 166542 445815 538648 511299 470269 359662 54547 -146663
23855 -146663 9809 -56517 -150603 -86693 308 292408 463175 201243 -100856 -5818
23845 -5818 59415 -29604 -192225 -153723 79911 104438 -97694 -388277 -399164 -406121 -508633
23834 -508633 -700148 -906064 -965709 -759129 -508912 -403412 -298322 -288231 -472378 -567344
23824 -567344 -516875 -524862 -501653 -447565 -302509 -199576 -21911 156527 240172 184045 71125
23813 71125 25721 80894 94210 221518 49471 -233559 -174092 -156984 -237017 -84699 -107998
23802 -107998 -46599 13479 -215970 -349489 -378555 -196674 57634 117533 174477 230911 324104
23791 324104 450508 194536 251601 476918 502415 319820 -83086 -219249 -163154 -195642
23781 -195642 -102126 -111553 -302562 -422383 -337569 -205938 -51697 -185096 -536730 -697275
23771 -697275 -685713 -636742 -510699 -319560 -152867 -137411 -94135 -171681 -218456 -43634 128931
23760 128931 89122 -159912 -494756 -748433 -845157 -700957 -471378 -397367 -529009 -521821
23750 -521821 -384014 -264858 -104047 194844 257060 63175 -136048 -276586 -370310 -165606
23740 -165606 -61033 -69145 25693 187242 295464 294538 168903 50291 -56111 -351852 -743030
23729 -743030 -854185 -820822 -560700 -306318 -363808 -344480 -417668 -410804 -327312 -125714 19717
23718 19717 -17696 67552 57646 12457 87741 59042 -69136 -202588 -295085 -404552 -367026
23707 -367026 -216280 -105104 685 68339 20539 -204906 -507884 -724429 -677370 -437885
23697 -437885 -483425 -568671 -527093 -368853 -314665 -232972 -69764 -115975 -170627 -87262 49382
23686 49382 239623 366806 237565 159721 309644 237417 -39049 -207021 -344672 -563354
23676 -563354 -483032 -286270 -233555 -129544 -78271 13264 25542 -179448 -323335 -248390 -137945
23665 -137945 -197262 -419353 -439405 -220900 -221438 -426482 -325768 128826 412762 439857 265512
23654 265512 79113 104444 96754 207859 238799 212569 188465 209575 193638 159863 -20081
23643 -20081 -213167 -283079 -338844 -198481 -37983 -69174 -117039 -299050 -450851 -532623 -474976
23632 -474976 -535087 -697413 -759795 -816516 -831798 -677974 -376331 -10319 222305 120663
23622 120663 247258 231037 -47567 -61756 104837 388171 553998 266603 -100135 -274601
23612 -274601 -408258 -309280 -220815 -262246 -268173 -159330 38522 35864 -46993 -124712 -129681
23601 -129681 -191732 -281677 -164944 -160130 -436429 -590445 -371796 47321 311465 339389
23591 339389 238727 -9832 -150169 -217320 -401459 -514125 -547817 -534743 -524922 -441034 -340881
23580 -340881 -338909 -542306 -646497 -428972 -79735 -52270 -301889 -322527 -186627 -15116
23570 -15116 33049 -58510 -271038 -380707 -455770 -545547 -482798 -373318 -340585 -387132 -364098
23559 -364098 -287619 -333459 -339870 -321901 -304898 -265492 -256576 -155611 -100303 -199499 -385002
23548 -385002 -416591 -489864 -464183 -354263 -261692 -310737 -305814 -238309 -112664 157115 280047
23537 280047 248885 148037 166930 67355 2554 -203627 -497526 -311025 58599 19311
23527 19311 -49080 -8530 -113930 -201228 -272060 -351790 -298061 -228064 -368047 -421290 -242825
23516 -242825 -60807 -146717 -463084 -604115 -448488 -218776 -217408 -428496 -589217 -614979
23506 -614979 -590643 -618516 -569693 -447493 -212201 46990 -12159 -162831 -271450 -78270
23496 -78270 145078 9548 -48473 56037 216334 265399 239057 310762 248568 -101565 -418553
23485 -418553 -571936 -514301 -419615 -233143 -188711 -320104 -321715 -328953 -204195 -192084 -247280
23474 -247280 -64529 2566 -88797 -58611 2300 10426 -29172 -314704 -506434 -628037 -518028
23463 -518028 -197455 -55951 -87746 -173310 -432409 -607227 -737720 -545924 -287361 -162380
23453 -162380 -140208 -36751 122448 108552 5377 -244804 -196684 -186795 -269616 -315518 -472789
23442 -472789 -545125 -753684 -772314 -547695 -375584 -338840 -357921 -263021 -179313 -209575 -192364
23431 -192364 -222243 -342633 -532411 -615011 -714069 -827681 -788961 -705006 -536385 -337081
23421 -337081 -70360 -19118 -110783 -299821 -358780 -337220 -318821 -295212 -250392 -36909 202630
23410 202630 420333 386212 256700 155596 13575 -49269 -57410 -114744 -180914 -126774 -8320
23399 -8320 -45651 19587 112457 206786 430362 506174 498293 301462 106558 163108 172346 -18977
23387 -18977 -329164 -554411 -542538 -504499 -574450 -317682 -26984 14094 -286409 -393475
23377 -393475 -246581 -79869 175070 186935 -159381 -364016 -274702 -57320 -92795 -251309
23367 -251309 -255531 -137757 -20713 5205 33541 -14233 90732 209284 177265 -55762 -35223
23356 -35223 240397 41946 -237178 -10588 212960 103998 -65609 -171103 -190887 -70396
23346 -70396 -59181 -32833 261338 374022 263338 363896 585745 537365 307826 338634
23336 338634 337318 127554 11450 -125033 -197125 -80882 -210039 -87222 214019 220310
23326 220310 121790 -75464 -248377 -250427 -383769 -650820 -619015 -338266 13537 380674
23316 380674 448829 334892 335683 427729 538374 516807 314922 163418 -25861 -167768 -262056
23305 -262056 -187862 -95620 -160218 -148934 -104333 -84281 -126670 -154784 -160847 -181327 -300380
23294 -300380 -514117 -593067 -541180 -622663 -814685 -671265 -387782 -380735 -524455 -453773 -286672
23283 -286672 -368307 -766258 -1057590 -848043 -497807 -240906 -189275 -466909 -687405 -733734
23273 -733734 -704557 -603225 -413818 -488078 -502166 -156203 307510 456450 252553 245750
23263 245750 352769 292902 309476 283573 -128351 -484499 -492727 -423395 -401523 -476443 -454769
23252 -454769 -452434 -488417 -474199 -315415 -325780 -533228 -641842 -684964 -615932 -464645 -336554
23241 -336554 -275677 -407647 -339984 -93311 36072 2576 -28339 -129278 -206090 -294353 -545125
23230 -545125 -830253 -1044849 -995211 -912080 -633831 -430582 -255760 -23099 98869 -105214
23220 -105214 -211884 -307435 -343955 -385032 -457560 -379757 -426927 -488858 -334443 -221641 -205228
23209 -205228 -19355 158247 204017 64352 35303 65614 58277 17584 20592 -83576 -357708
23198 -357708 -484440 -395307 -139951 36706 -35270 -109710 -153790 -332158 -335535 -211976 -264070
23187 -264070 -193761 -56419 -25449 1619 313027 563383 586073 284138 -96097 -61863
23177 -61863 27683 95757 71355 -7903 89013 167201 107130 -131724 -370056 -475806 -469701
23166 -469701 -262778 -82569 -114670 -216331 -448867 -604905 -837531 -834099 -403958 -111670
23156 -111670 -26824 -5463 -23125 2179 26361 -103404 -175960 -225960 -440434 -476775 -282999
23145 -282999 -216937 -220136 -156069 -139649 -55633 129828 102665 22655 21761 -68753 -174179 -243367
23133 -243367 -164753 -167777 -330289 -460900 -411945 -184690 134288 241649 104749 -167835
23123 -167835 -317008 -227113 -232501 -244749 -197991 -292296 -309810 -253424 -457059 -778088 -870871
23112 -870871 -752444 -479661 -200937 -218284 -474358 -741018 -857859 -986352 -809560 -670134
23102 -670134 -501131 -283306 -74872 -90792 2485 134164 132122 -97527 -274251 -235340
23092 -235340 -83409 -114955 -85097 126850 114340 -15263 -224113 -191501 -46233 67770
23082 67770 74440 89848 -17026 -324415 -376191 -136589 -112249 -86679 225174 601415 744054
23071 744054 539676 229889 -180023 -492830 -578256 -614153 -752271 -846082 -611333 -283715
23061 -283715 -214576 -264767 -233442 -177564 -54241 27538 51938 283876 312220 -31814 -57210
23050 -57210 138609 146327 -43609 -297777 -277069 -92462 -6649 -160139 -182268 14933 33438
23039 33438 -95950 -276659 -438978 -408592 -389218 -351315 -324509 -479950 -468039 -331892 -335321
23028 -335321 -190381 195861 346559 306887 193989 72764 -167436 -383919 -309657 -208701
23018 -208701 -162216 -141030 -118281 -150614 -217117 -171138 -157416 -64478 -206840 -434764 -420910
23007 -420910 -155474 -78511 -281126 -370463 -205619 -124907 -53920 -4645 174124 292620
22997 292620 368450 548158 507367 371096 362077 482413 539360 410642 202232 87516
22987 87516 87057 14493 -233434 -250196 -252923 -205312 -99987 -62139 14302 -65936 -35783 81403
22975 81403 225702 222619 -47763 -98929 -144028 -395698 -458601 -76514 289370 498953 549166
22964 549166 516562 551756 493292 99757 -54762 49240 56839 -49199 -157092 -215087 -269532
22953 -269532 -409187 -353408 -124108 -9267 65468 80380 -14443 -293083 -552252 -533913
22943 -533913 -530268 -663723 -699401 -545581 -485592 -631656 -762822 -584952 -190011 138207
22933 138207 165371 125413 97691 7189 -40799 36130 72562 91324 135558 104929 197993
22922 197993 190460 164307 53693 -205459 -412127 -381149 -278093 -122935 -71660 -86781 -147976
22911 -147976 -131922 -146046 -114565 -89708 -215178 -251850 -336084 -498751 -295387 -48571 -112194
22900 -112194 -330737 -390098 -484710 -623031 -393270 -97841 83640 101840 132810 141262 152942
22889 152942 41027 -156411 -346772 -361128 -237645 -55701 139170 98389 9071 -61849
22879 -61849 -176439 -192088 -12618 132666 205274 272262 161680 -164075 -478504 -389890
22869 -389890 -229301 -109288 -213885 -313968 -190567 -109832 -113094 -260680 -330247 -254822
22859 -254822 -52154 125448 176345 325479 322752 199497 181153 210998 303609 284821 252089
22848 252089 386062 335620 215119 148345 126642 204789 247606 325277 449716 504627 385661
22837 385661 179922 149025 102921 68753 154163 203770 228732 188808 105249 55431 203475
22826 203475 221567 100149 19753 89761 246132 311441 394353 571978 577510 432451 488509
22815 488509 631847 522848 253500 33588 -173941 -464073 -497019 -135631 344521 594397
22805 594397 539983 370485 37206 -87593 -44314 92654 193496 55359 -104550 -261967
22795 -261967 -270836 -163995 -84520 32844 146151 290606 356443 201859 69682 113213
22785 113213 79394 -44733 -107010 -147809 -265278 -418352 -418744 -285260 -214270 -207827 -121465
22774 -121465 178542 268327 41439 -177148 -66003 227976 618918 829406 727428 506996
22764 506996 291039 421166 684445 609002 181841 -87278 -95072 -102430 -10100 -35504 -131363
22753 -131363 -232927 -181119 -61890 -153923 -487688 -692801 -508463 -292270 -231174 -260937
22743 -260937 -194886 -108328 -150248 -347007 -421657 -236580 -61545 -40535 81975 212423
22733 212423 250962 342371 248479 258965 327144 378887 273544 206990 338284 300090 215494
22722 215494 93713 69704 116001 40693 43550 131257 -19725 -201872 -274322 -267007 -139674
22711 -139674 -15534 -115134 -75951 -27482 -30680 186735 299137 104426 -34695 -139510
22701 -139510 -57149 48805 140639 51911 -181481 -388572 -471340 -525061 -386291 -43696
22691 -43696 79603 222495 338387 405468 394718 334691 169666 -75008 -86644 -72479 -218563
22680 -218563 -241127 -307815 -407253 -485130 -380216 -141965 111705 274537 400784 414859
22670 414859 434553 643056 1199558 1924336 1936896 1431812 960459 816481 822654 670868
22660 670868 376343 123508 18288 116214 309400 305980 149702 68670 -24022 -35588 269424
22649 269424 640099 665230 454781 87600 -215821 -291093 -388244 -405489 -205827 -220837
22639 -220837 -178733 -119939 17317 76267 84660 130661 55045 -40370 87499 246045 175025
22628 175025 122337 112783 149751 328829 454740 472050 483107 243790 83814 -179507 -300810
22617 -300810 -103160 220395 573937 679198 652736 625378 607094 571221 468140 380440
22607 380440 473693 458662 249415 -8655 116595 394212 350562 -45924 -144103 -28571
22597 -28571 166445 394566 520215 326696 262970 363212 438424 376314 242741 163185
22587 163185 224307 509647 579272 515244 499834 517518 529065 292474 65970 65912 218679
22576 218679 115057 -86356 -36883 -71603 -45551 31543 49519 27534 55537 227284 549119
22565 549119 898772 1095990 1061033 878854 746888 614613 238934 -80341 -74179 153057
22555 153057 300526 374395 393378 337160 357814 265444 298044 265727 245190 236046 74557
22544 74557 73707 68936 -89641 2875 275132 388204 448906 392436 194668 31632 -70337
22533 -70337 -150861 -189015 -134893 -153827 -297765 -285897 -283840 -252869 -152904 95808 363753
22522 363753 521812 608803 665942 744875 818219 639195 559174 534492 476297 388781 240843
22511 240843 175389 164291 254996 481973 709788 886299 878746 580951 180319 -35981
22501 -35981 -53927 61768 -2535 -188514 -216295 -98256 -272391 -387060 -150186 -10621
22491 -10621 43800 77026 121375 148046 118209 90754 173987 372681 460678 350812 -3806
22480 -3806 -469439 -949638 -1091046 -854917 -759550 -715236 -724674 -733082 -507454 -254209 -6667
22469 -6667 85830 153503 208397 311958 364462 313610 335626 225328 6564 -79227 -148398
22458 -148398 -260597 -214001 -63210 92714 166846 35465 -93402 -152099 -222537 -143412
22448 -143412 92604 59471 -16258 28098 140059 292600 334600 244517 61679 -42902
22438 -42902 109195 381646 420168 437652 225402 -154520 -241709 -140762 66800 153042
22428 153042 157139 306346 403168 443543 554584 507717 291612 48477 7494 -175232 -525967
22417 -525967 -690225 -524548 -291496 13058 43287 -152086 -181709 -134305 -15289 27074
22407 27074 95000 129300 48454 -78336 -172700 -261942 -511036 -651633 -273221 137507 202308
22396 202308 86361 -128446 -380956 -556550 -467495 -462926 -579011 -567743 -379207 -262500
22386 -262500 -322653 -369028 -402230 -341133 -153256 148065 330884 447877 447528 419369 395654
22375 395654 117983 -178495 -365163 -488792 -387047 -266027 -308032 -250019 -286856 -225526
22365 -225526 -54852 199478 438213 740804 952071 931832 777414 478155 408169 308549
22355 308549 308257 440329 543930 439551 255539 239140 244977 347982 312757 190042 221257
22344 221257 320930 323934 300359 221540 70631 35893 146587 225245 376210 488127 378529
22333 378529 181985 242411 344984 412325 718567 824623 469017 283366 457819 637602
22323 637602 800171 692522 629025 757925 1000620 1294349 1569818 1697894 1682122 1476299
22313 1476299 1275056 1190824 1106075 911542 688059 540330 425666 517451 571029 494210
22303 494210 398993 433267 469150 490351 494309 470802 219397 75369 18900 -155430 -265140
22292 -265140 -306443 -219073 116720 359974 387904 416045 437653 348434 174518 -35481 -255991
22281 -255991 -338056 -299149 -111126 65191 227426 373296 486375 478719 402153 310429 282593
22270 282593 73742 -163205 -283110 -337521 -121927 -35783 -374421 -693766 -763187 -786240
22260 -786240 -692331 -492759 -607052 -708160 -711469 -821526 -902679 -670457 -305920 -189710
22250 -189710 -127049 -73413 -144011 -329600 -485446 -269579 24132 15699 -186988 -227529 -62986
22239 -62986 230601 331386 343908 268624 122123 120870 138843 22163 -70025 -73053 -75540
22228 -75540 -75319 -203250 -446419 -391539 -332002 -404913 -514503 -436451 -144541 155725 149935
22217 149935 213490 292049 199976 78142 -161105 -141472 -125337 -205432 -471136 -909231 -961029
22206 -961029 -567629 -315654 -372774 -408943 -78686 340797 529866 424024 293570 278942
22196 278942 76687 -226762 -400663 -457232 -434374 -399462 -416615 -381370 -319183 -120224 -29720
22185 -29720 28916 185956 183146 90833 148096 280756 324548 350393 406266 359655 175926
22174 175926 125722 46902 -92186 -126419 -159703 -246436 -334343 -256205 -157035 -109432 -212941
22163 -212941 -323371 -402492 -381628 -379642 -378935 -414195 -411170 -47150 252459 317143 311301 237963
22151 237963 164886 -20630 -276000 -309815 -234550 -280970 -410189 -415250 -332941 -186279 -137929
22140 -137929 -316327 -415823 -284325 -260227 -255742 -69334 57085 46104 122178 180769 183315
22129 183315 207094 189948 220612 249199 276019 263533 46249 -194407 -366967 -409421 -593428
22118 -593428 -711597 -573799 -330134 -140502 -234310 -408574 -331721 -232883 -98169 116253
22108 116253 220605 165357 145287 -28107 -230002 -157185 128622 351197 328568 229259
22098 229259 211333 165470 181008 345812 244448 59889 131645 165777 200784 188613 -78862
22087 -78862 -87968 45121 362723 541545 646628 765028 490873 92075 110090 302109
22077 302109 280608 186207 22388 -215240 -471052 -517268 -314442 -222102 -324115 -409244
22067 -409244 -404868 -358743 -298601 -255177 -160991 -101086 -402155 -538287 -392001 -585163 -753751
22056 -753751 -617560 -599925 -752851 -634050 -259961 -3130 140780 179315 106894 60252
22046 60252 54669 24511 -59706 -310900 -596782 -499287 -210642 -107693 -137625 -255313 -257171
22035 -257171 -228331 -145812 70633 94442 937 -91200 -76637 -91153 -57642 -2174 -97894
22024 -97894 -364580 -526963 -554019 -474073 -242155 -104182 -86142 -15867 208137 454993
22014 454993 492928 470126 509054 434817 445190 579589 655035 850853 1006401 841868 493576
22003 493576 345522 384832 300206 76123 -160188 -326250 -244607 54428 238149 312939
21993 312939 483142 423559 262374 118408 65484 -44249 -200324 -260315 -144381 158089
21983 158089 344486 101588 -119567 -160693 -92784 215640 245600 144352 184290 396543
21973 396543 631005 753074 819944 674940 415427 351852 597909 687594 567400 499021
21963 499021 435908 496554 424100 150978 -25137 -35988 207472 308586 229261 265210 82033
21952 82033 -100806 -183942 -162174 -299583 -406154 -370784 -387157 -162488 209680 323516
21942 323516 423681 542810 540535 492790 357079 58471 -82399 -52165 -91127 -37128 281019
21931 281019 410359 368840 367869 375700 340414 186578 -40495 -102316 -25354 97420 97823 33790
21919 33790 225158 413579 469377 349547 142526 -97145 -153320 36325 172804 451779
21909 451779 431861 217898 75822 -209598 -341845 -226810 -229019 -125643 37937 238127
21899 238127 427046 272643 233499 262930 85659 -133986 -259510 -194259 -70704 -26384
21889 -26384 -23444 -26707 -105892 -64872 20731 71070 118809 91509 -75457 23797 6102 -202673
21877 -202673 -388189 -328397 -147290 -99977 -136226 -376961 -608019 -533537 -308644 -416044
21867 -416044 -414046 -393881 -415334 -370721 -228007 -237026 -370488 -347832 -311157 -317654 -455458
21856 -455458 -583527 -553008 -249685 -45297 -97680 -251582 -207270 37528 349449 595814
21846 595814 799426 894599 601776 438721 470465 347234 322778 209751 86590 172351
21836 172351 408022 501794 295531 98815 165013 305458 382251 261891 227647 346431
21826 346431 515185 410252 39350 33666 275921 407097 247796 75363 27019 33247
21816 33247 246778 293450 127304 -59712 -343582 -564817 -557771 -514337 -366557 -270440 -210799
21805 -210799 -218684 -158808 -57463 -181796 -193365 -54143 72122 134886 251107 488249
21795 488249 623594 602384 426121 52980 -169590 -38864 114821 34180 -233704 -395127
21785 -395127 -493873 -595778 -509782 -376175 -286362 -393424 -338373 -122546 214702 562838
21775 562838 707082 650762 644207 1078782 1361335 1286709 1154169 917977 790758 501529
21765 501529 126879 16333 -19300 62447 162502 156915 156675 150748 170384 26507 -122097
21754 -122097 -114227 71630 325910 354775 257820 270144 291018 486778 553144 387895 454638
21743 454638 861684 1134974 1211139 1144970 973841 779516 641500 621349 654305 630554
21733 630554 457939 155346 71420 72318 29719 40851 51491 39230 105848 168834 270089
21722 270089 295537 349393 316637 123255 114641 122969 321139 705413 918637 1211717 1548309
21711 1548309 1887723 2460281 3527519 5377525 8146814 9967448 8564496 5932332
21703 5932332 4074865 2880824 1977966 1514629 1232677 892091 606147 455042 571418
21694 571418 643936 533769 291122 77580 204210 515461 571787 502026 463598 273351
21684 273351 98522 110388 147429 217513 316760 351668 331028 324761 413559 500632 750174
21673 750174 703254 267453 68703 -53437 -193308 -172767 192106 368069 307751 144029
21663 144029 7110 65025 225926 231990 275087 387404 463530 650715 642400 739361 1014442
21652 1014442 1210470 1403679 1500404 1564951 1603454 1351494 995646 555873 239396 6956
21642 6956 -93207 -11865 162070 227481 14695 79984 197794 193851 303282 432472 369479
21631 369479 248484 159775 188363 291261 505857 796692 867379 702941 573402 426231
21621 426231 322208 242743 33139 -134582 -62648 179150 236850 193179 205081 -23482
21611 -23482 4726 193384 246777 174208 51725 15041 -17687 82738 168520 -81635 -368420
21600 -368420 -397442 -301271 -183357 -36483 237653 595752 860575 829881 581694 309083
21590 309083 88227 -138166 -120153 -28090 78283 201482 64764 -159108 -431320 -519035
21580 -519035 -319985 -95885 -11756 16849 189208 414376 513410 479371 189412 172969
21570 172969 318901 540976 494152 498772 578303 790615 926468 634410 223366 -12188
21560 -12188 43030 168879 308356 450545 448747 329367 214461 293571 585044 637433 475835
21549 475835 576993 659886 622277 635164 563131 610297 653888 504676 289761 190346 134764
21538 134764 204328 444562 483438 224836 131121 109261 -10159 -43658 49692 63599 -41069
21527 -41069 96662 254975 165661 102159 151646 266407 319388 467399 577822 407013
21517 407013 142346 -70017 -110087 141892 575449 830849 878184 989465 1141180 1169675
21507 1169675 1059268 872094 763966 798598 717179 389374 296277 563309 756032 735287
21497 735287 496565 283288 32461 -160301 -133227 -98815 -94291 61116 152178 186735 124135
21486 124135 -168767 -318801 -232280 -375266 -675736 -587030 -320258 -259044 -363163 -352022
21476 -352022 -303472 -405856 -431000 -286770 -105785 32093 -48897 -100125 295469 624804
21466 624804 745120 1149527 1598114 1506316 1100708 544900 296301 340950 451582 707747
21456 707747 694842 518318 525596 369426 158423 93333 189600 238288 347437 477455 469138
21445 469138 425606 386313 314432 152469 10498 76255 14858 -89199 57829 114034 16339
21434 16339 169685 368518 433000 416061 423929 241265 75591 52054 29007 52949 -74562
21423 -74562 -116866 -4703 42545 41915 31418 73521 126000 80021 72372 322193 512784 599313
21411 599313 634206 580687 585507 590962 458887 266295 138081 -24645 -211414 -229256 -215666
21400 -215666 -279247 -418309 -323944 -314623 -356922 -379297 -283234 -146049 -84544 85049 139778
21389 139778 74964 112938 367292 562751 587453 453598 165393 54628 375632 522637
21379 522637 354643 78710 -45842 -5660 -70486 -353132 -652121 -796400 -576060 -244418
21369 -244418 44402 -19292 -249376 -518261 -598422 -427001 -252930 -44387 117193 117335
21359 117335 -49672 37387 232786 327153 344346 131474 38566 313446 565102 787150
21349 787150 702943 262015 -74464 -288519 -308051 -376216 -497180 -389051 -275807 -364376
21339 -364376 -370883 -306133 -205736 -93000 -24286 -81364 -128605 -166110 -213494 -19044 -40053
21328 -40053 -169961 -63567 93761 162430 389514 612868 744305 923670 952984 750956
21318 750956 490107 289997 117674 87091 189530 107133 75183 153771 284147 468519
21308 468519 593526 610037 454805 380037 473067 531925 783008 961887 982320 937924 669710
21297 669710 257850 176565 269494 303780 328082 233423 51483 81113 232031 324289 460428
21286 460428 493908 428564 317690 213615 208614 170041 69135 -33351 32489 112885 180397
21275 180397 261585 344418 253674 140555 242728 413663 628732 660387 455057 388161
21265 388161 302165 198502 265628 474807 753468 698233 476765 491674 591859 1023854
21255 1023854 1388820 1549594 1745496 1874515 2251776 2668245 3275489 4104000 5133855
21246 5133855 6142570 6560930 6042118 4894336 3991831 3427075 3033040 2601864 2249960
21237 2249960 2007646 1705918 1480827 1339205 1085237 826025 808536 865399 867364 869580
21227 869580 729504 758265 773446 501893 392519 555164 694086 814455 701411 708313
21217 708313 821827 590935 557400 573642 561185 647064 538481 551616 875164 1265763
21207 1265763 1804867 2390577 3002809 3097484 2794240 2697178 2767715 2535826 1938999 1527396
21197 1527396 1308270 1154714 1179949 1536273 1633049 1282205 761737 446819 296803 230136
21187 230136 274581 397324 780307 892235 860045 1211446 1512642 1447143 1126734 679526
21177 679526 418903 329209 533415 694483 729524 892733 1026045 1030276 1036350 1006034 961405
21166 961405 759372 542870 393224 262730 69194 -60466 23062 129090 202089 79368
21156 79368 -99819 -178488 -93896 239839 343881 158568 -34042 117547 259039 396087
21146 396087 709504 788124 448843 214453 255051 457796 775572 866338 793999 536180
21136 536180 227375 228516 378504 421490 421005 536361 758740 853295 777678 585425 463462
21125 463462 343634 393046 553417 731114 775725 507783 425544 387977 73317 -83641
21115 -83641 7609 180833 348880 244006 134681 85725 279163 513638 766821 896929
21105 896929 953383 904402 838873 856193 839601 844917 772558 833607 949264 841143 597617
21094 597617 213190 144925 239138 265385 370798 655382 1149774 1719218 1619848 1165892
21084 1165892 808490 727470 682265 701345 663643 574268 570722 760687 1022194 1280106 1475538
21073 1475538 1588471 1617021 1511139 1463812 1282323 1164493 1203412 1565755 2072643 2067008
21063 2067008 1784046 1503342 1403176 1373154 1296355 1209448 1142561 1096019 1066394 978987 924785
21052 924785 854637 974429 1214041 1393638 1611430 2030088 2511779 2721261 2697658 2668129
21042 2668129 2285613 1665325 1393115 1470202 1330551 1101342 1171937 1372629 1474195 1610797
21032 1610797 1583383 1434894 1423489 1465627 1491259 1411682 1366382 1303749 1243456 1186111 1010371
21021 1010371 801347 681139 861189 1188122 1308376 1151264 1163407 1158956 1029435 973370
21011 973370 1108838 1254426 1684506 2084199 2287431 2263818 2125799 2277027 2295183 2156317
21001 2156317 2461278 2698755 2970338 3174500 3423282 3710281 4333589 4855004 5803795
20992 5803795 7454105 9520374 11908888 15939271 22132710 32176210 47834640 69172620
20984 69172620 75105653 55851234 36907006 25682583 19041956 14458230 11284431 9087839
20976 9087839 7543110 6606589 6036114 5418051 4894351 4291242 3757387 3445876 3525379
20967 3525379 3641333 3531358 3225578 3070015 3039099 3067708 2957860 2581370 2189382 2032544
20957 2032544 2027098 1949431 1628603 1383368 1414815 1432499 1421621 1485048 1463975 1452111 1572556
20946 1572556 1729492 1857760 1986688 1943294 1696037 1537754 1463820 1502567 1465174 1388006
20936 1388006 1425522 1439654 1604665 1712113 1549706 1244638 1091952 1177903 1215811 1104858
20926 1104858 958657 852623 837441 1126147 1412551 1588700 1759126 1810102 1702960 1725352
20916 1725352 1800175 1869069 1978275 2184374 2471914 2818500 3074116 2878571 2604272 2637300
20906 2637300 3059056 3514368 3673700 3687332 3761338 3947608 4391715 5099730 5983952 7039081
20896 7039081 8812543 11578954 13924003 13115858 10614685 9062897 8864717 10120593
20888 10120593 12240027 12464967 9881872 7555917 6232513 5543127 4768606 4117425 3682804
20879 3682804 3416963 3061238 2769851 2705195 2645410 2653141 2610638 2486755 2324469 2019612
20869 2019612 1773989 1894065 2009252 2067851 2182459 2090606 1852645 1891207 1830484 1761235
20859 1761235 1783952 1831242 1723466 1534553 1531980 1756354 1943993 1793814 1593898 1496454
20849 1496454 1338305 1261413 1258962 1311139 1309248 1113001 1149554 1464892 1879029 2231018 2320517
20838 2320517 2220023 1990874 1720792 1340440 1298320 1404565 1378265 1340970 1170808 1216726
20828 1216726 1348864 1526204 1642257 1759791 1873129 1889329 1829184 1723539 1598335 1352044
20818 1352044 1237125 1385233 1476781 1504567 1467138 1350646 1188444 1062221 844319 712155
20808 712155 589171 632771 713948 919648 1263434 1280919 1222672 1305004 1406967 1544760
20798 1544760 1482662 1277498 1110191 1109486 1172542 1057776 1093975 1318928 1497686 1529921 1427064
20787 1427064 1396017 1345791 1475810 1545742 1592868 1723319 1811131 1712224 1313408 995423
20777 995423 1056699 1338910 1603442 1856443 2244689 2679743 2962623 2955891 2586765 1982065
20767 1982065 1529457 1393911 1283811 1154348 1057132 1060067 1176640 1384021 1637177 1743561
20757 1743561 1775113 1844308 1839760 1604121 1279635 1200480 1226683 1138964 1077535 1151155 1285132
20746 1285132 1263896 1349681 1465750 1391302 1289967 1242255 1359635 1528697 1737331 1823417
20736 1823417 1384715 917683 869832 829718 881383 1078204 1378837 1463450 1471827 1753947
20726 1753947 2221066 2426026 2067782 1498982 1111237 1023634 977690 1066710 1154475 1056784
20716 1056784 614105 102751 -123561 -4173 326305 762715 943422 780518 609445
20707 609445 580966 826611 959674 1078931 1136129 960849 611940 527717 544530 377468
20697 377468 230177 203810 303398 580828 840362 798213 722770 831609 920492 987093 887024
20686 887024 573855 366942 199204 -15081 -30701 212091 327594 163118 135685 111943
20676 111943 157623 316546 515835 696654 834874 808733 601723 478744 615637 698355
20666 698355 593487 556989 529545 367643 229403 176232 271488 403910 533487 582303
20656 582303 318315 102711 245571 291221 137195 -28365 120389 560083 864015 733556
20646 733556 434660 290238 315851 244859 272217 334104 366053 377157 312224 224990 115898
20635 115898 129773 120585 92653 -96966 -287452 -343061 -134099 172059 248823 142998 221349
20624 221349 180923 166162 482906 821492 1004510 1120470 1162653 1021266 839143 705469
20614 705469 610844 580813 396640 198419 264374 362660 154213 53910 172526 319316
20604 319316 520600 713102 784744 648787 274159 -19757 -135991 -56234 101035 360825
20594 360825 648531 605322 359798 378731 483487 553006 543277 645395 527459 323194
20584 323194 276086 298262 235607 262923 337015 413221 346581 386992 390218 327398 525931
20573 525931 676743 663880 530671 355213 267376 501011 842811 1118572 1059521 802167
20563 802167 747593 1035994 1380408 1446135 1149386 838617 686624 759016 872507 899171
20553 899171 993587 1035832 686900 433652 492796 445227 429545 713726 1040534 995312 832011
20542 832011 667167 547323 572944 665046 730135 752997 748993 815994 874758 874632 691167
20531 691167 609464 768292 1106777 1302938 1179001 756389 459335 559916 845435 1008977
20521 1008977 1078894 821608 557043 354965 467592 680174 757277 689699 647058 737686
20511 737686 744853 740070 652061 613817 656183 904943 944431 873359 1150263 1578662 1745311
20500 1745311 1631720 1320064 1113096 1154610 1041854 1004010 1065955 1147027 1291933 1663186
20490 1663186 1683426 1385307 998066 663944 532648 593127 656601 866281 1190790 1499826
20480 1499826 1684020 1851948 1901667 1757254 1624108 1461678 1368796 1381617 1477426 1415672
20470 1415672 1371249 1156787 979922 982894 1099331 1349823 1899207 2158183 1966947 1703760
20460 1703760 1441459 1258942 1118388 959898 967997 1150609 1215745 1067592 842503 704727
20450 704727 690575 857926 1062170 1085961 917922 748839 646450 604714 686808 806816
20440 806816 960077 1058727 1158072 1185645 1171374 1264763 1142371 849120 595592 606135 920067
20429 920067 1016677 988513 981905 1037981 1149496 1225111 1206917 1281050 1501630 1720940 1786493
20418 1786493 1607141 1336878 1184334 1154372 1213592 1108137 977553 925917 1028194 1193233
20408 1193233 1356904 1463929 1281140 1103781 1014703 907730 1013484 896162 694883 739883
20398 739883 842957 956778 1172212 1257945 1163183 1088964 1251548 1604762 1830463 2044435
20388 2044435 2097874 1994985 1770835 1663885 1723669 1641482 1586756 1687534 1867082 1801617
20378 1801617 1454122 1055905 814654 821805 939545 1105317 1351256 1351198 1336153 1519202 1611836
20367 1611836 1763390 1912089 2054728 2018716 1813825 1587015 1492807 1520959 1709041 2039522
20357 2039522 2161446 2264323 2309795 2515446 2726177 2695845 2504479 2246065 2170677 1979790
20347 1979790 1735039 1717499 1747871 1934143 2105042 2278890 2143664 1959100 1978813 1861126
20337 1861126 1718345 1544598 1309549 1306361 1619720 1966119 2079141 2175359 2055909 1906454
20327 1906454 1827297 1957131 2076209 2092577 2256741 2408257 2508953 2533130 2446358 2451410
20317 2451410 2640554 2759393 2762536 2767409 2774845 2750321 2813142 2938895 3000339 3140670 3263686
20306 3263686 3241812 3230412 3289912 3348909 3452286 3608722 3916668 4159403 4243372 4054868
20296 4054868 4022376 4316969 4815288 4950706 4970734 5011215 5039882 5300495 5692150 6132630
20286 6132630 6577189 7363852 8459691 9774967 11736210 14501240 17418640 18382990 17666792
20277 17666792 17245088 17465557 17743362 17531873 16896871 16089015 15158496 14223144 13644781
20268 13644781 13315427 12837442 12077545 11029582 10152828 9489321 9108263 8717579 8299891
20259 8299891 8007232 7833190 7872357 7909819 7863679 7872708 7840785 7880968 8062408 8331147 8509994
20248 8509994 8693571 9238812 10119590 10947263 11513883 12269869 13369306 14362508 15136799
20239 15136799 14931582 13968135 13233962 12853748 12763098 12943495 13281282 14052016 15030825
20230 15030825 16413955 18330711 20738782 23602372 27423503 32916271 41688206 54909162
20222 54909162 70111105 74705207 62220863 46502588 35665228 29269950 25341486
20215 25341486 22662947 20334239 18583122 17636124 17223885 17055220 16839740 16554388 16399777
20206 16399777 16181018 15820386 15485773 15027343 14686527 14557952 14527341 14901962 15435954
20197 15435954 15111905 14304747 13861839 13560400 13262087 13167034 13428900 13982982 14588507
20188 14588507 15503760 16909344 18848831 21521363 25043910 28755810 31532236 31431284
20180 31431284 28069119 23710413 19942207 16904235 14713662 13317366 12496916 11847405
20172 11847405 11389123 11091896 10796529 10675232 10803947 10996077 10901377 10486860 9776663
20163 9776663 8801247 8017016 7587379 7429190 7287398 7287558 7281739 7334765 7405604 7403517 7764991
20152 7764991 8215584 8513456 8520525 8582432 8805497 8896835 8654380 8089053 7642775 7315985
20142 7315985 6997389 6745681 6574526 6504865 6610675 6811091 6939944 6727827 6424873 6423924
20132 6423924 6741256 7074032 6930782 6717877 6797804 6731634 6781874 7071876 7390830 7590498
20122 7590498 7784535 7876092 7620817 7307120 7197746 7073168 6879072 6720038 6611884 6660954
20112 6660954 6692428 6761220 6849056 6936171 6808955 6538105 6512138 6606305 6326888 6045507
20102 6045507 5938297 5788130 5682704 5603139 5464174 5464108 5671448 5967187 6215861 6461559
20092 6461559 7019718 7808526 8867154 9972484 10858334 10759723 9836409 8806825 8021708
20083 8021708 7671910 7559087 7515698 7568938 7608664 7426153 7373848 7498636 7488842 7227336
20073 7227336 6924355 6700180 6474696 6276739 6030624 5645985 5718173 6115966 6413267 6564183
20063 6564183 6955171 7516726 7846677 7964764 7869875 7767186 7636241 7375033 7464810 7739302
20053 7739302 7903989 8115501 8417424 8379709 8130970 8149819 8358199 8737548 9200879 9849053
20043 9849053 10565623 11605902 13130296 14458009 14962734 14995364 15329755 16148609 17573352
20034 17573352 19661314 22974603 27580435 33120847 38165873 39100150 34773684 29671517
20026 29671517 26259486 24099050 22886186 22592828 22784695 22703758 22141879 21384635 19824271
20017 19824271 18130040 16829880 15852177 14796112 14083113 13410803 12950232 12756785 13173732
20008 13173732 13789777 14193482 14550039 15062830 15580476 15929672 16117027 16574753 17478940
19999 17478940 18435803 17945528 16827040 16193600 16361089 16930263 17737928 18344681 19242535
19990 19242535 20685981 23347213 27023679 31893261 37914799 47273117 61786517 81794186
19982 81794186 89223433 74654673 60846926 55122019 55751238 62044886 74227678 94326935
19974 94326935 125998318 176995221 253709794 325576173 315109445 236664849 163299014
19967 163299014 115644561 86121258 66496650 53550479 44817909 39025007 34847508
19960 34847508 31504548 28293064 25552662 23198194 21503402 20213284 19410623 18581420
19952 18581420 17910748 17428814 17177466 16809710 16599441 16686699 17208328 17829454 18462952
19943 18462952 18620463 18111981 17339358 16733775 16399449 16222060 16219370 16482564 17205077 18106917
19933 18106917 19222540 20243037 20874313 21124052 21213736 21384842 22229069 23898822 26067598
19924 26067598 28345451 31005388 34259977 38089444 41957744 45978213 50832796 57741502
19916 57741502 67253047 80604011 100625819 133333133 186488481 265765616 332154151
19909 332154151 316837346 242922615 170658406 123079715 95037004 77834977 66671250
19902 66671250 59030094 53654084 49871486 47417156 45965063 45606928 46904300 50234095
19894 50234095 55877983 62131397 62962208 57090876 50764065 46744677 43307301 39738058
19886 39738058 36797192 34547736 32893577 31925702 31011018 29549339 28170461 27186255
19878 27186255 26694345 26681617 27111685 27877020 29269518 31402112 34303161 37675503 40341858
19869 40341858 40772250 38988718 36757683 34823199 33110742 31746099 30382027 28747815
19861 28747815 27168917 25732997 24527014 23391350 22525838 22346175 22679618 23296440 24235354
19852 24235354 25435856 26754182 27443514 26932684 25443412 23655451 22274059 21480876
19844 21480876 20997361 20607138 20334511 19906289 19029720 17909911 17078178 16446056 16119213
19835 16119213 16235644 16689117 17376566 17666617 17310720 16382903 15186439 14095482 13289422
19826 13289422 12860356 12918586 13102110 13255052 13196914 12939350 12475701 11518188 10605918 10022717
19816 10022717 9412347 8886442 8873481 8966228 8700295 8356716 7956261 8055173 8586540 9117807
19806 9117807 9574168 9888243 9632346 9107235 8845883 8706757 8484745 8672014 8913104
19797 8913104 8611594 7924268 7399396 7166586 6753574 6319047 6153784 6139624 6304758 6536040
19787 6536040 6681892 6666581 6595140 6673281 6872275 7072371 7454430 7655878 7641918 7449624
19777 7449624 7241469 6924355 6564994 6272444 6223315 6367428 6500261 6522502 6445247 6136840
19767 6136840 5805082 5886751 5942786 6146836 6282109 6100161 5764883 5419566 5267658 5090220
19757 5090220 4963141 4685651 4637629 5072748 5670701 5986803 6326090 6623721 6644505 6340895
19747 6340895 6012282 5709679 5607503 5620820 5628526 5571636 5447709 5427264 5646505 5752913
19737 5752913 5649396 5551406 5619695 5742905 5804203 5679034 5657389 5779557 5872080 5597105
19727 5597105 5320861 5256733 5275251 5404519 5752242 6044839 6490679 7154699 7856868 8108890
19717 8108890 7966086 7766735 7509335 7347564 7218302 7221538 7516528 7616799 7453976 7268792
19707 7268792 7244273 7491019 8154410 8789291 9041957 9249183 9642003 9962269 10026404 10086493
19697 10086493 9946319 9637328 9482656 9631084 10103188 10910653 11975116 13247669 14616715
19688 14616715 15803295 16338815 16039257 15284192 14439258 13921395 13479037 13256059 13345596
19679 13345596 13763396 14491768 15277381 15518492 15149808 14526812 14062623 13601131 13063550
19670 13063550 12408526 11767412 11236356 10785098 10420516 10254231 10197329 9992673 9403647
19661 9403647 8880465 8726004 8718911 8509083 8214705 7937908 7707808 7547347 7547031 7472226
19651 7472226 7358919 7260239 7279245 7405505 7499357 7413384 7284714 7229699 7220343 7166532 7088142
19640 7088142 7151439 7486220 8132940 8815998 9664690 10467593 11098541 11827609 13449292
19631 13449292 15980986 19175791 23936959 31084933 41960015 58287250 82806530 117540497
19623 117540497 151904714 156206086 127449895 91510738 64159716 46452554 34977426
19616 34977426 27412018 22094157 18529545 16104982 14253556 12782221 11633117 10565054
19608 10565054 9761318 9132685 8665851 8190915 7449581 6808021 6249013 5721608 5428037
19599 5428037 5056310 4634510 4275924 4054301 4013648 3872974 3892592 3969620 3781390 3545403
19589 3545403 3413683 3384152 3426983 3521980 3496223 3369419 3209286 3130905 2958886 2820068
19579 2820068 2768096 2954334 2956068 2990469 3271444 3688264 4205219 4371387 3957780 3440193
19569 3440193 3390940 3396203 3361559 3333021 3422277 3596260 3420683 3187579 3179489 3078058 2896438
19558 2896438 3055654 3000124 2773808 2868163 2835574 2614955 2513854 2310699 2144885 2084858
19548 2084858 2022617 1836724 1721620 1704324 1796354 1867787 1943086 1862993 1771282 1687630 1653471
19537 1653471 1670400 1761851 1666881 1460187 1425179 1352120 1255463 1250662 1550860 2076454 2468524
19526 2468524 2722841 2879969 2891550 2924746 2867402 2696450 2746268 2617756 2376911 2172106
19516 2172106 1895731 1804968 1789172 1711062 1719837 1841301 1910756 1884114 1922176 2037154 2054611
19505 2054611 1817444 1618520 1569743 1584436 1789369 1847655 1710807 1695419 1707237 1822668
19495 1822668 1844665 2038304 2506585 3099050 3814257 4673384 4696059 3826648 2957197 2573816
19485 2573816 2313261 2049062 1885351 1693293 1428514 1184909 1278717 1570350 1923367 2166802
19475 2166802 2129392 2003835 1872371 1803289 1701713 1540210 1528686 1513905 1626030 1770187
19465 1770187 1751938 1852600 1956670 2060727 2148539 1909086 1633064 1748410 2062036 2144875
19455 2144875 2133785 2297853 2494664 2738637 2853167 2924268 3039930 3073899 2978418 3031089
19445 3031089 3342300 3689353 3781069 3881776 4079582 4315766 4849595 5540163 6193409 6910268
19435 6910268 7787759 8885572 10291880 11911860 13603334 15896464 19191305 23614689
19427 23614689 29445735 37418742 48648502 64133338 83803026 103887344 115684793
19420 115684793 113407356 100360451 82515755 64394973 49531475 38621390 30718119
19413 30718119 25028966 20656658 16918086 13975733 11890849 10383662 9329985 8624964
19405 8624964 7822143 7029266 6506741 6287350 5808858 5307343 4906914 4304524 3793535
19396 3793535 3482605 3050831 2718758 2558846 2454821 2369223 2223117 2126589 2127839 2193072
19386 2193072 2281615 2192508 1952791 1684575 1347859 1278637 1616524 1667753 1604304 1614591
19376 1614591 1721472 2065015 2384992 2287492 2159491 2266925 2553678 3011485 3280007 3441585
19366 3441585 3603415 3634792 3881410 4100055 4390076 4590177 4526218 4337367 4196057 3924421
19356 3924421 3419417 3096291 2990994 2929245 2815843 2620520 2382998 2352423 2323392 2083974
19346 2083974 1985044 1835683 1678715 1659770 1962502 2095273 2212011 2281530 2117195 2043338
19336 2043338 1857937 1755292 1604337 1519619 1634363 1639734 1632235 1744140 2010254 2271593
19326 2271593 2179866 2029796 1762440 1481052 1559718 1623856 1541322 1637896 1663564 1494730
19316 1494730 1257567 1119518 1116883 1321367 1439419 1498066 1522542 1331806 1170013 1007882
19306 1007882 996767 1104976 1108781 1183433 1196697 1100367 1262717 1480021 1373043 1177521
19296 1177521 1140596 1203681 1274756 1216636 1060319 1070172 1338542 1651777 1842305 1992359
19286 1992359 2071477 2186129 2298356 2227783 2139304 1818896 1294535 969553 1059007 1352639
19276 1352639 1409834 1322709 1420791 1576374 1383517 1175529 1260256 1210173 1061329 1079388
19266 1079388 1232034 1451119 1645525 1718041 1622203 1507147 1589255 1766793 1940263 2074361
19256 2074361 1897560 1887953 2027106 2053520 2106911 2245748 2350470 2630135 2966669 3298054
19246 3298054 3438995 3527184 3666492 3683099 3719986 3780296 3941478 4111723 4229431 4341821
19236 4341821 4566569 4901696 5178897 5301253 5304637 5278942 4952828 4394114 4073065 3888390
19226 3888390 3625335 3656086 3672177 3631437 3616861 3474668 3356463 3299378 3193207 3006150
19216 3006150 2948630 2960664 2870386 2878608 2676016 2543603 2364371 2248792 2121992 2132560
19206 2132560 2262822 2223736 2231745 2201859 2058356 1998309 2071105 2192570 2254808 2422049 2630367
19195 2630367 2530658 2426520 2537422 2447645 2164766 2149736 2355452 2667430 2969278 3262618
19185 3262618 3437749 3435637 3427506 3530375 3761150 3871321 3775078 3685664 3884757 4112296
19175 4112296 4465437 4958127 5475975 6239893 7105155 7744257 8057450 8277454 8612818
19166 8612818 8597483 8299569 7966921 7300327 6442178 5618403 5062203 4869426 4814641 5086409
19156 5086409 5208976 4951638 4595274 4286589 3735155 3483067 3518136 3407185 3260219 3131397
19146 3131397 3191902 3415207 3589330 3748858 3786023 4029974 4144631 4082326 4037203 3969725
19136 3969725 4055862 4121852 4344390 4762473 4793578 4898342 5223783 5483548 5605357 5868426
19126 5868426 6210937 6219163 6143443 6113822 6388634 6820039 7211372 7309563 7033369 6551015
19116 6551015 6027863 5527034 5055465 4796691 4854787 4832152 4595734 4365126 4012299 3707273
19106 3707273 3538318 3343287 3155376 3082385 3035621 3208939 3264588 3054688 3031360 3193241
19096 3193241 3383712 3479780 3448343 3341528 3053844 2807831 2548563 2613409 2908285 3137013
19086 3137013 3324466 3462552 3379910 3139254 3207157 3245485 3047304 2908612 2903551 3093828
19076 3093828 3326080 3404192 3375177 3357369 3229867 2859782 2718239 2859341 2632537 2139134
19066 2139134 2014145 2207218 2103932 1936138 1950421 1919480 1888651 1922931 2130065 2380710
19056 2380710 2666325 2942758 3206344 3252907 3154176 2889736 2513342 2177974 2116325 2313504
19046 2313504 2453092 2584592 2775365 2783100 2832829 2815142 2625920 2589094 2611566 2355863
19036 2355863 2160739 2287843 2571089 2774834 2916873 3094695 3174243 3227679 3296109 3377025
19026 3377025 3435211 3249079 3093277 2909991 2667053 2596728 2538730 2428174 2377342 2321231
19016 2321231 2472148 2599021 2695148 2894495 2932960 2857795 2653116 2474792 2201917 1844299
19006 1844299 1712185 1884912 1855896 1715043 1444344 960004 1051707 1416421 1736954 1672906
18996 1672906 1461673 1521788 1551796 1558745 1630685 1604739 1772601 1718670 1356503 1181743 1294639
18985 1294639 1484238 1505540 1400005 1489793 1660105 1884703 1890674 1689481 1580943 1710345
18975 1710345 1927388 2099801 2375321 2452142 2304495 2215002 2109516 1874660 1592507 1358958
18965 1358958 1361088 1363390 1329992 1199805 1207195 1006070 843937 867062 883357 873493 796626
18954 796626 827675 723756 600663 795832 905414 846178 1019196 1232156 1282577 1203062
18944 1203062 1043736 918584 990533 996190 831878 659217 486455 440800 525713 573136
18934 573136 668011 832515 950222 1064895 1124609 1038903 773334 530725 558268 737277
18924 737277 692796 369530 380051 517416 571036 484836 214375 126491 232412 364869
18914 364869 557891 708586 837700 968852 993508 875148 880512 1110803 1465280 1795340
18904 1795340 2101884 2050099 1858976 1930144 1964128 1777948 1498907 1196415 893444 785362
18894 785362 747104 651181 615845 538875 341025 419426 538435 431321 448103 605412 706920
18883 706920 519010 515974 648070 730024 762855 773131 721528 773323 796966 666289 516625
18872 516625 521240 414723 378042 430040 449621 470320 356704 263446 344624 577378 689155
18861 689155 683559 617610 436455 296489 273341 297826 309984 312637 370355 517711 852948
18850 852948 1132950 1044408 846071 695701 864982 1061854 1094402 912815 745866 703646
18840 703646 772458 814429 777951 736969 642313 623771 829770 1063374 841038 510530 436671
18829 436671 402189 424565 672872 812443 759944 596404 236702 58804 207270 415596
18819 415596 329740 367861 723173 1010382 1103408 962764 770854 681252 641015 794319
18809 794319 820840 692192 341724 121480 30566 22087 134856 226343 317055 506835 752894
18798 752894 864782 812318 639011 306827 63326 75615 128243 169883 189913 417730
18788 417730 761168 898425 923991 664435 336277 385284 237010 87833 45034 183121
18778 183121 389473 593125 642245 589632 744116 917804 805742 754621 773858 873080
18768 873080 1075966 1106259 1183775 1433828 1461209 1449206 1389273 1367516 1470792 1436755 1353398
18757 1353398 1303589 1476938 1667470 1775434 1676882 1325290 1139216 1028389 1030695 787104
18747 787104 666874 977910 1272845 1353852 1194140 945413 817198 864534 817093 788498
18737 788498 635849 389235 425274 465019 534084 652773 733689 751355 536578 278001
18727 278001 378153 520958 493447 538045 743264 646840 464721 552720 596237 590430 563683
18716 563683 458495 375661 445624 538018 559007 441110 332668 240513 188012 362210 375020
18705 375020 213627 179554 91019 101598 481416 667360 736154 907208 935982 1221866
18695 1221866 1406910 1467392 1634244 1685763 1564586 1293347 1037444 671943 364447 357288
18685 357288 600923 720176 591627 491095 680961 833764 670751 626704 642706 538944
18675 538944 396534 359587 530080 804069 758997 440197 339892 433718 334055 289543
18665 289543 467045 511146 451885 465390 512898 498316 570279 744062 704444 557546 623957
18654 623957 990018 1214499 1159137 1024019 976001 1010100 967421 867731 820934 853925 992662
18643 992662 973686 737544 623112 702467 676533 590108 618784 518542 563126 687913 688534
18632 688534 703486 815074 758779 729049 782412 921022 946007 823682 600395 443801
18622 443801 355990 325698 487592 717719 794938 752934 661897 599605 522804 671943 888656
18611 888656 1014462 1087632 1162632 1238417 1314000 1146260 1024324 1173279 1218100 902762
18601 902762 575758 543694 724060 909880 1172643 1309614 1389063 1509630 1820133 2348354
18591 2348354 2793152 3448985 4153723 4884135 5918201 6962540 7249484 6585868 5834213
18582 5834213 5076681 4293569 3685842 3345752 3002204 2805592 2800783 2734257 2439843 2050789
18572 2050789 1912242 1913717 1976424 2149971 2262820 2431913 2579829 2321843 2133842 2258841
18562 2258841 2411567 2666107 2922126 3010124 2962806 2964217 3073316 3008522 3026833 3160512
18552 3160512 3333000 3521556 3595735 3470785 3210514 2880084 2801317 2837263 2750790 2682048
18542 2682048 2680473 2680954 2566684 2410709 2347877 2332765 2127578 2107794 2345901 2644784 2870020
18531 2870020 2959300 2938260 2955665 3116987 3409685 3694953 3745197 3492662 3511531 3700457
18521 3700457 3978084 4114060 4015681 3980470 3784794 3652061 3612360 3694449 4034220 4508495
18511 4508495 5058830 5625228 6170679 6602906 6925560 7203528 7507221 7864609 8592968
18502 8592968 9338758 10079718 10810107 11138640 10782501 9890918 9058073 8499244 8107430
18493 8107430 7727782 7454604 7429652 7482453 6971530 6344524 5831764 5561863 5534332 5412405
18483 5412405 5352778 5524717 5745867 5861215 6265808 6647882 6944880 7206792 7476904 7871731
18473 7871731 8612170 9651981 10634140 11543619 12611453 13725801 14399798 14317651 13560874
18464 13560874 12461641 11417651 10688967 10243812 10252989 10751799 11464774 12260949 12961869
18455 12961869 13900398 15282422 17224951 19719020 23876122 30049419 39401555 53581192
18447 53581192 75640660 108453740 147441491 162867390 138169385 99847932 69861880
18440 69861880 50693388 38306145 30189772 24647447 21017498 18405294 16330287 14453314
18432 14453314 13038220 12064142 11458837 10906826 10515557 10107700 9327846 8549092 8127634
18423 8127634 7855602 7945567 8173257 8339176 8263336 7930092 7534165 7272601 7269551 7364779
18413 7364779 7392018 7358946 7022686 6641286 6605069 6394679 5917037 5528857 5281088 4968216
18403 4968216 4843101 4967083 5078869 5091221 4999695 4777510 4594518 4726124 4905972 5005477
18393 5005477 5148250 5461054 5761009 5914685 5777869 5867372 5850851 5714116 5513558 5661832
18383 5661832 5949596 6027614 5993341 5881240 5516633 4832743 4384268 4195908 3910609 3898655
18373 3898655 4131598 4106650 3976521 3779563 3547966 3484473 3410398 3205066 2989301 3100564
18363 3100564 3069188 2970413 3031169 3052185 3041865 2877686 2661583 2781479 3020909 3333655
18353 3333655 3614208 3622990 3526904 3474464 3580601 3421889 3228766 3262761 3187765 2921818
18343 2921818 2524607 2426712 2630786 2850773 3070454 3178199 3112993 2971942 2756072 2679562
18333 2679562 2759273 2943053 3099401 3043610 2793955 2779465 2924697 2873249 2645175 2458363
18323 2458363 2521621 2722306 3251016 3667377 4069115 4866085 5932017 7601451 9690928
18314 9690928 10948339 9564532 7154997 5457937 4358684 3582138 3044746 2785823 2509519
18305 2509519 2255515 2320660 2442018 2530987 2751049 2897891 2979093 2962028 2706804 2402402
18295 2402402 2102485 1954482 1943873 1737946 1730188 1726082 1602338 1557893 1535524 1510064 1420696
18284 1420696 1383419 1569518 1447597 1116826 985611 1072900 1273374 1390451 1492291 1458256
18274 1458256 1281083 1154856 1083790 1242989 1532344 1638396 1790471 1894873 2073428 2617486
18264 2617486 2881994 2835015 2871523 3295588 3880750 4262117 4796225 5959166 7579782
18255 7579782 9156227 10257460 10576194 9986620 8764554 7370884 6035285 5282653 5053863
18246 5053863 4757970 4574851 4496390 4516218 4699536 4671453 4253889 3894620 3665158 3396542
18236 3396542 3148876 2916081 2816399 3072176 3274450 3506602 3617305 3813293 3808879 3447742
18226 3447742 3081418 2951063 2790024 2588628 2313506 2160610 2117356 2157246 2213905 2259734
18216 2259734 2189779 2120766 2019006 1994605 2177473 2430574 2255360 1854114 1569199 1554760
18206 1554760 1622406 1669640 1777183 2157650 2316262 2378342 2539971 2712821 2835075 3071086
18196 3071086 3297389 3302161 3201449 3369152 3641513 3954078 4237594 4536689 4981662 5641272
18186 5641272 6228629 6827462 7598803 8916668 10545352 12722158 15866891 20464788 26850368
18177 26850368 35771752 48562062 68402941 98117786 134204513 153217612 138657990
18170 138657990 106208716 75464450 54046096 40026565 30723431 24082641 19278784
18163 19278784 15736448 13186017 11308975 10024475 8854567 7876747 7181986 6394078
18155 6394078 5505732 4686982 4232695 4100860 4178094 4157518 4024635 3875737 3848771 3978310
18145 3978310 4132380 4114374 3769191 3479694 3072860 2831796 2831361 2844754 2692544 2436421
18135 2436421 2422512 2598665 2663475 2619192 2412875 2382212 2499769 2686031 2846772 3080732
18125 3080732 3325248 3498604 3614949 3670542 3627725 3419437 3267550 3455224 3923713 4452843
18115 4452843 4937480 5539984 6361579 7322311 8689894 9953388 10444226 10019198 8953365
18106 8953365 7907261 7069310 6128736 5095176 4208831 3581654 3164916 2863698 2837166
18097 2837166 2973751 2938637 2695869 2372534 2235304 2130425 2239364 2522669 2769004 3090290
18087 3090290 3574507 3901952 3794596 3486346 3090610 2663737 2382133 2162098 1977557
18078 1977557 1914635 1918037 1985094 1889987 1947651 2190272 2207732 2178193 2306240 2528050 2493701
18067 2493701 2384632 2346445 2170167 2040239 1874657 1887619 2294419 2696352 2849619 2714357
18057 2714357 2445048 2258624 2372069 2188310 1651170 1489245 1689539 1838470 1817843 1694417
18047 1694417 1910563 2129958 2149694 1958490 1822354 1907841 2089493 2306899 2376756 2467310
18037 2467310 2604300 2597321 2479966 2715578 2944430 3002610 3165368 3241650 2922880 2445366
18027 2445366 2202586 2022858 1908987 1947971 2059962 2096051 2162477 2076557 2109583 2273216
18017 2273216 2338121 2287387 2226261 2386137 2466355 2380562 2378452 2234304 1998304 1817992 1471916
18006 1471916 1262774 1458201 1877833 1973004 1768704 1614740 1535926 1480381 1664461 1891395
17996 1891395 2224683 2706031 3121702 3198725 2822205 2206268 1770721 1688415 1735843 1619108
17986 1619108 1589200 1480695 1391804 1484840 1647631 1660967 1406908 1050221 969989 1245413
17976 1245413 1368538 1230897 1168838 1203406 948774 791961 695776 469217 460914 527736
17966 527736 704302 846111 1050533 1260816 1426772 1700551 1800429 1694161 1407820 1097741
17956 1097741 987332 1071050 945776 908143 1246370 1622417 1870382 2045481 2210127 2116608
17946 2116608 1865384 1694268 1596008 1526728 1577807 1697536 1743630 1677128 1683049 1704001 1602445
17935 1602445 1431357 1154586 988229 1084457 1341779 1580453 1737167 1680507 1653948 1716377
17925 1716377 1773361 1736428 1691647 1969210 2174489 1964603 1490844 983245 796018 852148
17915 852148 974770 933146 817701 899169 1076242 1273969 1453085 1510787 1548718 1612963
17905 1612963 1570574 1230796 1023732 1031362 1303402 1713394 1977065 1954532 1742998 1636988
17895 1636988 1595836 1535736 1356062 1388346 1414532 1359226 1375817 1534511 1922974 2364811
17885 2364811 2314999 2009891 1759845 1693507 1606874 1623615 1738648 1782714 1734380 1492827
17875 1492827 1235383 1051065 869795 716553 844913 1097908 1189571 1190903 1152650 1039809
17865 1039809 946213 1095392 1184557 1261445 1348431 1275064 1263523 1372213 1702938 2178984
17855 2178984 2419691 2613562 3137516 3776822 4662608 5952454 7861385 10363432 10889760
17846 10889760 8575396 6134985 4593964 3687592 3065891 2657769 2716614 2869093 2715041
17837 2715041 2627856 2635813 2594874 2609778 2403116 2186796 2060150 2023787 2105001 2028761 1969227
17826 1969227 2054264 2127093 2166531 2022725 1935612 2099547 2549834 3190104 3746936 4239607
17816 4239607 4615687 4823711 5112240 5486045 5488691 5082834 4676673 4350266 3928618 3402358
17806 3402358 3108006 2868641 2637654 2264686 1859197 1636989 1539961 1552394 1520025 1437274
17796 1437274 1139845 966560 1086792 1268924 1366876 1355728 1329516 1403637 1443333 1277704
17786 1277704 1149072 1171761 1141649 1128028 1335716 1584144 1466377 1272634 1355304 1389913
17776 1389913 1197586 1167762 1251027 1144494 1128300 1083507 1066150 1024346 947918 834209 789863
17765 789863 942935 1099467 1152537 1262274 1513204 1704473 1572687 1432364 1391223 1450492
17755 1450492 1433047 1589788 1566977 1458990 1458252 1366017 1188056 1208907 1127103 957265 1086387
17744 1086387 1250299 1260061 1302316 1296093 1091907 978356 1033791 1029422 1041412 1005669 909058
17733 909058 1078001 1289404 1228807 1042035 1098310 1074996 943120 1117623 1334426 1630978
17723 1630978 2136164 2447793 2240980 1908121 1843962 1787995 1561384 1606456 1954280 2166767
17713 2166767 2092004 2000185 1720104 1536313 1707590 1817933 1733898 1632893 1647341 1777668
17703 1777668 1900473 1892109 1699532 1463599 1258624 1012507 1018937 1114333 1120478 1152067 1119401
17692 1119401 1059739 998160 863919 698413 497264 465290 594448 796439 876461 870748
17682 870748 692257 470584 485384 507505 616124 929499 1247842 1430131 1482242 1385242
17672 1385242 1058130 955631 870513 836269 849123 804132 799772 972738 1269585 1335074 1467587
17661 1467587 1758441 2037408 2357687 2519288 2607552 2623749 2702017 2850127 2933496 3071743
17651 3071743 3316851 3468833 3265990 2982322 2882027 2659275 2348832 2029905 1878112
17642 1878112 1971905 2117861 2203866 2237320 2085100 1861755 1683592 1502568 1525537 1948877
17632 1948877 2240775 2301152 2185720 2082741 2178465 2134908 1926745 1639391 1424057 1266534
17622 1266534 1350692 1597600 1809734 2108862 2227389 2261311 2284131 2304272 2122120 2101162
17612 2101162 2222775 2407078 2610428 2985512 3453558 3585396 3452126 3249421 2950889
17603 2950889 2851153 2746695 2972017 3331258 3803923 4137325 4837358 5922954 7435336
17594 7435336 9177072 11874301 15621928 21057054 29208687 42122260 61519441 82055869
17586 82055869 78651738 55981272 38245813 26777457 19749560 14907538 11690719 9327769
17578 9327769 7777419 6507937 5576084 4870545 4503470 4165755 3997956 3735009 3554758
17569 3554758 3260749 2887918 2309233 1953415 1770420 1692790 1637370 1608150 1433587 1224340
17559 1224340 1121117 1176124 1262891 1388335 1328155 1292200 1235520 1130953 1209520 1397130
17549 1397130 1329601 1146821 1100059 934088 884202 1113748 1307141 1298997 1490643 1752208
17539 1752208 1711848 1638200 1687410 1727514 1730711 1723711 1617701 1749100 2036109 2266675 2256055
17528 2256055 2104218 1771937 1519745 1512914 1583676 1801596 2048972 2208609 2388913 2565017
17518 2565017 2750610 2942323 3193027 3398082 3536414 3467078 3242800 3100447 3230254 3696804
17508 3696804 4479781 5394693 6460183 7593780 8641911 9539624 10036073 9728360 8949192
17499 8949192 8128893 7326589 6336420 5441247 5022392 4865341 4515823 4103027 3869169
17490 3869169 3726714 3699523 3792099 3833931 3410504 3082593 2920266 2823351 2917754 3033097
17480 3033097 3104660 3237595 3349107 3483786 3485025 3447611 3442773 3462215 3232275 2872865 2662625
17469 2662625 2580294 2439053 2167993 2039310 2134941 2466693 2705285 2846114 3039275 3300000
17459 3300000 3564592 3717042 3925439 4248845 4631045 5123770 5716122 6123794 6330652
17450 6330652 6406877 6663924 7122644 7550508 8358054 9772756 11364967 12421318 12682632
17441 12682632 12383781 11653286 10912905 10367911 9965162 9629548 9853018 10446271 11133634
17432 11133634 11478331 11910703 12701408 13667829 14971965 16719062 18737563 21372470 25167145
17423 25167145 30422166 37296984 46437665 58764182 75142758 95377779 116441001
17416 116441001 131664621 137722583 138589983 141111588 152013471 173413788 187738146
17409 187738146 173536856 139436067 102853052 74729431 56246566 43759111 35038239
17402 35038239 28838399 24307753 20689889 17740445 15557787 13717467 11924596 10541994
17394 10541994 9556477 8772204 8116952 7478177 6720733 5976207 5621787 5439642 5020275
17385 5020275 4672735 4493029 4347810 4180491 4083382 4016204 3840137 3775681 3651870 3538124
17375 3538124 3221336 2830039 2657700 2400261 2205182 1885662 1502130 1441517 1444514 1403024
17365 1403024 1384936 1287260 1413718 1553899 1777160 1805470 1568763 1369333 1330651 1291607
17355 1291607 1343390 1519031 1826890 1944662 1742606 1603788 1480660 1465461 1491861 1417696
17345 1417696 1415766 1319027 1489534 1701698 1765485 1789536 1679296 1612688 1685359 1808891 1985000
17334 1985000 2027530 2012695 2146134 2413053 2694285 2988440 3175143 3476238 3696227 3573513
17324 3573513 3115028 2495304 1943902 1648214 1531500 1748260 2164220 2221652 2210634 2255753
17314 2255753 2119119 2133697 2112294 1959712 1997564 2085561 1930437 1786525 1720684 1621250
17304 1621250 1739676 1912160 2058501 2309592 2610770 2450087 1905536 1627680 1635190 1607629
17294 1607629 1507875 1562630 1562468 1335876 1076072 921026 752227 555591 500043 353935
17284 353935 114651 102346 281763 471276 361936 208290 227957 209572 319348 406758
17274 406758 425974 409318 109326 -41568 -103332 47208 233484 258532 342605 403360 366814
17263 366814 247739 357614 554504 665409 787841 784169 693715 601304 279937 -54825
17253 -54825 -90834 -121252 -20183 -21785 -79292 5396 -276130 -465093 -238329 -54872 151872
17242 151872 414788 378689 314005 151133 -71576 -3170 400066 565488 400977 263915
17232 263915 263626 225149 60919 -42798 5434 -117240 -2053 194409 98939 -228063 -439276
17221 -439276 -277380 -285718 -247828 -292252 -499815 -340369 -168876 -56608 156496 230049
17211 230049 215444 174576 30303 -4095 175688 226447 115732 -12431 -181332 -339685
17201 -339685 -186464 88166 159866 48741 -417922 -927169 -1047831 -915624 -687597 -581083
17191 -581083 -602907 -433280 -230680 -111506 -185866 -191403 -69313 -8683 -93273 -3088 381160
17180 381160 403027 228256 203498 245137 290986 394979 279129 203896 520900 951421
17170 951421 915497 709798 516419 244650 -32699 -134429 -47158 106808 177275 100174
17160 100174 -10730 -183296 -189324 -35595 -33286 -143221 -90270 69006 77420 -191943 -348085
17149 -348085 -284843 -232388 -232027 -160484 -89553 -25672 91581 122184 -4659 -23945 9989
17138 9989 63502 58321 62624 252259 286304 247156 111450 20031 133736 192861 241182 425281
17126 425281 484605 397216 222871 38120 -155044 -351394 -357051 -178222 -333709 -481346
17116 -481346 -315092 -217184 -87296 -84822 -54976 -33551 15897 132815 144727 148697 53200
17105 53200 -135167 -151103 -125763 -115686 -104601 -158941 -203363 -298420 -412408 -439155 -431360
17094 -431360 -396471 -271800 -156307 -251188 -285772 -185094 -51675 11226 284 83685 44844
17083 44844 -150110 -301083 -107344 106383 181641 255875 139687 -294700 -557462 -478579
17073 -478579 -412485 -355231 -146330 -142394 -306413 -400800 -308972 -209410 -99789 141652 -51136
17062 -51136 -206387 -70918 57249 42535 27636 64742 51291 107961 312458 444642 382110
17051 382110 209432 123178 96489 139261 394362 368518 186668 348481 287682 -3919
17041 -3919 21031 119633 86379 54561 236304 296329 430938 366809 305937 190936 198851
17030 198851 207614 70691 76464 -40859 -223705 -104735 187390 275415 223789 239692 232047
17019 232047 10217 -55254 -43721 -68712 118446 199790 161857 126438 51969 38495 121776
17008 121776 136337 133588 270286 258221 223137 63178 -84407 -149276 -111894 59352 41346
16997 41346 -4128 27038 -11522 -173308 -303564 -90497 214294 295953 247567 242557 293538
16986 293538 194276 44286 -203707 -292065 -219456 -219526 -312730 -371767 -205950 -90578 -205420
16975 -205420 -364560 -523745 -599499 -452207 -369476 -287877 -269977 -292942 -134779 -135555 -134536
16964 -134536 79777 18499 -36964 149336 379159 517064 469069 213596 -70814 -198730
16954 -198730 -96570 35805 -158820 -254539 -123447 -3969 1115 64327 177062 215685
16944 215685 93104 76261 -15667 -68198 23144 -53233 -300100 -519492 -573144 -673625 -392714
16933 -392714 -160239 -18337 -21688 94065 283613 342319 368500 299750 57626 -232795
16923 -232795 -220164 -7320 25022 -110624 -292475 -468027 -418580 -328256 -241614 -217507 -130834
16912 -130834 -336304 -575412 -508292 -489863 -493722 -527943 -601180 -727567 -634169 -432023 -429876
16901 -429876 -436806 -383809 -363911 -434113 -348553 -109497 142374 138562 -8539 -28332 55639
16890 55639 64114 73210 160770 174328 138345 83804 -53884 -55169 282773 469321 419493 367122
16878 367122 274293 252341 157204 -74350 -43396 99028 268526 222152 11523 -296124
16868 -296124 -301074 -43744 354319 592881 636711 702558 646433 638649 822190 848690 792373
16857 792373 846981 927486 781654 568791 391098 348728 434624 356164 272610 418090 802988
16846 802988 1143907 1506920 1772694 1881960 2177859 2547174 2786515 3059653 3232161 3368393
16836 3368393 3522477 3903129 4398650 4541249 4521998 4540762 4418495 4012662 3362788 2904274
16826 2904274 2671723 2282168 2026645 1923800 1722320 1425583 965207 749094 787688 888365
16816 888365 923732 1094349 1271851 1655172 1980400 1904040 1584088 1302398 1348191 1419728
16806 1419728 1261780 1061693 1023797 1060209 978742 560420 405096 462690 334851 264546
16796 264546 393134 343195 182121 94431 110181 204356 143715 232695 110465 -114157 -142527
16785 -142527 44869 283064 283230 185216 122203 162879 27684 -161811 -221681 -70090 229419
16774 229419 404612 351949 252721 64439 -229624 -444879 -617849 -514142 -347048 -335551
16764 -335551 -282384 -113172 33228 109327 185391 320027 532958 597082 553956 235256
16754 235256 32770 180959 270675 318898 471988 331645 40077 -259284 -619977 -646816
16744 -646816 -530514 -382819 -185751 -30756 77344 92695 105797 272675 360404 311145
16734 311145 145819 -175045 -430920 -470868 -431223 -473450 -389819 -261601 -291084 -492117
16724 -492117 -471285 -331956 64599 357077 303435 155368 -5866 -228604 -475713 -623652
16714 -623652 -574758 -498080 -269868 107951 221650 133200 275 8267 27262 72948 141078
16703 141078 118893 -234718 -581999 -651340 -641434 -342266 -71666 53372 267468 458638
16693 458638 492464 616765 690321 525429 467815 336368 214637 168391 186668 390273
16683 390273 520647 408790 223394 79408 -15883 138039 294262 130002 -233059 -454335
16673 -454335 -439344 -394291 -296356 -213407 -214159 -157259 -132920 -333603 -531517 -508705 -559921
16662 -559921 -703146 -700056 -482988 -196163 57867 -34906 -285385 -556356 -663873 -515246
16652 -515246 -386497 -368777 -431178 -490331 -501473 -479016 -194519 -173391 -272397 -249234 -134115
16641 -134115 87611 65915 -118595 -227011 -255604 -364765 -297529 -71368 -32597 -177451
16631 -177451 -183814 3992 -6925 -95018 -210669 -404056 -413699 -479063 -627885 -652957 -440086
16620 -440086 -322021 -235101 -266438 -461907 -469668 -158547 107440 99263 116483 163468 73926
16609 73926 186886 370138 402836 299337 251454 216230 122315 51796 24830 136768 130823
16598 130823 -58365 -333690 -501959 -442375 -463696 -521800 -339024 -198257 -55375 172014
16588 172014 247065 125201 78677 182918 220721 162420 200452 165337 -66122 -193584 -246193
16577 -246193 -362783 -513678 -504346 -426472 -194972 -46182 -11857 53058 76373 -25490 -174550
16566 -174550 -192349 -220483 -515200 -564657 -559855 -675987 -837818 -774957 -547895 -344683 -404406
16555 -404406 -626494 -614219 -319761 -13502 24852 -168356 -272953 -279030 -367184 -344185 -150358
16544 -150358 91967 121384 -223574 -332608 -147270 -64196 -10505 81269 20255 -97566
16534 -97566 -76563 66176 53210 -15097 50818 215924 56859 -239739 -268957 -241984 -355478
16523 -355478 -621145 -952628 -1100259 -890858 -534777 -318085 -181922 12934 76209 -205314
16513 -205314 -362617 -472470 -523210 -420142 -349267 -314240 -415201 -506563 -538781 -724158
16503 -724158 -647951 -476504 -340664 -127982 -152817 -171357 64597 363420 330785 231023
16493 231023 112430 80770 53024 17712 35365 -70125 -175032 -138055 -90058 -169061 -341206
16482 -341206 -432479 -533465 -606174 -385033 -245622 -140847 -154849 -211115 -207418 -367538 -526833
16471 -526833 -579628 -578002 -564292 -427300 -212034 -12837 141032 221565 9363 -198810
16461 -198810 -139526 -57822 -91683 -242492 -236817 -165658 -115054 -92753 -153454 -378293 -583533
16450 -583533 -436203 -407987 -569758 -512194 -331264 -139717 26168 21171 1366 21784 -152016
16439 -152016 -64070 14986 -206468 -473918 -577401 -498326 -439324 -294010 -263630 -62291
16429 -62291 160595 72581 -158266 -377445 -446344 -331939 -192318 -217690 -148160 -17111
16419 -17111 -92289 -158953 -256440 -376686 -638945 -793670 -762036 -779595 -602858 -278522 -229009
16408 -229009 -554401 -668468 -622511 -607127 -527696 -317997 -172414 -155668 -180807 -276932 -388740
16397 -388740 -459150 -290163 -89406 -43751 -174643 -185119 -102475 -198866 -385571 -263639
16387 -263639 -59809 221354 269210 -190507 -459546 -265700 -232948 -304251 -357700 -440951
16377 -440951 -448696 -391410 -529846 -565607 -348621 -184129 -113637 -158569 -405701 -541216 -530596
16366 -530596 -684115 -819656 -802192 -612880 -437427 -479713 -456915 -303250 -168212 -201118
16356 -201118 -426770 -660019 -589950 -537739 -462739 -273432 -310267 -375358 -232856 -98408
16346 -98408 -143010 -325281 -584468 -797629 -752994 -486898 -238715 -184106 -185277 -257458 -120622
16335 -120622 39489 68337 60093 151215 247005 197775 139070 23501 -234405 -381763 -494235
16324 -494235 -577789 -581447 -648679 -722893 -537742 -173559 38615 -39049 -143073 -146894 -66669
16313 -66669 -55460 -154174 -214255 -272600 -191222 111394 279540 342996 384379 342212 284306
16302 284306 207306 199715 227074 317073 334889 90157 36025 105618 -20111 -41244 -130187
16291 -130187 -81290 35419 153863 133030 -141700 -171599 289973 516354 376523 115026
16281 115026 -34580 -65630 -279538 -416109 -275547 -141306 -41326 -147844 -545250 -665144
16271 -665144 -534842 -400478 -313282 -315332 -269744 -145019 -82765 -49548 60653 -165621 -408955
16260 -408955 -378243 -490817 -474561 -312039 -225146 -166263 -8919 -129669 -439224 -449467
16250 -449467 -477875 -402432 -425653 -456521 -322918 -226923 -282045 -331918 -417579 -659997 -726164
16239 -726164 -587710 -469602 -418920 -378100 -339115 -629825 -913919 -1009689 -859167 -465125
16229 -465125 -463831 -690613 -809090 -807470 -752160 -582299 -567922 -652202 -827311 -816928 -582488
16218 -582488 -650635 -822377 -744531 -429964 -210168 89036 385525 222557 -121203 -363092
16208 -363092 -463300 -386286 -286675 -464917 -659084 -799847 -749381 -529998 -351863 -311397
16198 -311397 -319278 -372717 -383476 -301290 -336006 -323163 -193868 73387 162840 165619 119817
16187 119817 6943 -74004 -185298 -172958 -56606 166612 245707 3511 -163126 -196319
16177 -196319 36494 161674 -54552 -298495 -320270 -412357 -371844 -173108 -142444 -66940
16167 -66940 122124 199523 106297 -46451 -256741 -357473 -228082 -88163 -25401 66968
16157 66968 95137 -88475 -317244 -214404 -97717 -89258 -59108 -94006 -234306 -196870 -109441
16146 -109441 -117325 -177036 -108499 -84787 -278181 -292032 -9777 104110 -13570 -194104 -454565
16135 -454565 -545270 -446747 -363551 -410821 -723320 -1017763 -1000742 -652706 -342278 -74915
16125 -74915 -191755 -212060 -33250 -12465 -144762 -299981 -260098 -217585 -236302 -412259 -443052
16114 -443052 -408485 -399843 -362139 -374891 -275022 -114202 -43482 70220 50512 -80876 -94415
16103 -94415 90159 105925 -93604 -247451 -211276 -119754 -154550 -284912 -166920 -39409
16093 -39409 -46382 -55817 53651 40276 104994 126096 -31935 -302144 -417583 -429611 -425559
16082 -425559 -472711 -446453 -520704 -548353 -375318 -416420 -620717 -821091 -886015 -900896 -835024
16071 -835024 -826041 -676484 -493659 -403176 -159417 -50616 -33047 -126326 -223349 -256757 -309183
16060 -309183 -159907 -23008 -79517 -29475 57011 -102835 -294470 -314255 -226361 -190949 -256558
16049 -256558 -257155 -265979 -271166 -196134 -34036 8568 -121352 -14728 -83448 -206794 -218847
16038 -218847 -176086 -265098 -266329 -188531 -345173 -558295 -692611 -554486 -675620 -802644
16028 -802644 -737004 -374921 -138199 -59072 76907 43900 -35168 25990 -29187 -10842 29747
16017 29747 2307 51246 276902 555877 587412 403928 103480 -121632 -256974 -371480
16007 -371480 -310840 -181510 52029 96744 2783 -116284 -135586 -165715 -343220 -485437
15997 -485437 -350132 -19996 193882 218304 295053 345927 237249 224599 105639 -104488
15987 -104488 -258086 -255935 -137637 -103937 -31412 -11258 -65728 17327 9894 -6686 73153
15976 73153 90505 -7894 -87411 -201616 -287350 -450192 -564078 -543671 -524754 -535074 -382660
15965 -382660 -113987 68643 16721 -178164 -287778 -224281 -254335 -440048 -411749 -99811
15955 -99811 57621 81114 141227 143155 8382 24036 35589 -31577 -315749 -460633 -275257
15944 -275257 -8473 -23048 -168704 4178 126018 156444 229831 163608 1270 -157431
15934 -157431 -322058 -526835 -421160 -225392 -119623 -55960 10798 36014 11149 -30987
15924 -30987 -69329 -41214 -32977 -117037 -56703 157462 186850 163012 339134 661384 881228
15913 881228 950908 779677 521277 393434 198421 70629 170904 395100 537659 623531
15903 623531 635838 476536 410025 349066 434225 521384 507167 509722 583068 546055 268980
15892 268980 213910 153601 139168 246077 315288 345970 227315 142986 139330 185088 311599
15881 311599 459949 455082 381418 306449 266654 373663 414591 475125 454697 501939 466096
15870 466096 411598 483607 546584 596415 586140 279884 -8590 -9367 251847 197231 -184723
15859 -184723 -345720 -360181 -298490 -166896 -138699 -284146 -234421 -40293 -48603 -23753 -35526
15848 -35526 -96741 -220406 -299035 -235313 -132070 -175522 -333187 -346674 -223527 -122604 -201880
15837 -201880 -308146 -177487 11647 -60915 -7201 175143 290118 140626 -16929 21023
15827 21023 64771 68869 -12455 -142486 -362085 -339403 -217724 -213775 -164508 -211456 -382500
15816 -382500 -229869 -74537 -127106 122471 152049 -128971 -307465 -293173 -189924 -42338
15806 -42338 -2562 -28135 241739 384199 267137 196850 77894 -5297 -70893 -36512 -157178
15795 -157178 -399056 -563879 -681234 -672622 -745620 -944248 -935223 -793641 -680869 -661649 -369271
15784 -369271 107112 203797 146751 -2800 -97071 -61821 -104549 -180372 -187510 -146263 -125885
15773 -125885 -201814 -269504 -356923 -447806 -525157 -456936 -174612 -89045 -94719 -20216 178542
15762 178542 129640 -71404 -277403 -273677 -241737 -257754 -322086 -290078 97528 64156 -166971
15751 -166971 -171407 -259259 -403020 -588557 -425754 -158259 -135329 -370224 -362167 -346732 -377149
15740 -377149 -356799 -293447 -286085 -319608 -233478 -239640 -440260 -473925 -323269 -280001 -324859
15729 -324859 -410571 -462619 -649399 -532475 -121879 30548 -11169 76526 -68035 -373866
15719 -373866 -424053 -338716 -334867 -325497 -380200 -555363 -591771 -438405 -348505 -359138 -291801
15708 -291801 -198997 -387993 -473324 -541124 -461956 -278074 -354122 -450016 -510044 -607358 -770589
15697 -770589 -715021 -498576 -348138 -228161 -72849 111277 196116 58662 -360631 -613736
15687 -613736 -561437 -398420 -176871 136416 349332 342907 316608 423978 429871 257328 5970
15676 5970 -292435 -557981 -759178 -752189 -495561 -343276 -276073 -320889 -486208 -592287 -452814
15665 -452814 -182110 7165 163236 336084 129595 -292963 -415048 -359667 -197710 -126408
15655 -126408 -157694 -99544 -202144 -274449 -218041 -1412 141013 201710 200541 82578 115630
15644 115630 101732 143487 69537 -341 28221 164716 -41660 -281107 -212524 -118158 -176099
15633 -176099 -77985 91873 24552 50013 217410 242629 110448 -134593 -324519 -454223
15623 -454223 -485043 -268955 -1333 -23570 -319198 -519556 -515330 -484642 -728722 -963389
15613 -963389 -887655 -569965 -339178 -158954 -96066 -272065 -379447 -350395 -347513 -266443 -217582
15602 -217582 -32693 80210 120021 189142 220320 250916 96744 -7512 75690 116684 27027
15591 27027 -106986 -191989 -273070 -338109 -302041 -417907 -701309 -867715 -1012393 -1105059 -1054872
15580 -1054872 -753272 -543821 -396017 -253491 -193862 -73958 -201137 -457756 -532693 -510589
15570 -510589 -518487 -402791 -201074 -163946 -252091 -297766 -195152 14855 171483 167079 116228
15559 116228 87167 126410 170674 224868 351457 343051 232352 91939 -55158 -98405 -46880
15548 -46880 33640 71980 8828 -251529 -304394 -92143 -68736 -119233 -182499 -386043 -559574
15537 -559574 -578542 -682563 -920725 -949323 -781629 -652323 -492325 -467776 -344044 -56893
15527 -56893 -4484 -217754 -328532 -440831 -349866 -309954 -419470 -468363 -496552 -429628 -259023
15516 -259023 -245360 -350603 -543389 -630896 -549511 -539145 -514842 -192864 -42412 -119696 -252309
15505 -252309 -258405 -231456 -209135 -53902 108166 -55592 -315384 -399916 -490684 -659430 -742226
15494 -742226 -758044 -690796 -711385 -716993 -629888 -472815 -492078 -537925 -545422 -689611 -724348
15483 -724348 -485305 -440017 -601692 -743735 -711440 -532420 -520239 -478533 -448546 -311479
15473 -311479 -194501 -110191 -169415 -143975 -179390 -279247 -281835 -252093 -165400 -371701 -609468
15462 -609468 -572890 -538280 -510303 -427492 -256299 -262051 -196167 -29025 -11322 -146430 -384464
15451 -384464 -350368 -214806 -171689 -145898 -293421 -287164 -113678 -143119 -309232 -295948 -273814
15440 -273814 -393711 -477958 -516242 -461507 -355874 -320642 -304810 -281470 -69682 224866 265263
15429 265263 207376 315296 348045 79756 -53008 -160905 -588157 -862465 -819231 -617560
15419 -617560 -616638 -541226 -548372 -619441 -524737 -525612 -583003 -514512 -502185 -642712 -603043 -512709
15407 -512709 -383999 -232646 -435864 -596410 -397055 -203981 35120 88832 -93497 -266759
15397 -266759 -253694 -145868 -273993 -457895 -348158 -98370 57714 55664 -145570 -375723
15387 -375723 -473743 -366027 -254744 -279106 -362882 -366732 -504976 -362319 -288137 -357267 -278722
15376 -278722 -202339 -258728 -162603 142218 422235 443877 415325 410550 388321 424505 322540
15365 322540 238186 172295 22898 -113551 -6207 158580 181386 -412 -45264 -135631
15355 -135631 -258409 -348944 -398020 -431048 -428811 -420667 -387402 -209772 -199215 -275468 -320526
15344 -320526 -304215 -107748 -6836 -51688 -141586 -212107 -352913 -521983 -685810 -697361
15334 -697361 -546040 -464786 -507524 -309163 -37634 -10574 -85792 -252107 -349024 -317422 -309240
15323 -309240 -205505 -139303 -120347 -78048 -53217 -5364 -14363 115521 322524 340324 209505
15312 209505 193054 -4824 -170997 -247336 -298062 -227248 -104870 -16862 -27182 -145762 -228796
15301 -228796 -244057 -88956 112006 223307 329942 520151 594310 558901 232698 -81668
15291 -81668 56371 274911 265340 139724 76017 -21658 -134154 61166 425055 514606 300563
15280 300563 62001 119466 126130 41324 -12515 -99523 -84764 -285673 -517425 -393569 -262509
15269 -262509 -278140 -391531 -343635 -251228 -206468 -251973 -264953 -374380 -586739 -653917 -573660
15258 -573660 -568511 -466704 -399325 -323576 -226661 -218203 -237233 -217426 -197265 -345663 -534000
15247 -534000 -677590 -620108 -680627 -823290 -788503 -647206 -461449 -375295 -397884 -367688 -536891
15236 -536891 -658905 -566428 -553547 -451076 -216358 -177574 -233350 -74510 82526 -48319
15226 -48319 -256138 -359407 -207805 -194333 -309541 -70438 126847 309717 395151 156798
15216 156798 -101046 -365755 -620511 -598880 -412706 -356572 -213096 -28959 209145 284052
15206 284052 236882 24003 -117906 -222570 -386657 -336051 -361747 -398046 -443120 -448504 -331553
15195 -331553 -415856 -460741 -570246 -515334 -399623 -474760 -403839 -179647 102909 253198
15185 253198 65660 -42971 -98206 -115136 56056 189756 101020 -122540 -319560 -247545
15175 -247545 -79946 -70278 -158403 -205406 -250984 -461261 -613233 -617193 -573694 -514591 -353588
15164 -353588 -207290 -208530 -316018 -309308 -363815 -468744 -407200 -434388 -507557 -623253 -784485
15153 -784485 -699254 -555005 -460038 -384981 -321698 -514383 -513147 -426041 -446593 -564273 -759984
15142 -759984 -727299 -655480 -589641 -481668 -475903 -349513 -194333 -163970 -118904 -27314 132271
15131 132271 186837 -9826 10336 5242 -106013 -75317 -307835 -615418 -682872 -721845 -560310
15120 -560310 -492874 -486571 -481971 -489288 -502436 -400217 -494603 -728461 -708835 -425327 -177434
15109 -177434 -18647 143804 -122797 -375084 -423143 -414014 -299698 -73175 -5953 -176140
15099 -176140 -42488 156169 112235 -195118 -500393 -582328 -515894 -315995 -338481 -285416
15089 -285416 -151264 -81002 -109385 -336915 -426120 -269132 13762 217350 126172 19180
15079 19180 -181675 -435789 -425345 -241225 9484 179401 271959 456944 596181 585848
15069 585848 464488 109192 -57795 115395 274575 498154 611972 642637 531364 129355
15059 129355 -137838 -125461 84943 151032 268454 198646 43653 -201258 -530288 -469660
15049 -469660 -167201 38122 81359 -250615 -394150 -414664 -471815 -385727 -362705 -423135 -493366
15038 -493366 -536001 -392119 -187424 -340483 -772715 -746847 -445647 -320473 -409124 -562115
15028 -562115 -535722 -379962 -247269 -270007 -410999 -446441 -426809 -235234 81896 150881
15018 150881 139327 45659 -38346 62837 185115 92462 42764 -201119 -436346 -440966 -396860
15007 -396860 -328413 -289525 -379028 -486268 -465453 -132381 150689 337104 334451 220201 179804
14996 179804 35455 -111055 -396423 -830510 -1031401 -1184876 -1277401 -1147876 -938814 -714162
14986 -714162 -451341 -237406 -150116 -133643 -147450 -247416 -299055 -260879 -125232 56990 244889
14975 244889 158425 -19652 113942 198348 142222 199189 313741 374197 459574 556468 408777
14964 408777 254092 84019 -196603 -133494 -25775 -146545 -200565 -51077 -110206 -77171
14954 -77171 -41165 -155709 -289082 -234035 -164002 -105238 -69552 -267998 -251612 -17968 68707
14943 68707 -15069 -39514 260177 429862 32774 -417667 -545909 -259187 -216049 -370921
14933 -370921 -310405 -203656 -158029 -80180 -91568 -197085 -312091 -259232 -130580 -206601 -270663
14922 -270663 -238684 -331236 -294948 -197535 -132930 -4580 19052 94195 84671 97759 42541
14911 42541 9804 138849 91845 -75392 -136029 -205709 -233121 -319813 -425360 -469764 -481076
14900 -481076 -337961 -380493 -512509 -611585 -460260 -250585 -134343 -106520 -16638 -49877
14890 -49877 -289491 -317662 -188996 -24696 96994 97420 25398 16930 21767 -39324 10279 122722
14878 122722 168805 209440 293315 356821 259735 30315 -152877 -51691 259526 454301
14868 454301 697492 657165 369612 183905 38623 46373 45827 -28808 -40483 -86641 -199371
14857 -199371 -286690 -265186 -118225 -99389 -124588 -82848 121553 301705 307001 112002 2214
14846 2214 -14455 -73389 -344042 -563995 -407569 -321422 -469828 -466620 -200566 -61122 -48940
14835 -48940 -80470 -93240 -125321 -208010 -362131 -299380 -240788 -422825 -462262 -527448 -521103
14824 -521103 -351228 -240198 -194105 -241872 -364245 -559109 -895533 -787782 -471975 -463206
14814 -463206 -570313 -744566 -881476 -839631 -637060 -572166 -528237 -573479 -821085 -792641
14804 -792641 -514971 -361991 -419185 -412322 -333896 -410518 -417148 -223565 -82511 86005 165283
14793 165283 76641 -157083 -413915 -394639 -224570 -142011 -336911 -421906 -443553 -404750 -395672
14782 -395672 -334549 -314367 -182370 112740 256505 136943 -85749 -144811 -80967 -91703
14772 -91703 11909 97569 63981 -218652 -341622 -424155 -495844 -410036 -415983 -401251 -349527
14761 -349527 -210731 -99663 41932 -124152 -196799 -23921 49282 -144052 -262141 -126626
14751 -126626 37332 190793 109347 -84586 -364003 -413442 -111165 -10934 -71763 12626
14741 12626 36064 -82607 -83807 35456 -8017 -227943 -488430 -525331 -162814 130948 106611
14730 106611 -25005 -208081 -243030 -120466 -145725 -224947 -257256 -223637 -50820 -75634 -247004
14719 -247004 -305982 -359224 -413791 -449449 -708859 -714374 -450190 -288401 -129915 76021 252239
14708 252239 12707 -317204 -395162 -393110 -196624 100665 32589 -274177 -346348 -321383 -387263
14697 -387263 -368275 -402034 -589859 -815797 -841971 -878002 -722002 -559672 -512507 -318503
14687 -318503 -255775 -419238 -401467 -319822 -305364 -294757 -212045 -367059 -533488 -628509 -641973
$$ [...]
##END NTUPLES=NMR SPECTRUM
##END=
