##TITLE=C13_SA_37_185
 D2O, 2700 sc

 3.3.2020
##JCAMPDX= 6.0         $$ Bruker NMR JCAMP-DX V2.0
##DATA TYPE= NMR SPECTRUM
##DATA CLASS= NTUPLES
##ORIGIN= UXNMR, Bruker Analytische Messtechnik GmbH
##OWNER= root
$$ XWIN-NMR		Version 3.5
$$ Wed Mar  4 13:43:45 2020 Russian Standard Time (UT+4h)  she@DPX200
##.OBSERVE FREQUENCY= 50.327896
##.OBSERVE NUCLEUS= ^13C
##.ACQUISITION MODE= SIMULTANEOUS
##.ACQUISITION SCHEME= undefined
##.AVERAGES= 16580
##.DIGITISER RES= 17
##SPECTROMETER/DATA SYSTEM= spect
##.PULSE SEQUENCE= zgpg30
##.SOLVENT NAME= MeOD
##.SHIFT REFERENCE= (INTERNAL, MeOD, 0, 222.624)
##AUDIT TRAIL= $$ (NUMBER, WHEN, WHO, WHERE, WHAT)
$$ ##TITLE= Audit trail, XWIN-NMR		Version 3.5
$$ ##JCAMPDX= 5.01
$$ ##ORIGIN= Bruker BioSpin GmbH
$$ ##OWNER= she
$$ F:/spectra/data/she/nmr/c13/1/pdata/1/auditp.txt
$$ ##AUDIT TRAIL=  $$ (NUMBER, WHEN, WHO, WHERE, WHAT)
(   1,<2020-03-04 08:33:49.10 +0400>,<she>,<DPX200>,
      <created by zg, POWCHK disabled, PULCHK disabled
       terminated by command 'halt'
       configuration hash MD5:
       00 E9 B6 7A A2 85 ED C7 34 08 36 98 17 FE 4E 26
       data hash MD5: 32K
       29 45 9D 9B 10 F4 E9 FD B0 3A 7A 6F 50 C7 01 77>)
(   2,<2020-03-04 13:42:24.92 +0400>,<she>,<DPX200>,
      <Start of raw data processing
       efp BC_mod = 2 LB = 1 FT_mod = 6 PKNL = 1 PHC0 = -223.5674 PHC1 = 26.00638 SI = 32K 
       data hash MD5: 32K
       3A 93 7C B6 82 F8 9E 47 2A DB A2 35 BD 1E B8 4A>)
(   3,<2020-03-04 13:42:27.85 +0400>,<she>,<DPX200>,
      <abs ABSG = 5 
       data hash MD5: 32K
       F8 7C 7A AD 51 1A 89 AB 17 EF A6 B4 BE E5 F3 2E>)
(   4,<2020-03-04 13:42:50.01 +0400>,<she>,<DPX200>,
      <pk PHC0 = -12.61066 PHC1 = 10.6 
       data hash MD5: 32K
       40 84 73 79 FD 52 88 BD AE 9D 12 3C 0C 9D 01 F5>)
(   5,<2020-03-04 13:42:53.67 +0400>,<she>,<DPX200>,
      <abs ABSG = 5 
       data hash MD5: 32K
       16 78 D8 B8 8D 20 DC 63 3D F0 B2 AA 0F 57 29 D9>)
$$ ##END=
$$ 
$$ hash MD5
$$ 71 29 D2 34 9F C5 CA D7 D3 A3 16 C8 F4 15 48 6B
##$RELAX= 
##$RELAX= 
##$RELAX= 
##$RELAX= 
##$RELAX= 
##$RELAX= 
##$RELAX= 
##$RELAX= 
$$ Bruker specific parameters
$$ --------------------------
##$DU= <F:/spectra>
##$EXPNO= 1
##$NAME= <c13>
##$PROCNO= 1
##$TYPE= <nmr>
##$USER= <she>
##$AMP= (0..31)
100 100 100 100 100 100 100 100 100 100 100 100 100 100 100 100 100 100 
100 100 100 100 100 100 100 100 100 100 100 100 100 100 
##$AQSEQ= 0
##$AQ_mod= 1
##$AUNM= <au_zg>
##$AUTOPOS= <>
##$BF1= 50.322709
##$BF2= 200.13
##$BF3= 50.322709
##$BF4= 500.13
##$BF5= 500.13
##$BF6= 500.13
##$BF7= 500.13
##$BF8= 500.13
##$BYTORDA= 1
##$CFDGTYP= 0
##$CFRGTYP= 5
##$CHEMSTR= <none>
##$CNST= (0..31)
1 1 145 1 1 1 1 1 1 1 1 1 1 1 1 1 1 1 1 1 1 1 1 1 1 1 1 1 1 1 1 1 
##$CPDPRG= <waltz16>
##$CPDPRG1= <>
##$CPDPRG2= <waltz16>
##$CPDPRG3= <>
##$CPDPRG4= <mlev>
##$CPDPRG5= <mlev>
##$CPDPRG6= <mlev>
##$CPDPRG7= <mlev>
##$CPDPRG8= <mlev>
##$CPDPRGB= <>
##$CPDPRGT= <>
##$D= (0..31)
$$ [...]
##$SUBNAM4= <"">
##$SUBNAM5= <"">
##$SUBNAM6= <"">
##$SUBNAM7= <"">
##$SUBNAM8= <"">
##$SUBNAM9= <"">
##$SW= 239.972175391363
##$SWIBOX= (0..15)
0 1 3 0 0 0 0 0 0 0 0 0 0 0 0 0 
##$SW_h= 12077.2946859903
##$TD= 32768
##$TD0= 1
##$TE= 0
##$TE2= 300
##$TE3= 300
##$TEG= 300
##$TL= (0..7)
120 120 120 120 120 120 120 120 
##$TP= (0..7)
150 150 150 150 150 150 150 150 
##$TP07= 0
##$TPNAME0= <>
##$TPNAME1= <>
##$TPNAME2= <>
##$TPNAME3= <>
##$TPNAME4= <>
##$TPNAME5= <>
##$TPNAME6= <>
##$TPNAME7= <>
##$TPOAL= (0..7)
0.5 0.5 0.5 0.5 0.5 0.5 0.5 0.5 
##$TPOFFS= (0..7)
0 0 0 0 0 0 0 0 
##$TUNHIN= 0
##$TUNHOUT= 0
##$TUNXOUT= 0
##$USERA1= <user>
##$USERA2= <user>
##$USERA3= <user>
##$USERA4= <user>
##$USERA5= <user>
##$V9= 5
##$VALIST= <valist>
##$VCLIST= <CCCCCCCCCCCCCCC>
##$VD= 0
##$VDLIST= <DDDDDDDDDDDDDDD>
##$VPLIST= <PPPPPPPPPPPPPPP>
##$VTLIST= <TTTTTTTTTTTTTTT>
##$WBST= 1024
##$WBSW= 4
##$XGAIN= (0..3)
0 0 0 0 
##$XL= 0
##$YL= 0
##$YMAX_a= 90329379
##$YMIN_a= -29847995
##$ZGOPTNS= <>
##$ZL1= 120
##$ZL2= 120
##$ZL3= 120
##$ZL4= 120
##$ABSF1= 222.624
##$ABSF2= -17.3728
##$ABSG= 5
##$ABSL= 3
##$ALPHA= 0
##$AQORDER= 0
##$ASSFAC= 0
##$ASSFACI= 0
##$ASSFACX= 0
##$ASSWID= 0
##$AUNMP= <proc_1d>
##$AZFE= 0.1
##$AZFW= 0.5
##$BCFW= 0
##$BC_mod= 2
##$BYTORDP= 0
##$COROFFS= 0
##$CY= -3
##$DATMOD= 1
##$DC= 0
##$DFILT= <>
##$DTYPP= 0
##$F1P= 0
##$F2P= 0
##$FCOR= 0.5
##$FTSIZE= 32768
##$FT_mod= 6
##$GAMMA= 0
##$GB= 0
##$INTBC= 1
##$INTSCL= 4.134877e-10
##$ISEN= 128
##$LB= 1
##$LEV0= 0
##$LPBIN= 0
##$MAXI= 10000
##$MC2= 0
##$MEAN= 0
##$ME_mod= 0
##$MI= 0.1934396
##$NCOEF= 0
##$NC_proc= 1
##$NLEV= 6
##$NOISF1= 120.0001
##$NOISF2= 80.00006
##$NSP= 0
##$NTH_PI= 0
##$NZP= 0
##$OFFSET= 222.624
##$PC= 1.4
##$PHC0= -236.1781
##$PHC1= 36.60638
##$PH_mod= 1
##$PKNL= yes
##$PPARMOD= 0
##$PSCAL= 0
##$PSIGN= 0
##$REVERSE= no
##$SF= 50.3227315989248
##$SI= 32768
##$SIGF1= 140
##$SIGF2= 120
##$SINO= 11.81781
##$SIOLD= 32768
##$SREGLST= <13C.CDCl3>
##$SSB= 0
##$STSI= 32768
##$STSR= 0
##$SW_p= 12077.2946859903
##$SYMM= 0
##$S_DEV= 0
##$TDeff= 32768
##$TDoff= 0
##$TI= <>
##$TILT= no
##$TM1= 0
##$TM2= 0
##$TOPLEV= 0
##$USERP1= <user>
##$USERP2= <user>
##$USERP3= <user>
##$USERP4= <user>
##$USERP5= <user>
##$WDW= 1
##$XDIM= 32768
##$YMAX_p= 385153149
##$YMIN_p= -5001777
$$ End of Bruker specific parameters
$$ ---------------------------------
##NTUPLES= NMR SPECTRUM
##VAR_NAME=  FREQUENCY,     SPECTRUM/REAL,   SPECTRUM/IMAG
##SYMBOL=    X,             R,               I
##VAR_TYPE=  INDEPENDENT,   DEPENDENT,       DEPENDENT
##VAR_FORM=  AFFN,          ASDF,            ASDF
##VAR_DIM=   32768,         32768,           32768
##UNITS=     HZ,            ARBITRARY UNITS, ARBITRARY UNITS
##FACTOR=    0.368581032318806, 1,           1
##FIRST=     11203.0474431902, 0,            0
##LAST=      -874.247242800138, 0,           0
##MIN=       -874.247242800138, -5001777,    0
##MAX=       11203.0474431902, 385153149,    0
$$ Real data points
##PAGE= N=1
##DATA TABLE= (X++(R..R)), XYDATA
$$ [...]
##PAGE= N=2
##DATA TABLE= (X++(I..I)), XYDATA
$$ plain form
22641 16328804 16498058 16904475 17254806 17249137 17208210 17004233 16625925 15911058 15549368 16358217
22631 16358217 17187920 17505615 17760162 18110186 17237331 16490753 16115737 16458727 17109154
22622 17109154 18131570 18652781 18944908 19170776 18547561 17584691 17186503 17681448 17808730
22613 17808730 17954527 17256503 16853505 16966971 17284682 18174630 18406867 17702956 17447149
22604 17447149 17539629 17036486 16549182 16638632 16726907 17353356 17987812 18298321 18140359 17544084
22594 17544084 17087597 17424840 17702713 17883392 18182837 18351168 18648514 18975486 18591023
22585 18591023 18168987 18455103 18433445 17677761 17040458 17100605 18172225 18895572 18130426
22576 18130426 16757804 15878861 15508348 15551691 15946607 16581961 16731256 17174502 17033881
$$ packed form
22641A6328804J69254M06417L50331n669m0927k03977l78308p14867l61690Q08849
22631A6358217Q29703L17695K54547L50024q72855p46578l75016L42990O50427
22622A7109154J022416N21211K92127K25868o23215r62870l98188M94945J27282
22613A7808730J45797o98024m02998J13466L17711Q89948K32237p03911k55807
22604A7447149R2480n03143m87304Q9450Q8275O26449O34456L10509j57962n96275
22594A7544084m56487L37243K77873J80679K99445J68331K97346L26972l84463
22585A8591023m22036K86116k1658p55684o37303O0147J071620P23347p65146
22576A8130426j372622q78943l70513M3343L94916O35354J49295M43246j40621
$$ plain form
22567 17033881 16865835 17341106 18188966 18561028 18579665 18466509 18230187 17464966 17002211
22558 17002211 17821659 18509820 18910411 19148077 19163553 19521402 19848127 19897481 19985546 19795000
22548 19795000 19657258 19836580 19832791 19907845 20120885 20269904 20726996 20925182 20286692 19978911
22538 19978911 19748108 19204978 19040992 19439879 20512637 21442378 22153843 22068428 21780484
22529 21780484 21605775 21876081 22115958 22116749 21764635 21016175 20692547 19892032 19721007 20438403
22519 20438403 20468576 20288560 19853824 19757514 19752281 20392358 20718990 20806528 21047257 21256839
22509 21256839 20910369 20098421 19694379 20148686 20650743 20719123 19823500 19180191 19705747
22500 19705747 20358243 20629283 20434746 19863667 19381622 19581703 20300867 21171776 21566030
$$ packed form
22567A7033881j68046M75271Q47860L72062J8637j13156k36322p65221m62755
22558A7002211Q19448O88161M00591K37666J5476L57849L26725M9354Q8065j90546
22548A9795000j37742J79322l789P5054K13040J49019M57092J98186o38490l07781
22538A9978911k30803n43130j63986L98887J072758R29741P11465q5415k87944
22529B1780484j74709K70306K39877P91l52114p48460l23628q00515j71025P17396
22519B0438403L0173j80016m34736r6310n233O40077L26632Q7538K40729K09582
22509B1256839l46470q11948m04042M54307N02057O8380q95623o43309N25556
22500A9705747O52496K71040j94537n71079m82045K00081P19164Q70909L94254
$$ plain form
22491 21566030 22297391 22313311 21625048 22027438 22998220 23093153 22101726 21301849 21774597 22575877
22481 22575877 22937256 23244138 23324950 23052902 22560055 22284811 22752731 23011018 23207193
22472 23207193 24024831 24181377 23675672 23296712 23373909 23622983 24070501 24013979 23327439 23065005
22462 23065005 23384533 24015487 24327125 24699498 25310908 25625842 26498383 27061080 27140134
22453 27140134 27414950 28311200 28313131 27003344 26379415 26514195 26576536 26748314 26804369 26576380
22443 26576380 26155298 26316302 27035584 28208848 28750925 28114506 27150929 27353670 28234548
22434 28234548 28764640 28775060 28712724 28811515 28648604 28485695 28810336 29278905 29419006 29829383
22424 29829383 30180560 30481225 31178252 31502717 32134530 33059304 33311993 34018899 34228317
$$ packed form
22491B1566030P31361J5920o88263M02390R70782R4933r91427p99877M72748Q01280
22481B2575877L61379L06882Q0812k72048m92847k75244M67920K58287J96175
22472B3207193Q17638J56546n05705l78960P7197K49074M47518n6522o86540k62434
22462B3065005L19528O30954L11638L72373O11410L14934Q72541N62697P9054
22453B7140134K74816Q96250J931j309787o23929J34780O2341J71778N6055k27989
22443B6576380m21082J61004P19282J173264N42077o36419r63577K02741Q80878
22434B8234548N30092J0420o2336R8791j62911j62909L24641M68569J40101M10377
22424B9829383L51177L00665O97027L24465O31813R24774K52689P06906K09418
$$ plain form
22415 34228317 33972096 34155175 34291527 35055488 35565517 35922771 36437363 36980142 37498462
22406 37498462 38005143 38569396 37822211 36668378 36226281 36854159 37998766 39248334 39872883
22397 39872883 39844846 41077149 42719189 44424560 45448119 46692595 48362626 49502859
22389 49502859 51304896 53592062 55492304 57128193 58774484 60134506 61086399 62338515
22381 62338515 64548177 66953531 69078074 71970477 74529243 77691106 82899705 88412942
22373 88412942 94437067 101159599 107926249 114397185 121523467 127927545 132128403 131365562
22365 131365562 124580876 114585880 103448849 89398786 69167831 39904644 -7056293
22358 -7056293 -66955358 -110641310 -126587971 -125245782 -117829335 -109709185 -100903119 -92314258
$$ packed form
22415C4228317k56221J83079J36352P63961N10029L57254N14592N42779N18320
22406C7498462N06681N64253p47185j153833m42097O27878J144607J249568O24549
22397C9872883k8037J232303J642040J705371J023559J244476J670031J140233
22389D9502859J802037K287166J900242J635889J646291J360022R51893J252116
22381F2338515K209662K405354K124543K892403K558766L161863N208599N513237
22373H8412942O024125O722532O766650O470936P126282O404078M200858p62841
22365A31365562o784686r994996j1137031j4050063k0230955k9263187m6960937
22358g056293n9899065m3685952j5946661J342189P416447Q120150Q806066Q588861
$$ plain form
22350 -92314258 -84752700 -77884192 -71729300 -66381128 -61904435 -57840263 -53887219 -50092788
22342 -50092788 -46663432 -43974106 -41267316 -38717922 -36280697 -33921606 -31810954 -30129136
22334 -30129136 -28740160 -27097999 -25031930 -23136159 -22361887 -21674536 -20820515 -20177835 -19565417
22325 -19565417 -18800823 -17728321 -16829064 -15763547 -14732722 -14159841 -13467160 -13157229 -13146274
22316 -13146274 -13298261 -13317412 -12723238 -11658023 -9950740 -9072304 -9147729 -9008547 -8504871
22307 -8504871 -7338230 -6190068 -5644144 -5264655 -4994940 -4472069 -4311583 -4721707 -4173867
22298 -4173867 -3185554 -2050242 -1239081 -815865 -679572 -693224 -692551 -1289228 -1888636 -1693655
22288 -1693655 -1930545 -2180607 -2110663 -1676108 -1236648 -1217850 -1402500 -1455891 -1852911 -2580213
$$ packed form
22350i2314258P561558O868508O154892N348172M476693M064172L953044L794431
22342e0092788L429356K689326K706790K549394K437225K359091K110652J681818
22334c0129136J388976J642161K066069J895771P74272O87351Q54021O42680O12418
22325a9565417P64594J072502Q99257J065517J030825N72881O92681L09931J0955
22316a3146274j51987j9151N94174J065215J707283Q78436p5425J39182N03676
22307h504871J166641J148162N45924L79489K69715N22871J60486m10124N47840
22298d173867R88313J135312Q11161M23216J36293j3652O73n96677n99408J94981
22288a693655k36890k50062O9944M34555M39460J8798j84650n3391l97020p27302
$$ plain form
22278 -2580213 -2911916 -2433870 -2239429 -2004730 -1342764 -1111649 -994979 200806 1475258
22269 1475258 1940796 1989948 1619060 1804199 2665883 3653065 4182770 4606117 4940515 5303916
22259 5303916 5632897 5430481 5224275 4669145 3738400 2979584 2982776 4400950 5092716 5191900
22249 5191900 4902134 4254369 4187351 4199121 4628577 5245111 4892703 3908791 3405706 3473149
22239 3473149 4423237 5455248 5880844 5579571 4916645 4668810 4206876 4446721 5184977
22230 5184977 5574763 6048055 5661031 5309359 4983284 5104369 6165878 7191056 6937584
22221 6937584 6632741 6548273 5789510 5767565 6101565 6415823 6182823 6048393 5889630 5185037
22211 5185037 4274866 3633664 3430869 4152444 5799319 6386685 5800803 6283948 6635270
$$ packed form
22278b580213l31703M78046J94441K34699O61966K31115J16670J195785J274452
22269A475258M65538M9152l70888J85139Q61684R87182N29705M23347L34398L63401
22259E303916L28981k02416k06206n55130r30745p58816L192J418174O91766R9184
22249E191900k89766o47765o7018J1770M29456O16534l52408r83912n03085O7443
22239C473149R50088J032011M25596l01273o62926k47835m61934K39845P38256
22230E184977L89786M73292l87024l51672l26075J21085J061509J025178k53472
22221F937584l04843q4468p58763k1945L34000L14258k33000j34430j58763p04593
22211E185037r10171o41202k02795P21575J646875N87366n85882M83145L51322
$$ plain form
22202 6635270 5741780 4488530 3905383 4621290 5637531 6670405 7404791 7254738 6886855
22193 6886855 7291636 7383748 7599840 7447962 7117762 7267072 7494005 7026474 6474573 6959570
22183 6959570 7657998 7953989 7615566 7138976 6682782 6642890 6928336 7550946 8092211 8063843
22173 8063843 7242284 7411107 7891846 7963827 7705455 7684518 8170781 8200966 7739432 7740744
22163 7740744 7360260 7075302 7471844 8052391 8524706 9021320 9994915 11033374 10968632
22154 10968632 10157934 10064836 9959656 9536481 9458560 9889949 9869758 9310926 9759675 10782395
22144 10782395 11483787 11260226 10842679 10506832 10379776 9777180 8972611 9055269 9633905
22135 9633905 10251991 10299896 9991443 9264784 9074242 9046357 8562079 9200013 9530814 9709432
$$ packed form
22202F635270q93490j253250n83147P15907J016241J032874P34386j50053l67883
22193F886855M04781R2112K16092j51878l30200J49310K26933m67531n51901M84997
22183F959570O98428K95991l38423m76590m56194l9892K85446O22610N41265k8368
22173H063843q21559J68823M80739P1981k58372k0937M86263L0185m61534J312
22163G740744l80484k84958L96542N80547M72315M96614R73595J038459o4742
22154A0968632q10698r3098j05180m23175p7921M31389k0191n58832M48749J022720
22144A0782395P01392k23561m17547l35847j27056o02596q04569Q2658N78636
22135I633905O18086M7905l08453p26659j90542k7885m84278O37934L30801J78618
$$ plain form
22125 9709432 9277174 7966845 7104931 7048609 7461203 8537220 9496245 9469727 8385225
22116 8385225 7220090 6646897 6610258 7587807 8377695 8817926 8886790 8944034 8852609 8507154
22106 8507154 8531542 8760085 8883439 8867967 8646603 8585487 8938954 9454588 9776208 9751841
22096 9751841 9333714 9112745 9668265 10665306 10960228 10627982 9895999 9471505 10013313
22087 10013313 10257057 10654424 11253907 10972086 10617538 10004763 9343998 8465867 7648161
22078 7648161 7430495 8046728 9030112 10028988 10833904 10827503 10046059 9256390 9392665 9888475
22068 9888475 10303828 11162254 11580228 11493850 11044499 10994948 10719348 10291645 10251139 10356788
22058 10356788 9496697 8151470 8009207 8410381 8866756 8915299 8833513 9410245 9537586
$$ packed form
22125I709432m32258j310329q61914n6322M12594J076017R59025k6518j084502
22116H385225j165135n73193l6639R77549P89888M40231O8864N7244r1425l45455
22106H507154K4388K28543J23354j5472k21364o1116L53467N15634L21620k4367
22096I751841m18127k20969N55520R97041K94922l32246p31983m24494N41808
22087A0013313K43744L97367N99483k81821l54548o12775o60765q78131q17706
22078G648161k17666O16233R83384R98876Q04916o401p81444p89669J36275M95810
22068I888475M15353Q58426M17974q6378m49351m9551k75600m27703m0506J05649
22058A0356788q60091j345227j42263M01174M56375M8543q1786N76732J27341
$$ plain form
22049 9537586 9316434 9477005 10062341 10567653 10872011 11712106 12476017 12976343 12810753
22040 12810753 12668806 12058752 10613447 9311673 9035339 9344614 9611520 9863743 10359918
22031 10359918 10536723 10371689 10571647 10064946 9443574 10210728 10933314 10848148 11170203
22022 11170203 11368537 11808464 11794848 11061379 10887803 11797619 12512098 11925327 10766230
22013 10766230 10558388 10550754 9836478 9651876 10065419 10594802 10363714 10159321 10347853 9957677
22003 9957677 9344054 9864379 10336882 11139027 12261402 12268059 11869071 11725735 11870010 12289082
21993 12289082 12287019 11358230 10702808 10557251 10748471 10725045 10484623 10943267 10807176 10176567
21983 10176567 10191300 9978992 10132022 11228997 11669988 11552129 11980369 11902133 11500442
$$ packed form
22049I537586k21152J60571N85336N05312L04358Q40095P63911N00326j65590
22040A2810753j41947o10054j445305j301774k76334L09275K66906K52223M96175
22031A0359918J76805j65034J99958n06701o21372P67154P22586q5166L22055
22022A1170203J98334M39927j3616p33469j73576R09816P14479n86771j159097
22013A0766230k07842p634p14276j84602M13543N29383k31088k04393J88532l90176
22003I957677o13623N20325M72503Q02145J122375O657l98988j43336J44275M19072
21993A2289082k063r28789o55422j45557J91220k3426k40422M58644j36091o30609
21983A0176567J4733k12308J53030J096975M40991j17859M28240p8236m01691
$$ plain form
21974 11500442 11532100 12153001 12454456 11863772 11855440 12218737 12015749 11427580 11845625 12487085
21964 12487085 12925027 13427674 13490097 12777885 11580211 11351848 12257221 13055833 13123716
21955 13123716 12620855 12405953 12458841 12931430 13662985 13208861 12686184 12994164 13305999
21946 13305999 13288289 12562009 11191414 10520381 10920700 10827190 10614163 10494725 10140644
21937 10140644 10386876 10571304 10016207 9850759 9953428 10405942 11244730 11393497 11283084
21928 11283084 11426207 12135119 12681685 13282353 13684237 13664014 13717986 13623029 13590741 13544476
21918 13544476 13148751 12573043 12578834 13282154 13496779 13105126 12418417 11908184 11134472 10966307
21908 10966307 11423138 11834892 12125150 12899671 13196794 12668137 12869938 13026166 12781068
$$ packed form
21974A1500442L1658O20901L01455n90684q332L63297k02988n88169M18045O41460
21964A2487085M37942N02647O2423p12212j197674k28363R05373P98612O7883
21955A3123716n02861k14902N2888M72589P31555m54124n22677L07980L11835
21946A3305999j7710p26280j370595o71033M00319r3510k13027j19438l54081
21937A0140644K46232J84428n55097j65448J02669M52514Q38788J48767j10413
21928A1283084J43123P08912N46566O00668M01884k0223N3972r4957l2288m6265
21918A3544476l95725n75708N791P03320K14625l91653o86709n10233p73712j68165
21908A0966307M56831M11754K90258P74521K97123n28657K01801J56228k45098
$$ plain form
21899 12781068 12381871 11509889 11087642 10795415 10574262 11121538 11075829 10847416 11233767
21890 11233767 11508977 11784186 12396560 13104042 13449841 13054546 13538468 13989387 13683044
21881 13683044 12998550 12656149 12937405 13517430 13334054 12338361 12335428 12823450 12522129 12260295
21871 12260295 12632443 12609369 11849524 11479100 11538958 12113505 12555292 12344341 12326967 12092711
21861 12092711 11781694 12075776 12229216 12127745 11967698 11798121 12279924 13063711 13294455
21852 13294455 12586259 12255185 12134041 11764987 11613977 11693752 11527872 12194575 13140579
21843 13140579 13495807 13482838 13205056 12881248 12462168 13109492 13166203 12786261 12488310 12461743
21833 12461743 13312756 14592865 15185959 14561352 13966955 13172610 13138546 12794643 11848539
$$ packed form
21899A2781068l99197q71982m22247k92227k21153N47276m5709k28413L86351
21890A1233767K75210K75209O12374P07482L45799l95295M83922M50919l06343
21881A3683044o84494l42401K81256N80025j83376r95693k933M88022l01321k61834
21871A2260295L72148k3074p59845l70424N9858N74547M41787k10951j7374k34256
21861A2092711l11017K94082J53440j01471j60047j69577M81803P83787K30744
21852A3294455p08196l31074j21144l69054j51010P9775j65880O66703R46004
21843A3140579L55228j2969k77782l23808m19080O47324N6711l79942k97951k6567
21833A2461743Q51013J280109N93094o24607n94397p94345l4064l43903r46104
$$ plain form
21824 11848539 11757236 12129125 11922632 11895816 12423389 13172042 13923528 14711956 15356153 15247101
21814 15247101 14653420 14255819 13616406 13257591 13039697 12474854 12465361 12782671 12356340 11873924
21804 11873924 11819607 12301879 13536715 14354155 13611067 12505925 12251219 12310039 13104575
21795 13104575 13550712 13593820 13979191 14356507 14174786 13738381 13265638 13044744 13143925 13594232
21785 13594232 13777654 13010414 12356219 12322254 12573120 12663722 12078719 12086763 12958943 13515087
21775 13515087 13730353 13009188 13195842 13680595 13529731 13126103 12802438 13255891 13698990
21766 13698990 13880136 13034473 11629926 11330048 12115777 13264578 14322031 13881521 12722662
21757 12722662 13084779 14165410 14044709 13527262 13720433 14516140 14235771 12928421 12372180
$$ packed form
21824A1848539r1303L71889k06493k6816N27573P48653P51486P88428O44197j09052
21814A5247101n93681l97601o39413l58815k17894n64843r493L17310m26331m82416
21804A1873924n4317M82272J234836Q17440p43088j105142k54706N8820P94536
21795A3104575M46137M3108L85371L77316j81721m36405m72743k20894R9181M50307
21785A3594232J83422p67240o54195l3965K50866R0602n85003Q044Q72180N56144
21775A3515087K15266p21165J86654M84753j50864m03628l23665M53453M43099
21766A3698990J81146q45663j404547k99878P85729J148801J057453m40510j158859
21757A2722662L62117J080631j20701n17447J93171P95707k80369j307350n56241
$$ plain form
21748 12372180 12301520 12321836 12191136 11337848 11128484 11813574 12330890 13015659 13496808 13869815
21738 13869815 14249041 13897557 13800076 13358286 12971009 12546687 12377213 12864571 12925048 12382510
21728 12382510 12132611 12460149 13153498 13444535 13837183 14082083 14497010 15275116 15642969
21719 15642969 15644208 14944791 14092985 14111018 14339431 13521304 12798121 12973317 13139658 12662341
21709 12662341 12295144 12452730 12769416 12895923 12663710 12664097 12733861 12762297 12749160 12723935
21699 12723935 12636393 11947330 11367972 10834926 10417146 10548345 11358181 11549643 11599903 12364947
21689 12364947 13508440 14393631 14572021 14094507 13598814 12849700 12785335 13690351 14300989
21680 14300989 14114365 14084811 14594696 14603084 14653895 14247206 14125000 13830577 13121838 12808661
$$ packed form
21748A2372180p0660K0316j30700q53288k09364O85090N17316O84769M81149L73007
21738A3869815L79226l51484r7481m41790l87277m24322j69474M87358O0477n42538
21728A2382510k49899L27538O93349K91037L92648K44900M14927P78106L67853
21719A5642969J239o99417q51806J8033K28413q18127p23183J75196J66341m77317
21709A2662341l67197J57586L16686J26507k32213L87O9764K8436j3137k5225
21699A2723935q7542o89063n79358n33046m17780J31199Q09836J91462N0260P65044
21689A2364947J143493Q85191J78390m77514m95693p49114o4365R05016O10638
21680A4300989j86624k9554N09885Q388N0811m06689j22206k94423p08739l13177
$$ plain form
21670 12808661 13088312 14151837 15649439 16419209 16571269 15648431 14446954 14444446 14705116
21661 14705116 15494328 15396150 14742772 14515832 14483156 14555903 14823400 14643416 14185311 14489831
21651 14489831 14520965 14059927 13442860 12724680 13109875 14277346 14487677 13593913 14156273
21642 14156273 15127047 15324913 15106011 15541510 15443680 14209162 12982940 12478778 12918986
21633 12918986 13688564 14745392 15460125 15592769 15391200 15122340 14256331 13772400 13560775
21624 13560775 13291485 12900350 12224667 12104589 12116755 12424093 12975389 13101546 12856194
21615 12856194 12310135 12208674 12527271 12716578 13181222 13655985 13257720 12828921 13279835
21606 13279835 13442095 13813588 14197465 14327907 15112551 15608583 16087824 15925682 15243657
$$ packed form
21670A2808661K79651J063525J497602P69770J52060r22838j201477k508K60670
21661A4705116P89212r8178o53378k26940l2676P2747K67497j79984m58105L04520
21651A4489831L1134m61038o17067p18180L85195J167471K10331q93764N62360
21642A4156273R70774J97866k18902M35499r7830j234518j226222n04162M40208
21633A2918986P69578J056828P14733J32644k01569k68860q66009m83931k11625
21624A3560775k69290l91135o75683j20078J2166L07338N51296J26157k45352
21615A2856194n46059j01461L18597J89307M64644M74763l98265m28799M50914
21606A3279835J62260L71493L83877J30442P84644M96032M79241j62142o82025
$$ plain form
21597 15243657 14777587 14206702 13546171 13122292 13143879 12767554 12529676 13141824 13598492
21588 13598492 13411430 13687774 13942349 13525969 12753671 12373051 12765026 13571866 14004346
21579 14004346 14122831 14249617 14336684 13603566 12996088 13197295 13440896 13474844 14090972 15037530
21569 15037530 14910575 14206358 14520316 14850584 14642449 14631525 14452297 14301737 14821304
21560 14821304 15550012 14558112 13694099 14151031 14522839 15526271 16499621 16272388 16197685
21551 16197685 16341559 15737929 15026263 14613089 14737832 15508279 16025733 15730962 15451977
21542 15451977 15580320 15814410 15966575 15675425 14931338 14720054 15361717 16129820 16641159
21533 16641159 16312729 15403659 15154096 14899681 14419808 14103970 13725973 13922063 14288388
$$ packed form
21597A5243657m66070n70885o60531m23879K1587l76325k37878O12148M56668
21588A3598492j87062K76344K54575m16380p72298l80620L91975Q06840M32480
21579A4004346J18485J26786Q7067p33118o07478K01207K43601L3948O16128R46558
21569A5037530j26955p04217L13958L30268k08135j0924j79228j50560N19567
21560A4821304P28708r91900q64013M56932L71808J003432R73350k27233p4703
21551A6197685J43874o03630p11666m13174J24743P70447N17454k94771k78985
21542A5451977J28343K34090J52165k91150p44087k11284O41663P68103N11339
21533A6641159l28430r09070k49563k54415m79873l15838l77997J96090L66325
$$ plain form
21524 14288388 14116749 13634838 13814530 13883572 13308517 12173480 11583341 12010293 12719287
21515 12719287 13346933 13501130 13740614 13672319 14023983 14769505 14675840 14464814 14433183 14642690
21505 14642690 15557492 16394199 16865142 16535058 15124507 14987985 15435151 14911414 14154170
21496 14154170 14461542 15523204 16048261 16011557 15854887 15425167 15721460 16650917 17224929
21487 17224929 17084671 16759979 16240331 15561042 15197246 15035070 14502663 14271133 14439448
21478 14439448 13767228 13118542 13560386 14487371 15310742 16617239 17859807 17131298 15898336
21469 15898336 15312930 14812673 14240310 14508060 15407510 16034213 16430940 16042570 14997459
21460 14997459 14719293 14338634 14414418 14382562 14315264 14529610 15141581 16237197 16364277 15725727
$$ packed form
21524A4288388j71639m81911J79692O9042n75055j135037n90139M26952P08994
21515A2719287O27646J54197K39484o8295L51664P45522r3665k11026l1631K09507
21505A4642690R14802Q36707M70943l30084j410551j36522M47166n23737p57244
21496A4154170L07372J061662N25057l6704j56670m29720K96293R29457N74012
21487A7224929j40258l24692n19648o79289l63796j62176n32407k31530J68315
21478A4439448o72220o48686M41844R26985Q23371J306497J242568p28509j232962
21469A5898336n85406n00257n72363K67750Q99450O26703L96727l88370j045111
21460A4997459k78166l80659P5784l1856o7298K14346O11971J095616J27080o38550
$$ plain form
21450 15725727 15641037 15891940 16084155 15848224 15846095 15999814 16300817 16204343 15825695 15244624
21440 15244624 14979551 14754021 14356966 14522729 14976647 14901907 14803655 14691914 14314459 14354722
21430 14354722 14639593 14420777 14337520 14507121 15147374 15041645 13824427 13054903 12930130
21421 12930130 13025002 13194092 13342942 13758158 14684164 15395717 15797881 15909515 16157219
21412 16157219 15809130 15369642 14740263 14119622 14318050 14563800 15132304 15954491 16133976
21403 16133976 15961595 15540533 15173202 14658268 14552655 14365281 13976003 13979848 14033666 13858649
21393 13858649 13696600 13795606 14675857 14728368 13934297 13770576 14037908 14141323 14381331 14581289
21383 14581289 14280599 14179490 14599987 15748865 16166032 15825489 16384809 17442882 18273631
$$ packed form
21450A5725727q4690K50903J92215k35931k129J53719L01003r6474l78648n81071
21440A5244624k65073k25530l97055J65763M53918p4740r8252j11741l77455M0263
21430A4354722K84871k18816q3257J69601O40253j05729j217218p69524j24773
21421A2930130R4872J69090J48850M15216R26006P11553M02164J11634K47704
21412A6157219l48089m39488o29379o20641J98428K45750N68504Q22187J79485
21403A6133976j72381m21062l67331n14934j05613j87374l89278L845N3818j75017
21393A3858649j62049R9006Q80251N2511p94071j63721K67332J03415K40008J99958
21383A4581289l00690j01109M20497J148878M17167l40543N59320J058073Q30749
$$ plain form
21374 18273631 17939729 16947373 16271350 16557335 16791389 16830844 16343846 15978303 15896351 15442046
21364 15442046 14405808 13921126 14221069 13968281 14063453 14065615 13791445 14572624 15750231
21355 15750231 16221446 15818948 15428023 15392561 15855511 15545853 15303211 15661218 15589034 15605448
21345 15605448 15676913 15927252 16329387 15967900 15071491 14013605 13724109 13898190 14627519
21336 14627519 16017170 16796292 16641521 15090901 14487375 15296088 15807046 15939510 15868233
21327 15868233 14912666 13541108 13437043 13864241 14243696 14280161 14449898 14934933 15961613
21318 15961613 15880074 15552248 15687268 15168542 14863453 14642302 13792033 13329916 14253652
21309 14253652 15309339 15567775 15857602 15960878 15763216 15499052 15354580 15476067 15596598
$$ packed form
21374A8273631l33902r92356o76023K85985K34054L9455m86998l65543q1952m54305
21364A5442046j036238m84682K99943k52788R5172K162k74170P81179J177607
21355A5750231M71215m02498l90925l5462M62950l09658k42642L58007p2184J6414
21345A5605448P1465K50339M02135l61487q96409j057886k89496J74081P29329
21336A4627519J389651P79122j54771j550620o03526Q08713N10958J32464p1277
21327A5868233r55567j371558j04065M27198L79455L6465J69737M85035J026680
21318A5961613q1539l27826J35020n18726l05089k21151q50269m62117R23736
21309A4253652J055687K58436K89827J03276j97662k64164j44472J21487J20531
$$ plain form
21300 15596598 15615443 15958475 16198339 16500223 16953279 16375056 16005100 15419510 14873279
21291 14873279 14118494 13531485 13634310 13898102 14643034 15354234 15266691 14576173 14510024 15806407
21281 15806407 16734520 16683424 16366986 15976014 16345805 16450691 16418438 16595091 16963536 16724213
21271 16724213 16762243 17192012 16721747 16359743 16797934 17268702 17110112 16407084 16298969
21262 16298969 15988035 15932032 16442574 16145887 15053122 14602807 14439509 14309784 14873394
21253 14873394 15423745 16046802 16553095 16343916 15843951 15898418 16553143 16621816 16316243 15383471
21243 15383471 15300077 16379667 17455948 17955383 18289849 18614405 18482604 18316254 18194396
21234 18194396 17866914 17152809 16466030 16517860 17341567 18667014 19416660 19257608 18968859
$$ packed form
21300A5596598J8845L43032K39864L01884M53056n78223l69956n85590n46231
21291A4873279p54785n87009J02825K63792P44932P11200q7543o90518o6149J296383
21281A5806407R28113n1096l16438l90972L69791J04886l2253J76653L68445k39323
21271A6724213L8030M29769m70265l62004M38191M70768j58590p03028j08115
21262A6298969l10934n6003N10542k96687j092765m50315j63298j29725N63610
21253A4873394N50351O23057N06293k09179m99965N4467O54725O8673l05573r32772
21243A5383471q3394J079590J076281M99435L34466L24556j31801j66350j21858
21234A8194396l27482p14105o86779N1830Q23707J325447P49646j59052k88749
$$ plain form
21225 18968859 18737512 18604240 18562491 18662456 17812776 16884612 16356221 15658576 15566571 15788106
21215 15788106 15824723 16131554 16679640 16917830 17530749 18051960 17712401 17411110 17323599 17344975
21205 17344975 17006173 16391392 15374627 15040939 15777964 15771199 15661991 16237268 16921797
21196 16921797 17509508 17722068 17678565 17466539 17288115 17581914 17758688 17688282 17805483 17577620
21186 17577620 17794496 18188897 18575126 18487706 18225704 17572130 17352614 18028912 18105454 17792289
21176 17792289 17061522 16693795 17004353 17089023 17060852 16927512 16462597 16267748 16293307 16157113
21166 16157113 16527578 16937737 17239753 16901002 16624645 17558799 18607679 18614081 18168971
21157 18168971 17792924 17964624 17931896 17687173 17497300 16994942 17215558 17405695 17232600
$$ packed form
21225A8968859k31347j33272m1749R9965q49680r28164n28391o97645r2005K21535
21215A5788106L6617L06831N48086K38190O12919N21211l39559l01291q7511K1376
21205A7344975l38802o14781j016765l33688P37025o765j09208N75277O84529
21196A6921797N87711K12560m3503k12026j78424K93799J76774p0406J17201k27863
21186A7577620K16876L94401L86229q7420k62002o53574k19516O76298P6542l13165
21176A7792289p30767l67727L10558Q4670k8171j33340m64915j94849K5559j36194
21166A6157113L70465M10159L02016l38751k76357R34154J048880O402m45110
21157A8168971l76047J71700l2728k44723j89873n02358K20616J90137j73095
$$ plain form
21148 17232600 17132043 17224438 17409615 17806364 18654809 19265306 19569736 19478066 19310138 18991031
21138 18991031 18820811 18319623 17407027 16684631 16552734 17518696 18304538 18459911 18977854
21129 18977854 18853931 18458868 18164074 18651228 19101283 19230726 18872189 18293477 18137544
21120 18137544 18696010 18865682 18013047 17688890 17811745 18204797 18345027 18365777 18433254 18312265
21110 18312265 18160271 17600885 16748505 16756370 17278636 17664874 17504948 17287356 17041687 16663734
21100 16663734 16849067 17353114 17829849 17737010 17584040 17495150 17283624 17096057 17037682 17166415
21090 17166415 17991945 18420451 17131606 15696050 15636107 15740089 15591336 15668703 16504204
21081 16504204 17336054 17394441 17544155 18287028 18889648 18739367 18477044 18669327 18830395
$$ packed form
21148A7232600j00557R2395J85177L96749Q48445O10497L04430r1670j67928l19107
21138A8991031j70220n01188r12596p22396j31897R65962P85842J55373N17943
21129A8977854j23923l95063k94794M87154M50055J29443l58537n78712j55933
21120A8137544N58466J69672q52635l24157J22855L93052J40230K0750O7477j20989
21110A8312265j51994n59386q52380P865N22266L86238j59926k17592k45669l77953
21100A6663734J85333N04047M76735r2839j52970q8890k11526j87567n8375J28733
21090A7166415Q25530M28506j288845j435556n9943J03982j48753P7367Q35501
21081A6504204Q31850N8387J49714P42873O02620j50281k62323J92283J61068
$$ plain form
21072 18830395 18331963 17820257 17888520 18048259 18221342 19010079 19583942 20117447 20921693
21063 20921693 21102706 21053545 21187985 21698999 21200295 20584766 20288663 20517826 20757989
21054 20757989 20731796 20698890 20681364 20709355 20841873 20721211 20343925 20462971 21329348 22055457
21044 22055457 22475763 22251138 21704685 21093003 20440881 20839575 21408878 21684914 20838713
21035 20838713 19636159 19972713 20440948 20893268 21084016 21339074 21562102 21741759 22446509
21026 22446509 22969238 23002480 22537025 22287866 21887573 20963413 20136868 20233626 20877173 21308847
21016 21308847 21514669 21812089 22285725 21920719 21438342 21331704 21224548 21002737 20670158
21007 20670158 21057674 21527638 21549839 21557127 21460422 21461516 21185825 20997800 21426554 22424641
$$ packed form
21072A8830395m98432n11706O8263J59739J73083P88737N73863N33505Q04246
21063B0921693J81013m9161J34440N11014m98704o15529k96103K29163K40163
21054B0757989k6193l2906j7526K7991J32518j20662l77286J19046Q66377P26109
21044B2055457M20306k24625n46453o11682o52122L98694N69303K76036q46201
21035B0838713j202554L36554M68235M52320J90748K55058K23028J79657P04750
21026B2446509N22729L3242m65455k49159m00293r24160q26545R6758O43547M31674
21016B1308847K05822K97420M73636l65006m82377j06638j07156k21811l32579
21007B0670158L87516M69964K2201P288r6705J094k75691j88025M28754R98087
$$ plain form
20997 22424641 23662442 24406035 24571653 23837822 23360201 23153659 23619655 23964246 23720577
20988 23720577 22921452 22801281 22344521 21886159 22037864 22631232 22919603 22687379 22494855
20979 22494855 22483101 22482103 22387085 22594787 22603891 23180518 23906562 25054245 26099257 26618821
20969 26618821 27368725 27214541 26214280 25381602 25093624 25087839 25666153 26121798 26155129 26618953
20959 26618953 27084722 26878936 26626806 27666668 27965599 27177983 26926823 27644431 28378561
20950 28378561 28762611 29635239 30069336 30413942 30888074 31329286 31978797 32149063 32561764
20941 32561764 33872793 35395736 36395692 36979602 37259392 37231814 37216201 37978082 39278344
20932 39278344 40240154 41875960 43782829 44994345 45677457 46815645 48274596 49869468
$$ packed form
20997B2424641J237801P43593J65618p33831m77621k06542M65996L44591k43669
20988B3720577p99125j20171m56760m58362J51705N93368K88371k32224j92524
20979B2494855j1754r98r5018K07702R104N76627P26044J147683J045012N19564
20969B6618821P49904j54184j000261q32678k87978n785N78314M55645L3331M63824
20959B6618953M65769k05786k52130J039862K98931p87616k51160P17608P34130
20950B8378561L84050Q72628M34097L44606M74132M41212O49511J70266M12701
20941C2561764J311029J522943R99956N83910K79790k7578j5613P61881J300262
20932C9278344R61810J635806J906869J211516O83112J138188J458951J594872
$$ plain form
20924 49869468 52140723 55333622 59004365 62922743 66265054 70382349 76105108 82053116
20916 82053116 88505614 95607889 100950315 102147237 92320055 59962182 6835577 -41060008
20908 -41060008 -63925964 -67513609 -64003028 -58261449 -52223239 -45966679 -40112057 -35862355
20900 -35862355 -32399254 -29616058 -27464761 -24494455 -21600187 -19425146 -17104042 -15467100
20892 -15467100 -14759558 -14276766 -13071821 -10962918 -9456117 -8449473 -7192325 -5577369
20884 -5577369 -4272357 -3313542 -2672270 -1701703 -1038715 -1462626 -1507401 -363363 878722
20875 878722 1499887 1992830 2787514 3497049 3850039 4465589 5369791 5795457 5635717 5091019
20865 5091019 4805200 4701443 4701731 5019252 5521357 5958933 6603051 7211798 7697416 7956244
$$ packed form
20924D9869468K271255L192899L670743L918378L342311M117295N722759N948008
20916H2053116O452498P102275N342426J196922r827182l2357873n3126605m7895585
20908d1060008k2865956l587645L510581N741579O038210O256560N854622M249702
20900c5862355L463101K783196K151297K970306K894268K175041K321104J636942
20892a5467100P07542M82792J204945K108903J506801J006644J257148J614956
20884e577369J305012R58815O41272R70567O62988m23911m4775J144038J242085
20875H78722O21165M92943P94684P09535L52990O15550R04202M25666j59740n44698
20865E091019k85819j03757K88L17521N02105M37576O44118O08747M85618K58828
$$ plain form
20855 7956244 7336126 7454858 7897797 7708125 7870119 8731118 9654150 10675255 12093505
20846 12093505 12562267 11966005 11383079 10574996 9930046 9151760 8965460 9357887 8886164
20837 8886164 7928186 7804653 8262736 9105376 9805174 10159869 9888156 9529231 9035281
20828 9035281 8916340 9364551 9504826 10057549 10999718 11000014 10603244 10276425 10062657 10949428
20818 10949428 11500298 11632145 12132978 12279674 11905101 11485853 11724645 11889749 11698337
20809 11698337 11681918 11599357 11917394 12170422 12132038 12117187 12095269 12761532 14015274 14044301
20799 14044301 13107137 12080467 11784044 12266273 13099392 13442694 12799364 12655541 13180640
20790 13180640 13406794 12661884 12349141 12494105 12361015 12767362 12694345 12423951 12406789 12508555
$$ packed form
20855G956244o20118J18732M42939j89672J61994Q60999R23032J021105J418250
20846A2093505M68762n96262n82926q08083o44950p78286j86300L92427m71723
20837H886164r57978j23533M58083Q42640O99798L54695k71713l58925m93950
20828I035281j18941M48211J40275N52723R42169K96l96770l26819k13768Q86771
20818A0949428N50870J31847N00833J46696l74573m19248K38792J65104j91412
20809A1698337j6419q2561L18037K53028l8384j4851k1918O66263J253742K9027
20799A4044301r37164j026670k96423M82229Q33119L43302o43330j43823N25099
20790A3180640K26154p44910l12743J44964j33090M06347p3017k70394j7162J01766
$$ plain form
20780 12508555 12457534 12069040 11204597 11296607 12113945 12102804 12146037 12436422 12196450 12085977
20770 12085977 12323949 12365770 12792483 12644714 12406308 12220870 12066364 12518249 13199244
20761 13199244 13655019 13520870 13599044 14381152 14562938 14273001 14588549 14864963 14963092 15055646
20751 15055646 15186043 14563578 13539257 13406792 13667520 13508021 13027410 13186971 14075034
20742 14075034 14958321 15522751 15075632 14630680 14552767 14419923 14209690 14366472 14557084
20733 14557084 14657234 15004959 14565940 14179034 14978837 16148333 16236938 16154804 15829833
20724 15829833 15832348 15102608 13753848 13432784 14285165 14905638 15328111 16159191 17036479
20715 17036479 17677682 17448580 17008002 16672629 16322466 16373262 16615289 16809544 16104767
$$ packed form
20780A2508555n1021l88494q64443R2010Q17338j1141M3233K90385k39972j10473
20770A2085977K37972M1821M26713j47769k38406j85438j54506M51885O80995
20761A3199244M55775j34149P8174P82108J81786k89937L15548K76414R8129R2554
20751A5055646J30397o22465j024321j32465K60728j59499m80611J59561Q88063
20742A4075034Q83287N64430m47119m44952p7913j32844k10233J56782J90612
20733A4557084J00150L47725m39019l86906P99803J169496Q8605q2134l24971
20724A5829833K515p29740j348760l21064Q52381O20473M22473Q31080Q77288
20715A7036479O41203k29102m40578l35373l50163N0796K42027J94255p04777
$$ plain form
20706 16104767 15747048 16113654 16400188 16658474 16964085 16552333 15687756 15599689 15628674 15139105
20696 15139105 15201027 16142066 16780061 17064042 15936749 14969913 15231199 15504071 15590935
20687 15590935 16465538 16826110 16047914 15041747 15106372 15618102 15529585 15957948 16820929
20678 16820929 16995365 16629927 16838132 17594044 17716232 17325586 17237783 17389350 17533432
20669 17533432 17203331 17305288 17729536 17683974 17010840 16913044 16887625 16624196 16623988 16807117
20659 16807117 16812861 16932020 16918288 16741454 16228402 16644509 17206166 16674076 16049157 16265685
20649 16265685 16707398 16535621 15171938 14507443 14057274 14646160 15578569 15576764 15789038
20640 15789038 15812765 16214656 16662478 16919718 17001282 17372572 17391574 17451562 16842021 15970635
$$ packed form
20706A6104767l57719L66606K86534K58286L05611m11752q64577q8067K8985m89569
20696A5139105O1922R41039O37995K83981j127293r66836K61286K72872Q6864
20687A5590935Q74603L60572p78196j006167O4625N11730q8517M28363Q62981
20678A6820929J74436l65438K08205P55912J22188l90646q7803J51567J44082
20669A7533432l30101J01957M24248m5562o73134r7796k5419k63429k08J83129
20659A6807117N744J19159j3732j76834n13052M16107N61657n32090o24919K16528
20649A6265685M41713j71777j363683o64495m50169N88886R32409j805K12274
20640A5789038K3727M01891M47822K57240Q1564L71290J9002N9988o09541q71386
$$ plain form
20630 15970635 16502877 17468367 18144720 18419901 18358296 17743099 17143820 16987023 17122261
20621 17122261 17113116 17336693 17242248 17598559 18864571 20168649 20628199 20116758 19493140
20612 19493140 19367420 18493992 17086146 16234571 16286696 17107326 19006352 20405044 20535426
20603 20535426 19970341 18915113 18047411 18783497 19804404 20241722 20152969 19522869 19658076
20594 19658076 19549238 19004903 18649165 19105935 19653047 19851630 19864559 19922327 19994276 20025901
20584 20025901 20101865 20081073 19762671 19451095 18835421 18571333 19162116 19240502 18483104 18123354
20574 18123354 19099100 19915847 20144382 20670584 20656191 20397929 20284514 20199887 20358175 20521034
20564 20521034 20736471 20794787 20012963 18738084 18468833 19282803 20038756 20503050 21366166
$$ packed form
20630A5970635N32242R65490O76353K75181o1605o15197n99279j56797J35238
20621A7122261r145K23577r4445L56311J266012J304078M59550n11441o23618
20612A9493140j25720q73428j407846q51575N2125Q20630J899026J398692J30382
20603B0535426n65085j055228q67702P36086J020907M37318q8753o30100J35207
20594A9658076j08838n44335l55738M56770N47112J98583J2929N7768P1949L1625
20584B0025901P5964k0792l18402l11576o15674k64088N90783P8386p57398l59750
20574A8123354R75746Q16747K28535N26202j4393k58262j13415q4627J58288J62859
20564B0521034K15437N8316p81824j274879k69251Q13970P55953M64294Q63116
$$ plain form
20555 21366166 21965213 21798385 21830993 22061416 22142303 21608269 20572640 20111905 20191256 20491553
20545 20491553 21121861 21653551 22710379 23738555 23844039 23494650 23253863 22999013 22750049
20536 22750049 23200812 23216615 22543234 21951728 21787807 22536838 22644829 22687643 22998693 23761082
20526 23761082 24344374 24473043 24126147 24087300 24688987 24795812 24705837 25449589 26721833
20517 26721833 26867395 26748022 27318483 28405683 29667124 30621861 31520945 31569261 31531469
20508 31531469 31822351 32528592 33679869 35631440 37523697 38575085 38972627 40191784
20500 40191784 41422021 42449818 44235888 47600513 51810618 55970845 61127012 67668520
20492 67668520 74784019 80861381 79028634 53745911 1774156 -36796100 -44607067 -40267340
$$ packed form
20555B1366166N99047j66828L2608K30423Q0887n34034j035629m60735P9351L00297
20545B0491553O30308N31690J056828J028176J05484l49389k40787k54850k48964
20536B2750049M50763J5803o73381n91506j63921P49031J07991M2814L11050P62389
20526B3761082N83292J28669l46896l8847O01687J06825q9975P43752J272244
20517B6721833J45562j19373N70461J087200J261441R54737Q99084M8316l7792
20508C1531469K90882P06241J151277J951571J892257J051388L97542J219157
20500D0191784J230237J027797J786070L364625M210105M160227N156167O541508
20492F7668520P115499O077362j832747k5282723n1971755l8570256p810967M339727
$$ plain form
20484 -40267340 -33773625 -27992479 -22569983 -18811796 -16365150 -14303509 -11890586 -9323921
20476 -9323921 -6530490 -4227675 -2650384 -2229639 -1987355 -771583 115882 747996 1315745
20467 1315745 2163918 3277197 4430815 5070400 5103135 5160648 5564265 5573181 5792055 6757711
20457 6757711 7715823 8108266 7524465 7477228 7960171 8797153 9233592 9715510 10697861 11282756
20447 11282756 11793320 12066404 11650372 11304123 10635730 10618300 11091201 11691341 11607813 10668276
20437 10668276 10351947 11400895 13143741 13665677 13453250 13349785 13318449 12715591 12425801
20428 12425801 13103287 14180265 14371007 13596883 13241579 13316193 13916332 14264192 14717195
20419 14717195 15035561 14898521 14191675 12882155 12049554 12146819 11942774 12023015 12570857
$$ packed form
20484d0267340O493715N781146N422496L758187K446646K061641K412923K566665
20476i323921K793431K302815J577291M20745K42284J215772Q87465O32114N67749
20467A315745Q48173J113279J153618O39585L2735N7513M03617Q916K18874R65656
20457F757711R58112L92443n83801m7237M82943Q36982M36439M81918R82351N84895
20447A1282756N10564K73084m16032l46249o68393j7430M72901O00140q3528r39537
20437A0668276l16329J048948J742846N21936k12427j03465l1336o02858k89790
20428A2425801O77486J076978J90742p74124l55304P4614O00139L47860M53003
20419A4717195L18366j37040p06846j309520q32601R7265k04045Q0241N47842
$$ plain form
20410 12570857 13380787 14074960 13976657 14336510 14268877 13872065 14031128 14039229 14349762 14178230
20400 14178230 13833926 14710361 15479301 15846081 15675165 14981491 14868286 14698614 15103072
20391 15103072 15641312 15756264 15908488 15703148 15168140 14848277 14580153 14542336 14771530
20382 14771530 15177717 15100118 15112585 15073718 14918363 15229050 15705596 15983096 16288545 16352508
20372 16352508 15797414 16215706 15990632 15246805 15221484 15530870 16486024 17268419 17757876
20363 17757876 17748674 17065060 16211969 16169061 16659430 17562296 18324681 19038341 19689876 19340932
20353 19340932 18595937 18101733 17833573 18158605 18246787 17450471 17392218 17232901 17195099 17580804
20343 17580804 17878644 18149715 18361892 18628473 18293610 17765332 17508050 17911743 18147809
$$ packed form
20410A2570857Q09930O94173r8303L59853o7633l96812J59063Q101L10533j71532
20400A4178230l44304Q76435P68940L66780j70916o93674j13205j69672M04458
20391A5103072N38240J14952J52224k05340n35008l19863k68124l7817K29194
20382A4771530M06187p7599J2467l8867j55355L10687M76546K77500L05449O3963
20372A6352508n55094M18292k25074p43827k5321L09386R55154P82395M89457
20363A7757876r202o83614q53091m2908M90369R02866P62385P13660O51535l48944
20353A9340932p44995m94204k68160L25032Q8182p96316n8253j59317l7802L85705
20343A7580804K97840K71071K12177K66581l34863n28278k57282M03693K36066
$$ plain form
20334 18147809 18043800 18522140 18811045 19175489 19030859 18683386 18998849 19188251 18796923
20325 18796923 18382574 18409997 18923328 19767126 20221754 20111323 19220745 18415151 18477284 19016904
20315 19016904 19690230 19666741 18857478 18688073 19155438 19589259 19651082 19362303 18946690 18599246
20305 18599246 18161782 17908863 17722740 18017962 18638112 19853471 20842969 20830782 20579708
20296 20579708 20351857 19730585 18798536 18643412 18742285 18344454 18963051 19939311 20135691
20287 20135691 19719988 18921798 18701999 18803236 18825157 19078580 19380976 19946271 20355002
20278 20355002 20358898 20402199 20619479 20843053 20712763 20476970 20627732 20873474 20228920 19994677
20268 19994677 20357181 20560767 20906131 21464103 21700833 21467967 21109866 21246450 21187905
$$ packed form
20334A8147809j04009M78340K88905L64444j44630l47473L15463J89402l91328
20325A8796923m14349K7423N13331Q43798M54628j10431q90578q05594O2133N39620
20315A9016904O73326k3489q09263j69405M67365M33821O1823k88779m15613l47444
20305A8599246m37464k52919j86123K95222O20150J215359R89498j2187k51074
20296B0579708k27851o21272r32049j55124R8873l97831O18597R76260J96380
20287B0135691m15703p98190k19799J01237K1921K53423L02396N65295M08731
20278B0355002L896M3301K17280K23574j30290k35793J50762K45742o44554k34243
20268A9994677L62504K03586L45364N57972K36730k32866l58101J36584n8545
$$ plain form
20259 21187905 21034122 20787045 20616569 20408721 20312219 20773967 21204849 20787251 20479664
20250 20479664 19878549 19451294 20128348 20988524 21614743 21839125 22620132 23182136 23135751
20241 23135751 22358050 21692282 21737170 21554004 21033209 20761180 20576803 20768517 21332491
20232 21332491 21195281 20691302 21276917 22094339 23039864 23211985 22739230 22377484 21861488
20223 21861488 21493285 21265662 21123475 22101717 23367320 23912600 23838105 23805574 22964726
20214 22964726 22078048 22216161 22915598 23980782 24711374 24249535 23480099 22832537 22636166
20205 22636166 23399981 24051029 24213925 24437289 24427193 24505574 24375792 23563076 23294653 23639782
20195 23639782 24167074 25121180 26029116 26500442 26525646 25718711 25610153 26208566 25641826
$$ packed form
20259B1187905j53783k47077j70476k07848r6502M61748M30882m17598l07587
20250B0479664o01115m27255O77054Q60176O26219K24382P81007N62004m6385
20241B3135751p77701o65768M4888j83166n20795k72029j84377J91714N63974
20232B1332491j37210n03979N85615Q17422R45525J72121m72755l61746n15996
20223B1861488l68203k27623j42187R78242J265603N45280p4495l2531q40848
20214B2964726q86678J38113O99437J065184P30592m61839p69436o47562j96371
20205B2636166P63815O51048J62896K23364j0096P8381j29782q12716k68423L45129
20195B3639782N27292R54106R07936M71326K5204q06935j08558N98413n66740
$$ plain form
20186 25641826 25345378 25167185 25123369 25335111 25258840 25607383 26333451 26261288 25761188 25635988
20176 25635988 25366240 25505032 26094097 26465002 26287888 26556658 27179445 27776451 27920336
20167 27920336 27954772 28186132 27733629 27248002 27378269 27367819 27599333 27969800 27679511 27182762
20157 27182762 27902779 28965572 29439168 29774923 29894328 29408951 29086081 29380889 29473348
20148 29473348 29270246 29709755 30084892 29793885 29685862 30104025 30651762 30771420 30296920
20139 30296920 30338507 30238367 29673367 29851267 30418720 30281645 30148992 30523603 31295449
20130 31295449 31951493 32056975 31566033 31484428 31130283 30730108 30838962 31122135 31825568
20121 31825568 32702486 33163863 32907657 33048342 33725574 33998291 34495401 35332854 35485097
$$ packed form
20186B5641826k96448j78193m3816K11742p6271L48543P26068p2163n00100j25200
20176B5635988k69748J38792N89065L70905j77114K68770O22787N97006J43885
20167B7920336L4436K31360m52503m85627J30267j0450K31514L70467k90289m96749
20157B7182762P20017J062793M73596L35755J19405m85377l22870K94808R2459
20148B9473348k03102M39509L75137k91007j08023M18163N47737J19658m74500
20139C0296920M1587j00140n65000J77900N67453j37075j32653L74611P71846
20130C1295449O56044J05482m90942q1605l54145m00175J08854K83173P03433
20121C1825568Q76918M61377k56206J40685O77232K72717M97110Q37453J52243
$$ plain form
20112 35485097 35022314 35380812 36132026 37115519 37622692 37905355 37565865 37226774 37981382
20103 37981382 38690467 38770824 38480533 38334191 37778009 36882368 37711208 39295971 40613887
20094 40613887 41102952 40645596 40348650 40210588 39917169 40397293 40486555 40366824 41314235
20085 41314235 41840046 41983052 42414103 43381265 43582418 43430813 44102655 45060197 46409595
20076 46409595 47632957 47469111 47084246 47611602 48234180 48799615 50059216 50842683 50748129
20067 50748129 51093966 52000633 53114841 54066148 53992509 54432454 55877939 57309219 58558918
20058 58558918 59869803 60833267 61157686 62445200 64931159 67765769 69963587 71971454
20050 71971454 74309826 75621774 76191278 77775387 79745195 82173057 85227162 87978187
$$ packed form
20112C5485097m62783L58498P51214R83493N07173K82663l39490l39091P54608
20103C7981382P09085Q0357k90291j46342n56182q95641Q28840J584763J317916
20094D0613887M89065m57356k96946j38062k93419M80124Q9262j19731R47411
20085D1314235N25811J43006M31051R67162K01153j51605O71842R57542J349398
20076D6409595J223362j63846l84865N27356O22578N65435J259601P83467r4554
20067E0748129L45837R06667J114208R51307p3639M39945J445485J431280J249699
20058E8558918J310885R63464L24419J287514K485959K834610K197818K007867
20050G1971454K338372J311948N69504J584109J969808K427862L054105K751025
$$ plain form
20042 87978187 90970613 95346257 100564468 106487732 112338038 119719216 128082774 137181273
20034 137181273 147999251 162045070 177435078 193768699 209694084 222560870 220320800
20027 220320800 174971402 57167007 -73840120 -136023530 -144792256 -134020577 -118780397
20020 -118780397 -104137792 -92292178 -81686172 -72263569 -63980550 -56779015 -50471742
20013 -50471742 -44923502 -38747965 -32806813 -28012648 -23744509 -20073318 -16678405 -12989402
20005 -12989402 -9193737 -5221641 -885715 2881150 5390983 8035136 10692853 13981161
19997 13981161 17832093 21388249 24280128 27891594 31780929 34204263 36314243 40513514
19989 40513514 45859242 51197579 56553492 63526506 71274680 79184996 86612811 91187292
$$ packed form
20042H7978187K992426M375644N218211N923264N850306P381178Q363558R098499
20034A37181273J0817978J4045819J5390008J6333621J5925385J2866786k240070
20027B20320800m5349398j17804395j31007127o2183410q768726J0771679J5240180
20020a18780397J4642605J1845614J0606006R422603Q283019P201535O307273
20013e0471742N548240O175537N941152M794165M268139L671191L394913L689003
20005a2989402L795665L972096M335926L766865K509833K644153K657717L288308
19997A3981161L850932L556156K891879L611466L889335K423334K109980M199271
19989D0513514N345728N338337N355913O973014P748174P910316P427815M574481
$$ plain form
19981 91187292 89275451 70087922 24959553 -30394553 -66740284 -78209360 -76462571
19974 -76462571 -70404847 -63337907 -56547526 -50116550 -43927959 -38745223 -34430667 -30193379
19966 -30193379 -26593849 -23890165 -21787044 -18972193 -16393672 -13817185 -11672864 -10325148
19958 -10325148 -8308504 -5743088 -2253060 795534 3220931 5153392 6879907 7878931
19950 7878931 8723504 10275351 11293850 12114714 13378658 14510099 15577330 16393630 17529680
19941 17529680 19455121 20879369 22142229 24119265 26442560 28764045 31091871 34411794
19933 34411794 37606473 40575777 43963688 47420874 50829051 54863141 60159896 65778382
19925 65778382 71669306 78211626 85769952 94519873 104225134 115454512 128791689 143492783
$$ packed form
19981I1187292j911841j9187529m5128369n5354106l6345731j1469076J746789
19974g6462571O057724P066940O790381O430976O188591N182736M314556M237288
19966c0193379L599530K703684K103121K814851K578521K576487K144321J347716
19958a0325148K016644K565416L490028L048594K425397J932461J726515R99024
19950G878931Q44573J551847J018499Q20864J263944J131441J067231Q16300J136050
19941A7529680J925441J424248J262860J977036K323295K321485K327826L319923
19933C4411794L194679K969304L387911L457186L408177M034090N296755N618486
19925F5778382N890924O542320P558326Q749921R705261J1229378J3337177J4701094
$$ plain form
19917 143492783 159382702 174088377 181514052 163981258 88263836 -42383302 -145815191
19910 -145815191 -181939905 -181679650 -169619235 -154601190 -139070343 -125659771 -114873103
19903 -114873103 -106626733 -99746268 -93948868 -88947756 -83867191 -78394756 -73200348 -68259032
19895 -68259032 -64702693 -62360304 -60629249 -58248354 -55863691 -52994822 -50263088 -47809336
19887 -47809336 -45872275 -44431494 -42955566 -40912460 -38567284 -37130624 -35831803 -34234746
19879 -34234746 -33184560 -32746790 -31948254 -30458883 -28887802 -27826833 -27310382 -26396655 -25504625
19870 -25504625 -24715796 -24110640 -23847076 -24137194 -23777009 -22949169 -22039544 -20965637 -19887437
19861 -19887437 -19691569 -19757488 -19607327 -18516061 -17081452 -16359686 -16336299 -15696278 -14859337
$$ packed form
19917A43492783J5889919J4705675P425675j7532794p5717422j30647138j03431889
19910a45815191l6124714K60255J2060415J5018045J5530847J3410572J0786668
19903a14873103Q246370O880465N797400N001112N080565N472435N194408M941316
19895f8259032L556339K342389J731055K380895K384663K868869K731734K453752
19887d7809336J937061J440781J475928K043106K345176J436660J298821J597057
19879c4234746J050186M37770P98536J489371J571081J060969N16451R13727Q92030
19870b5504625P88829O05156K63564k90118L60185Q27840R09625J073907J078200
19861a9887437J95868o5919J50161J091266J434609P21766K3387O40021Q36941
$$ plain form
19852 -14859337 -14774589 -14817780 -14488533 -13802964 -12609354 -11957969 -11483621 -11013858 -11008190 -11693099
19842 -11693099 -11555003 -10829247 -11391133 -11981349 -11467921 -10500599 -10423019 -10503095 -10157186 -9624168
19832 -9624168 -8903571 -8264668 -7476406 -6607607 -6784127 -7333501 -7189317 -6799654 -6734264 -6381078
19822 -6381078 -6523222 -7348025 -7631035 -7170315 -7347386 -7357617 -6949510 -6536824 -6532028 -6397026
19812 -6397026 -6152866 -5977453 -5878295 -5297308 -4487561 -4927585 -5576855 -5364595 -4819719 -4192149
19802 -4192149 -3590141 -4093727 -4533708 -4670891 -4775291 -4573236 -4956103 -5638764 -5963248
19793 -5963248 -5144553 -4297771 -3916621 -3803985 -3803566 -3206223 -2474331 -2573712 -2275507 -1929472
19783 -1929472 -1951360 -2247515 -1832258 -877944 205183 650573 465336 -35812 -201827
$$ packed form
19852a4859337Q4748m3191L29247O85569J193610O51385M74348M69763N668o84909
19842a1693099J38096P25756n61886n90216N13428R67322P7580q0076L45909N33018
19832i624168P20597O38903P88262Q68799j76520n49374J44184L89663O5390L53186
19822f381078j42144q24803k83010M60720j77071j0231M08107M12686M796J35002
19812f397026K44160J75413R9158N80987Q09747m40024o49270K12260N44876O27570
19802d192149O02008n03586m39981j37183j04400K02055l82867o82661l24484
19793e963248Q18695Q46782L81150J12636M19N97343P31892r9381K98205L46035
19783a929472k1888k96155M15257R54314J083127M45390j85237n01148j66015
$$ plain form
19774 -201827 -348875 -650691 -1136348 -1335149 -1260556 -816863 -774817 -790806 -188592 187866
19764 187866 557765 938718 439898 -79859 46998 551841 959539 1349390 1835985 2134745
19754 2134745 1878739 1964772 2100157 1943403 1966726 1890843 1470342 1217510 1080420 1309928
19744 1309928 977740 531749 1012831 1788787 1888440 1967407 2375189 2804072 2477757 1466498
19734 1466498 911114 2322328 3481812 3198324 3152809 3370981 3523998 3983718 4101592
19725 4101592 3628062 2644532 1663555 1655560 2129860 2610500 2754319 2963375 3363646 3779365
19715 3779365 4133473 4629706 5102955 4818448 4777034 5084045 5320566 5293921 4771070 4463321
19705 4463321 4609497 4868816 5270402 5978439 5786558 5563147 5457226 4956197 4172090
$$ packed form
19774b01827j47048l01816m85657j98801P4593M43693M2046j5989O02214L76458
19764A87866L69899L80953m98820n19757J26857N04843M07698L89851M86595K98760
19754B134745k56006Q6033J35385j56754K3323p5883m20501k52832j37090K29508
19744A309928l32188m45991M81082P75956R9653P8967M07782M28883l26315j011259
19734A466498n55384J411214J159484k83488m5515K18172J53017M59720J17874
19725D101592m73530r83530r80977p995M74300M80640J43819K09056M00271M15719
19715C779365L54108M96233M73249k84507m1414L07011K36521k6645n22851l07749
19705D463321J46176K59319M01586P08037j91881k23411j05921n01029p84107
$$ plain form
19696 4172090 3850271 3725128 4227620 4987342 5610490 5945563 6037163 5888026 5790082 5534572
19686 5534572 4782294 4814623 5635831 5787594 5738557 5754893 6118896 6514784 6892955 7209434
19676 7209434 6822682 6156067 5706328 5901890 6382626 6498968 6331979 5631056 5537611 5980322
19666 5980322 6383406 7115077 7247366 7226454 7120745 7429621 7448440 7491727 7630917 7894323
19656 7894323 8921700 10025660 10204516 9709443 9952599 10013107 9441305 8693847 8577755
19647 8577755 8794398 9101677 8992810 8280643 8222134 7955192 7076119 6696292 6666789 7364109
19637 7364109 7401417 6406653 5493239 5704483 6538741 7409723 7766686 7594688 7468600 7239065
19627 7239065 7788168 8026252 8033113 8819913 8992821 8482187 7864994 8107342 9168853 9727336
$$ packed form
19696D172090l21819j25143N02492P59722O23148L35073R1600j49137r7944k55510
19686E534572p52278L2329Q21208J51763m9037J6336L64003L95888L78171L16479
19676G209434l86752o66615m49739J95562M80736J16342j66989p00923r3445M42711
19666E980322M03084P31671J32289k0912j05709L08876J8819M3287J39190K63406
19656G894323J027377J103960J78856m95073K43156O0508n71802p47458j16092
19647H577755K16643L07279j08867p12167n8509k66942q79073l79827k9503O97320
19637G364109L7308r94764r13414K11244Q34258Q70982L56963j71998j26088k29535
19627G239065N49103K38084O861P86800J72908n10634o17193K42348J061511N58483
$$ plain form
19617 9727336 9850103 10819302 11063013 10406644 9877179 9627758 9497121 9538013 9487676 9567628
19607 9567628 9657818 9864893 10219940 10169403 9748139 8943687 8360283 8834774 9735064 10318648
19597 10318648 10474056 10344070 10110023 10511070 10705017 10821881 10896216 11019398 11341023
19588 11341023 11294801 11151979 10908336 10568965 10960395 11110659 11134733 11481393 12177242 12329583
19578 12329583 12886042 13775169 13486704 13437441 13570167 12787170 12680935 14100287 15487991
19569 15487991 15196281 14688146 14562519 14735853 15446020 15275925 14588845 13820900 13570642
19560 13570642 13498591 13984901 14239127 14663907 15334961 15768241 16254432 16917888 17633646
19551 17633646 17999449 17845783 18042118 19104783 19788281 19201130 18246405 18425418 19270241
$$ packed form
19617I727336J22767R69199K43711o56369n29465k49421j30637M0892n0337P9952
19607I567628R0190K07075L55047n0537m21264q04452n83404M74491R00290N83584
19597A0318648J55408j29986k34047M01047J93947J16864P4335J23182L21625
19588A1341023m6222j42822k43643l39371L91430J50264K4074L46660O95849J52341
19578A2329583N56459Q89127k88465m9263J32726p82997j06235J419352J387704
19569A5487991k91710n08135j25627J73334P10167j70095o87080p67945k50258
19560A3570642p2051M86310K54226M24780O71054M33280M86191O63456P15758
19551A7633646L65803j53666J96335J062665O83498n87151r54725J79013Q44823
$$ plain form
19542 19270241 20866906 21946507 21878076 21617684 21791631 21898827 21764306 21621308 21891244
19533 21891244 22449559 23032528 23918457 24736740 25812614 27028175 28100297 29321340 30766669
19524 30766669 31783429 33112389 34561606 35989037 37138400 37988180 39263779 41417185
19516 41417185 43533454 46066493 48614694 51214924 55819190 60898798 66212067 73227662
19508 73227662 80598758 87648502 94250137 98018615 91415525 62319193 5773283 -48111915
19500 -48111915 -72847978 -77179633 -73587778 -66962172 -60052103 -53694643 -48125943 -43776001
19492 -43776001 -40023912 -37193254 -34703630 -31584452 -29242012 -27116463 -24740726 -22578346
19484 -22578346 -21107337 -20908310 -19960443 -18292803 -16664932 -14686836 -14178168 -14393160 -14178376
$$ packed form
19542A9270241J596665J079601o8431k60392J73947J07196j34521j42998K69936
19533B1891244N58315N82969Q85929Q18283J075874J215561J072122J221043J445329
19524C0766669J016760J328960J449217J427431J149363Q49780J275599K153406
19516D1417185K116269K533039K548201K600230M604266N079608N313269P015595
19508G3227662P371096P049744O601635L768478o603090k9096332n6545910n3885198
19500d8111915k4736063m331655L591855O625606O910069O357460N568700M349942
19492d3776001L752089K830658K489624L119178K342440K125549K375737K162380
19484b2578346J471009J99027R47867J667640J627871J978096N08668k14992K14784
$$ plain form
19475 -14178376 -13515252 -12895585 -12168121 -11213075 -10469095 -9948625 -9815295 -9050825 -8242220
19466 -8242220 -6260325 -5216393 -5299063 -5082847 -4814334 -4947776 -5129222 -4688681 -4472434
19457 -4472434 -4167672 -3137056 -2391024 -2736587 -2937716 -2908014 -3323605 -4174578 -4306081
19448 -4306081 -3625293 -2597764 -2022881 -1788388 -2041373 -2383107 -2462300 -2552779 -2620380 -1901826
19438 -1901826 -557208 627460 1132131 402495 -517366 -651888 261328 1350882 2308073
19429 2308073 2442195 1878941 1952532 1736785 1519660 1877626 2061411 2356919 2772762 2622469
19419 2622469 2258412 2276951 2799952 3507064 3231121 2130129 1260754 1178902 1361754 1865731
19409 1865731 2547697 2027037 1865038 2615575 2438013 1916012 2356133 2377302 1261563
$$ packed form
19475a4178376O63124O19667P27464R55046P43980N20470J33330P64470Q08605
19466h242220J981895J043932q2670K16216K68513j33442j81446M40541K16247
19457d472434L04762J030616P46032l45563k01129K9702m15591q50973j31503
19448d306081O80788J027529N74883K34493k52985l41734p9193r0479o7601P18554
19438a901826J344618J184668N04671p29636r19861j34522R13216J089554R57191
19429B308073J34122n63254P3591k15747k17125L57966J83785K95508M15843j50293
19419B622469l64057J8539N23001P07112k75943j100992q69375q1852J82852N03977
19409A865731O81966n20660j61999P50537j77562n22001M40121K1169j115739
$$ plain form
19400 1261563 1254124 1428816 1587678 1672026 1655904 2347590 3367635 4128559 4603127 4837557
19390 4837557 4677222 4629114 4838637 4914818 4109315 3807524 4403134 4255555 3802702 3488543
19380 3488543 3857884 4129478 4209441 4714894 5692912 6406265 5580520 4082928 3811134
19371 3811134 4205925 4938027 5653574 5988501 6295705 5671367 4782817 4528619 4692153
19362 4692153 5646747 5820903 5021826 4456447 4958789 5163893 4925592 4715119 4508809
19353 4508809 4229959 4410826 4953653 5871529 5798043 4242621 4008640 4137988 3810872
19344 3810872 4122559 4760251 4745015 4256927 4303327 4502993 5222445 6011553 5796359 5751410
19334 5751410 5941145 5708513 5229047 5701325 6028303 5953792 6079298 5937698 5844263 6332620
$$ packed form
19400A261563p439J74692J58862Q4348j6122O91686J020045P60924M74568K34430
19390D837557j60335m8108K09523P6181q05503l01791N95610j47579m52853l14159
19380C488543L69341K71594P9963N05453R78018P13353q25745j497592k71794
19371C811134L94791P32102P15547L34927L07204o24338q88550k54198J63534
19362D692153R54594J74156p99077n65379N02342K05104k38301k10473k06310
19353D508809k78850J80867N42827R17876p3486j555422k33981J29348l27116
19344C810872L11687O37692j5236m88088M6400J99666P19452P89108k15194m4949
19334E751410J89735k32632m79466M72278L26978p4511J25506j41600r3435M88357
$$ plain form
19324 6332620 6581794 6312865 5288428 4688906 5036542 4774425 4525241 5078454 5470771
19315 5470771 5500588 6048789 6700860 6577011 6149408 5588304 5909394 6729658 6778541 6250436
19305 6250436 6227991 6826048 7049425 6956972 6490561 5601963 4728073 5039987 5466894 5528934
19295 5528934 5840664 5567813 5914126 6352433 6455236 6057537 5752720 5860809 5871941 6260310
19285 6260310 6380267 6388421 6960607 7516827 6924751 5568456 5014798 5276156 5360223 5943396
19275 5943396 7210242 7893779 7189120 6149574 5460580 5810321 6237844 6249276 6067708
19266 6067708 5688484 6142674 6975759 7712526 8061045 8153007 7298528 6271668 5788325
19257 5788325 5464218 4815767 4836915 5573714 6019017 5952769 5980800 5899034 5345437 5316494
$$ packed form
19324F332620K49174k68929j024437n99522L47636k62117k49184N53213L92317
19315E470771K9817N48201O52071j23849m27603n61104L21090Q20264M8883n28105
19305F250436k2445N98057K23377r2453m66411q88598q73890L11914M26907O2040
19295E528934L11730k72851L46313M38307J02803l97699l04817J08089J1132L88369
19285F260310J19957Q154N72186N56220n92076j356295n53658K61358Q4067N83173
19275E943396J266846O83537p04659j039546o88994L49741M27523J1432j81568
19266F067708l79224M54190Q33085P36767L48519R1962q54479j026860m83343
19257E788325l24107o48451K1148P36799M45303o6248K8031q1766n53597k8943
$$ plain form
19247 5316494 5730410 6036517 6590872 6867969 6711207 6412220 6077973 6071963 6690801 7208266
19237 7208266 7820132 8268657 7920319 7304009 6904273 7045224 7368337 7706909 7478266
19228 7478266 6853888 6918720 7190996 6978054 6806678 7401875 7337536 6945020 6738802 6766279
19218 6766279 7080955 6919263 7061434 7278605 7546265 7974376 7952312 7965791 8066195 7904262
19208 7904262 7518800 7965975 8585932 8658375 8609390 8766719 8316384 8006730 7655668 7605048
19198 7605048 8131724 8454402 8721487 8768751 8845993 8479541 7993259 7438276 7731864 8214881
19188 8214881 8806703 9048372 8528850 8293380 8751700 8807276 8561698 8179548 8356612 8546878
19178 8546878 8318709 8563775 8933883 8147485 6978369 7240352 8438890 8680046 8477209
$$ packed form
19247E316494M13916L06107N54355K77097j56762k98987l34247o010O18838N17465
19237G208266O11866M48525l48338o16310l99736J40951L23113L38572k28643
19228G478266o24378O4832K72276k12942j71376N95197o4339l92516k06218K7477
19218F766279L14676j61692J42171K17171K67660M28111k2064J3479J00404j61933
19208G904262l85462M47175O19957P2443m8985J57329m50335l09654l51062n0620
19198G605048N26676L22678K67085M7264P7242l66452m86282n54983K93588M83017
19188H214881N91822K41669n19522k35470M58320N5576k45578l82150J77064J90266
19178H546878k28169K45066L70108p86398j169116K61983J198538K41156k02837
$$ plain form
19169 8477209 8134276 8415352 8609670 8580250 8174318 7163990 6828308 6889733 7156711 7558846
19159 7558846 8279732 8696967 9372868 9244385 9112793 9619409 9432111 9555926 9789756
19150 9789756 9666251 9577528 9571916 9875160 9311645 8423158 8251097 9016148 8530593 8007477
19140 8007477 7865352 7902550 7716460 7272223 7919016 8274227 8587887 8661402 8478187 7675671
19130 7675671 7724648 8563639 9426077 9852168 10343868 10593547 10484979 10227758 9938186 9095602
19120 9095602 8626917 9084924 10001727 10041576 9339640 9141708 8816462 8265714 8504638 9384300
19110 9384300 9841514 9911611 9841940 9238511 8319760 8177983 8340818 8536004 9233108 9202826
19100 9202826 8918400 8729720 8536196 8959338 9658811 9678728 8951820 8365104 7955097 7862078
$$ packed form
19169H477209l42933K81076J94318k9420m05932j010328l35682O1425K66978M02135
19159G558846P20886M17235O75901j28483j31592N06616j87298J23815K33830
19150I789756j23505q8723n612L03244n63515q88487j72061P65051m85555n23116
19140H007477j42125L7198j86090m44237O46793L55211L13660P3515j83215q02516
19130G675671M8977Q38991Q62438M26091M91700K49679j08568k57221k89572q42584
19120I095602m68685M58007R16803L9849p01936j97932l25246n50748K38924Q79662
19110I384300M57214P0097o9671o03429r18751j41777J62835J95186O97104l0282
19100I202826k84426j88680j93524M23142O99473J9917p26908n86716m10007r3019
$$ plain form
19090 7862078 8017704 8070958 8453484 9067380 9077931 8712575 9070071 9488418 10038491 10032270
19080 10032270 8891511 8265527 8124789 9033160 9935539 9834021 9243135 9036483 9154981
19071 9154981 9676034 10434649 10625488 10281581 9735691 9009810 8498457 8597200 9620544
19062 9620544 10526672 10600752 9837544 9666100 9324298 8753476 8769605 9632038 10480634 11422665
19052 11422665 11367421 10535736 10416442 10386326 9634919 8596255 8491682 8829576 9404689
19043 9404689 9966855 9676067 9328691 9040760 8338808 7955842 8741272 9439144 9559106
19034 9559106 9625129 8590233 7538960 7319075 7838076 8700228 9452405 9497013 8947822
19025 8947822 8602306 9147780 10124915 10546516 10239473 9926456 9886180 9521938 9508957 9386015
$$ packed form
19090G862078J55626N3254L82526O13896J0551l65356L57496M18347N50073o221
19080A0032270j140759o25984j40738R08371R02379j01518n90886k06652J18498
19071I154981N21053P58615J90839l43907n45890p25881n11353R8743J023344
19062I620544R06128P4080p63208j71444l41802n70822J6129Q62433Q48596R42031
19052A1422665n5244q31685j19294l0116p51407j038664j04573L37894N75113
19043I404689N62166k90788l47376k87931p01952l82966P85430O97872J19962
19034I559106O6023j034896j051273k19885N19001Q62152P52177M4608n49191
19025H947822l45516N45474R77135M21601l07043l13017m0276l64242j2981j22942
$$ plain form
19015 9386015 9260502 9485967 9938388 10173511 10178543 10060245 10252564 10999034 11690778 11654898
19005 11654898 11281475 10674740 10144371 10533051 10893466 10881073 10497775 9910706 9511825
18996 9511825 9615382 9731212 9832679 10170904 10455440 11392413 11513925 10295443 9952841
18987 9952841 9797374 9633963 9938978 9569509 9179945 9407604 9688979 10395359 11228059
18978 11228059 11864765 11579643 10620856 9845362 10268798 10772246 10623178 10398780 10018823
18969 10018823 9645508 8914373 8936523 10400504 11219034 11288845 11384709 11480616 10996037 9769240
18959 9769240 9133603 9120735 8910069 7652198 6318115 6078182 6544925 7448285 8595123
18950 8595123 8998192 9293578 10163654 10245746 9961198 10185991 10211737 9662914 8917223 8752876
$$ packed form
19015I386015j25513K25465M52421K35123N032j18298J92319P46470O91744l5880
19005A1654898l73423o06735n30369L88680L60415j2393l83298n87069l98881
18996I511825J03557J15830J01467L38225K84536R36973J21512j218482l42602
18987I952841j55467j63411L05015l69469l89564K27659K81375P06380Q32700
18978A1228059O36706k85122r58787p75494M23436N03448j49068k24398l79957
18969A0018823l73315p31135K2150J463981Q18530O9811R5864R5907m84579j226797
18959I769240o35637j2868k10666j257871j334083k39933M66743R03360J146838
18950H595123M03069K95386Q70076Q2092k84548K24793K5746n48823p45691j64347
$$ plain form
18940 8752876 9370729 9444137 9114919 9050324 9054593 9158659 8565810 7788770 7754085 7564571
18930 7564571 8387370 9285029 9273582 9021498 9049646 9465790 9835591 9612913 9576376 9468827
18920 9468827 9077573 8978568 9079952 10177656 11130861 10872170 10232013 9752580 9796772 10182011
18910 10182011 10465514 10474976 10393648 10065702 10371311 10612900 11133498 11747502 11535670 11758838
18900 11758838 12364223 12371432 11679352 10661621 10850701 11436200 11201709 10784088 10501180
18891 10501180 10313074 10247670 10838657 11285349 11357376 10873471 9258589 8486671 8978628
18882 8978628 9647681 10051051 10353814 10773417 10787793 10496445 10460103 10262622 9704222 9216326
18872 9216326 9317348 10155693 10546325 10040889 9343421 9215471 9548395 9783887 9723124 9108178
$$ packed form
18940H752876O17853P3408l29218o4595M269J04066n92849p77040l4685j89514
18930G564571Q22799Q97659j1447k52084K8148M16144L69801k22678l6537j07549
18920I468827l91254r9005J01384J097704R53205k58691o40157m79433M4192L85239
18910A0182011K83503R462q1328l27946L05609K41589N20598O14004k11832K23168
18900A1758838O05385P209o92080j017731J89080N85499k34491m17621k82908
18891A0501180j88106o5404N90987M46692P2027m83905j614882p71918M91957
18882H978628O69053M03370L02763M19603J4376k91348l6342j97481n58400m87896
18872I216326J01022Q38345L90632n05436o97468j27950L32924K35492o0763o14946
$$ plain form
18862 9108178 8574908 9722615 11587943 12422064 12612990 12338445 12235397 12331396 11742404
18853 11742404 11627025 12439330 13158033 12936781 12260939 11844806 11008013 10549107 10839166
18844 10839166 11809920 12611665 12909265 12949975 13104719 12861121 12104807 11120425 10648109
18835 10648109 11269532 11652685 11236352 10440385 9498110 9792635 11059460 11774397 11415284
18826 11415284 10896794 10744853 10523932 10232196 10511754 10867741 11084188 10923437 10163709
18817 10163709 9608218 9372548 9866992 9955871 10013623 9252764 8899736 9594251 10253851 11052463
18807 11052463 11350166 10985791 10770423 10131468 9992182 10520523 10207776 10431723 10835477
18798 10835477 10389234 9724420 9417562 10378287 11164876 11176049 11089768 11364764 11720495 11305736
$$ packed form
18862I108178n33270J147707J865328Q34121J90926k74545j03048R5999n88992
18853A1742404j15379Q12305P18703k21252o75842m16133q36793m58906K90059
18844A0839166R70754Q01745K97600M0710J54744k43598p56314r84382m72316
18835A0648109O21423L83153m16333p95967r42275K94525J266825P14937l59113
18826A1415284n18490j51941k20921k91736K79558L55987K16447j60751p59728
18817A0163709n55491k35670M94444Q8879N7752p60859l53028O94515O59600P98612
18807A1052463K97703l64375k15368o38955j39286N28341l12747K23947M03754
18798A0835477m46243o64814l06858R60725P86589J1173q6281K74996L55731m14759
$$ plain form
18788 11305736 11381205 11957361 11719769 10551964 10084186 10288335 9743588 10071889 11250490
18779 11250490 11452121 11260464 11121195 11531631 12007966 11559464 11176756 11281113 11220263
18770 11220263 10216581 10038536 10899912 11449941 11600586 11680330 11312560 10205106 9550928
18761 9550928 9239595 9315373 9963530 10426300 10462496 10600766 10295214 10183593 10260528 10223101
18751 10223101 10794508 11239421 11565274 12058080 12608989 12378067 11967537 11449313 11496380
18742 11496380 11291693 11211191 10909283 10054518 9899378 10194037 10401354 10825561 10972973
18733 10972973 10831464 10807963 10796213 10293269 10099562 10147022 9920508 9513831 9905844 10741713
18723 10741713 11807088 12185833 11120255 10326909 10352711 10336824 10736648 11078314 11323938
$$ packed form
18788A1305736P5469N76156k37592j167805m67778K04149n44747L28301J178601
18779A1250490K01631j91657j39269M10436M76335m48502l82708J04357o0850
18770A1220263j003682j78045Q61376N50029J50645P9744l67770j107454o54178
18761I550928l11333P5778O48157M62770L6196J38270l05552j11621P6935l7427
18751A0223101N71407M44913L25853M92806N50909k30922m10530n18224M7067
18742A1496380k04687q0502l01908q54765j55140K94659K07317M24207J47412
18733A0972973j41509k3501j1750n02944j93707M7460k26514m06677L92013Q35869
18723A0741713J065375L78745j065578p93346K5802j5887L99824L41666K45624
$$ plain form
18714 11323938 11098848 10153767 9872605 10378624 10857396 11658869 11904978 11562173 10966469
18705 10966469 10402958 10850309 11534284 11360931 10805967 10433950 11000631 11577734 11446699
18696 11446699 10625872 9556067 9342844 9222058 8905087 8439070 8253147 8690942 9558100
18687 9558100 10352815 10462882 10604811 10773072 10609040 10958836 11430447 11791321 11545289
18678 11545289 10555903 10131447 10475318 11076829 11564123 11873852 11768294 11672743 10981188
18669 10981188 10630154 11126569 11415599 11345638 11590605 11363309 10747113 10897176 11106290
18660 11106290 11089254 11030190 11349269 11842070 12315334 12305355 11850977 10981184 10362497 10304754
18650 10304754 10441268 10550719 10728406 10950822 11118517 11601131 12463836 12443443 12287949
$$ packed form
18714A1323938k25090r45081k81162N06019M78772Q01473K46109l42805n95704
18705A0966469n63511M47351O83975j73353n54964l72017N66681N77103j31035
18696A1446699q20827j069805k13223j20786l16971m66017j85923M37795Q67158
18687I558100P94715J10067J41929J68261j64032L49796M71611L60874k46032
18678A1545289r89386m24456L43871O01511M87294L09729j05558r5551o91555
18669A0981188l51034M96415K89030o9961K44967k27296o16196J50063K09114
18660A1106290j7036n9064L19079M92801M73264r979m54378q69793o18687n7743
18650A0304754J36514J09451J77687K22416J67695M82614Q62705k0393j55494
$$ plain form
18641 12287949 12141004 12034748 11910356 11474540 11357915 11549497 11636773 11595157 11613443 11910463
18631 11910463 12203710 12694967 13300247 13350004 13218610 12973318 12403688 12657319 12786919
18622 12786919 12107535 11157194 10490021 10468241 11006632 11290927 10960049 10829198 10763958 10371794
18612 10371794 10273990 10879233 11497280 10538526 10065726 10486201 10786083 10931635 11403384
18603 11403384 11786452 11256668 10903072 11123759 11231111 11895539 12521722 12533294 12330989
18594 12330989 12132535 12191147 12074799 11598856 11394297 11143879 10506608 10916424 12250958
18585 12250958 12602359 12413308 12221389 12395040 12697157 12731124 12614792 12934532 12659823
18576 12659823 12351069 12137412 12208084 12338229 12562364 12918215 12607406 11493431 10440300
$$ packed form
18641A2287949j46945j06256j24392m35816j16625J91582Q7276m1616J8286K97020
18631A1910463K93247M91257O05280M9757j31394k45292n69630K53631J29600
18622A2786919o79384r50341o67173k1780N38391K84295l30878j30851o5240l92164
18612A0371794r7804O05243O18047r58754m72800M20475K99882J45552M71749
18603A1403384L83068n29784l53596K20687J07352O64428O26183J1572k02305
18594A2330989j98454N8612j16348m75943k04559k50418o37271M09816J334534
18585A2250958L51401j89051j91919J73651L02117L3967j16332L19740k74709
18576A2659823l08754k13657P0672J30145K24135L55851l10809j113975j053131
$$ plain form
18567 10440300 10264363 10521113 11111836 12070444 13080409 14067480 14212355 13335242 12652505
18558 12652505 12311008 12934136 12562727 11951750 11458481 10943301 11208779 11820418 11823308 11901225
18548 11901225 12212240 12176173 12165670 12199938 12368035 12167226 12359691 11799518 11646936 12086703
18538 12086703 11441865 10661890 10631827 11699624 12516561 12430064 11781718 10926820 9820724
18529 9820724 10023684 10782405 11149968 12161449 13023619 13142582 12861120 12333695 11319564
18520 11319564 10753173 11072182 11900386 12163169 12065526 11748385 11674447 12028596 12752044 13677545
18510 13677545 14013950 13476360 12473248 12522527 12785829 13016976 13690309 14167194 14297602
18501 14297602 14589523 14365059 13874626 13760228 13277056 13241562 12822369 11653937 11783862
$$ packed form
18567A0440300j75937K56750N90723R58608J009965R87071J44875q77113o82737
18558A2652505l41497O23128l71409o10977m93269n15180K65478O11639K890P7917
18548A1901225L11015l6067j0503L4268J68097k00809J92465n60173j52582M39767
18538A2086703o44838p79975l0063J067797Q16937q6497o48346q54898j106096
18529I820724K02960P58721L67563J011481Q62170J18963k81462n27425j014131
18520A1319564n66391L19009Q28204K62783r7643l17141p3938L54149P23448R25501
18510A3677545L36405n37590j003112M9279K63302K31147O73333M76885J30408
18501A4297602K91921k24464m90433j14398m83172l5494m19193j168432J29925
$$ plain form
18492 11783862 12289802 12483541 12274759 12077798 12193535 12338680 11690233 11323411 11251516
18483 11251516 11171339 11140885 10505836 9926702 10044256 11027371 11956502 12126448 11559066 11430162
18473 11430162 11357987 10618000 10330184 10531732 11003211 11109064 10937647 11201541 11634926
18464 11634926 11425246 11041519 11132661 11369723 11561406 11958605 12017245 12147047 12964512 13453699
18454 13453699 13394393 12837411 12677265 12610098 12515907 12573596 12976930 13078320 12325670 12034714
18444 12034714 12058665 11563200 11339574 11626401 11538033 11887108 12734810 13627890 13844607 13432873
18434 13432873 12323128 11751725 12571471 12154096 10910580 10457782 10649295 11863758 12447109
18425 12447109 11837846 11493864 11111481 10508726 11117490 11559333 11535090 11715732 11813721 11688763
$$ packed form
18492A1783862N05940J93739k08782j96961J15737J45145o48447l66822p1895
18483A1251516q0177l0454o35049n79134J17554R83115R29131J69946n67382j28904
18473A1430162p2175p39987k87816K01548M71479J05853j71417K63894M33385
18464A1634926k09680l83727R1142K37062J91683L97199N8640J29802Q17465M89187
18454A3453699n9306n56982j60146o7167r4191N7689M03334J01390p52650k90956
18444A2034714K3951m95465k23626K86827q8368L49075Q47702Q93080K16717m11734
18434A3432873j109745n71403Q19746m17375j243516m52798J91513J214463N83351
18425A2447109o09263l43982l82383o02755O08764M41843k4243J80642R7989j24958
$$ plain form
18415 11688763 12370025 12644410 11649983 11046516 11690609 12834617 13145614 13544200 13153834
18406 13153834 12162261 11715313 12074208 12592803 13009222 12879129 12259987 12420247 12670309
18397 12670309 12456652 12784906 12707410 12725472 13182192 13310233 13009178 12911049 13049956 13191042
18387 13191042 12471779 12212443 12061237 12150328 11753182 11919174 12615381 12185484 11610158
18378 11610158 11770345 11943417 12067663 11940891 11625649 11838080 12111514 12303714 12433470
18369 12433470 11795535 11078860 10388374 9957810 10153243 10572476 10827453 10924640 11377370
18360 11377370 11791033 11983696 12350945 12679283 12712397 12638221 12660621 12841324 13229160 13215835
18350 13215835 13139413 13139498 12964731 12289029 11673569 11652554 11991356 12300142 11967132 11319824
$$ packed form
18415A1688763O81262K74385r94427o03467O44093J144008L10997L98586l90366
18406A3153834r91573m46948L58895N18595M16419j30093o19142J60260K50062
18397A2670309k13657L28254p7496J8062M56720J28041l01055r8129J38907J41086
18387A3191042p19263k59336j51206Q9091l97146J65992O96207m29897n75326
18378A1610158J60187J73072J24246j26772l15242K12431K73434J92200J29756
18369A2433470o37935p16675o90486m30564J95433M19233K54977R7187M52730
18360A1377370M13663J92663L67249L28338L3114p4176K2400J80703L87836j3325
18350A3215835p6422Q5j74767o75702o15460k1015L38802L08786l33010o47308
$$ plain form
18340 11319824 10773588 10859359 11495653 12014757 11790877 12011017 12444623 12456915 12504726 12017260
18330 12017260 11363102 11552027 11311176 10985900 11367903 12179290 11974955 11806986 12400540
18321 12400540 12782769 12452130 12118387 11796140 11738440 11473540 11360805 11497283 11311618
18312 11311618 11099969 10256446 9495170 10271093 11482991 11865238 11792113 12082918 11833538
18303 11833538 11240209 11370050 11227176 10894413 11055667 12059368 12969712 13082067 13449941
18294 13449941 13258869 13154577 12634043 12403012 13067320 13400250 12780602 12029404 11949631
18285 11949631 12483480 12344223 11920296 11292613 11262473 11303670 10905750 11093769 11263059 11565402
18275 11565402 11957927 12565240 12785577 12315661 11889989 11635578 12204421 12942696 13218076
$$ packed form
18340A1319824n46236Q5771O36294N19104k23880K20140M33606J2292M7811m87466
18330A2017260o54158J88925k40851l25276L82003Q11387k04335j67969N93554
18321A2400540L82229l30639l33743l22247n7700k64900j12735J36478j85665
18312A1311618k11649q43523p61276P75923J211898L82247p3125K90805k49380
18303A1833538n93329J29841j42874l32763J61254J003701R10344J12355L67874
18294A3449941j91072j04292n20534k31031O64308L32930o19648p51198p9773
18285A1949631N33849j39257m23927o27683l0140M1197l97920J88019J69290L02343
18275A1565402L92525O07313K20337m69916m25672k54411N68843P38275K75380
$$ plain form
18266 13218076 13657590 14359413 15040831 15613853 15668181 15411864 15411014 15478117 15209121 14180981
18256 14180981 13409570 12593036 11617165 10816048 10217298 10397259 10969300 11862907 12363696
18247 12363696 12666160 12387970 12003333 12152547 12269049 11913587 11929564 12088595 12149832 12088311
18237 12088311 11433079 11486447 11553188 11544189 11543261 11523604 12317759 12738267 12700021 12853577 12294629
18226 12294629 11507992 11152214 11583390 12378577 12976751 12725210 12007479 11697498 11979864
18217 11979864 11937607 11740756 12108761 12526147 12966364 12723210 11637101 11255901 11897277
18208 11897277 12393192 12124678 11724625 11389390 11542452 12021465 12066717 11678159 10823675
18199 10823675 10663422 10805364 11142880 11448636 11694204 11904535 11574626 11373033 10820478
$$ packed form
18266A3218076M39514P01823O81418N73022N4328k56317q50O7103k68996j028140
18256A4180981p71411q16534r75871q01117n98750J79961N72041Q93607N00789
18247A2363696L02464k78190l84637J49214J16502l55462J5977J59031O1237o1521
18237A2088311o55232N3368O6741q999r28j9657P94155M20508l8246J53556n58948
18226A2294629p86637l55778M31176P95187N98174k51541p17731l09981K82366
18217A1979864m2257j96851L68005M17386M40217k43154j086109l81200O41376
18208A1897277M95915k68514m00053l35235J53062M79013M5252l88558q54484
18199A0823675j60253J41942L37516L05756K45568K10331l29909k01593n52555
$$ plain form
18190 10820478 10114099 10103950 10977439 10955835 10390121 10517321 10988245 10572043 9914939 9544329
18180 9544329 9798631 10214557 9693375 9595277 10674740 11545796 11123631 10699107 10591648
18171 10591648 10507531 10314602 10355430 10590655 11087651 12062970 12553329 12617914 13043345 13679673
18161 13679673 13596615 13247556 12948498 12991510 13052820 13129540 13051734 12812178 12581253 12792305
18151 12792305 13155723 13652226 13923830 13658472 13409229 13859065 15424998 15378532 14331339
18142 14331339 14309044 14229787 13355666 12464276 12077986 12350305 12907202 13025939 13122764 12415857
18132 12415857 12142304 11855784 11842525 11770274 11954041 12473102 12681882 13363577 13196036 12503496
18122 12503496 12412814 12533571 12094730 12279524 12851625 13145598 12699850 11957837 11395900
$$ packed form
18190A0820478p06379j0149Q73489k1604n65714J27200M70924m16202o57104l70610
18180I544329K54302M15926n21182r8098J079463Q71056m22165m24524j07459
18171A0591648q4117j92929M0828K35225M96996R75319M90359O4585M25431O36328
18161A3679673q3058l49059k99058M3012O1310P6720p7806k39556k30925K11052
18151A2792305L63418M96503K71604k65358k49243M49836J565933m6466j047193
18142A4331339k2295p9257q74121q91390l86290K72319N56897J18737R6825p06907
18132A2415857k73553k86520j3259p2251J83767N19061K08780O81695j67541o92540
18122A2503496r0682J20757m38841J84794N72101K93973m45748p42013n61937
$$ plain form
18113 11395900 11175430 11382420 11109949 11176713 11736957 11859410 11021547 10745272 11294982
18104 11294982 11770290 11868450 11713261 12223758 13202316 13838871 13876050 13636683 13275550 13470610
18094 13470610 13638288 13473845 13384041 13305433 13003456 12820956 12956528 13515287 13761149 13898388
18084 13898388 14440348 15166732 14294250 13140880 12690631 12907444 13093347 11874977 11137669
18075 11137669 11739802 12411189 12427797 12208250 11878536 11722580 12351252 13374232 14014931
18066 14014931 13201764 12188608 11840620 12194151 12828659 13320786 13139427 12343431 12175313
18057 12175313 13574645 14748696 14071400 12965888 12324110 12141525 12498918 12542169 12390132
18048 12390132 12278699 12657906 12826012 12838076 13250028 14273979 15071843 14553450 13062362
$$ packed form
18113A1395900k20470K06990k72471O6764N60244J22453q37863k76275N49710
18104A1294982M75308R8160j55189N10497R78558O36555L7179k39367l61133J95060
18094A3470610J67678j64443q9804p8608l01977j82500J35572N58759K45862J37239
18084A3898388N41960P26384q72482j153370m50249K16813J85903j218370p37308
18075A1137669O02133O71387J6608k19547l29714j55956O28672J022980O40699
18066A4014931q13167j013156l47988L53531O34508M92127j81359p95996j68118
18057A2175313J399332J174051o77296j105512o41778j82585L57393M3251j52037
18048A2390132j11433L79207J68106J2064M11952J023951P97864n18393j491088
$$ plain form
18039 13062362 12285216 13439556 14728030 15095352 14373864 13590745 12917731 12630294 12434510
18030 12434510 12630779 12950881 13234039 12882794 11501531 10101048 9898361 10651274 11310367
18021 11310367 11623223 12094018 12227094 12043027 11824646 11930368 12604175 12932476 13094590
18012 13094590 13705282 13739161 13283781 12776439 12803200 12920233 13471859 13577281 13868519 14660077
18002 14660077 15008708 14203717 13513291 13545977 13113823 12616360 12708133 12809152 12760374 12876056
17992 12876056 13122056 13421686 13634924 13230824 12418059 11647908 11616886 12184714 12831585
17983 12831585 13347331 13401830 13184107 13191243 13373579 12988414 13349683 13978934 13449251 12399066
17973 12399066 12820914 13615493 13159085 12414547 12281386 12774328 13455052 13455520 12821384 11859848
$$ packed form
18039A3062362p77146J154340J288474L67322p21488p83119o73014k87437j95784
18030A2434510J96269L20102K83158l51245j381263j400483k02687P52913O59093
18021A1310367L12856M70795J33076j84067k18381J05722O73807L28301J62114
18012A3094590O10692L3879m55380n07342K6761J17033N51626J05422K91238P91558
18002A4660077L48631q04991o90426L2686m32154m97463R1773J01019m8778J15682
17992A2876056K46000K99630K13238m04100q12765p70151l1022N67828O46871
17983A2831585N15746N4499k17723P136J82336l85165L61269O29251n29683j050185
17973A2399066M21848P94579m56408p44538j33161M92942O80724M68o34136r61536
$$ plain form
17963 11859848 10829973 10764987 11098122 10703962 10924839 11978948 12495626 12818757 13287056
17954 13287056 13689101 13813530 13389957 12982452 12895418 12606258 12218856 12246826 12728527 12804658
17944 12804658 12586818 12480640 13073024 13733480 13542094 12718116 12447430 12986994 13253159
17935 13253159 12894256 12711886 12830178 13035885 12654046 12128938 12699955 13210277 13421800
17926 13421800 13712537 14025326 13566976 12891098 12690449 12588396 12144181 11104573 10443211
17917 10443211 10298482 10194610 10472503 11578097 12582838 12854055 12809231 12746241 13326015
17908 13326015 13632779 13502038 13250565 13535629 13605636 13110049 12922378 12478504 12031983
17899 12031983 11458404 12176698 12471270 12294614 12253098 11829828 12115958 11915209 11699633
$$ packed form
17963A1859848j029875o4986L33135l94160K20877J054109N16678L23131M68299
17954A3287056M02045J24429m23573m07505q7034k89160l87402K7970M81701P6131
17944A2804658k17840j06178N92384O60456j91386q23978k70686N39564K66165
17935A3253159l58903j82370J18292K05707l81839n25108N71017N10322K11523
17926A3421800K90737L12789m58350o75878k00649j02053m44215j039608o61362
17917A0443211j44729j03872K77893J105594J004741K71217m4824o2990N79774
17908A3326015L06764j30741k51473K85064P0007m95587j87671m43874m46521
17899A2031983n73579P18294K94572j76656m1516m23270K86130k00749k15576
$$ plain form
17890 11699633 11891373 12155827 12540879 12269033 11937558 12171143 12586549 12936184 13198098
17881 13198098 13736378 13429948 12588030 11984761 12159920 11853093 11496512 11576219 11724563
17872 11724563 12219626 12705835 13535780 14032066 14250632 14545327 13627231 12258616 11886068
17863 11886068 12152883 12018759 11904908 12771492 13717940 14145147 14494435 14110797 13213993
17854 13213993 13363632 14306641 14430098 14105374 14250799 14129321 13974895 14033218 13596385
17845 13596385 13330036 13492087 13812152 14102905 14424000 14675549 14734020 14054492 13916294
17836 13916294 14239796 14489943 14297505 13515189 13558499 13882902 13988229 13324866 12737448
17827 12737448 13118511 13922793 14107919 13823804 13843102 14719769 15727567 15925917 15665009
$$ packed form
17890A1699633J91740K64454L85052k71846l31475K33585M15406L49635K61914
17881A3198098N38280l06430q41918o03269J75159l06827l56581P9707J48344
17872A1724563M95063M86209Q29945M96286K18566K94695r18096j368615l72548
17863A1886068K66815j34124j13851Q66584R46448M27207L49288l83638q96804
17854A3213993J49639R43009J23457l24724J45425j21478j54426N8323m36833
17845A3596385k66349J62051L20065K90753L21095K51549N8471o79528j38198
17836A3916294L23502K50147j92438p82316M3310L24403J05327o63363n87418
17827A2737448L81063Q04282J85126k84115J9298Q76667J007798J98350k60908
$$ plain form
17818 15665009 14676161 13460339 13511592 14123511 14475829 14709806 14864701 14797118 14737454 14829891
17808 14829891 15048347 14132151 13579343 14029869 14242668 14063322 13406146 13162552 13391225
17799 13391225 13787786 14658264 14482330 14204882 14073334 12971921 12214773 12167778 12932295
17790 12932295 13684207 13087585 11929172 11849709 12480355 12925047 13071554 12856875 11980792
17781 11980792 11834553 12609098 12952431 12918108 13180914 13717522 13630271 13609621 14451489 15063149
17771 15063149 14542164 13564523 13536473 14043824 14250310 14493814 14803239 14696305 14541530
17762 14541530 14502388 14899409 14532123 14311172 14182264 14052067 14091092 13270972 12538894 12829733
17752 12829733 13304581 13473299 13155511 12959039 12855225 12466613 12038290 11658984 11066832
$$ packed form
17818A5665009r88848j215822N1253O11919L52318K33977J54895o7583n9664R2437
17808A4829891K18456r16196n52808M50526K12799j79346o57176k43594K28673
17799A3391225L96561Q70478j75934k77448j31548j101413p57148m6995P64517
17790A2932295P51912n96622j158413p9463O30646M44692J46507k14679q76083
17781A1980792j46239P74545L43333l4323K62806N36608q7251k0650Q41868O11660
17771A5063149n20985r77641k8050N07351K06486K43504L09425j06934j54775
17762A4541530l9142L97021l67286k20951j28908j30197L9025q20120p32078K90839
17752A2829733M74848J68718l17788j96472j03814l88612m28323l79306n92152
$$ plain form
17743 11066832 11351594 11571289 11367669 11227797 10774099 10785136 11074259 11356428 11378675 12046408
17733 12046408 13505748 14325238 14232576 13747793 13738679 14502194 14322354 13416191 13190169 13292929
17723 13292929 13786235 14019857 13585113 13150799 13141767 12944790 12705404 12868383 12910525 12357672
17713 12357672 11635494 11998868 12748044 13344903 13625723 13251543 12746219 12396926 12262308
17704 12262308 11688201 10997913 10914776 11231801 11939028 12945225 13655979 14045917 14975754
17695 14975754 15130661 14641452 15189029 15033084 13855633 13204443 13315296 13754734 13541328
17686 13541328 13260227 12901043 12486939 12169814 11939881 11846807 11764828 12005521 12442244 13037037
17676 13037037 13283506 12606079 13082585 13826665 13762961 13509991 13685266 13908352 14001801 14038673
$$ packed form
17743A1066832K84762K19695k03620j39872m53698J1037K89123K82169K2247O67733
17733A2046408J459340Q19490r2662m84783r114P63515j79840r06163k26022J02760
17723A3292929M93306K33622m34744m34314r032j96977k39386J62979M2142n52853
17713A2357672p22178L63374P49176N96859K80820l74180n05324l49293j34618
17704A2262308n74107o90288q3137L17025P07227J006197P10754L89938R29837
17695A4975754J54907m89209N47577j55945j177451o51190J10853M39438k13406
17686A3541328k81101l59184m14104l17125k29933r3074q1979K40693M36723N94793
17676A3037037K46469o77427M76506P44080o3704k52970J75275K23086R3449L6872
$$ plain form
17666 14038673 14082074 14596219 15104615 15130437 15273202 15493726 15252037 15022981 14246089 13798895
17656 13798895 13081590 13137507 12891225 12301062 12403456 12442158 12843700 13618836 14113500 14113158
17646 14113158 13781569 13686748 13393047 13474880 13592819 13570261 13534844 12789506 12764566 12752017
17636 12752017 12956268 13098579 12983349 13200071 13684431 13744726 14055527 14337429 14857625
17627 14857625 15887417 16179496 15658892 14678021 14462119 15083102 15091826 14173683 13217129
17618 13217129 12868592 12857597 12520995 12160919 11964035 12029868 12166439 12215618 12623606 13635975
17608 13635975 14885761 15210048 15558973 15108534 14893044 14751294 15214150 15154319 14386887
17599 14386887 14226830 13341822 12813736 12771823 12562165 12832406 13497748 13969854 14351748
$$ packed form
17666A4038673M3401N14145N08396K5822J42765K20524k41689k29056p76892m47194
17656A3798895p17305N5917k46282n90163J02394L8702M01542P75136M94664l42
17646A4113158l31589r4821k93701Q1833J17939k2558l5417p45338k4940j2549
17636A2752017K04251J42311j15230K16722M84360O0295L10801K81902N20196
17627A4857625J029792K92079n20604r80871k15902O20983Q724r18143r56554
17618A3217129l48537j0995l36602l60076j96884O5833J36571M9179M07988J012369
17608A3635975J249786L24287L48925m50439k15490j41750M62856n9831p67432
17599A4386887j60057q85008n28086m1913k09658K70241O65342M72106L81894
$$ plain form
17590 14351748 14400616 14256306 14274708 14201031 13458850 13499400 13809238 13895745 14280761 14102885
17580 14102885 13344443 12728645 12097981 12783145 14038706 13965000 13004045 12229788 12209906
17571 12209906 12227956 12250128 12729392 13389915 14297385 14772464 14860417 14269514 13698164 13282899
17561 13282899 13447907 14074067 14427369 14073930 14003745 13501938 12479842 12115780 12633113
17552 12633113 13643147 14442378 14552852 13622969 12077810 10224672 9475068 10515492 12011305
17543 12011305 12021590 11982845 11815049 11189358 11062976 11629184 12528343 12823419 12465995 11999130
17533 11999130 11996425 11371089 10628266 10258185 9899067 10432622 11411240 12249723 12493100 13387383
17523 13387383 14666679 14764143 13698861 13543056 14352020 14597980 14573253 14313010 13492765
$$ packed form
17590A4351748M8868j44310J8402p3677p42181M0550L09838Q6507L85016j77876
17580A4102885p58442o15798o30664O85164J255561p3706r60955p74257j9882
17571A2209906J8050K2172M79264O60523R07470M75079Q7953n90903n71350m15265
17561A3282899J65008O26160L53302l53439p0185n01807j022096l64062N17333
17552A2633113J010034P99231J10474r29883j545159j853138p49604J040424J495813
17543A2011305J0285l8745j67796o25691j26382N66208Q99159K95076l57424m66865
17533A1999130k705o25336p42823l70081l59118N33555R78618Q38483K43377Q94283
17523A3387383J279296R7464j065282j55805Q08964K45960k4727k60243q20245
$$ plain form
17514 13492765 12868100 12992369 13391988 13751517 14366265 14767625 14683506 14531102 14404146
17505 14404146 14502566 13653716 13271289 13803086 14256772 13977452 13023354 12959947 12933704 12566186
17495 12566186 12931254 13378939 13875438 14136209 13882992 14084660 14233751 14216483 14761530
17486 14761530 15175999 15220314 14780269 14053375 14513551 14909640 15117512 15709989 15566805
17477 15566805 15237874 15087016 14353175 14074147 13903589 13661935 13477223 13647592 13993601
17468 13993601 14328337 14978594 14902501 14551322 14820233 15026817 14915618 14666726 14635039 14138924
17458 14138924 13229889 13068464 13096112 13319706 13609547 13778719 13200252 12740602 13347509
17449 13347509 13860459 14082238 14482908 15198052 15506693 15482749 15157520 14211638 12909136
$$ packed form
17514A3492765o24665J24269L99619L59529O14748M01360q4119j52404j26956
17505A4404146R8420q48850l82427N31797M53686k79320r54098o3407k6243l67518
17495A2566186L65068M47685M96499K60771k53217K01668J49091j7268N45047
17486A4761530M14469M4315m40045p26894M60176L96089K07872N92477j43184
17477A5566805l28931j50858p33841k79028j70558k41654j84712J70369L46009
17468A3993601L34736O50257p6093l51179K68911K06584j11199k48892l1687m96115
17458A4138924r09035j61425K7648K23594K89841J69172n78467m59650O06907
17449A3347509N12950K21779M00670P15144L08641k3944l25229r45882j302502
$$ plain form
17440 12909136 12682834 12860845 12408803 12340079 12479628 12196430 12295345 12827518 13523851 13867028
17430 13867028 13870255 13626137 13542465 13719621 13635389 12716412 11910000 11686192 11724926 11651006
17420 11651006 12357727 13178712 14220775 15012609 14559022 13474323 13123000 13449947 13684312
17411 13684312 13664508 13095327 11850390 11080863 11767072 12140464 12082423 11954991 11780598
17402 11780598 11949538 11956399 12012660 12289899 13095781 13721157 14007133 14152441 13690431 13214696
$$ packed form
17440A2909136k26302J78011m52042o8724J39549k83198R8915N32173O96333L43177
17430A3867028L227k44118q3672J77156q4232r18977q06412k23808L8734p3920
17420A1651006P06721Q20985J042063P91834m53587j084699l51323L26947K34365
17411A3684312j9804n69181j244937p69527O86209L73392n8041j27432j74393
17402A1780598J68940O861N6261K77239Q05882O25376K85976J45308m62010m75735
$$ [...]
##END NTUPLES=NMR SPECTRUM
##END=
