##TITLE=C13_SA_37.139
 D2O, 23000 sc

 13.11.2019
##JCAMPDX= 6.0         $$ Bruker NMR JCAMP-DX V2.0
##DATA TYPE= NMR SPECTRUM
##DATA CLASS= NTUPLES
##ORIGIN= UXNMR, Bruker Analytische Messtechnik GmbH
##OWNER= root
$$ XWIN-NMR		Version 3.5
$$ Tue Nov 19 13:54:47 2019 Russian Standard Time (UT+4h)  she@DPX200
##.OBSERVE FREQUENCY= 50.327896
##.OBSERVE NUCLEUS= ^13C
##.ACQUISITION MODE= SIMULTANEOUS
##.ACQUISITION SCHEME= undefined
##.AVERAGES= 17920
##.DIGITISER RES= 17
##SPECTROMETER/DATA SYSTEM= spect
##.PULSE SEQUENCE= zgpg30
##.SOLVENT NAME= CDCl3
##.SHIFT REFERENCE= (INTERNAL, CDCl3, 0, 222.624)
##AUDIT TRAIL= $$ (NUMBER, WHEN, WHO, WHERE, WHAT)
$$ ##TITLE= Audit trail, XWIN-NMR		Version 3.5
$$ ##JCAMPDX= 5.01
$$ ##ORIGIN= Bruker BioSpin GmbH
$$ ##OWNER= she
$$ F:/spectra/data/she/nmr/c13/1/pdata/1/auditp.txt
$$ ##AUDIT TRAIL=  $$ (NUMBER, WHEN, WHO, WHERE, WHAT)
(   1,<2019-11-19 09:18:22.57 +0400>,<she>,<DPX200>,
      <created by zg, POWCHK disabled, PULCHK disabled
       terminated by command 'halt'
       configuration hash MD5:
       00 E9 B6 7A A2 85 ED C7 34 08 36 98 17 FE 4E 26
       data hash MD5: 32K
       2A 24 0A D2 A4 B6 23 AC 06 81 DC 24 53 A4 51 CE>)
(   2,<2019-11-19 13:50:38.29 +0400>,<she>,<DPX200>,
      <Start of raw data processing
       efp BC_mod = 2 LB = 1 FT_mod = 6 PKNL = 1 PHC0 = -244.2562 PHC1 = 34.40636 SI = 32K 
       data hash MD5: 32K
       B0 5D 0C 26 70 3C E3 EE 45 91 1C 77 F2 FD D3 1A>)
(   3,<2019-11-19 13:50:42.15 +0400>,<she>,<DPX200>,
      <abs ABSG = 5 
       data hash MD5: 32K
       7A 04 EE 12 A6 A8 D5 F7 BB FA 9E C6 57 46 A0 9F>)
(   4,<2019-11-19 13:51:21.51 +0400>,<she>,<DPX200>,
      <abs ABSG = 5 
       data hash MD5: 32K
       55 13 43 14 43 AC 90 E9 22 7A 0E C9 7C 99 5B 48>)
(   5,<2019-11-19 13:51:42.03 +0400>,<she>,<DPX200>,
      <pk PHC0 = -5.362378 PHC1 = 0 
       data hash MD5: 32K
       09 F5 90 15 D7 98 B2 90 64 78 92 76 10 5B F5 0A>)
(   6,<2019-11-19 13:52:11.14 +0400>,<she>,<DPX200>,
      <pk PHC0 = 10.17629 PHC1 = -3.8 
       data hash MD5: 32K
       D2 11 35 20 60 91 08 0D D7 A2 32 18 B9 43 8C DB>)
(   7,<2019-11-19 13:52:14.84 +0400>,<she>,<DPX200>,
      <abs ABSG = 5 
       data hash MD5: 32K
       0F 90 B5 33 35 81 6F 24 48 9B A2 92 5D 26 61 AC>)
$$ ##END=
$$ 
$$ hash MD5
$$ D0 FC 36 D6 AE CB AE 4C C3 8D 10 8B AB FA A0 E8
##$RELAX= 
##$RELAX= 
##$RELAX= 
##$RELAX= 
##$RELAX= 
##$RELAX= 
##$RELAX= 
##$RELAX= 
$$ Bruker specific parameters
$$ --------------------------
##$DU= <F:/spectra>
##$EXPNO= 1
##$NAME= <c13>
##$PROCNO= 1
##$TYPE= <nmr>
##$USER= <she>
##$AMP= (0..31)
100 100 100 100 100 100 100 100 100 100 100 100 100 100 100 100 100 100 
100 100 100 100 100 100 100 100 100 100 100 100 100 100 
##$AQSEQ= 0
##$AQ_mod= 1
##$AUNM= <au_zg>
##$AUTOPOS= <>
##$BF1= 50.322709
##$BF2= 200.13
##$BF3= 50.322709
##$BF4= 500.13
##$BF5= 500.13
##$BF6= 500.13
##$BF7= 500.13
##$BF8= 500.13
##$BYTORDA= 1
##$CFDGTYP= 0
##$CFRGTYP= 5
##$CHEMSTR= <none>
##$CNST= (0..31)
$$ [...]
##$SUBNAM4= <"">
##$SUBNAM5= <"">
##$SUBNAM6= <"">
##$SUBNAM7= <"">
##$SUBNAM8= <"">
##$SUBNAM9= <"">
##$SW= 239.972175391363
##$SWIBOX= (0..15)
0 1 3 0 0 0 0 0 0 0 0 0 0 0 0 0 
##$SW_h= 12077.2946859903
##$TD= 32768
##$TD0= 1
##$TE= 0
##$TE2= 300
##$TE3= 300
##$TEG= 300
##$TL= (0..7)
120 120 120 120 120 120 120 120 
##$TP= (0..7)
150 150 150 150 150 150 150 150 
##$TP07= 0
##$TPNAME0= <>
##$TPNAME1= <>
##$TPNAME2= <>
##$TPNAME3= <>
##$TPNAME4= <>
##$TPNAME5= <>
##$TPNAME6= <>
##$TPNAME7= <>
##$TPOAL= (0..7)
0.5 0.5 0.5 0.5 0.5 0.5 0.5 0.5 
##$TPOFFS= (0..7)
0 0 0 0 0 0 0 0 
##$TUNHIN= 0
##$TUNHOUT= 0
##$TUNXOUT= 0
##$USERA1= <user>
##$USERA2= <user>
##$USERA3= <user>
##$USERA4= <user>
##$USERA5= <user>
##$V9= 5
##$VALIST= <valist>
##$VCLIST= <CCCCCCCCCCCCCCC>
##$VD= 0
##$VDLIST= <DDDDDDDDDDDDDDD>
##$VPLIST= <PPPPPPPPPPPPPPP>
##$VTLIST= <TTTTTTTTTTTTTTT>
##$WBST= 1024
##$WBSW= 4
##$XGAIN= (0..3)
0 0 0 0 
##$XL= 0
##$YL= 0
##$YMAX_a= 113423901
##$YMIN_a= -36338357
##$ZGOPTNS= <>
##$ZL1= 120
##$ZL2= 120
##$ZL3= 120
##$ZL4= 120
##$ABSF1= 222.624
##$ABSF2= -17.3728
##$ABSG= 5
##$ABSL= 3
##$ALPHA= 0
##$AQORDER= 0
##$ASSFAC= 0
##$ASSFACI= 0
##$ASSFACX= 0
##$ASSWID= 0
##$AUNMP= <proc_1d>
##$AZFE= 0.1
##$AZFW= 0.5
##$BCFW= 0
##$BC_mod= 2
##$BYTORDP= 0
##$COROFFS= 0
##$CY= -3
##$DATMOD= 1
##$DC= 0
##$DFILT= <>
##$DTYPP= 0
##$F1P= 0
##$F2P= 0
##$FCOR= 0.5
##$FTSIZE= 32768
##$FT_mod= 6
##$GAMMA= 0
##$GB= 0
##$INTBC= 1
##$INTSCL= 4.134877e-10
##$ISEN= 128
##$LB= 1
##$LEV0= 0
##$LPBIN= 0
##$MAXI= 10000
##$MC2= 0
##$MEAN= 0
##$ME_mod= 0
##$MI= 0.1934396
##$NCOEF= 0
##$NC_proc= 0
##$NLEV= 6
##$NOISF1= 120.0001
##$NOISF2= 80.00006
##$NSP= 0
##$NTH_PI= 0
##$NZP= 0
##$OFFSET= 222.624
##$PC= 1.4
##$PHC0= -239.4423
##$PHC1= 30.60636
##$PH_mod= 1
##$PKNL= yes
##$PPARMOD= 0
##$PSCAL= 0
##$PSIGN= 0
##$REVERSE= no
##$SF= 50.3227315989248
##$SI= 32768
##$SIGF1= 140
##$SIGF2= 120
##$SINO= 11.81781
##$SIOLD= 32768
##$SREGLST= <13C.CDCl3>
##$SSB= 0
##$STSI= 32768
##$STSR= 0
##$SW_p= 12077.2946859903
##$SYMM= 0
##$S_DEV= 0
##$TDeff= 32768
##$TDoff= 0
##$TI= <>
##$TILT= no
##$TM1= 0
##$TM2= 0
##$TOPLEV= 0
##$USERP1= <user>
##$USERP2= <user>
##$USERP3= <user>
##$USERP4= <user>
##$USERP5= <user>
##$WDW= 1
##$XDIM= 32768
##$YMAX_p= 498466094
##$YMIN_p= -9317171
$$ End of Bruker specific parameters
$$ ---------------------------------
##NTUPLES= NMR SPECTRUM
##VAR_NAME=  FREQUENCY,     SPECTRUM/REAL,   SPECTRUM/IMAG
##SYMBOL=    X,             R,               I
##VAR_TYPE=  INDEPENDENT,   DEPENDENT,       DEPENDENT
##VAR_FORM=  AFFN,          ASDF,            ASDF
##VAR_DIM=   32768,         32768,           32768
##UNITS=     HZ,            ARBITRARY UNITS, ARBITRARY UNITS
##FACTOR=    0.368581032318806, 1,           1
##FIRST=     11203.0474431902, 0,            0
##LAST=      -874.247242800138, 0,           0
##MIN=       -874.247242800138, -9317171,    0
##MAX=       11203.0474431902, 498466094,    0
$$ Real data points
##PAGE= N=1
##DATA TABLE= (X++(R..R)), XYDATA
$$ [...]
##PAGE= N=2
##DATA TABLE= (X++(I..I)), XYDATA
$$ plain form
22554 63238713 64217173 63464891 62389586 62530824 62187204 61494857 60122097 59094369 58088411
22545 58088411 56203857 54423752 54831737 54966051 56810510 60183351 61708024 61168141
22537 61168141 60715222 59305993 57523383 57203992 56517051 56209092 55307385 54360535 54238739
22528 54238739 56086456 57681652 58328329 58317069 58073226 58448184 59089648 60258614 60610735
22519 60610735 59184422 58993565 60844897 61185405 60782854 60112457 59726401 59949326 58570251
22510 58570251 57924538 59216310 60993924 63361779 66016515 65776026 64273569 64434914
22502 64434914 65678943 64362644 61746140 61357974 61588176 62087919 61382998 61194394 63740392
22493 63740392 66056476 65590012 65004338 65095035 65585533 65871397 65104007 65415313 65879739
$$ packed form
22554F3238713R78460p52282j075305J41238l43620o92347j372760j027728j005958
22545E8088411j884554j780105M07985J34314J844459L372841J524673n39883
22537F1168141m52919j409229j782610l19391o86941l07959r01707r46850j21796
22528E4238739J847717J595196O46677j1260k43843L74958O41464J168966L52121
22519F0610735j426313j90857J851332L40508m02551o70397l86056K22925j379075
22510E8570251o45713J291772J777614K367855K654736k40489j502457J61345
22502F4434914J244029j316299k616504l88166K30202M99743p04921j88604K545998
22493F3740392K316084m66464n85674R0697M90498K85864p67390L11306M64426
$$ plain form
22484 65879739 64867015 65382995 65504345 62975784 61517335 61253662 60959604 60364598 60276994
22475 60276994 60233828 60639332 62074829 63074814 63103821 63215703 63762670 63559429 64452133
22466 64452133 63555042 62669569 62083874 61835360 63045324 63868554 64242722 63454946 62661187
22457 62661187 62112899 61738346 61652726 61556027 62005198 62235539 61985714 61095807 61432348 62705338
22447 62705338 63694610 63595593 62281067 62867270 64766867 66088787 68402064 69463488 68480189
22438 68480189 67411002 66907071 67344212 68678240 69365456 68758458 67639821 67737080 68883428
22429 68883428 69518787 70569002 71801511 72059565 71835931 71573482 70829226 69717859 68868980
22420 68868980 69901510 71301668 71027137 70066232 69887354 71772193 73750202 74536178 74677916
$$ packed form
22484F5879739j012724N15980J21350k528561j458449k63673k94058n95006q7604
22475F0276994m3166M05504J435497R99985K9007J11882N46967k03241Q92704
22466F4452133q97091q85473n85695k48514J209964Q23230L74168p87776p93759
22457F2661187n48288l74553q5620r6699M49171K30341k49825q89907L36541J272990
22447F2705338R89272r9017j314526N86203J899597J321920K313277J061424r83299
22438F8480189j069187n03931M37141J334028O87216o06998j118637R7259J146348
22429F8883428O35359J050215J232509K58054k23634k62449p44256j111367q48879
22420F8868980J032530J400158k74531r60905j78878J884839J978009P85976J41738
$$ plain form
22411 74677916 74765254 75059755 74965685 74886641 75458957 77035678 78396110 79619995 80066002
22402 80066002 80934325 81464686 81726752 81763573 81786848 82344473 82956309 83763886 85042266
22393 85042266 86070512 86837946 88598255 90560976 92102546 93468508 95773821 96904186
22385 96904186 97483361 98775579 98609989 98996587 101028275 101797436 101984832 104207969 107688901
22376 107688901 112271149 117756413 122173234 126201290 130789151 136129048 141649310 148193655
22368 148193655 155333149 163537160 171909812 179715351 189694979 201771143 215738472 229697480
22360 229697480 240757812 243677426 229772812 184894506 94230489 -18977189 -97813363
22353 -97813363 -130843874 -136441728 -127952001 -115248435 -101716223 -88725409 -76780475
$$ packed form
22411G4677916Q7338K94501r4070p9044N72316J576721J360432J223885M46007
22402H0066002Q68323N30361K62066L6821K3275N57625O11836Q07577J278380
22393H5042266J028246P67434J760309J962721J541570J365962K305313J130365
22385I6904186N79175J292218j65590L86598K031688P69161J87396K223137L480932
22376A07688901M582248N485264M416821M028056M587861N339897N520262O544345
22368A48193655P139494Q204011Q372652P805539R979628J2076164J3967329J3959008
22360B29697480J1060332K919614j3904614m4878306r0664017j13207678p8836174
22353i7813363l3030511n597854Q489727J2703566J3532212J2990814J1944934
$$ plain form
22346 -76780475 -65924801 -56474111 -47938160 -40744023 -35550819 -32427013 -29353079 -24601996
22338 -24601996 -18792054 -13075448 -9295888 -7605349 -6073075 -3237857 -1271674 -110270
22330 -110270 1503967 3384203 4668806 6561807 9194290 10835719 10767198 12162787 13729395
22321 13729395 13984502 13564694 13186175 13853464 15665425 19351164 22041929 21328673 20707157
22312 20707157 23470113 25270630 25816471 26199484 26574802 27406325 27046235 26914661 27586173
22303 27586173 28520185 29014930 29938951 31985039 33330588 34033372 34167246 35256355 36991636
22294 36991636 37387196 35806853 34812280 34588073 36368381 38232449 36872402 33702963
22286 33702963 32812950 34053951 35384130 35983597 35421721 34778979 33989659 33993201 34561731
$$ packed form
22346g6780475J0855674R450690Q535951P194137N193204L123806L073934M751083
22338b4601996N809942N716606L779560J690539J532274K835218J966183J161404
22330a10270J614237J880236J284603J893001K632483J641429o8521J395589J566608
22321A3729395K55107m19808l78519O67289J811961L685739K690765p13256o21516
22312B0707157K762956J800517N45841L83013L75318Q31523l60090j31574O71512
22303B7586173R34012M94745R24021K046088J345549P02784J33874J089109J735281
22294C6991636L95560j580343r94573k24207J780308J864068j360047l169439
22286C3702963q90013J241001J330179N99467n61876o42742p89320L542N68530
$$ plain form
22277 34561731 35683449 35748609 33895262 32013780 31823312 34148961 37784943 39235009
22269 39235009 38592199 38594726 41074583 42067733 39781557 38092182 37580955 37662425 37978429
22260 37978429 39061054 40462929 41221577 40961907 40886795 40521475 40471152 40054651 39168383
22251 39168383 39432372 40748782 40803004 39416293 37798788 36577854 35945785 35457243 36323078
22242 36323078 38508506 40492990 41767237 42832257 41280537 40119106 40562691 40857947
22234 40857947 40673723 40515189 41581358 43332803 43864165 44153242 44890384 44139132 42218305
22225 42218305 40323488 40965384 41258708 40942367 41874884 42331941 42922168 41722154 39931997
22216 39931997 40285731 42071782 43231865 43111914 43626740 44977140 45275754 46088423 46078480
$$ packed form
22277C4561731J121718O5160j853347j881482j90468K325649L635982J450066
22269C9235009o42810K527K479857R93150k286176j689375n11227Q1470L16004
22260C7978429J082625J401875P58648k59670p5112l65320n0323m16501q86268
22251C9168383K63989J316410N4222j386711j617505j220934o32069m88542Q65835
22242C6323078K185428J984484J274247J065020j551720j161431M43585K95256
22234D0857947j84224j58534J066169J751445N31362K89077P37142p51252j920827
22225D2218305j894817O41896K93324l16341R32517M57057N90227j200014j790157
22216C9931997L53734J786051J160083j19951N14826J350400K98614Q12669r943
$$ plain form
22207 46078480 45647199 44864730 44245612 44212650 45060103 46222829 46212453 45949477 46448295
22198 46448295 47234621 45844318 43298385 42159606 43506500 46505381 47413250 46706250
22190 46706250 46892561 46892521 46200611 46215429 46074400 45796687 46811631 47997640 48271872 47520520
22180 47520520 47269700 47542522 47718548 47761474 47545135 46664154 45027646 44478962 45167176
22171 45167176 46851939 47199202 45780087 45820216 46450261 47116339 46335349 44758593 45770999
22162 45770999 46515251 44690197 42915396 41955942 41284567 42085195 43191778 44140521 44450455
22153 44450455 44338243 44809003 45286650 46371189 46478278 45746525 45640982 44888351 43821427
22144 43821427 43869331 42712148 42264276 43745419 44503630 44565831 44776987 44800610 44430229
$$ packed form
22207D6078480m31281p82469o19118l2962Q47453J162726j0376k62976M98818
22198D6448295P86326j390303k545933j138779J346894K998881R07869p07000
22190D6706250J86311m0o91910J4818j41029k77713J014944J186009K74232p51352
22180D7520520k50820K72822J76026M2926k16339q80981j636508n48684O88214
22171D5167176J684763L47263j419115M0129O30045O66078p80990j576756J012406
22162D5770999P44252j825054j774801r59454o71375Q00628J106583R48743L09934
22153D4450455j12212M70760M77647J084539J07089p31753j05543p52631j066924
22144D3821427M7904j157183m47872J481143P58211O2201K11156K3623l70381
$$ plain form
22135 44430229 45122127 44586296 43324840 43036624 42183660 41111081 42714170 44080752 44664479
22126 44664479 45439318 46029709 46753153 47115095 46230943 45801271 46169029 46176447 47340464
22117 47340464 48971388 50346083 50986215 50909548 50214955 48759356 47406198 46988224 46611503
22108 46611503 45948969 45486535 45716978 45798987 45663025 45087167 45036840 45967794 46040372 46338171
22098 46338171 46856246 46576275 45505543 44532956 44502408 44810654 45111658 45786947 46110319
22089 46110319 47434941 48909274 48851545 47791852 47877259 48437809 47372304 47986270 49849100
22080 49849100 50748067 49643091 48884883 48844259 49564872 50995066 51145244 49770439 47479483
22071 47479483 45155274 44185534 45168795 44981125 45539064 47070365 47532251 47550125 48641268
$$ packed form
22135D4430229O91898n35831j261456k88216q52964j072579J603089J366582N83727
22126D4664479P74839N90391P23444L61942q84152m29672L67758P418J164017
22117D7340464J630924J374695O40132p6667o94593j455599j353158m17974l76721
22108D6611503o62534m62434K30443Q2009j35962n75858n0327R30954P2578K97799
22098D6338171N18075k79971j070732r72587l0548L08246L01004O75289L23372
22089D6110319J324622J474333n7729j059693Q5407N60550j065505O13966J862830
22080D9849100Q98967j104976p58208m0624P20613J430194J50178j374805k290956
22071D7479483k324209r69740R83261j87670N57939J531301M61886J7874J091143
$$ plain form
22062 48641268 47451951 46169582 46994201 47884593 48892838 48584158 47816347 47885108 48338179
22053 48338179 49403030 50278584 51460543 51833460 50855789 51047057 52282388 51047396 48692038
22044 48692038 46795950 47080136 49774004 51509915 50938478 50997115 51015649 49152420 47774190
22035 47774190 47159105 48299177 50053829 52218117 53324780 52677915 52413966 52322092 51874798
22026 51874798 52335572 53792997 53913543 52175628 51831222 51393028 50570503 50028019 48856649
22017 48856649 47305318 46816765 47367712 47782057 47125143 47389545 47676545 47709598 47288979
22008 47288979 47141700 47078158 47850993 48893399 47927527 46993048 47432233 47184895 46664032
21999 46664032 47368725 49503399 50084556 50239981 49049817 48203589 48019852 46956918 46842598
$$ packed form
22062D8641268j189317j282369Q24619Q90392J008245l08680p67811O8761M53071
22053D8338179J064851Q75554J181959L72917r77671J91268J235331j234992k355358
22044D8692038j896088K84186K693868J735911n71437N8637J8534j863229j378230
22035D7774190o15085J140072J754652K164288J106663o46865k63949r1874m47294
22026E1874798M60774J457425J20546j737915l44406m38194q22525n42484j171370
22017D8856649j551331m88553N50947M14345o56914K64402K87000L3053m20619
22008D7288979j47279o3542P72835J042406r65872r34479M39185k47338n20863
21999D6664032P04693K134674N81157J55425j190164q46228j83737j062934j14320
$$ plain form
21990 46842598 48585048 50287032 49460742 48133651 47546831 47789427 48523806 48176561 48673766
21981 48673766 49882726 51783931 52206366 50772517 50131488 51910960 53513315 53249933
21973 53249933 52309374 51663222 51391391 50675365 50255987 50966263 51567445 50821672 50834578
21964 50834578 51466741 51814308 51559684 52138719 52149097 51961632 51474632 49809119 48651015
21955 48651015 50146384 52897353 53782509 53296437 53047675 52423047 52317998 53129672 54210603
21946 54210603 55105507 55678304 55201015 53230872 52282033 51505721 48856817 47373299 47388461
21937 47388461 48421204 49554968 50104883 51043469 52079380 51261081 49652575 49485727 49842491
21928 49842491 50240387 48983988 48735988 49710794 50676695 51411837 51678516 51748061 51923561
$$ packed form
21990D6842598J742450J701984q26290j327091n86820K42596P34379l47245M97205
21981D8673766J208960J901205M22435j433849o41029J779472J602355k63382
21973E3249933r40559o46152k71831p16026m19378P10276O01182p45773J2906
21964E0834578O32163L47567k54624N79035J0378j87465m87000j665513j158104
21955D8651015J495369K750969Q85156m86072k48762o24628j05049Q11674J080931
21946E4210603Q94904N72797m77289j970143r48839p76312k648904j483518J5162
21937D7388461J032743J133764N49915R38586J035911q18299j608506j66848L56764
21928D9842491L97896j256399k48000R74806R65901P35142K66679O9545J75500
$$ plain form
21919 51923561 50932801 50531882 50788124 50905867 50399972 49089414 49029874 49750376 50602071
21910 50602071 50288874 50315357 50729923 50123040 49137786 49413612 50160983 50443851 49329142
21901 49329142 48388999 46039485 45036107 45761602 46723001 46912709 48128489 48538061 48063169
21892 48063169 48036376 47957769 47835376 48347869 49040756 49534493 49930226 49974367 50068270 50996910
21882 50996910 51227528 51064823 51499695 51317328 50494246 49947248 50046262 51267312 51555688
21873 51555688 51016315 50930094 51874500 52726273 52531114 51787945 49764319 47833767 46392651
21864 46392651 45877386 46105047 46252887 46384149 46285196 46564886 48086425 48928508 49421803
21855 49421803 48620428 47067935 46717160 46367484 45725986 45510034 45834695 46452291 47963675
$$ packed form
21919E1923561r90760m00919K56242J17743n05895j310558n9540P20502Q51695
21910E0602071l13197K6483M14566o06883r85254K75826P47371K82868j114709
21901D9329142r40143k349514j003378P25495R61399J89708J215780M09572m74892
21892D8063169k6793p8607j22393N12493O92887M93737L95733M4141R3903R28640
21882E0996910K30618j62705M34872j82367q23082n46998R9014J221050K88376
21873E1555688n39373q6221R44406Q51773j95159p43169k023626j930552j441116
21864D6392651n15265K27661J47840J31262r8953K79690J521539Q42083M93295
21855D9421803q01375j552493l50775l49676o41498k15952L24661O17596J511384
$$ plain form
21846 47963675 49252878 50203508 50800020 51313001 51945194 51056506 49656091 49352790 50206731
21837 50206731 50675914 49248791 48586498 49006801 49442472 50661924 51727101 51752966 50916208
21828 50916208 51858192 53174579 52263608 50512337 50871195 51639106 51415672 51872869 52528904
21819 52528904 52973650 53293293 52583332 52554412 51430235 50146750 49569231 49535900 49851422
21810 49851422 50334691 51354997 52563671 53115919 53988527 54959891 55786404 55654360 52990375
21801 52990375 51459858 50021359 48602883 48762079 49164219 48974104 48957307 49708627 51069412
21792 51069412 52354177 52632701 52447287 53119687 54299730 53214402 53282971 55402303 56088725
21783 56088725 55425660 54113491 52901412 53997682 55964935 53523386 49696860 48512350
$$ packed form
21846D7963675J289203R50630N96512N12981O32193q88688j400415l03301Q53941
21837E0206731M69183j427123o62293M20303M35671J219452J065177K5865q36758
21828E0916208R41984J316387r10971j751271L58858P67911k23434M57197O56035
21819E2528904M44746L19643p09961k8920j124177j283485n77519l3331L15522
21810D9851422M83269J020306J208674N52248Q72608R71364Q26513j32044k663985
21801E2990375j530517j438499j418476J59196M02140j90115j6797P51320J360785
21792E1069412J284765K78524j85414O72400J180043j085328O8569K119332O86422
21783E6088725o63065j312169j212079J096270J967253k441549l826526j184510
$$ plain form
21775 48512350 50058893 51807363 52547382 51783795 51813381 51940304 52198689 52707875 52515541
21766 52515541 52753326 52954553 53205720 52277214 50992146 50502129 49404954 49569129 51222548
21757 51222548 52724755 52902677 52789552 51867488 51940831 53724304 54128461 53051192 52394306
21748 52394306 52728979 53071770 52863081 52189404 51321296 50447865 50100696 49904356 51154907
21739 51154907 53423762 54533314 53238854 53427100 54735363 54165524 52163827 52451798
21731 52451798 52369107 51076749 48834709 47635910 48510867 49499528 48826336 48562035 47776384
21722 47776384 46538290 46816507 47937475 48992048 48858559 47599089 47838507 48624816 49269233
21713 49269233 50727655 51554603 51027613 49704910 49417026 50813101 53042759 54300652
$$ packed form
21775D8512350J546543J748470P40019p63587K9586J26923K58385N09186j92334
21766E2515541K37785K01227K51167r28506j285068m90017j097175J64175J653419
21757E1222548J502207J77922j13125r22064P3343J783473M04157j077269o56886
21748E2394306L34673L42791k08689o73677q68108q73431l47169j96340J250551
21739E1154907K268855J109552j294460J88246J308263n69839k001697K87971
21731E2451798q2691j292358k242040j198799Q74957R88661o73192k64301p85651
21722D7776384j238094K78217J120968J054573j33489j259470K39418P86309O44417
21713D9269233J458422Q26948n26990j322703k87884J396075K229658J257893
$$ plain form
21705 54300652 54411845 55567548 55318390 53495203 52575198 52550557 53677083 55315573 56415739
21696 56415739 55127317 53089292 51343849 51279190 52744143 54349282 56802513 56430931
21688 56430931 54028898 50918241 50364110 51299392 52183527 53015678 54317156 55107562 55112945
21679 55112945 54249287 52795228 52352930 52944094 53236351 53739936 54498403 55207395 55062133
21670 55062133 54036769 53724156 54143460 54009445 53974866 54014384 53509106 52782518 53480240
21661 53480240 54710493 54016663 52974747 52647625 52512503 51896020 51307276 49951101 51272079
21652 51272079 52635704 52375346 52548804 52708603 52219243 53135304 54274502 53963443 53986372
21643 53986372 55138128 55347459 54944326 55072013 55090644 55059087 55954307 56251637 55640871
$$ packed form
21705E4300652J11193J155703k49158j823187r20005k4641J126526J638490J100166
21696E6415739j288422k038025j745443o4659J464953J605139K453231l71582
21688E6430931k402033l110657n54131R35282Q84135Q32151J301478P90406N383
21679E5112945q63658j454059m42298N91164K92257N03585P58467P08992j45262
21670E5062133j025364l12613M19304j34015l4579L9518n05278p26588O97722
21661E3480240J230253o93830j041916l27122j35122o16483n88744j356175J320978
21652E1272079J363625k60358J73458J59799m89360R16061J139198l11059K2929
21643E3986372J151756K09331m03133J27687J8631l1557Q95220K97330o10766
$$ plain form
21634 55640871 55393422 54663274 53118097 52523309 52704876 52779826 51365930 50522750 50343238
21625 50343238 51871304 53428174 53440280 53158149 52721096 52707968 51703791 51315271 52324968
21616 52324968 51086861 48511621 48457865 49608163 49908345 49330473 49212097 49373693 49804082
21607 49804082 51139180 51911668 51993592 51781297 51605483 52383925 53488840 53261607 52903380
21598 52903380 52890357 52819881 51551867 51454109 53762203 54781683 54333864 54702333 55247921
21589 55247921 53821656 52035674 51645327 52307995 51655893 51892413 53509660 53331564 53573464
21580 53573464 53663589 53158168 53343248 53910273 53164882 53786583 54581181 54508311 54138425 53290384
21570 53290384 52690204 52506410 52135560 51328291 51005998 51182388 50576133 52095378 54747226
$$ packed form
21634E5640871k47449p30148j545177n94788J81567P4950j413896q43180j79512
21625E0343238J528066J556870J2106k82131m37053j3128j004177l88520J009697
21616E2324968j238107k575240n3756J150298L00182n77872j18376J61596M30389
21607D9804082J335098P72488Q1924k12295j75814P78442J104915k27233l58227
21598E2903380j3023p0476j268014r7758K308094J019480m47819L68469N45588
21589E5247921j426265j785982l90347O62668o52102K36520J617247j78096K41900
21580E3573464R0125n05421J85080N67025p45391O21701P94598p2870l69886q48041
21570E3290384o00180j83794l70850q07269l22293J76390o06255J519245K651848
$$ plain form
21561 54747226 55982544 55882112 56110013 56922747 58331557 58650249 57581044 57937843 57586942
21552 57586942 55660099 52434273 50501337 51018605 51859027 53194174 52768582 52477114 52564115
21543 52564115 52778097 52835670 52242903 52442372 52540981 52975701 52814081 52032202 51686180 51371059
21533 51371059 51241447 52617388 55283051 56076499 54400052 51455537 50934259 51068281 51574985
21524 51574985 51939644 51433119 52334675 51432634 50982487 51370749 51446834 52343564 52734945
21515 52734945 52378117 52512681 53257914 52930357 52637572 52995445 52976244 53050527 53814619 54529496
21505 54529496 54805963 54388541 53834439 53346683 52902248 52998712 52944958 55046423 56326589
21496 56326589 57138764 57958354 57259017 56393476 55318586 54776500 56097198 55460330 52202897
$$ packed form
21561E4747226J235318j00432K27901Q12734J408810L18692j069205L56799l50901
21552E7586942j926843l225826j932936N17268Q40422J335147m25592k91468Q7001
21543E2564115K13982N7573n92767J99469R8609M34720j61620p81879l46022l15121
21533E1371059j29612J375941K665663P93448j676447k944515n21278J34022N06704
21524E1574985L64659n06525R01556r02041m50147L88262P6085Q96730L91381
21515E2734945l56828J34564P45233l27557k92785L57873j9201P4283P64092P14877
21505E4529496K76467m17422n54102m87756m44435R6464n3754K101465J280166
21496E6326589Q12175Q19590o99337q65541j074890n42086J320698o36868l257433
$$ plain form
21487 52202897 50994016 53378973 55398766 54318833 52833169 52457022 52397354 53463691
21479 53463691 55231231 57214660 57420076 55670872 54229544 53033513 52137277 51894070
21471 51894070 52357375 52524626 52130270 51434380 50143577 50107932 51048383 51410258 51450736
21462 51450736 50643714 50353496 51572288 52812119 53816656 54269094 54041449 53836799 53207833
21453 53207833 53346643 54044058 54726967 55393632 55771825 55259150 53940905 52794924 52179899
21444 52179899 52664053 53247586 54279543 53767047 51426635 50442449 51505285 53738142 53833999
21435 53833999 53954450 53952461 52587908 52495814 54241717 56244997 57001854 56527067 56116656
21426 56116656 55991456 56062370 57229364 57452786 56673425 55998527 55988470 55495913 55499079 56548157
$$ packed form
21487E2202897j208881K384957K019793j079933j485664l76147n9668J066337
21479E3463691J767540J983429K05416j749204j441328j196031q96236k43207
21471E1894070M63305J67251l94356o95890j290803l5645R40451L61875M0478
21462E1450736q07022k90218J218792J239831J004537M52438k27645k04650o28966
21453E3207833J38810O97415O82909O66665L78193n12675j318245j145981o15025
21444E2179899M84154N83533J031957n12496k340412r84186J062836K232857R5857
21435E3833999J20451j989j364553r2094J745903K003280P56857m74787m10411
21426E6116656j25200P0914J166994K23422p79361o74898j0057m92557L166J049078
$$ plain form
21416 56548157 57668229 57186124 56370837 56230253 55329044 54156227 52635568 51590306 52748721
21407 52748721 55202241 57055512 55594549 53279693 53003677 53189022 53337832 53915448 53576392
21398 53576392 52395347 51946854 51846300 51478570 51473804 51689416 51788747 51594611 51511856 52868607
21388 52868607 53910556 51870506 49807010 49351407 49446031 50550220 52306610 52164557 51111970
21379 51111970 51654711 53287852 54624130 55126743 55175852 55860937 56830606 57023070 57491942
21370 57491942 57460559 55188705 53412520 52992787 54200523 55997495 57528423 59451040
21362 59451040 61009947 60370213 58689626 56999815 54864398 54861472 55518354 54498534 53385989
21353 53385989 53333094 53701753 54250101 54967851 54561050 53370481 52723846 52782510 52496910
$$ packed form
21416E6548157J120072m82105q15287j40584r01209j172817j520659j045262J158415
21407E2748721K453520J853271j460963k314856k76016J85345J48810N77616l39056
21398E3576392j181045m48493j00554l67730m766K15612R9331j94136q2755J356751
21388E2868607J041949k040050k063496m55603R4624J104189J756390j42053j052587
21379E1111970N42741J633141J336278N02613M9109O85085R69669J92464M68872
21370E7491942l1383k271854j776185m19733J207736J796972J530928J922617
21362E9451040J558907o39734j680587j689811k135417k926O56882j019820j112545
21353E3385989n2895L68659N48348P17750m06801j190569o46635N8664k85600
$$ plain form
21344 52496910 53039840 54613959 55691151 55626572 56212038 57201175 57586553 58473029 59545759
21335 59545759 59785314 60049893 60352702 58647583 57341104 57214977 56372763 55845558 56071030
21326 56071030 55135004 53862889 54393194 54633706 53898763 54280858 55091492 55607219 55764729
21317 55764729 55796952 54929406 55155934 54553948 53372224 53179542 52574128 51633774 52257619
21308 52257619 53361344 53283509 52759857 53890462 56252027 58043944 57184608 55203472 54281474
21299 54281474 53988466 54369690 54575735 54771461 54680345 53799926 52608178 52101881 53201018
21290 53201018 54748863 54206462 52952163 52118725 51389778 51123095 52800086 53080528 51865489
21281 51865489 50819900 51058274 51353342 50536399 50469904 49296743 48425473 49380619 51276586
$$ packed form
21344E2496910N42930J574119J077192o4579N85466R89137L85378Q86476J072730
21335E9545759K39555K64579L02809j705119j306479j26127q42214n27205K25472
21326E6071030r36026j272115N30305K40512p34943L82095Q10634N15727J57510
21317E5764729L2223q67546K26528o01986j181724j92682o05414r40354O23845
21308E2257619J103725p7835n23652J130605K361565J791917q59336j981136r21998
21299E4281474k93008L81224K06045J95726r1116q80419j191748n06297J099137
21290E3201018J547845n42401j254299q33438p28947k66683J676991K80442j215039
21281E1865489j045589K38374K95068q16943o6495j173161q71270R55146J895967
$$ plain form
21272 51276586 53203798 54704326 55410533 55406293 55949591 56405731 55585773 54341439 54290594
21263 54290594 55276870 55793335 56693518 56325265 55446290 55494611 55472673 55578051 55345430 55297941
21253 55297941 55253960 53474289 51873404 53287640 54796421 55134750 54061686 53017805
21245 53017805 52340375 52481809 54197108 55298955 55587043 54787911 54822290 55736786 56852674
21236 56852674 57648174 57054617 55710118 55127848 54962841 54291956 54866164 54924218 54167132
21227 54167132 54484365 55230494 54665476 54279652 53778574 52086555 52106469 53318056 54122261
21218 54122261 56277244 57669415 57867788 58394699 57889047 57096369 56092800 55452106 55575415
21209 55575415 54978265 54479390 54273510 54150605 54257803 53474800 53521113 53910159 54762680
$$ packed form
21272E1276586J927212J500528P06207m240N43298M56140q19958j244334n0845
21263E4290594R86276N16465R00183l68253q78975M8321k1938J05378k32621m7489
21253E5297941m3981j779671j600885J414236J508781L38329j073064j043881
21245E3017805o77430J41434J715299J101847K88088p99132L4379R14496J115888
21236E6852674P95500n93557j344499n82270j65007o70885N74208N8054p57086
21227E4167132L17233P46129n65018l85824n01078j692019J9914J211587Q04205
21218E4122261K154983J392171J98373N26911n05652p92678j003569o40694J23309
21209E5575415n97150m98875k05880j22905J07198p83003M6313L89046Q52521
$$ plain form
21200 54762680 56019407 56290063 56295862 55446593 54425608 54469783 55728989 56021384 55850419
21191 55850419 57497129 57517315 57417390 58349512 58628643 58030207 58456126 58917506 58656263
21182 58656263 59112919 59782752 59123124 57782843 56609810 57077068 58812557 58985554 58947794
21173 58947794 58838558 58265150 57343320 56225439 56346849 57485468 58545572 57740283 55986984
21164 55986984 54903487 53620028 53613139 54086817 52998827 52892984 53802395 53560378 52479289
21155 52479289 52273703 54014338 54762495 54864129 55290901 55484933 56729948 56916029 56070339
21146 56070339 55163241 53278296 51109680 50477076 52314467 53956968 54974850 55048472 54808455
21137 54808455 55881203 56396081 55556532 54407728 52974544 52777506 53969561 54495984 54786302
$$ packed form
21200E4762680J256727K70656N799q49269j020985M4175J259206K92395j70965
21191E5850419J646710K0186r9925R32122K79131n98436M25919M61380k61243
21182E8656263M56656O69833o59628j340281j173033M67258J735489J72997l7760
21173E8947794j09236n73408r21830j117881J21410J138619J060104q05289j753299
21164E5986984j083497j283459o889M73678j087990j05843R09411k42017j081089
21155E2479289k05586J740635P48157J01634M26772J94032J245015J86081q45690
21146E6070339r07098j884945k168616o32604J837391J642501J017882P3622k40017
21137E4808455J072748N14878q39549j148804j433184j97038J192055N26423K90318
$$ plain form
21128 54786302 55133904 55344821 55782330 56998071 57939191 58122910 58463455 57918387 57822498
21119 57822498 57234414 54472844 53251292 53392741 52511575 52196353 53555052 55358566 57017421
21110 57017421 57476025 55814912 54644856 54630103 54478998 56644538 59215983 60110771 59800023
21101 59800023 59275989 60050592 60066345 58618500 58861330 60599942 60854822 59354222 57843876
21092 57843876 56252681 54569873 54741989 56469069 57889314 58999795 59690612 59826332
21084 59826332 60679218 61347137 60658217 60897542 61029790 59783930 57705495 57546972 58597319
21075 58597319 58046812 58969912 60998466 63053820 62924314 62796611 61651975 59564841 58702546
21066 58702546 58266479 58861156 59283195 58196277 57453180 56550404 56393439 58398911 59503895
$$ packed form
21128E4786302L47602K10917M37509J215741R41120J83719L40545n45068r5889
21119E7822498n88084k761570j221552J41449q81166l15222J358699J803514J658855
21110E7017421M58604j661113j170056j4753j51105K165540K571445Q94788l10748
21101E9800023n24034P74603J5753j447845K42830J738612K54880j500600j510346
21092E7843876j591195j682808J72116J727080J420245J110481O90817J35720
21084E9826332Q52886O67919o88920K39325J32248j245860k078435j58523J050347
21075E8597319n50507R23100K028554K055354j29506j27703j144636k087134q62295
21066E8702546m36067N94677M22039j086918p43097r02776j56965K005472J104984
$$ plain form
21057 59503895 58162656 56009851 55110569 55402740 56296934 57669104 58438632 58874909 60385711
21048 60385711 61550369 60263900 58939973 58511425 57857642 57481297 57777220 56907415 56298517
21039 56298517 57055523 58336666 60175478 59933739 59528360 60208561 61004813 60458410 60427027
21030 60427027 62297247 62856981 61816315 61602018 61910676 60752755 59014350 58202237 57460787
21021 57460787 57239849 59456315 61718224 61812465 60834498 59487480 59900026 62535434 65250632
21012 65250632 65149747 64271039 64876881 65322058 65205578 64841073 65592830 65660461 64696966
21003 64696966 63679289 63058145 63265721 64208236 64831797 64101217 64381171 64966905 64581661
20994 64581661 64964229 66154342 67058655 66981501 64963060 64047888 64320537 64556007 63984969
$$ packed form
21057E9503895j341239k152805q99282K92171Q94194J372170P69528M36277J510802
21048F0385711J164658j286469j323927m28548o53783l76345K95923q69805o08898
21039E6298517P57006J281143J838812k41739m05379O80201P96252n46403l1383
21030F0427027J870220N59734j040666k14297L08658j157921j738405q12113p41450
21021E7460787k20938K216466K261909R4241r77967j347018M12546K635408K715198
21012F5250632j00885q78708O05842M45177j16480l64505P51757O7631r63495
21003F4696966j017677o21144K07576R42515O23561p30580K79954N85734l85244
20994F4581661L82568J190113R04313p7154k018441r15172K72649K35470n71038
$$ plain form
20985 63984969 61519354 59399404 60796086 62077639 63234374 64328384 63967701 63420703
20977 63420703 64122586 65227723 65590067 65491694 65845159 65345501 65425253 66302085 66572036
20968 66572036 65813503 65230425 65915425 66832766 68279574 70515975 70628043 68006700 66929513
20959 66929513 66236898 64880037 64683023 65158914 65393476 66400548 67260265 67683696 69167559
20950 69167559 70099399 70157000 69746990 69853032 72554023 73740971 74535459 76269960 77204960
20941 77204960 77613526 78808597 79722717 79519445 79542783 80051476 80737647 81728698 82829530
20932 82829530 85103637 87021232 88665392 91281966 92656292 93880580 96422364 98614049
20924 98614049 99903771 101770541 105331224 109542144 113551503 119815381 128309876 136871999
$$ packed form
20985F3984969k465615k119950J396682J281553J156735J094010l60683n46998
20977F3420703P01883J105137L62344r8373L53465m99658P9752Q76832K69951
20968F6572036p58533n83078O85000R17341J446808K236401J12068k621343j077187
20959F6929513o92615j356861j97014M75891K34562J007072Q59717M23431J483863
20950F9167559R31840N7601m10010J06042K700991J186948P94488J734501R35000
20941G7204960M08566J195071R14120k03272K3338N08693O86171R91051J100832
20932H2829530K274107J917595J644160K616574J374326J224288K541784K191685
20924I8614049J289722J866770L560683M210920M009359O263878Q494495Q562123
$$ plain form
20916 136871999 146337022 156901549 168406369 173562118 159786147 106933291 24543578
20909 24543578 -33754389 -53456180 -53669190 -47014989 -38440111 -27777182 -17784543 -10572002
20901 -10572002 -4341327 536376 3333117 5734515 9047467 13301211 16564620 18122936
20893 18122936 19751416 22475159 23194371 23959946 25699853 27811602 30152881 31531121
20885 31531121 30763885 30090650 30506809 30516715 31786884 32260248 33246210 35365531 37492323
20876 37492323 38253258 37918075 37677015 37224959 37384582 39049140 40522500 40149895 39821596
20867 39821596 41879460 43304249 42969502 43797266 44827856 44801626 44138464 43819828 42378999
20858 42378999 42061914 44059300 45002483 45091983 45383692 45992463 46166182 45319155 44401829
$$ packed form
20916A36871999R465023J0564527J1504820N155749j3775971n2852856q2389713
20909B4543578n8297967j9701791k13010O654201Q574878J0662929R992639P212541
20901a0572002O230675M877703K796741K401398L312952M253744L263409J558316
20893A8122936J628480K723743P19212P65575J739907K111749K341279J378240
20885C1531121p67236o73235M16159R906J270169M73364R85962K119321K126792
20876C7492323P60935l35183k41060m52056J59623J664558J473360l72605l28299
20867C9821596K057864J424789l34747Q27764J030590k6230o63162l18636j440829
20858D2378999l17085J997386R43183Q9500K91709O08771J73719q47027r17326
$$ plain form
20849 44401829 45620499 46988273 46876302 46913216 46568139 46667974 48176332 50054363 49356270
20840 49356270 48394803 48405870 48180626 48081447 48934933 49800780 49254048 49090621 49122262 47823061
20830 47823061 46780052 47576751 48067828 47797421 47472076 47189127 47455070 48243589 49803413
20821 49803413 50880717 49971523 48722968 48534322 47264794 46481512 48315213 50346781
20813 50346781 50199882 50179329 50595069 50195873 48778152 49611059 50859897 50767762 51307592
20804 51307592 52917003 52819541 51066939 48575649 47351675 48667547 51299681 51663991
20796 51663991 51538517 53142467 53945100 52289042 51289057 51127740 51778967 51496931 51050378
20787 51050378 50798099 50578133 51065471 52154222 53952497 54851467 55067056 54743936 53147869
$$ packed form
20849D4401829J218670J367774j11971L6914l45077R9835J508358J878031o98093
20840D9356270r61467J1067k25244r9179Q53486Q65847n46732j63427L1641j299201
20830D7823061j043009P96699M91077k70407l25345k82949K65943P88519J559824
20821D9803413J077304r09194j248555j88646j269528p83282J833701K031568
20813E0346781j46899k0553M15740l99196j417721Q32907J248838r2135N39830
20804E1307592J609411r7462j752602k491290j223974J315872K632134L64310
20796E1663991j25474J603950Q02633j656058r99985j61317O51227k82036m46553
20787E1050378k52279k19966M87338J088751J798275Q98970K15589l23120j596067
$$ plain form
20778 53147869 51022922 51283616 52825702 52603735 50736167 50535019 52164572 54147240
20770 54147240 54839747 53973118 51672604 51611117 52270261 52408962 51628473 51162991 51740030
20761 51740030 51983389 50612843 49351862 50475555 51919985 52471080 53160267 53355120 52899421
20752 52899421 51203611 49456273 49666353 50038639 49243203 49099384 49156861 49772639 50184386
20743 50184386 50679381 49504198 49048407 50463101 51869215 53482520 54377114 54137855 53514133
20734 53514133 53485526 53874978 53730379 53991396 55030602 56903662 57623290 57467539 57011146
20725 57011146 57122409 58572352 59292949 58871636 57860576 59023666 59744834 58745874 57738176
20716 57738176 55810606 53964578 52939149 52904257 53171144 53029508 54484969 54723660 54412154
$$ packed form
20778E3147869k124947K60694J542086k21967j867568k01148J629553J982668
20770E4147240O92507q66629k300514o1487O59144J38701p80489m65482N77039
20761E1740030K43359j370546j260981J123693J444430N51095O89187J94853m55699
20752E2899421j695810j747338K10080L72286p95436j43819N7477O15778M11747
20743E0184386M94995j175183m55791J414694J406114J613305Q94594k39259o23722
20734E3514133k8607L89452j44599K61017J039206J873060P19628j55751m56393
20725E7011146J11263J449943P20597m21313j011060J163090P21168r98960j007698
20716E7738176j927570j846028j025429l4892K66887j41636J455461K38691l11506
$$ plain form
20707 54412154 54515377 54854358 55293431 54986346 54162472 53907189 53889152 53229697 52804345
20698 52804345 53280050 53218615 53880103 55070248 55623601 55304278 55224027 55343663 55076159
20689 55076159 54734588 54433680 53259516 52899927 54274737 56663688 58199264 58504746 57948864
20680 57948864 56798601 55360003 54668822 54376748 54863708 54822442 53951127 53009953 53377161
20671 53377161 56242195 58682178 59407966 58169053 57872112 57117312 55766894 55269191 55224381
20662 55224381 55849879 57432153 58086795 57367151 56496085 55056112 53975869 54707926 54190570
20653 54190570 53391368 53274756 53264372 53456614 54592414 56484635 57131894 56444290 56324142
20644 56324142 55876081 55010537 54776782 55225117 56491764 57697300 56559688 55209860 54856669
$$ packed form
20707E4412154J03223L38981M39073l07085q23874k55283j8037o59455m25352
20698E2804345M75705o1435O61488J190145N53353l19323q0251J19636k67504
20689E5076159l41571l00908j174164l59589J374810K388951J535576L05482n55882
20680E7948864j150263j438598o91181k92074M86960m1266q71315r41174L67208
20671E3377161K865034K439983P25788j238913k96941p54800j350418m97703m4810
20662E5224381O25498J582274O54642p19644q71066j439973j080243P32057n17356
20653E4190570p99202j16612j0384J92242J135800J892221O47259o87604j20148
20644E6324142m48061q65544k33755M48335J266647J205536j137612j349828l53191
$$ plain form
20635 54856669 55459613 55458465 55546524 55281707 53614308 52638043 54358473 56034150 56372225
20626 56372225 58858048 60448240 58830094 55619630 54434007 55355694 55704995 56182414
20618 56182414 56997450 57896263 57990099 58263549 58347667 57422030 57848095 58760291 58702916 57915320
20608 57915320 57989907 59099657 59782939 59341122 58657697 58855159 60389449 62086517 61996148
20599 61996148 62580425 62904491 62294488 61510215 60505329 57103596 53327630 52907737 55083398
20590 55083398 57489514 57699971 57474496 56859090 57083844 58248727 60972186 61872046 62862220
20581 62862220 63919006 63006321 62433784 62664987 63790853 63521271 63448443 63732764 62482482
20572 62482482 61070209 62495425 64142380 63315651 63185071 63090677 60657308 59136968 58827596
$$ packed form
20635E4856669O02944j148Q8059k64817j667399r76265J720430J675677L38075
20626E6372225K485823J590192j618146l210464j185623R21687L49301M77419
20618E6182414Q15036Q98813R3836K73450Q4118r25637M26065R12196n7375p87596
20608E7915320P4587J109750O83282m41817o83425J97462J534290J697068r0369
20599F1996148N84277L24066o10003p84273j004886l401733l775966m19893K175661
20590E5083398K406116K10457k25475o15406K24754J164883K723459Q99860R90174
20581F2862220J056786r12685n72537K31203J125866k69582p2828K84321j250282
20572F2482482j412273J425216J646955q26729j30580r4394k433369j520340l09372
$$ plain form
20563 58827596 58941046 59471566 59558718 60081317 61070721 61213228 61541660 61273001 60575094
20554 60575094 61360068 62629481 63429919 62385845 61608258 62393805 63495629 63473962 63385351
20545 63385351 64423134 64971959 66035770 66382467 67246324 67808739 67698616 68387703 68803002
20536 68803002 67998798 67082983 67088047 67044942 66647565 67206452 68455199 69562032 69136605
20527 69136605 68448761 68650147 68057512 67646013 68292276 68998401 69361485 68756327 70767158
20518 70767158 72935780 73345965 72999625 72296313 73567874 75138436 74895175 74850114 75151882
20509 75151882 75514963 76432850 78619531 80309758 83029368 84923743 85082327 86716878
20501 86716878 90097587 93563236 97007814 100496592 106370013 113987112 123644192 132064067
$$ packed form
20563E8827596J13450N30520Q7152N22599R89404J42507L28432k68659o97907
20554F0575094P84974J269413Q00438j044074p77587P85547J101824k1667q8611
20545F3385351J037783N48825J063811L46697Q63857N62415j10123O89087M15299
20536F8803002q04204r15815N064m3105l97377N58887J248747J106833m25427
20527F9136605o87844K01386n92635m11499O46263P06125L63084o05158K010831
20518G0767158K168622M10185l46340p03312J271561J570562k43261m5061L01768
20509G5151882L63081R17887K186681J690227K719610J894375J58584J634551
20501H6716878L380709L465649L444578L488778N873421P617099R657080Q419875
$$ plain form
20493 132064067 132475473 97195429 28506847 -6977249 -10026573 -4930604 1493984 7374896
20485 7374896 13256855 19466456 24017779 26228445 27972180 30982116 32682183 32617092
20477 32617092 32333407 32104626 32895635 35090169 37931666 39973325 41016896 40755205 41100016
20468 41100016 41897169 41597434 42224489 43671584 46441168 48960491 48734137 48842835 49796117
20459 49796117 50613848 50434132 49305028 47086949 47003598 49405115 51698285 53039103 52898850
20450 52898850 53673328 54705664 54264915 54322782 54111694 53378170 53868878 54207101 54328191
20441 54328191 53526419 53300910 53451812 52129176 52455881 51733870 51310241 51997138 52083728
20432 52083728 52536932 53143668 54917946 56171019 54476206 52992507 51327010 50508298
$$ packed form
20493A32064067M11406l5280044o8688582l5484096l049324N095969O424588N880912
20485G374896N881959O209601M551323K210666J743735L009936J700067o5091
20477C2617092k83685k28781P91009K194534K841497K041659J043571k61691L44811
20468D1100016P97153k99735O27055J447095K769584K519323k26354J08698R53282
20459D9796117Q17731j79716j129104k218079q3351K401517K293170J340818j40253
20450E2898850P74478J032336m40749N7867k11088p33524M90708L38223J21090
20441E4328191q01772k25509J50902j322636L26705p22011m23629O86897Q6590
20432E2083728M53204O06736J774278J253073j694813j483699j665497q18712
$$ plain form
20424 50508298 49705075 49190988 50616917 50850553 51058631 53180145 54020841 53828407 53311097
20415 53311097 53101201 53998276 54916878 56417932 57485339 56429091 56385162 56937254 56562599
20406 56562599 56033924 56152252 57347334 58284578 58425693 58170276 56999937 54466676 53273204
20397 53273204 54063315 55918533 57262186 56677641 55310512 54526567 54338662 53982668 53199008
20388 53199008 51672464 51307315 52909367 54702419 54409339 53959186 54117246 55921873 57955191
20379 57955191 59093630 59796133 58085611 56308481 55490826 56709517 59172303 59133339 57773604
20370 57773604 58603653 59971988 60274836 59736672 58084288 56164492 55890438 56425757 57509746
20361 57509746 58647928 58625549 57939720 57966450 59163617 59737395 59409772 59737308 60157356
$$ packed form
20424E0508298q03223n14087J425929K33636K08078K121514Q40696j92434n17310
20415E3311097k09896Q97075R18602J501054J067407j056248m3929N52092l74655
20406E6562599n28675J18328J195082R37244J41115k55417j170339k533261j193472
20397E3273204P90111J855218J343653n84545j367129p83945j87905l55994p83660
20388E3199008j526544l65149J602052J793052k93080m50153J58060J804627K033318
20379E7955191J138439P02503j710522j777130q17655J218691K462786l8964j359735
20370E7773604Q30049J368335L02848n38164j652384j919796k74054N35319J083989
20361E7509746J138182k2379o85829K6730J197167N73778l27623L27536M20048
$$ plain form
20352 60157356 60609340 60601043 59475423 57453875 56057609 56584293 57139489 57699645 59049224
20343 59049224 59277114 59729478 62050141 63210448 63011363 62418359 62304755 61765705 59990943
20334 59990943 59048916 58216487 56947655 56172892 55813638 55911796 57723245 58938798 58923128
20325 58923128 59446398 61119062 60925733 60077713 60384713 60593780 60644524 60976071 61693488
20316 61693488 60219615 58952686 59976406 61045745 60975761 61404079 62330574 63394004 64294892
20307 64294892 63699961 62305068 62134991 62030137 60494817 60549983 62532966 63343507 63239090
20298 63239090 63472067 64026828 63535140 62845607 61361232 59514031 58341054 59244775 59830316
20289 59830316 60065863 60327593 58764574 56925742 56997379 58254095 58849724 58360586 58828381
$$ packed form
20352F0157356M51984q297j125620k021548j396266N26684N55196N60156J349579
20343E9049224K27890M52364K320663J160307j99085n93004j13604n39050j774762
20334E9990943r42027q32429j268832p74763l59254R8158J811449J215553j5670
20325E8923128N23270J672664j93329q48020L07000K09067N0744L31547P17417
20316F1693488j473873j266929J023720J069339o9984M28318R26495J063430R00888
20307F4294892n94931j394893j70077j04854j535320N5166J982983Q10541j04417
20298F3239090K32977N54761m91688o89533j484375j847201j172977R03721N85541
20289E9830316K35547K61730j563019j838832P1637J256716N95629m89138M67795
$$ plain form
20280 58828381 60510773 62031817 63763919 63209952 60587256 60145101 61509836 62482163
20272 62482163 63252480 64678327 66218300 66922116 65246867 62949376 62625426 63273762 62692572
20263 62692572 62272617 63560174 64498551 64406572 63539364 63206058 64163148 65125981 65580528
20254 65580528 65478336 64392993 63732728 64713756 67049585 68186279 66459261 65509638 64194778
20245 64194778 62418187 60906850 60888180 63182951 65079982 65906854 66670047 67398054 66574962
20236 66574962 65748853 65235876 64578750 64117335 63693622 63941158 65114256 67024914 68354372
20227 68354372 67664754 65432566 64679288 65613981 66081554 66446715 65924949 65304845 65552844
20218 65552844 65506928 64734912 64380440 65096570 67358360 70339655 71687224 71826498 72276879
$$ packed form
20280E8828381J682392J521044J732102n53967k622696m42155J364735R72327
20272F2482163P70317J425847J539973P03816j675249k297491l23950O48336n81190
20263F2692572m19955J287557R38377r1979q67208l33306R57090R62833M54547
20254F5580528j02192j085343o60265R81028K335829J136694j727018r49623j314860
20245F4194778j776591j511337j8670K294771J897031Q26872P63193P28007q23092
20236F6574962q26109n12977o57126m61415m23713K47536J173098J910658J329458
20227F8354372o89618k232188p53278R34693M67573L65161n21766o20104K47999
20218F5552844m5916p72016l54472P16130K261790K981295J347569J39274M50381
$$ plain form
20209 72276879 71929831 70507183 71251674 73044292 72634769 70291630 67372339 66648622 67607735
20200 67607735 67671398 67331300 67220221 65922314 66218053 67501140 68500324 69012409 67863563
20191 67863563 67650243 68458227 67227786 65785562 64664003 64226183 64185594 64148628 63617146
20182 63617146 63818112 64724502 66324058 68038784 68058227 67375711 67074876 68186745 69603399
20173 69603399 69042325 68332843 68904515 68915193 67363165 66934988 66450626 65886877 66836477
20164 66836477 68188668 69090091 70288449 71636638 71378738 70098900 70000360 70437985 70191902
20155 70191902 69283316 70069440 71949477 71433975 69971647 70205605 70680296 70580335 70924308
20146 70924308 71516955 70317204 69811107 69670792 71009792 73942660 77025696 77534081 74731376
$$ packed form
20209G2276879l47048j422648P44491J792618m09523k343139k919291p23717R59113
20200F7607735O3663l40098j11079j297907K95739J283087R99184N12085j148846
20191F7863563k13320Q07984j230441j442224j121559m37820m0589l6966n31482
20182F3617146K00966R06390J599556J714726J9443o82516l00835J111869J416654
20173F9603399n61074p09482N71672J0678j552028m28177m84362n63749R49600
20164F6836477J352191R01423J198358J348189k57900j279838r8540M37625k46083
20155G0191902r08586P86124J880037n15502j462328K33958M74691r9961L43973
20146G0924308N92647j199751n06097j40315J339000K932868L083036N08385k802705
$$ plain form
20137 74731376 72568961 72489799 73027211 74043457 75793704 76410689 76670354 77290463 78531313
20128 78531313 77530164 75845974 76542922 77977336 78375200 78369961 77281462 75450125 74398925
20119 74398925 74027894 73125508 74947731 75747055 75694070 77041426 78435730 79558431 81984525
20110 81984525 83147079 84334858 85479096 84630693 83588724 83334899 83761298 85080653
20102 85080653 87074361 87838948 86306533 84662947 82914984 81641236 79955440 77731089
20094 77731089 77956775 79539331 81003070 82146970 83014104 83157959 83007537 84511646 84924831
20085 84924831 83991402 84366998 86266248 88608432 89338240 88710654 87303339 87458984 88715825
20076 88715825 88563426 88420605 90214940 92451617 94315709 95051293 96239546 98938285
$$ packed form
20137G4731376k162415p9162N37412J016246J750247O16985K59665O20109J240850
20128G8531313j001149j684190O96948J434414L97864n239j088499j831337j051200
20119G4398925l71031r02386J822223P99324n2985J347356J394304J122701K426094
20110H1984525J162554J187779J144238q48403j041969k53825M26399J319355
20102H5080653J993708P64587j532415j643586j747963j273748j685796k224351
20094G7731089K25686J582556J463739J143900Q67134J43855j50422J504109M13185
20085H4924831r33429L75596J899250K342184P29808o27586j407315J55645J256841
20076H8715825j52399j42821J794335K236677J864092P35584J188253K698739
$$ plain form
20068 98938285 100610468 101559709 101853448 102401166 103093697 101990510 101087477 101594981 102244212
20059 102244212 102221833 102288515 103460232 105808657 109392897 112591153 115571063 117692883
20051 117692883 119505286 120718592 120269202 120552305 123230681 126973251 131492475 134415854
20043 134415854 137027981 141562955 147318385 151956985 156361153 161642072 168301990 176091677
20035 176091677 184286160 192729414 203283771 216520965 233679700 253522796 276630678
20028 276630678 303079960 328775631 331533677 264644893 90914693 -78462115 -144356483
20021 -144356483 -148274079 -131010325 -111034701 -92291570 -74610544 -57243163 -44424061
20014 -44424061 -34145720 -25763791 -17402123 -10429231 -3422782 4018796 10687178 15795467
$$ packed form
20068I8938285J672183R49241K93739N47718O92531j103187r03033N07504O49231
20059A02244212k2379O6682J171717K348425L584240L198256K979910K121820
20051A17692883J812403J213306m49390K83103K678376L742570M519224K923379
20043A34415854K612127M534974N755430M638600M404168N280919O659918P789687
20035A76091677Q194483Q443254J0554357J3237194J7158735J9843096K3107882
20028B76630678K6449282K5695671K758046o6888784j73730200j69376808o5894368
20021a44356483l917596J7263754J9975624J8743131J7681026J7367381J2819102
20014d4424061J0278341Q381929Q361668O972892P006449P441578O668382N108289
$$ plain form
20006 15795467 18997676 22904782 28848208 33170966 37689697 42304370 46293754 50809175
19998 50809175 55581681 59510961 64013175 69100928 73871560 77526288 79136039 81201092
19990 81201092 88010525 96211565 105346765 115987025 128292508 139295450 150397095
19983 150397095 158296092 154460877 118976203 42959194 -29367324 -60447844 -63689752
19976 -63689752 -55774356 -46536208 -36024265 -25477770 -16271007 -10640358 -5981794 -610120
19968 -610120 3412476 6185766 9639068 14702139 17493682 17395067 18765366 22708301 26548796
19959 26548796 28536412 29505922 30549196 31892757 34388916 37700134 39743135 41546910
19951 41546910 45699296 48803619 49459866 50567057 50912007 53073288 55255630 57523621
$$ packed form
20006A5795467L202209L907106N943426M322758M518731M614673L989384M515421
19998E0809175M772506L929280M502214N087753M770632L654728J609751K065053
19990H1201092O809433Q201040R135200J0640260J2305483J1002942J1101645
19983A50397095P898997l835215l5484674p6017009p2326518l1080520l241908
19976f3689752P915396R238148J0511943J0546495R206763N630649M658564N371674
19968f10120M022596K773290L453302N063071K791543r8615J370299L942935L840495
19959B6548796J987616R69510J043274J343561K496159L311218K043001J803775
19951D1546910M152386L104323O56247J107191L44950K161281K182342K267991
$$ plain form
19943 57523621 60280557 62979225 64085516 65350921 67696857 70001624 72052132 72958886
19935 72958886 74747002 78715115 83268109 87272249 90823249 95413604 100517047 106120121
19927 106120121 112214475 120468846 128455001 134971724 141253395 150502205 165042895 183053906
19919 183053906 202933336 224771985 247963977 271931373 284495247 249426780 108853452
19912 108853452 -81379933 -184729933 -204984128 -193362651 -172931569 -151054912 -131234504
19905 -131234504 -115055652 -100867664 -89388563 -80451337 -71241336 -62033017 -54076192
19898 -54076192 -48910219 -44423431 -40163745 -36373331 -33148950 -29234356 -26245145 -25340317
19890 -25340317 -23407347 -21139181 -18831836 -17194203 -14895507 -12847503 -12169168 -9864216
$$ packed form
19943E7523621K756936K698668J106291J265405K345936K304767K050508R06754
19935G2958886J788116L968113M552994M004140L551000M590355N103443N603074
19927A06120121O094354Q254371P986155O516723O281671R248810J4540690J8011011
19919A83053906J9879430K1838649K3191992K3967396J2563874l5068467j40573328
19912A08853452j90233385j03350000k0254195J1621477K0431082K1876657J9820408
19905a31234504J6178852J4187988J1479101Q937226R210001R208319P956825
19898e4076192N165973M486788M259686L790414L224381L914594K989211R04828
19890b5340317J932970K268166K307345J637633K298696K048004O78335K304952
$$ plain form
19882 -9864216 -6821165 -4907558 -3189281 -1202025 1132694 4437392 6081675 6393768
19874 6393768 5673845 5481315 5573235 6780519 9081820 10068136 10818297 10747224 10879020
19865 10879020 11827354 11847595 12367157 13458162 13505200 14114119 14765017 14044766 12938344
19856 12938344 13519696 14706991 14628663 14915686 17013820 19735082 20350149 20845156 21427708
19847 21427708 22951987 24321049 25175764 25136925 25054929 24877661 24931009 26402590 28079435
19838 28079435 29031219 30187949 31151931 31069453 29059787 28623298 29314504 29408596 30338848
19829 30338848 29631671 28951103 28774829 28812026 28923343 29552155 29532289 27502775 25837224
19820 25837224 25571415 26689084 28101421 30186704 31747177 32476859 32434588 33782702 34478596
$$ packed form
19882i864216L043051J913607J718277J987256K334719L304698J644283L12093
19874F393768p19923j92530R1920J207284K301301R86316P50161p1073J31796
19865A0879020R48334K0241N19562J091005M7038O08919O50898p20251j106422
19856A2938344N81352J187295p8328K87023K098134K721262O15067M95007N82552
19847B1427708J524279J369062Q54715l8839q1996j77268N3348J471581J676845
19838B8079435R51784J156730R63982q2478k009666m36489O91206R4092R30252
19829C0338848p07177o80568j76274L7197J11317O28812j9866k029514j665551
19820B5837224k65809J117669J412337K085283J560473P29682m2271J348114O95894
$$ plain form
19811 34478596 34351303 34988613 36031228 35717335 35332883 34551464 35046972 37482691 37830708
19802 37830708 38595240 40086041 39616658 38573509 37124122 36067352 34712812 33931958
19794 33931958 33279483 33649012 35523230 35557044 35595423 35612772 34844299 33781095 32153069
19785 32153069 32057148 33555649 35549113 38294962 40201335 41178839 40580334 38987472 38527789
19776 38527789 40016076 40327836 39628570 38903056 38118044 37169367 36458391 37650700 39467967
19767 39467967 39109524 35709840 32733974 33137975 34751826 35534315 36583008 37933831
19759 37933831 38422277 37830348 36288721 35881884 36427887 36764315 37635623 38807802 38428366
19750 38428366 37391663 37227157 38125688 40118608 41419347 40826396 39715745 39700273 41200870
$$ packed form
19811C4478596j27293O37310J042615l13893l84452p81419M95508K435719L48017
19802C7830708P64532J490801m69383j043149j449387j056770j354540p80854
19794C3931958o52475L69529J874218L3814L8379J7349p68473j063204j628026
19785C2153069r5921J498501J993464K745849J906373R77504n98505j592862m59683
19776C8527789J488287L11760o99266p25514p85012r48677p10976J192309J817267
19767C9467967l58443l399684k975866M04001J613851P82489J048693J350823
19759C7933831M88446n91929j541627m06837N46003L36428Q71308J172179l79436
19750C8428366j036703j64506Q98531J992920J300739n92951j110651j5472J500597
$$ plain form
19741 41200870 42357211 42521755 42109055 41888731 42358949 42995372 42477642 41637239 40235715
19732 40235715 39032382 38826607 40111834 41432196 42471075 42174928 41543836 42351339 43171459
19723 43171459 42637047 42418478 42613420 41832245 41636525 42463154 43464005 44362978 44566723
19714 44566723 44306060 43380761 41359336 39094732 38452834 39730375 41126750 42271873
19706 42271873 42395883 43076112 44647565 44236825 42570516 42213429 43271179 44214932 45531146
19697 45531146 46518685 45160797 43389660 41946186 42464420 44299107 43318841 42569981 43603820
19688 43603820 45000497 45817277 45249792 44590730 44698972 44431775 43894704 43811677 44596414
19679 44596414 45592063 46385320 45604991 44617386 42109977 40510435 40531887 41366296 43704454
$$ packed form
19741D1200870J156341J64544m12700k20324M70218O36423n17730q40403j401524
19732D0235715j203333k05775J285227J320362J038879k96147o31092Q07503Q20120
19723D3171459n34412k18569J94942p81175j95720Q26629J000851Q98973K03745
19714D4566723k60663r25299k021425k264604o41898J277541J396375J145123
19706D2271873J24010O80229J571453m10740j666309l57087J057750R43753J316214
19697D5531146R87539j357888j771137j443474N18234J834687r80266p48860J033839
19688D3603820J396677Q16780n67485o59062J08242k67197n37071q3027P84737
19679D4596414R95649P93257p80329r87605k507409j599542K1452Q34409K338158
$$ plain form
19670 43704454 46196851 47171272 47169544 46596309 46714351 46473517 44601256 44020979 43552144
19661 43552144 42523104 41498119 40452919 40115832 41356001 42852154 44908772 46638105
19653 46638105 47203046 47129573 47270147 47254623 48024336 49767002 49883258 49727099 49705913 48525526
19643 48525526 47105426 46363078 44535508 43673633 42925440 41206722 41056601 41644403 43837429
19634 43837429 47312512 50334974 51374064 52254188 53236938 52555478 51220461 50056579
19626 50056579 49270026 48699635 48511028 47582876 46898313 46160437 46489917 47439991 48283418
19617 48283418 49024976 47031080 45662241 47342756 48591319 48942138 50366001 51786186
19609 51786186 52669030 52126948 49678582 48241033 48347120 47481871 47555474 49059893 50170892
$$ packed form
19670D3704454K492397R74421j728n73235J18042k40834j872261n80277m68835
19661D3552144j029040j024985j045200l37087J240169J496153K056618J729333
19653D6638105N64941p3473J40574j5524P69713J742666J16256j56159k1186j180387
19643D8525526j420100p42348j827570q61875p48193j718718j50121N87802K193026
19634D3837429L475083L022462J039090Q80124R82750o81460j335017j163882
19626E0056579p86553n70391j88607r28152o84563p37876L29480R50074Q43427
19617D8283418P41558j993896j368839J680515J248563L50819J423863J420185
19609E1786186Q82844n42082k448366j437549J06087q65249P3603J504419J110999
$$ plain form
19600 50170892 50228780 49996805 50193442 50809377 51507929 51400263 50434474 48964076 48548567
19591 48548567 49915099 51297638 51367045 52667587 53160776 52429848 52507812 52177499 53217773
19582 53217773 55239253 55818475 55257926 54594714 54302607 54894152 56210620 56884131 54716509
19573 54716509 52544292 53434238 54398138 53252017 51640359 51464119 52750345 53519507 52343736
19564 52343736 52260292 52746559 52411460 51618411 52078305 53254179 54425462 56183419 57873124
19555 57873124 58018008 58244927 59896424 61669400 63266534 62563060 60734138 60914328 61141233
19546 61141233 60317625 60887339 62620546 63075637 62464831 61387757 61093896 60221189 61383690
19537 61383690 63736578 65486226 67041339 67167375 66346231 66214078 66447423 66548025 66894821
$$ packed form
19600E0170892N7888k31975J96637O15935O98552j07666r65789j470398m15509
19591D8548567J366532J382539O9407J300542M93189p30928P7964l30313J040274
19582E3217773K021480N79222n60549o63212k92107N91545J316468O73511k167622
19573E4716509k172217Q89946R63900j146121j611658j76240J286226P69162j175771
19564E2343736q3444M86267l35099p93049M59894J175874J171283J757957J689705
19555E7873124J44884K26919J651497J772976J597134p03474j828922J80190K26905
19546F1141233q23608N69714J733207M55091o10806j077074k93861q72707J162501
19537F1383690K352888J749648J555113J26036q21144j32153K33345J00602L46796
$$ plain form
19528 66894821 66402975 64553389 65820418 67509041 69190059 72013380 72536627 72112082
19520 72112082 72295338 73914390 76435215 78997606 80606695 83314516 86518451 88581932
19512 88581932 89763687 92666789 96237784 100699350 105542953 111371611 118752033 128207439
19504 128207439 139647274 150256734 160225122 165493305 152656373 98175947 13042615
19497 13042615 -44357190 -60919981 -59455228 -52696981 -45324089 -39164240 -32774474 -24917810
19489 -24917810 -18165361 -13586112 -8710147 -2649558 1822098 4083695 5567060 7383908
19481 7383908 9394914 11594765 13245738 13974708 14805619 16675993 18624877 21049207
19473 21049207 22851119 23291603 22666263 22023539 22070451 22133238 22161641 23001816 25288732
$$ packed form
19528F6894821m91846j849586J267029J688623J681018K823321N23247m24545
19520G2112082J83256J619052K520825K562391J609089K707821L203935K063481
19512H8581932J181755K903102L570995M461566M843603N828658P380422R455406
19504A28207439J1439835J0609460R968388N268183j2836932n4480426q5133332
19497A3042615n7399805j6562791J464753O758247P372892O159849O389766P856664
19489b4917810O752449M579249M875965O060589M471656K261597J483365J816848
19481G383908K011006K199851J650973P28970Q30911J870374J948884K424330
19473B1049207J801912M40484o25340o42724M6912O2787K8403Q40175K286916
$$ plain form
19464 25288732 27110246 28295797 28793664 28459686 27564129 28002478 30102698 31672512 32163350
19455 32163350 31580225 30919169 30630909 30795855 31231533 31475084 30540163 30765929 32381535
19446 32381535 33833255 35213999 36217256 36445305 36959829 38739112 39838794 39896194 39994450
19437 39994450 38860825 37446150 36904489 37329201 41092277 43631460 41767391 39069001
19429 39069001 39612536 42151898 43324799 42533091 40871205 40689715 41370687 41240060 39947727
19420 39947727 37311333 36112444 37648553 39338794 39747239 40002014 40702878 40784033 40981224
19411 40981224 40795956 40043234 39458280 39538519 39869227 39973718 40600694 41875524 41869819 41201357
19401 41201357 41939748 41284671 37896762 36246553 38294671 39668642 41323123 43311968
$$ packed form
19464B5288732J821514J185551M97867l33978q95557M38349K100220J569814M90838
19455C2163350n83125o61056k88260J64946M35678K43551r34921K25766J615606
19446C2381535J451720J380744J003257K28049N14524J779283J099682N7400R8256
19437C9994450j133625j414675n41661M24712L763076K539183j864069k698390
19429C9069001N43535K539362J172901p91708j661886j81490O80972j30627j292333
19420C9947727k636394j198889J536109J690241M08445K54775P00864Q1155J97191
19411D0981224j85268p52722n84954Q0239L30708J04491O26976J274830n705o68462
19401D1201357P38391o55077l387909j650209K048118J373971J654481J988845
$$ plain form
19393 43311968 43831153 44105512 45416692 46582886 46163042 44175804 43409667 44324084 43855695
19384 43855695 42865100 43562895 43669597 42945092 41679725 40165329 40131485 39365932 39004057
19375 39004057 39758647 40442968 40769574 40801043 41276054 42710422 44060667 44505132 43728516
19366 43728516 42606294 41566413 40758073 39600950 38233086 37665733 38065050 37843006 37549636
19357 37549636 37458703 37529550 39648608 41919877 42484863 42198172 41138395 39939662 40380972
19348 40380972 41121495 42588809 44455902 43606410 42043426 42670345 44136609 46158887
19340 46158887 47184655 46509956 45050453 43271882 41464974 39756751 39404178 40645093
19332 40645093 42912974 42705718 42244356 44122526 46864206 49353006 49215572 48035932
$$ packed form
19393D3311968N19185K74359J311180J166194m19844j987238p66137R14417m68389
19384D3855695r90595O97795J06702p24505j265367j514396l3844p65553l61875
19375C9004057P54590O84321L26606L1469M75011J434368J350245M44465p76616
19366D3728516j122222j039881q08340j157123j367864n67353L99317k22044k93370
19357C7549636r0933P0847K119058K271269N64986k86691j059777j198733M41310
19348D0380972P40523J467314J867093q49492j562984O26919J466264K022278
19340D6158887J025768o74699j459503j778571j806908j708223l52573J240915
19332D0645093K267881k07256m61362J878170K741680K488800j37434j179640
$$ plain form
19324 48035932 46729163 45524242 44630801 45100020 45537870 45247592 44157415 43655605 43366134
19315 43366134 43922759 45122714 44568953 43317871 43295656 42877163 41580063 41214415 42237557
19306 42237557 43616931 43903954 44574621 45997747 45809784 44928554 44513324 44889008 44939969
19297 44939969 44047271 43501209 43137977 43220667 43443581 43236917 43436824 43833970 44560545
19288 44560545 44411724 43398702 43613306 44597070 44361222 44698745 44604792 43387325 43723977
19279 43723977 45694702 46390159 46676488 46241761 45573865 47313204 48512440 48780400 48107144
19270 48107144 47182110 45888886 45511553 47137809 47984301 47027764 46565419 47298833 47746858
19261 47746858 46799988 45715024 45770337 44810901 42814096 42162671 43281612 43751313 42515824
$$ packed form
19324D8035932j306769j204921q93441M69219M37850k90278j090177n01810k89471
19315D3366134N56625J199955n53761j251082k2215m18493j297100l65648J023142
19306D2237557J379374K87023O70667J423126j87963q81230m15230L75684N0961
19297D4939969q92698n46062l63232Q2690K22914k06664J99907L97146P26575
19288D4560545j48821j013022K14604R83764k35848L37523r3953j217467L36652
19279D3723977J970725O95457K86329m34727o67896J739339J199236K67960o73256
19270D8107144r25034j293224l77333J626256Q46492r56537m62345P33414M48025
19261D7746858r46870j084964N5313r59436j996805o51425J118941M69701j235489
$$ plain form
19252 42515824 42452578 43275334 44239135 44619785 43755881 42270017 41275113 40943266 41789567
19243 41789567 43556269 43961074 44238231 44530387 45824914 46094808 44963877 45307863 48220699
19234 48220699 49945066 49507467 49328509 49851078 50156313 47587680 44000037 43520851 45735754
19225 45735754 47674353 48817295 48544645 47686452 45541239 44500092 46076950 48778954
19217 48778954 51535848 53255585 52596788 49809616 47484821 47684500 48021068 47670270 47546147
19208 47546147 47027111 45866851 46839776 47433844 47572971 49317650 50875617 50836585 48447233
19199 48447233 47085284 46940569 46519192 47335197 47719912 47705140 46731165 45114819 45009942
19190 45009942 45290038 45765549 46713019 47927489 48166139 46531398 46736785 48848489 50775610
$$ packed form
19252D2515824o3246Q22756R63801L80650q63904j485864r94904l31847Q46301
19243D1789567J766702M04805K77157K92156J294527K69894j130931L43986K912836
19234D8220699J724367m37599j78958N22569L05235k568633l587643m79186K214903
19225D5735754J938599J142942k72650q58193k145213j041147J576858K702004
19217D8778954K756894J719737o58797k787172k324795J99679L36568l50798j24123
19208D7546147n19036j160260R72925N94068J39127J744679J557967l9032k389352
19199D8447233j361949j44715m21377Q16005L84715j4772r73975j616346j04877
19190D5009942K80096M75511R47470J214470K38650j634741K05387K111704J927121
$$ plain form
19181 50775610 50928107 49069099 48130986 49053386 50654735 50602504 50019919 50445713 49546982
19172 49546982 47536299 47419912 48669704 47838995 45950722 44747318 46451004 47183198
19164 47183198 48390033 50715276 52292454 51966791 50362379 49676678 49590538 47614938 46913088
19155 46913088 47565678 46904971 45720427 45237421 46065533 46890205 48722721 50731061 50513903
19146 50513903 49281705 48062054 48977059 49210106 49143399 50765392 50862043 48070873 45573861
19137 45573861 46064742 45965060 45421526 46303791 47385775 47610568 48933394 49482401 48719702
19128 48719702 47691895 47472264 48041041 49340408 50155923 49666359 48763115 49046196 48683052
19119 48683052 47826555 49291096 50206450 49751331 48332436 47261043 47757818 49341820 49266791
$$ packed form
19181E0775610J52497j859008r38113R22400J601349n2231n82585M25794q98731
19172D9546982k010683j16387J249792q30709j888273j203404J703686P32194
19164D7183198J206835K325243J577178l25663j604412o85701q6140j975600p01850
19155D6913088O52590o60707j184544m83006Q28112Q24672J832516K008340k17158
19146E0513903j232198j219651R15005K33047o6707J621993R6651k791170k497012
19137D5573861M90881r9682n43534Q82265J081984K24793J322826N49007p62699
19128D8719702j027807k19631N68777J299367Q15515m89564r03244K83081l63144
19119D8683052q56497J464541R15354m55119j418895j071393M96775J584002p5029
$$ plain form
19110 49266791 48659221 47561058 46911733 46727773 46060649 47664433 49447702 49831921 49403577
19101 49403577 49634783 50055275 52315254 53888885 53851491 53669632 53529723 52924092 53080768
19092 53080768 53620487 53288064 51913220 51427021 51856749 52511504 52412890 49458554 45776287
19083 45776287 43547504 43542352 45145131 46339042 47426029 47280472 47222046 46305098 45985867
19074 45985867 47682026 47622013 48445980 48287829 45516758 44493984 44026154 44683566 46795637
19065 46795637 46423498 45031755 45286971 45901525 47054835 46623753 45359563 45113476 44655484
19056 44655484 45456193 47039696 47806129 49448181 50287370 49482129 47605081 46923632 47488883
19047 47488883 47774949 48464366 48805097 48038133 46583351 45629298 46128610 47547317 48557263
$$ packed form
19110D9266791o07570j098163o49325j83960o67124J603784J783269L84219m28344
19101D9403577K31206M20492K259979J573631l7394j81859j39909o05631J56676
19092E3080768N39719l32423j374844m86199M29728O54755r8614k954336l682267
19083D5776287k228783n152J602779J193911J086987j45557n8426r16948l19231
19074D5985867J696159o0013Q23967j58151k771071j022774m67830O57412K112071
19065D6795637l72139j391743K55216O14554J153310m31082j264190k46087m57992
19056D4655484Q00709J583503P66433J642052Q39189q05241j877048o81449N65251
19047D7488883K86066O89417L40731p66964j454782r54053M99312J418707J009946
$$ plain form
19038 48557263 49426833 49168686 49680675 49165289 48145233 49304933 51266254 51055559 50984448
19029 50984448 49661565 47315379 46273878 46130170 45883990 44953554 45208806 46668751 47751344
19020 47751344 48024836 48169970 48361946 48403622 47794527 46586648 46464499 47692790 47344424
19011 47344424 46352794 46811228 46254780 45847891 46806065 47144593 46607218 45393186 44645188
19002 44645188 44498675 45470378 45830620 45860080 45978353 45401713 45134589 45902612 45356462
18993 45356462 46757809 47371686 46519085 47957813 49005445 48770249 48694073 49084297 48965306
18984 48965306 48574449 48333703 49459254 50209524 49684688 49288910 49624434 49526929 50193636
18975 50193636 49683476 47949605 46051147 44038410 43386955 44314535 45206935 45976291 46908259
$$ packed form
19038D8557263Q69570k58147N11989n15386j020056J159700J961321k10695p1111
19029E0984448j322883k346186j041501j43708k46180r30436K55252J459945J082593
19020D7751344K73492J45134J91976M1676o09095j207879j22149J228291l48366
19011D7344424r91630M58434n56448m06889R58174L38528n37375j214032p47998
19002D4645188j46513R71703L60242K9460J18273n76640k67124P68023n46150
18993D5356462J401347O13877q52601J438728J047632k35196p6176L90224j18991
18984D8965306l90857k40746J125551P50270n24836l95778L35524r7505O66707
18975E0193636n10160j733871j898458k012737o51455R27580Q92400P69356R31968
$$ plain form
18966 46908259 48526186 50183695 51115450 52270663 52315933 50604224 49623796 50601381 52340689
18957 52340689 52786758 51416052 50516590 49635509 48786437 47806843 47749328 48949586 49093867
18948 49093867 47341984 45994814 45882975 47086352 48705744 49828870 50263810 49795814
18940 49795814 49284898 48347036 47748188 48469356 48756607 49147797 49449599 49392539 49617430
18931 49617430 50807384 50616909 49538401 49297518 47927945 45625786 45143128 47088155
18923 47088155 48873958 49153472 48996245 50322167 52684942 52527260 51989335 51835896 50730910
18914 50730910 50203355 50225772 48868905 48232452 48717082 49271699 50131171 50218860 50247952 49630772
18904 49630772 50025534 49605412 48412911 48960298 49841546 50319125 49730787 49874054 50425391
$$ packed form
18966D6908259J617927J657509R31755J155213M5270j711709r80428R77585J739308
18957E2340689M46069j370706q99462q81081q49072r79594n7515J200258J44281
18948D9093867j751883j347170j11839J203377J619392J123126M34940m67996
18940D9795814n10916r37862n98848P21168K87251L91190L01802n7060K24891
18931D9617430J189954j90475j078508k40883j369573k302159m82658J945027
18923D7088155J785803K79514j57227J325922K362775j57682n37925j53439j104986
18914E0730910n27555K2417j356867o36453M84630N54617Q59472Q7689K9092o17180
18904D9630772L94762m20122j192501N47387Q81248M77579n88338J43267N51337
$$ plain form
18895 50425391 50940383 50476193 50368187 51346646 50753006 50129213 50366083 51105466 51699992
18886 51699992 50999392 49921638 50586790 52157408 52932638 52054468 51727997 51305980 51561928
18877 51561928 49966786 46588086 45484157 46012207 46506832 47776380 49361396 48757590
18869 48757590 48647647 49142534 49214866 49741456 50321373 50198348 51033258 52047863 52820514
18860 52820514 53802798 53285660 52602537 51945484 50859914 50281807 50113184 49695665 50980940
18851 50980940 52979621 53519618 52924961 51620525 50998030 52240802 53601196 53680358 52624088
18842 52624088 51663972 50396719 51077192 53019048 52968704 51616080 50773906 50412060 50753400
18833 50753400 50183194 51061473 52818769 52826407 52361229 52846759 53113431 52497769 52520383 52167586
$$ packed form
18895E0425391N14992m64190j08006R78459n93640o23793K36870P39383N94526
18886E1699992p00600j077754O65152J570618P75230q78170l26471m22017K55948
18877E1561928j595142l378700j103929N28050M94625J269548J585016o03806
18869D8757590j09943M94887P2332N26590N79917j23025Q34910J014605P72651
18860E2820514R82284n17138o83123o57053j085570n78107j68623m17519J285275
18851E0980940J998681N39997n94657j304436o22495J242772J360394P9162j056270
18842E2624088r60116j267253O80473J941856n0344j352624q42174l61846L41340
18833E0753400n70206Q78279J757296P638m65178M85530K66672o15662K2614l52797
$$ plain form
18823 52167586 50203630 48423260 48633606 47631393 46374105 45795995 45129206 44751852 44269303
18814 44269303 44416080 47094700 49140030 49874888 51579684 53101606 52592856 51538300
18806 51538300 49968541 48725350 48010005 48070396 49045933 49828813 50427876 49495691 49669086
18797 49669086 48532132 46269579 46118008 47464114 48033325 47880277 47552578 47209942 47297812
18788 47297812 48139583 48845928 49143772 50579776 52118857 52264608 51356667 50989099 49692811
18779 49692811 48188533 48346237 49037154 48636830 49089782 49910013 50043148 50816974 51733064
18770 51733064 51977561 51965708 51836490 52163449 51731857 51017110 50802961 50225890 49472393
18761 49472393 48696322 49298964 51125083 51857596 50694088 50727822 51815421 51382742 50186693
$$ packed form
18823E2167586j963956j780370K10346j002213j257288n78110o66789l77354m82549
18814D4269303J46777K678620K045330P34858J704796J521922n08750j054556
18806E1538300j569759j243191p15345O0391R75537P82880N99063r32185J73395
18797D9669086j136954k262553j51571J346106N69211j53048l27699l42636Q7870
18788D7297812Q41771P06345K97844J436004J539081J45751r07941l67568j296288
18779D9692811j504278J57704O90917m00324M52952Q20231J33135P73826R16090
18770E1733064K44497j1853j29218L26959m31592p14747k14149n77071p53497
18761D9472393p76071O02642J826119P32513j163508L3734J087599m32679j196049
$$ plain form
18752 50186693 49399512 49800763 50673930 51567196 51998454 51841209 50638152 48956746 48718367
18743 48718367 49512465 50672021 51184288 50622001 51191606 50377195 48749222 48775131 49893297
18734 49893297 50147304 50033782 50561382 50620395 49648186 49029912 48787884 48218487 48344500
18725 48344500 48103654 47272487 48049786 48848058 50250806 50162103 48328506 46638398 44860995
18716 44860995 44573756 45443174 47108767 48562513 49880345 53096358 55352182 54101876
18708 54101876 53112208 53124016 52653529 52668066 53205609 53158307 52738007 51265083 49120372
18699 49120372 47041758 46632860 47869264 50145285 53049804 53715938 50900531 48142452
18691 48142452 47477954 47443764 48322009 48859963 49542526 49058392 47758948 47002888 47171353
$$ packed form
18752E0186693p87181M01251Q73167Q93266M31258j57245j203057j681406k38379
18743D8718367P94098J159556N12267n62287N69605q14411j627973K5909J118166
18734D9893297K54007j13522N27600N9013r72209o18274k42028n69397J26013
18725D8344500k40846q31167P77299P98272J402748q8703j833597j690108j777403
18716D4860995k87239Q69418J665593J453746J317832L216013K255824j250306
18708E4101876r89668J1808m70487J4537N37543m7302m20300j472924k144711
18699D9120372k078614m08898J236404K276021K904519O66134k815407k758079
18691D8142452o64498l4190Q78245N37954O82563m84134j299444p56060J68465
$$ plain form
18682 47171353 49298093 51278947 51544506 51423570 50432404 48304697 46768069 47447512 49305933
18673 49305933 50887229 50532303 49931439 50441805 50586400 49660322 48293198 47471112 47529380
18664 47529380 48010472 48344431 48934947 47928789 46468185 47344491 50442655 51567631 51233978
18655 51233978 51295349 52041287 52483978 52389084 52868374 52977282 52456358 51196774 51842494
18646 51842494 52448222 52431803 54051180 54546774 54847437 56877547 57005326 54256358 53180017
18637 53180017 52428196 50219854 48577836 49085728 50227281 51219052 52050570 53041684 52808137
18628 52808137 52292433 52033583 52542728 52089674 52621802 54932933 54425171 52854282 51997901
18619 51997901 52124178 51217251 49829700 49942326 51996197 53939403 54678474 55455434 57225371
$$ packed form
18682D7171353K126740J980854K65559j20936r91166k127707j536628O79443J858421
18673D9305933J581296l54926o00864N10366J44595r26078j367124q22086N8268
18664D7529380M81092L33959N90516j006158j460604Q76306L098164J124976l33653
18655E1233978O1371P45938M42691r4894M79290J08908n20924j259584O45720
18646E1842494O05728j6419J619377M95594L00663K030110J27779k748968j076341
18637E3180017p51821k208342j642018N07892J141553R91771Q31518R91114k33547
18628E2808137n15704k58850N09145m53054N32128K311131n07762j570889q56381
18619E1997901J26277r06927j387551J12626K053871J943206P39071P76960J769937
$$ plain form
18610 57225371 57365393 54946699 53509256 51876788 50077191 50456641 51676067 52311459
18602 52311459 51732950 51284157 51701825 51915337 51993642 52529851 52659293 49900556 47062076
18593 47062076 46321141 47390015 48930554 49458768 50544200 50858768 51265718 51875276 51375581
18584 51375581 50001812 49675630 50491413 51368383 53290032 54376477 54076650 53412859 51972295
18575 51972295 51756863 51350015 51279493 52622319 54220727 55890021 55666830 53923717 53458439
18566 53458439 54622475 53947705 52422575 52126951 51973407 50026458 49240246 50209828 51119927
18557 51119927 50855831 50644776 49941312 49158950 49339180 49556677 50228348 51312297 51551011
18548 51551011 50444493 49965117 51374793 52645500 52733410 53165201 54049918 53952770 52988863
$$ packed form
18610E7225371J40022k418694j437443j632468j799597L79450J219426O35392
18602E2311459n78509m48793M17668K13512P8305N36209J29442k758737k838480
18593D7062076p40935J068874J540539N28214J085432L14568M06950O09558m99695
18584E1375581j373769l26182Q15783Q76970J921649J086445k99827o63791j440564
18575E1972295k15432m06848p0522J342826J598408J669294k23191j743113m65278
18566E3458439J164036o74770j525130k95624j53544j946949p86212R69582R10099
18557E1119927k64096k11055p03464p82362J80230K17497O71671J083949K38714
18548E1551011j106518m79376J409676J270707Q7910M31791Q84717r7148r63907
$$ plain form
18539 52988863 51810866 52631610 53016255 53685827 53456858 50855523 48260746 47154353 45770746
18530 45770746 45413098 45789852 47880980 50760733 51880136 51397033 49450566 48389834
18522 48389834 49021098 50665836 51652998 51290540 50069944 49734643 50370420 50494595 48139853
18513 48139853 47644485 48074834 47698247 49830126 51079986 51244139 49559035 47757348 46892395
18504 46892395 47946314 49525495 50809683 51569341 51245556 50456259 51539878 52756294
18496 52756294 53130010 53401897 52280634 52449505 52858372 53624414 54981318 54745320 53572688
18487 53572688 52955634 52084113 51744165 52311017 51213405 50215213 50470717 51852720 52564265
18478 52564265 51762446 53371494 54277330 52643649 51872143 51910082 51574793 51526269 51679678
$$ packed form
18539E2988863j177997Q20744L84645O69572k28969k601335k594777j106393j383607
18530D5770746l57648L76754K091128K879753J119403m83103j946467j060732
18522D8389834O31264J644738R87162l62458j220596l35301O35777J24175k354742
18513D8139853m95368M30349l76587K131879J249860J64153j685104j801687q64953
18504D6892395J053919J579181J284188P59658l23785p89297J083619J216416
18496E2756294L73716K71887j121263J68871M08867P66042J356904k35998j172632
18487E3572688o17054q71521l39948N66852j097612r98192K55504J382003P11545
18478E2564265q01819J609048R05836j633681p71506L7939l35289m8524J53409
$$ plain form
18469 51679678 52022470 51127905 50713665 51551051 53065546 54095074 53943550 53154663 53826795
18460 53826795 55499847 55887931 55981430 55969803 55652708 55690040 54882348 55233583 55218347 55948530
18450 55948530 57842133 58197594 56551774 55393257 55904484 57184686 56850130 55066295
18442 55066295 53678962 53542215 54133671 54488533 54143080 53555372 54311502 55709813 55720611
18433 55720611 54070543 51799500 50611088 50890322 51292440 51284307 51210467 51281307 51089726
18424 51089726 51449260 51746919 51145333 50939495 52716866 53266181 52782271 51973997 52557524
18415 52557524 54323778 52954149 52386324 53338186 52630032 51880920 51179193 50477980 51304206
18406 51304206 52378971 52995078 53919144 55280313 54082828 51701104 50831094 49944360 50051884
$$ packed form
18469E1679678L42792q94565m14240Q37386J514495J029528j51524p88887O72132
18460E3826795J673052L88084R3499j1627l17095L7332q07692L51235j5236P30183
18450E5948530J893603L55461j645820j158517N11227J280202l34556j783835
18442E5066295j387333j36747N91456L54862l45453n87708P56130J398311J0798
18433E5720611j650068k271043j188412K79234M02118q133p3840P0840j91581
18424E1089726L59534K97659o01586k05838J777371N49315m83910q08274N83527
18415E2557524J766254j369629n67825R51862p08154p49112p01727p01213Q26226
18406E1304206J074765O16107R24066J361169j197485k381724q70010q86734J07524
$$ plain form
18397 50051884 51085753 51785702 51940226 52057016 52112987 51799139 51867918 50789365 48541307
18388 48541307 48130852 48995434 50231680 51470828 52218926 52689179 52997545 52317469 50938250
18379 50938250 50630713 51127723 50841691 51564635 52095894 51748144 51424610 50919965 49920156
18370 49920156 51092926 52332782 52022473 50993007 50970611 52348033 52785872 53264441 54219439
18361 54219439 54767836 54798923 53983442 54146781 55787045 56558100 55181194 53236988 52715725
18352 52715725 53642420 54381464 54347656 54149046 54063243 53643247 51580020 49734829 49840169
18343 49840169 50362363 50227667 50120969 49995196 50423596 51109022 51080698 50303884 51351046
18334 51351046 53689702 54587306 53611526 53707454 53434275 53179422 53131493 53289528 53177572
$$ packed form
18397E0051884J033869O99949J54524J16790N5971l13848O8779j078553k248058
18388D8541307m10455Q64582J236246J239148P48098M70253L08366o80076j379219
18379E0938250l07537M97010k86032P22944N31259l47750l23534n04645r99809
18370D9920156J172770J239856l10309j029466k2396J377422M37839M78569R54998
18361E4219439N48397L1087q15481J63339J640264P71055j376906j944206n21263
18352E2715725R26695P39044l3808j98610q5803m19996k063227j845191J05340
18343D9840169N22194j34696j06698j25773M28400O85426k8324p76814J047162
18334E1351046K338656Q97604r75780R5928k73179k54853m7929J58035j11956
$$ plain form
18325 53177572 52393459 51702431 51084553 49668527 50195147 50939571 50321700 49423709 49194950
18316 49194950 51012366 53000716 53281914 53719002 54198587 55188837 56248295 56740019 55644399
18307 55644399 53177860 52487652 54005164 54715839 54161446 53404740 53434217 54768479 55690035
18298 55690035 55634626 55410451 55186650 55721424 54980799 52521775 51140522 51199759 50993929
18289 50993929 52103868 54505299 55403004 54007247 53798310 53212863 51348152 51133147 51750894
18280 51750894 51884431 53126908 53106433 53456163 53475510 51253164 49859295 49153753 49690587
18271 49690587 52229065 54053580 53788914 52816558 51349365 50348661 49535005 50108851 52360048
18262 52360048 53377281 52417217 51064681 51451369 53630210 54654333 54159126 54220594 55155824
$$ packed form
18325E3177572p84113o91028o17878j416026N26620P44424o17871q97991k28759
18316D9194950J817416J988350K81198M37088M79585R90250J059458M91724j095620
18307E5644399k466539o90208J517512P10675n54393p56706K9477J334262R21556
18298E5690035n5409k24175k23801N34774p40625k459024j381253N9237k05830
18289E0993929J109939K401431Q97705j395757k08937n85447j864711k15005O17747
18280E1750894J33537J242477k0475L49730J9347k222346j393869p05542N36834
18271D9690587K538478J824515k64666r72356j467193j000704q13656N73846K251197
18262E2360048J017233r60064j352536L86688K178841J024123m95207O1468R35230
$$ plain form
18253 55155824 55406304 55045324 53750708 51997727 51182663 51600399 52193227 52200426 51603339
18244 51603339 50897978 51778876 54580018 55988357 54827523 53301733 51651370 50547386
18236 50547386 50758516 51448955 50336003 51040925 53501542 54923350 54059164 52207225 51657109
18227 51657109 51911237 53217133 54856448 57281419 58150374 55918134 52168321 49902572
18219 49902572 49199426 48618236 48886046 49723495 50127950 50712939 50229807 49781947 50175995
18210 50175995 51621456 52802891 53255287 53919518 54500948 55041087 55930188 56441441 56082216
18201 56082216 55840083 54880441 53065018 51538458 51335061 53005066 53644276 52238762 50997154
18192 50997154 49927280 50337187 50667612 51395692 53074018 52825685 51536001 51539171 52708446
$$ packed form
18253E5155824K50480l60980j294616j752981q15064M17736N92828P199n97087
18244E1603339p05361Q80898K801142J408339j160834j525790j650363j103984
18236E0547386K11130O90439j112952P04922K460617J421808q64186j851939n50116
18227E1657109K54128J305896J639315K424971Q68955k232240l749813k265749
18219D9902572p03146n81190K67810Q37449M04455N84989m83132m47860L94048
18210E0175995J445461J181435M52396O64231N81430N40139Q89101N11253l59225
18201E6082216k42133r59642j815423j526560k03397J670005O39210j405514j241608
18192E0997154j069874M09907L30425P28080J678326k48333j289684L170J169275
$$ plain form
18183 52708446 52775564 52263888 52447603 52195502 51881465 51436933 50913913 52190901 54848465
18174 54848465 56592730 56748826 55806463 55768022 56275332 54970532 51796196 50528918 51312299
18165 51312299 51567268 50034520 49002934 50068364 50449778 49878735 48762879 48077445 48678506
18156 48678506 50299444 51837517 53132613 53590472 53579827 50866221 49083128 51086012
18148 51086012 52652512 52093627 52410103 51991575 51841111 53275621 53050207 52534263 52991152
18139 52991152 53106197 52429055 53284845 54272367 54559661 54650492 54774804 55495291 55197826
18130 55197826 54479788 52872484 51383198 51485709 51686013 50444182 48900949 48553008 49151437
18121 49151437 48554359 49875857 51074890 51030119 50474893 49964689 48773812 48431941 49463443
$$ packed form
18183E2708446O7118n11676J83715k52101l14037m44532n23020J276988K657564
18174E4848465J744265J56096r42363l8441N07310j304800l174336j267278P83381
18165E1312299K54969j532748j031586J065430L81414n71043j115856o85434O01061
18156D8678506J620938J538073J295096M57859j0645k713606j783093K002884
18148E1086012J566500n58885L16476m18528j50464J434510k25414n15944M56889
18139E2991152J15045o77142Q55790R87522K87294R0831J24312P20487k97465
18130E5197826p18038j607304j489286J02511K00304j241831j543233l47941N98429
18121D9151437n97078J321498J199033m4771n55226n10204j190877l41871J031502
$$ plain form
18112 49463443 50804333 52645613 54026379 54155724 53782926 52966701 52493251 53218538 54661007
18103 54661007 55120582 54837203 53696539 53746188 53837128 54181006 56324029 57152609 56662709
18094 56662709 56815913 57106577 57989072 58637423 58691613 57555614 55160750 53341569 53419716
18085 53419716 54022648 54190215 53568004 52598198 50926655 49393931 49213581 50534571 51941683
18076 51941683 52388412 52537667 54275331 55179408 54185042 52688377 50657958 50135387 51374446
18067 51374446 53176895 53764483 52858175 50740510 50427262 51776777 53079411 52616698 51114453
18058 51114453 50718781 51649110 52602429 51793559 50863639 52101085 53986548 53503829 51818130
18049 51818130 50261008 49742720 50112927 51131281 50951202 49765585 49235824 49856660 51240698
$$ packed form
18112D9463443J340890J841280J380766J29345l72798q16225m73450P25287J442469
18103E4661007M59575k83379j140664M9649R0940L43878K143023Q28580m89900
18094E6662709J53204K90664Q82495O48351N4190j135999k394864j819181P8147
18085E3419716O02932J67567o22211r69806j671543j532724j80350J320990J407112
18076E1941683M46729J49255J737664R04077r94366j496665k030419n22571J239059
18067E1374446J802449N87588r06308k117665l13248J349515J302634m62713j502245
18058E1114453l95672R30329R53319q08870r29920J237446J885463m82719j685699
18049E1818130j557122n18288L70207J018354j80079j185617n29761O20836J384038
$$ plain form
18040 51240698 52814299 54624104 55561125 55441597 54953705 54864410 54236449 54013629 54830501
18031 54830501 54975550 53861339 51744982 49675863 49418635 50149753 51124663 51917908 51640878
18022 51640878 51109050 53260729 57155050 58000153 56728151 56035103 55775565 55381176 54976196
18013 54976196 55578468 57045255 56586951 56626456 57102737 54804647 53041207 54183457 56205670
18004 56205670 56795641 55390462 54482788 53781874 53048043 52505554 52489621 52541394 51710861
17995 51710861 51957594 52513575 51915938 51967474 53039616 53153568 52018004 50924070 51076464
17986 51076464 50369149 50179339 52719649 54048126 52963961 51112191 50635345 52769792
17978 52769792 52792195 52663320 54582365 55841741 55619318 55022117 54670969 55127630 55143433
$$ packed form
18040E1240698J573601J809805R37021j19528m87892q9295o27961k22820Q16872
18031E4830501J45049j114211k116357k069119k57228P31118R74910P93245k77030
18022E1640878n31828K151679L894321Q45103j272002o93048k59538l94389m04980
18013E4976196O02272J466787m58304L9505M76281k298090j763440J142250K022213
18004E6205670N89971j405179r07674p00914p33831n42489j5933N1773q30533
17995E1710861K46733N55981n97637N1536J072142J13952j135564j093934J52394
17986E1076464p07315j89810K540310J328477j084165j851770m76846K134447
17978E2769792K2403j28875J919045J259376k22423n97201l51148M56661J5803
$$ plain form
17969 55143433 54651906 53757593 54772727 55948064 56025863 56106082 57010891 56710477 54893846
17960 54893846 53354430 53522480 54456501 54969944 56203861 56305207 55672527 55202392 53804625
17951 53804625 53396771 53847682 55327269 56566883 56185944 54742746 53321156 52661404 52473003
17942 52473003 52540720 53739469 55173291 54580018 53481456 52082561 51528985 51434085 51191968
17933 51191968 51582540 51175807 52626984 54022292 52792211 50691148 50616072 51907494 52074404
17924 52074404 53405369 54782286 54326400 54580426 54972838 54332827 55124473 55054020 53886388
17915 53886388 52812500 51678618 51530620 51109308 51166947 51673038 51677065 52086691 53172223
17906 53172223 54006182 54303530 53975644 55001002 55883911 56820023 58025409 58691631 57947744
$$ packed form
17969E5143433m91527q94313J015134J175337P7799Q0219R04809l00414j816631
17960E4893846j539416J68050R34021N13443J233917J01346o32680m70135j397767
17951E3804625m07854M50911J479587J239614l80939j443198j421590o59752j88401
17942E2473003O7717J198749J433822n93273j098562j398895n53576r4900k42117
17933E1191968L90572m06733J451177J395308j230081k101063p5076J291422J66910
17924E2074404J330965J376917m55886K54026L92412o40011P91646p0453j167632
17915E3886388j073888j133882j47998m21312N7639N06091M027M09626J085532
17906E3172223Q33959K97348l27886J025358Q82909R36112J205386O66222p43887
$$ plain form
17897 57947744 57295355 58115287 58446619 57251389 57334381 57214941 56774136 56351613 55482709
17888 55482709 54895702 54472103 54800528 55228523 55303796 54714138 53158881 52595496 53486334
17879 53486334 54317816 53792868 52793501 52305060 52019030 51475828 52061434 53660543 55640631
17870 55640631 56279424 55857290 55065632 54151870 52272917 50901786 53027000 56138323 56993024
17861 56993024 56704710 56970294 56849976 56637397 56457845 59095052 60442318 59910933 58582226
17852 58582226 56580742 55332075 56192324 55915770 53998673 52246723 50437289 50881889
17844 50881889 52502808 54707226 56107720 55898625 54640128 52639009 51632566 52347090
17836 52347090 52784559 54369332 55786266 56013491 55664440 55214418 55617193 55483143 53915228
$$ packed form
17897E7947744o52389Q19932L31332j195230Q2992j19440m40805m22523q68904
17888E5482709n87007m23599L28425M27995P5273n89658j555257n63385Q90838
17879E3486334Q31482n24948r99367m88441k86030n43202N85606J599109J980088
17870E5640631O38793m22134p91658r13762j878953j371131K125214L111323Q54701
17861E6993024k88314K65584j20318k12579j79552K637207J347266n31385j328707
17852E8582226k001484j248667Q60249k76554j917097j751950j809434M44600
17844E0881889J620919K204418J400494k09095j258497k001119j006443P14524
17836E2347090M37469J584773J416934K27225l49051m50022M02775j34050j567915
$$ plain form
17827 53915228 53418813 55522203 56283300 55645179 54641406 53713115 52657097 52392635 54412642
17818 54412642 56015265 55945431 54184409 52833042 52831297 52180766 52154354 52192320 52470650 51851974
17808 51851974 51201522 51601124 51366251 49428527 49392721 51597558 53998786 55854147 57210331
17799 57210331 58971959 57774903 55873136 56129417 56697518 56329431 55586380 54031940 52179176
17790 52179176 50817959 50662272 51859432 54419158 57140994 56963110 54843469 54642908
17782 54642908 55261460 55324966 55246825 56208620 56792089 56047594 53749617 52370543 52068706
17773 52068706 53204325 54063600 53667410 53063235 51613419 50659237 49653168 48238698 48041562
17764 48041562 48571929 49147466 50890803 52662438 54326528 55995800 56361615 56217188 55800325
$$ packed form
17827E3915228m96415K103390P61097o38121j003773r28291j056018k64462K020007
17818E4412642J602623o9834j761022j351367j745o50531k6412L7966K78330o18676
17808E1851974o50452L99602k34873j937724l5806K204837K401228J855361J356184
17799E7210331J761628j197056j901767K56281N68101l68087p43051j554440j852764
17790E2179176j361217j55687J197160K559726K721836j77884k119641k00561
17782E4642908O18552O3506p8141R61795N83469p44495k297977j379074l01837
17773E2068706J135619Q59275l96190o04175j449816r54182j006069j414470j97136
17764D8041562N30367N75537J743337J771635J664090J669272L65815j44427m16863
$$ plain form
17755 55800325 55932180 55308151 54066317 54562062 53965868 53583649 54217093 53869534 53553439
17746 53553439 54225585 55215059 54905509 54543573 54135346 53415128 55089459 58260568 60134378
17737 60134378 60748036 60005409 59163229 57489219 55416371 54243215 53688082 52831917 53161451
17728 53161451 54201967 54244259 55800803 57526891 57873387 57458500 56192582 54592510 54318222
17719 54318222 53242364 52575003 53653675 54265811 53657768 54467422 55836615 56510517 55611840
17710 55611840 53515490 51490311 50397174 51709405 53243937 52752615 52520125 53168840
17702 53168840 55029753 55623082 55881591 56760501 56157497 56012280 56563053 56882333 56864358
17693 56864358 55484856 54679875 54268535 53666622 53978847 54735826 54390090 53616007 53156085
$$ packed form
17755E5800325J31855o24029j241834M95745n96194l82219O33444l47559l16095
17746E3553439O72146R89474l09550l61936m08227p20218J674331L171109J873810
17737F0134378O13658p42627q42180j674010k072848j173156n55133q56165L29534
17728E3161451J040516M2292J556544J726088L46496m14887j265918j600072k74288
17719E4318222j075858o67361J078672O12136o08043Q09654J369193O73902q98677
17710E5611840k096350k025179j093137J312231J534532m91322k32490O48715
17702E3168840J860913N93329K58509Q78910o03004j45217N50773L19280j7975
17693E6864358j379502q04981m11340o01913L12225P56979l45736p74083m59922
$$ plain form
17684 53156085 53746789 55399178 55653448 56464859 57737365 58153909 57911954 57177161 55752422
17675 55752422 54977827 54858386 53635038 53454780 54260707 55161657 54656770 53096634 52123051
17666 52123051 52586298 53498285 54282765 55867876 56389074 55667009 54630973 53784730 53361425
17657 53361425 54469520 56825747 57594451 56477227 55498119 56302716 56428498 56199877 55492915
17648 55492915 53349427 52353845 54379298 55893454 55586855 54741616 54452532 53319504 52366929
17639 52366929 51990571 51901096 51722623 51795763 52330092 52928031 53244128 53456056 53366270 53689701
17629 53689701 52692100 49662265 49659634 51568418 52292416 53529291 53234871 51790290 52242117
17620 52242117 51927999 51631387 52893842 53574999 54305345 54582225 54726657 54630794 54316041
$$ packed form
17684E3156085N90704J652389K54270Q11411J272506M16544k41955p34793j424739
17675E5752422p74595j19441j223348j80258Q05927R00950n04887j560136r73583
17666E2123051M63247R11987P84480J585111N21198p22065j036036q46243m23305
17657E3361425J108095K356227P68704j117224r79108Q04597J25782k28621p06962
17648E5492915k143488r95582K025453J514156l06599q45239k89084j133028r52575
17639E2366929l76358q9475j78473P3140N34329N97939L16097K11928q9786L23431
17629E3689701r97601l029835k631J908784P23998J236875k94420j444581M51827
17620E2242117l14118k96612J262455O81157P30346K76880J44432r5863l14753
$$ plain form
17611 54316041 53269070 53109774 54349340 53177929 51083847 50959489 53347438 55181266
17603 55181266 54843484 54246692 54065380 53589945 53045666 52461692 53064558 53862939 52983765
17594 52983765 52749180 52250292 51680557 51342784 51860845 51902194 52325965 53389385 54388452
17585 54388452 55313257 55120985 55553481 55637867 54609496 54903075 56568581 56808501 56525864
17576 56525864 56311994 55544809 54102039 53471002 54977149 56460482 56411265 55402981 55631843
17567 55631843 56736813 57719003 58688560 59171981 59827627 58014383 55909988 55397172 56131060
17558 56131060 56162293 54310065 53137266 53665003 53794455 54173897 54199420 53815957 52893937
17549 52893937 52120594 52390400 52458707 52310147 52645589 52436273 51901002 51233047 51799066
$$ packed form
17611E4316041j046971j59296J239566j171411k094082j24358K387949J833828
17603E5181266l37782n96792j81312m75435n44279n83974O02866P98381q79174
17594E2983765k34585m98888n69735l37773N18061M1349M23771J063420R99067
17585E4388452R24805j92272M32496Q4386j028371K93579J665506K39920k82637
17576E6525864k13870p67185j442770o31037J506147J483333m9217j008284K28862
17567E5631843J104970R82190R69557M83421O55646j813244k104395n12816P33888
17558E6131060L1233j852228j172799N27737J29452L79442K5523l83463r22020
17549E2893937p73343K69806O8307j48560L35442k09316n35271o67955N66019
$$ plain form
17540 51799066 52386716 52114616 51923420 52094085 52458413 52465044 52908089 54122492 55764471
17531 55764471 55913294 54182797 53151887 54305780 55638354 55222008 55064925 54142384 54084942
17522 54084942 53770525 52421635 51973472 52551838 53323906 53976686 54690991 54965111 54985165
$$ packed form
17540E1799066N87650k72100j91196J70665L64328O631M43045J214403J641979
17531E5764471J48823j730497j030910J153893J332574m16346j57083r22541n7442
17522E4084942l14417j348890m48163N78366P72068O52780P14305K74120K0054
$$ [...]
##END NTUPLES=NMR SPECTRUM
##END=
