##TITLE=C13_SA_33.156
 CDCl3, 22550 sc

 21.11.2019
##JCAMPDX= 6.0         $$ Bruker NMR JCAMP-DX V2.0
##DATA TYPE= NMR SPECTRUM
##DATA CLASS= NTUPLES
##ORIGIN= UXNMR, Bruker Analytische Messtechnik GmbH
##OWNER= root
$$ XWIN-NMR		Version 3.5
$$ Fri Nov 22 13:43:47 2019 Russian Standard Time (UT+4h)  she@DPX200
##.OBSERVE FREQUENCY= 50.327896
##.OBSERVE NUCLEUS= ^13C
##.ACQUISITION MODE= SIMULTANEOUS
##.ACQUISITION SCHEME= undefined
##.AVERAGES= 22550
##.DIGITISER RES= 17
##SPECTROMETER/DATA SYSTEM= spect
##.PULSE SEQUENCE= zgpg30
##.SOLVENT NAME= DMSO
##.SHIFT REFERENCE= (INTERNAL, DMSO, 0, 222.624)
##AUDIT TRAIL= $$ (NUMBER, WHEN, WHO, WHERE, WHAT)
$$ ##TITLE= Audit trail, XWIN-NMR		Version 3.5
$$ ##JCAMPDX= 5.01
$$ ##ORIGIN= Bruker BioSpin GmbH
$$ ##OWNER= she
$$ F:/spectra/data/she/nmr/c13/1/pdata/1/auditp.txt
$$ ##AUDIT TRAIL=  $$ (NUMBER, WHEN, WHO, WHERE, WHAT)
(   1,<2019-11-22 13:41:51.95 +0400>,<she>,<DPX200>,
      <created by zg, POWCHK disabled, PULCHK disabled
       terminated by command 'halt'
       configuration hash MD5:
       00 E9 B6 7A A2 85 ED C7 34 08 36 98 17 FE 4E 26
       data hash MD5: 32K
       5C E6 10 54 1A C3 4E 96 29 08 69 16 CE DB 58 34>)
(   2,<2019-11-22 13:41:54.71 +0400>,<she>,<DPX200>,
      <Start of raw data processing
       efp BC_mod = 2 LB = 1 FT_mod = 6 PKNL = 1 PHC0 = -259.1645 PHC1 = 71.20636 SI = 32K 
       data hash MD5: 32K
       6D B5 DB EE 32 3F 0B A9 27 9D 6A A7 11 93 D3 90>)
(   3,<2019-11-22 13:42:04.29 +0400>,<she>,<DPX200>,
      <abs ABSG = 5 
       data hash MD5: 32K
       28 05 AF B2 F4 22 45 8F 1F D8 90 AB 8B EE F9 01>)
(   4,<2019-11-22 13:42:57.18 +0400>,<she>,<DPX200>,
      <pk PHC0 = 23.49175 PHC1 = -34.80001 
       data hash MD5: 32K
       FC 97 68 D3 57 58 E9 A3 3B 55 B3 3B E0 16 F1 B7>)
(   5,<2019-11-22 13:43:00.59 +0400>,<she>,<DPX200>,
      <abs ABSG = 5 
       data hash MD5: 32K
       C9 07 AC 13 EA 6C F0 8F D5 DC 38 54 D6 9E 3F F5>)
$$ ##END=
$$ 
$$ hash MD5
$$ A6 9B EC D8 D5 D8 09 66 B2 EC 73 DF 0A 2C 41 02
##$RELAX= 
##$RELAX= 
##$RELAX= 
##$RELAX= 
##$RELAX= 
##$RELAX= 
##$RELAX= 
##$RELAX= 
$$ Bruker specific parameters
$$ --------------------------
##$DU= <F:/spectra>
##$EXPNO= 1
##$NAME= <c13>
##$PROCNO= 1
##$TYPE= <nmr>
##$USER= <she>
##$AMP= (0..31)
100 100 100 100 100 100 100 100 100 100 100 100 100 100 100 100 100 100 
100 100 100 100 100 100 100 100 100 100 100 100 100 100 
##$AQSEQ= 0
##$AQ_mod= 1
##$AUNM= <au_zg>
##$AUTOPOS= <>
##$BF1= 50.322709
##$BF2= 200.13
##$BF3= 50.322709
##$BF4= 500.13
##$BF5= 500.13
##$BF6= 500.13
##$BF7= 500.13
##$BF8= 500.13
##$BYTORDA= 1
##$CFDGTYP= 0
##$CFRGTYP= 5
##$CHEMSTR= <none>
##$CNST= (0..31)
1 1 145 1 1 1 1 1 1 1 1 1 1 1 1 1 1 1 1 1 1 1 1 1 1 1 1 1 1 1 1 1 
##$CPDPRG= <waltz16>
##$CPDPRG1= <>
##$CPDPRG2= <waltz16>
##$CPDPRG3= <>
##$CPDPRG4= <mlev>
##$CPDPRG5= <mlev>
##$CPDPRG6= <mlev>
##$CPDPRG7= <mlev>
##$CPDPRG8= <mlev>
##$CPDPRGB= <>
##$CPDPRGT= <>
##$D= (0..31)
$$ [...]
##$SUBNAM4= <"">
##$SUBNAM5= <"">
##$SUBNAM6= <"">
##$SUBNAM7= <"">
##$SUBNAM8= <"">
##$SUBNAM9= <"">
##$SW= 239.972175391363
##$SWIBOX= (0..15)
0 1 3 0 0 0 0 0 0 0 0 0 0 0 0 0 
##$SW_h= 12077.2946859903
##$TD= 32768
##$TD0= 1
##$TE= 0
##$TE2= 300
##$TE3= 300
##$TEG= 300
##$TL= (0..7)
120 120 120 120 120 120 120 120 
##$TP= (0..7)
150 150 150 150 150 150 150 150 
##$TP07= 0
##$TPNAME0= <>
##$TPNAME1= <>
##$TPNAME2= <>
##$TPNAME3= <>
##$TPNAME4= <>
##$TPNAME5= <>
##$TPNAME6= <>
##$TPNAME7= <>
##$TPOAL= (0..7)
0.5 0.5 0.5 0.5 0.5 0.5 0.5 0.5 
##$TPOFFS= (0..7)
0 0 0 0 0 0 0 0 
##$TUNHIN= 0
##$TUNHOUT= 0
##$TUNXOUT= 0
##$USERA1= <user>
##$USERA2= <user>
##$USERA3= <user>
##$USERA4= <user>
##$USERA5= <user>
##$V9= 5
##$VALIST= <valist>
##$VCLIST= <CCCCCCCCCCCCCCC>
##$VD= 0
##$VDLIST= <DDDDDDDDDDDDDDD>
##$VPLIST= <PPPPPPPPPPPPPPP>
##$VTLIST= <TTTTTTTTTTTTTTT>
##$WBST= 1024
##$WBSW= 4
##$XGAIN= (0..3)
0 0 0 0 
##$XL= 0
##$YL= 0
##$YMAX_a= 104763635
##$YMIN_a= -141878990
##$ZGOPTNS= <>
##$ZL1= 120
##$ZL2= 120
##$ZL3= 120
##$ZL4= 120
##$ABSF1= 222.624
##$ABSF2= -17.3728
##$ABSG= 5
##$ABSL= 3
##$ALPHA= 0
##$AQORDER= 0
##$ASSFAC= 0
##$ASSFACI= 0
##$ASSFACX= 0
##$ASSWID= 0
##$AUNMP= <proc_1d>
##$AZFE= 0.1
##$AZFW= 0.5
##$BCFW= 0
##$BC_mod= 2
##$BYTORDP= 0
##$COROFFS= 0
##$CY= -3
##$DATMOD= 1
##$DC= 0
##$DFILT= <>
##$DTYPP= 0
##$F1P= 0
##$F2P= 0
##$FCOR= 0.5
##$FTSIZE= 32768
##$FT_mod= 6
##$GAMMA= 0
##$GB= 0
##$INTBC= 1
##$INTSCL= 4.134877e-10
##$ISEN= 128
##$LB= 1
##$LEV0= 0
##$LPBIN= 0
##$MAXI= 10000
##$MC2= 0
##$MEAN= 0
##$ME_mod= 0
##$MI= 0.1934396
##$NCOEF= 0
##$NC_proc= 3
##$NLEV= 6
##$NOISF1= 120.0001
##$NOISF2= 80.00006
##$NSP= 0
##$NTH_PI= 0
##$NZP= 0
##$OFFSET= 222.624
##$PC= 1.4
##$PHC0= -235.6727
##$PHC1= 36.40635
##$PH_mod= 1
##$PKNL= yes
##$PPARMOD= 0
##$PSCAL= 0
##$PSIGN= 0
##$REVERSE= no
##$SF= 50.3227315989248
##$SI= 32768
##$SIGF1= 140
##$SIGF2= 120
##$SINO= 11.81781
##$SIOLD= 32768
##$SREGLST= <13C.CDCl3>
##$SSB= 0
##$STSI= 32768
##$STSR= 0
##$SW_p= 12077.2946859903
##$SYMM= 0
##$S_DEV= 0
##$TDeff= 32768
##$TDoff= 0
##$TI= <>
##$TILT= no
##$TM1= 0
##$TM2= 0
##$TOPLEV= 0
##$USERP1= <user>
##$USERP2= <user>
##$USERP3= <user>
##$USERP4= <user>
##$USERP5= <user>
##$WDW= 1
##$XDIM= 32768
##$YMAX_p= 269637802
##$YMIN_p= -1227474
$$ End of Bruker specific parameters
$$ ---------------------------------
##NTUPLES= NMR SPECTRUM
##VAR_NAME=  FREQUENCY,     SPECTRUM/REAL,   SPECTRUM/IMAG
##SYMBOL=    X,             R,               I
##VAR_TYPE=  INDEPENDENT,   DEPENDENT,       DEPENDENT
##VAR_FORM=  AFFN,          ASDF,            ASDF
##VAR_DIM=   32768,         32768,           32768
##UNITS=     HZ,            ARBITRARY UNITS, ARBITRARY UNITS
##FACTOR=    0.368581032318806, 1,           1
##FIRST=     11203.0474431902, 0,            0
##LAST=      -874.247242800138, 0,           0
##MIN=       -874.247242800138, -1227474,    0
##MAX=       11203.0474431902, 269637802,    0
$$ Real data points
##PAGE= N=1
##DATA TABLE= (X++(R..R)), XYDATA
$$ [...]
15875a98753k8129J50120K23178j0500k9472n0446j24478j6252Q3661J01109R4360
15864A94398J08142q3618K082l9512k51213k17275l9186o824l4371j7672j7943
15853d02992J89830K21868N1864J96124K944o8778O2717N9109L7587r1740q8082
15842A70451P1565k8352q9558J28135l5959j44335p1933m4076r6077L9467J34936
15831C4264P3070j18908k48706q8334m2298P3362R2508o6361r573P7037K34196
15820A0257K03041O0946L5504L5256M337q2621j45415j69158k37297o3175J22449
15809b25876K06232P1613q5466n4991J38031J39588J8783K0651J01550R509j67024
15798A72600q8337j78979j76236k5879N6344J832L9170J43437K65610K5314k56895
$$ plain form
15875 -198753 -226882 -76762 146416 135916 106444 55998 -68480 -84732 -1071 100038 194398
15864 194398 302540 218922 221004 181492 -69721 -286996 -326182 -333006 -367377 -385049 -402992
15853 -402992 -213162 8706 60570 256694 259638 190860 253577 312686 350273 258533 170451
15842 170451 242016 213664 124106 252241 216282 71947 14 -44062 -140139 -100672 34264
15831 34264 107334 -11574 -260280 -348614 -390912 -317550 -225042 -291403 -300976 -223939 10257
15820 10257 213298 274244 309748 345004 349341 266720 121305 -47853 -285150 -348325 -225876
15809 -225876 -19644 51969 -33497 -88488 49543 189131 207914 228565 330115 339624 172600
15798 172600 84263 -94716 -270952 -296831 -240487 -238655 -199485 -56048 209562 234876 -22019
15787b2019j77947J68706K10098Q0121M2840M2100J1299M9990m1310N0151P5590
15776D89619j04680k19850l48077j13688p2785j51094J0999J25059J41217J09215
15766a34065K62577J55991l8508j78453j62981l1673n4008j11219j97395r2060
15756e81794o4928M5014J10397J54053J43467n4554j48021O3151K01196J58273
15746B6254J67054J24834k6416M5029j4842p7063M2347j6356r3321r271J35284
15735C03533K2324j04768j6235j5917L2261l8304n5461P2929o919N9999L1162
15724B84604R832P8266j16225l15931l8339K4278m2330J24564O3408O2669L5676
15713A70472j84933k36587j52348j27013m4332j17481j29562j21946M8964K01827
$$ plain form
15787 -22019 -199966 -31260 178838 258959 301799 343899 355198 405188 363878 414029 489619
15776 489619 384939 165089 -182988 -296676 -369461 -520555 -509556 -384497 -243280 -134065
15766 -134065 128512 284503 245995 67542 -95439 -127112 -181120 -292339 -489734 -581794
15756 -581794 -646722 -601708 -491311 -337258 -193791 -248345 -396366 -333215 -132019 26254
15746 26254 193308 318142 291726 336755 321913 244850 287197 270841 177520 168249 303533
15735 303533 325857 221089 204854 188937 221198 182894 127433 200362 193443 253442 284604
15724 284604 294436 372702 256477 -59454 -97793 -73515 -115845 8719 72127 134796 170472
15713 170472 -14461 -251048 -403396 -530409 -574741 -692222 -821784 -943730 -894766 -692939
15703f92939L97823L62932o8816j77601J3792J92021L607j57916l077J28223Q0939
15692G8988Q9795J86581Q9997j9309j06190j69165k1581L7702o8932p6524o2089
15681d0727m1217m513j04040p085l622J14475J45817J75101j17105l81013k26191
15670d90120n2743L8196O6790J7759R2391J17299J40595K5569R0770o2174j44647
15659a60315K5008r0806j39149J00316J07556J43426J68788J51981J92028O4486
15649E63319k75203k02811P1732j43909j54753o7318O1106j3787J4420O2999J80957
15638I6752J52066M5428p4490r1381j6831L4160j9662j64077j57387M6221J64191
15627A4990J24126l5224K1200R3750j39634k84794r085J53288j4757j79175j70026
$$ plain form
15703 -692939 -295116 67816 -1000 -178601 -164809 27212 30819 -127097 -130174 -1951 78988
15692 78988 168783 355364 445361 426052 319862 150697 129116 166818 97886 21362 -40727
15681 -40727 -81944 -86457 -190497 -197582 -201204 -86729 59088 234189 117084 -263929 -490120
15670 -490120 -542863 -504667 -437877 -420118 -327727 -210428 -69833 -44264 46506 -15668 -160315
15659 -160315 -135307 -226113 -365262 -264946 -157390 -13964 154824 306805 498833 563319
15649 563319 288116 85305 157037 13128 -141625 -208943 -147837 -161624 -147204 -84205 96752
15638 96752 248818 294246 219756 128375 111544 145704 126042 -38035 -195422 -149201 14990
15627 14990 139116 103892 125092 218842 79208 -205586 -214671 -61383 -76140 -255315 -425341
15616d25341j73022j26884N7436Q0374K6737J25310P5785K4347K44896K63915
15606A73553J7580k13001k38220l36541j95046J42375K18402R8002L5000J76457
15596a21439J89938Q3765j32418k47393R6958M51462Q9476k85624k66576j86274
15586c28125J27605L09371J67310k602r714j82420k42475j21506O2963J66571
15576e3022K1234p285k334R5627j98831j59235n3489j42446j27212k9387J58418
15565d97962J54402R1065K3185r5303j77803j53197k38251k88716J98742M79190
15555e04648K15488J50770R1831j19426j188K8481k4349N9555R1383J25490j3801
15544I9586K5063N7326k74596p2720J59384K13228J82514j02002k66734J1341
$$ plain form
15616 -425341 -598363 -725247 -667811 -587437 -560700 -435390 -359605 -335258 -90362 173553
15606 173553 191133 -21868 -260088 -596629 -791675 -649300 -430898 -332896 -297896 -121439
15596 -121439 68499 152264 19846 -227547 -130589 320873 410349 124725 -141851 -328125
15586 -328125 -200520 108851 276161 273559 263845 81425 -161050 -282556 -219593 -53022
15576 -53022 -31788 -39073 -41407 54220 -144611 -303846 -357335 -499781 -626993 -656380 -497962
15565 -497962 -343560 -252495 -229310 -324613 -502416 -655613 -893864 -1182580 -983838 -504648
15555 -504648 -289160 -138390 -46559 -165985 -167173 -138692 -163041 -103486 -12103 113387 99586
15544 99586 124649 181975 -92621 -165341 -5957 207271 389785 287783 21049 32390
15534C2390K28884Q4544r8271k34170j70843j61662l5397n4223j01617K8749J13741
15523c67875J73553j18221j50551K3436J41317J20676Q041Q7853L14495K49565
15513D82289j01432m3946R5014m3418P3743J62862p4435l35095k95829p4877J34277
15502b0847K55116N6623j72410p9379P9725R9567p702J39315L5643j27789k22643
15491C5219j00849K8350N2964K22596M513j03599l04580l24625l5656N8026R2142
15480c75499J39002Q9183L4009j79020q9508k1697M2223R5727r9100j48024R784
15469e02920J9341N5214j5719k34146j72094K35518J96659K8880k9064k37440
15459f55771j23577K91585M02356J40398n9242j5657l0891m9859l1291n588r853
$$ plain form
15534 32390 261274 345818 247547 13377 -157466 -319128 -354525 -408748 -510365 -481616 -367875
15523 -367875 -194322 -312543 -463094 -439658 -298341 -177665 -169624 -81771 232724 482289
15513 482289 380857 336911 431925 388507 462250 625112 550677 215582 -80247 -155124 -20847
15502 -20847 234269 290892 118482 39103 118828 218395 210693 350008 385651 257862 35219
15491 35219 -65630 -37280 15684 238280 242793 139194 -165386 -490011 -525667 -467641 -375499
15480 -375499 -236497 -147314 -113305 -292325 -381833 -403530 -361307 -265580 -364680 -512704 -502920
15469 -502920 -483579 -428365 -444084 -678230 -850324 -614806 -418147 -389267 -418331 -655771
15459 -655771 -779348 -487763 -85407 54991 -4251 -19908 -50799 -100658 -131949 -137537 -147390
15448a47390J73078L24215Q1231k89191j15595o8036j15560J33949K43237L3653
15438B53591j37105j31124j27267l3050N9675J59583o256j14026j22020N2344
15428a45655K09026J44081J56888J20560j67972k09755j44798k5425R6463q219
15418B5194q6600k7858K9425M5917J48540Q6436P4357R1274O7525j03475l59904
15407i169j70032J1415l1127q107N3015o6983r9472j36928J5209K42743J97667
15396a769K45j17520r8838J85349K47607O7504L5382l9298M1963m6565j50408
15385A23652k68355M2365K79538J6437j34484j2647j27638k05995q7178J81531
15375a92774K99356J16883J31690J19564j78754j99294K0724L6272k51439k21126
$$ plain form
15448 -147390 25688 349903 431134 141943 26348 -41688 -157248 -23299 219938 253591
15438 253591 116486 -14638 -141905 -174955 -115280 44303 38047 -75979 -197999 -145655
15428 -145655 63371 207452 364340 484900 316928 107173 -37625 -63050 33413 25194
15418 25194 -61406 -89264 -59839 -13922 134618 221054 295411 386685 454210 350735 -9169
15407 -9169 -179201 -167786 -198913 -207020 -154005 -220988 -320460 -457388 -442179 -199436 -1769
15396 -1769 -1524 -119044 -217882 -32533 215074 282578 317960 278662 320625 274060 123652
15385 123652 -144703 -102338 177200 193637 59153 46506 -81132 -287127 -374305 -192774
15375 -192774 106582 223465 355155 474719 295965 96671 117395 153667 -97772 -318898
15365c18898N7996Q1769J08503J10883Q5016q4045j68840r3755J24988J55486
15355E9103J1915j26145k663O207j19833P6022Q9693J3921o2377j52354n9801
15344b66312O6170L3347L5986J73935M0053k3591o6267K4119o9674k20948j58294
15333d31476J7016J11721J8988R488R1989L3459J07696J11786K4620l0674p9154
15322a4541Q3490K79527K50955p3232o5809M0272r0300j69267l19896k02172j36871
15311d17844q5054J35796J74941J85284K01569Q3905O2073Q23j06650k39170j99340
15300b03667j9075J38028J03845Q847K06775J13114J1208k10159j23028n0587
15290b4699M0992K05948J44651J79600Q1465j80841j64525k1849J91521O4341
$$ plain form
15365 -318898 -260902 -179133 -70630 40253 125269 41224 -127616 -221371 -96383 59103
15355 59103 71018 -55127 -57790 -51583 -171416 -95394 -5701 8220 -54157 -206511 -266312
15344 -266312 -200142 -166795 -130809 43126 83179 59588 -6679 17440 -52234 -273182 -431476
15333 -431476 -414460 -302739 -283751 -274263 -182274 -148815 -41119 70667 95287 64613 -14541
15322 -14541 68949 348476 599431 526199 460390 500662 410362 241095 -78801 -280973 -417844
15311 -417844 -502898 -367102 -192161 -6877 194692 278597 340670 341493 234843 -4327 -203667
15300 -203667 -222742 -84714 19131 27978 234753 347867 359075 148916 25888 -24699
15290 -24699 16293 222241 366892 546492 627957 447116 282591 260742 452263 516604
15280E16604k33816k84273j09248K8573J9938m7088K7416O8549m689M842R2980
15269G9788O8087L481M7237P2918p0615M6551K22686m1284k04207m7108M0584
15258B18118m2689l2280J3665o9715L4314J86501J74659j4172j01294k1740o939
15247C38428j29593j9380l5881j33675n196K3836k5990k8464J99096P2651O1868
15236C17700J27996P7402J73299j9345j90778j93614j57915r2328p6094N1205
15226A7528j06292q2970J45352M3610k19183j66181j8004J53341L28120J0555
15216A05876l1467j15043k81492q4565J52677R0334L4020R7786O6586r3991j29288
15205a88567p3668j87507j15415K6669J1165J02238J30986n9460q0626p918j14060
$$ plain form
15280 516604 282788 -1485 -110733 -82160 -62222 -109310 -81894 -13345 -18034 -13192 79788
15269 79788 147875 151356 198593 271511 200896 247447 470133 428849 224642 177534 218118
15258 218118 175429 143149 156814 87099 121413 307914 482573 468401 367107 345367 338428
15247 338428 208835 189455 153574 19899 14703 38539 12549 -15915 183181 255832 317700
15236 317700 445696 523098 696397 677052 486274 292660 134745 42417 -33677 17528
15226 17528 -88764 -171734 -26382 17228 -201955 -368136 -386140 -232799 95321 105876
15216 105876 74409 -40634 -322126 -406691 -254014 -163680 -129660 -31874 34712 -59279 -188567
15205 -188567 -262235 -449742 -565157 -538488 -527323 -425085 -294099 -353559 -434185 -442103 -556163
15194e56163k2694J55460J22225J84466R8356J36921K06762J06986k96098l47132
15184b10911L0224J3940m02K4777j1684n4468N5575L41858J59088j42774j85879
15173A9344j2924p8039l3428L9901q857j02798m8954p766O6065Q5833O3792j01024
15161a18855M970j69028l6213K02890L35438K61393k05797k89910j62786K7066
15151a50832J12989o187j55491j1890N5485L9659o434J10793J9541O6863J01376
15140A75872j54029j83747P3064R9107k48552j27530K76705K06014j20118j69666
15130a72880K952P3263O4022J20501Q8698K600R5180P5467L3032j89933k22198
15119b9296P1051L09692L1497k38826o0243J15493J6232j66549k38089k54033
$$ plain form
15194 -556163 -578857 -423397 -301172 -116706 -18350 118571 325333 432319 136221 -210911
15184 -210911 -180687 -166747 -167149 -142372 -154056 -208524 -152949 188909 347997 205223 19344
15173 19344 6420 -71619 -105047 -65146 -74003 -176801 -225755 -233521 -167456 -81623 -17831 -118855
15161 -118855 -113885 -282913 -319126 -116236 219202 480595 274798 -15112 -177898 -150832
15151 -150832 -37843 -44030 -199521 -211411 -155926 -116267 -122701 -11908 7633 74496 175872
15140 175872 21843 -161904 -88840 10267 -238285 -365815 -89110 116904 -3214 -172880
15130 -172880 -169928 -96665 -32643 87858 176556 179156 274336 349803 382835 192902 -29296
15119 -29296 41755 351447 382944 144118 83875 199368 215600 49051 -189038 -443071
15109d43071o7750j38489m6836K94536K67711J21571J68939N9609k23009k92827
15099b99616l9484K04605J15328r1240J3753J17506M0167l9256j23912r4154K0425
15088a75878R8447Q6907N3015K8937O1546J56372L9053j14625j12622k7626l0050
15077F3476k23524m1922O4783r6661j16094p0629m6204r1177J95544M39226J60963
15066B37781o0710l4998k5346j37558O0013L4678j67584k50775m8885J56248r0870
15055c28006l76030l22915j9766J71317R9581J19402J21242J89852K74336L09455
15045B38468M21266J9260l08996k16278L508J80982R9040J8491K935N7968K5266
15034E41910j69321k41822j00006j3021R9190k5424l0436K3842M9032K7168j57580
$$ plain form
15109 -443071 -510821 -649310 -696146 -401610 -133899 -12328 156611 216220 -6789 -299616
15099 -299616 -339100 -134495 -19167 -110407 -96654 20852 61019 21763 -102149 -196303 -175878
15088 -175878 -77431 9476 62491 91428 152974 309346 348399 233774 121152 93526 63476
15077 63476 -160048 -201970 -137187 -233848 -349942 -420571 -466775 -557952 -362408 76818 237781
15066 237781 177071 142073 116727 -20831 39182 73860 -93724 -344499 -393384 -237136 -328006
15055 -328006 -704036 -1026951 -1046717 -875400 -775819 -656417 -535175 -345323 -70987 238468
15045 238468 659734 678994 369998 153720 157228 338210 437250 455741 458676 516644 541910
15034 541910 372589 130767 30761 17740 116930 91506 61070 84912 133944 161112 3532
15023C532p0961L5234Q5476K75556J02550j93009k76322O0208J56909q0811J01388
15012A99750L5820j27644J7145j06204O3473L0783j01012J74855J51143O7602
15002D05711J15606j6174k34992j26378j81640j49226j546J9357j92249N6339
14992c05192K99425M3656m15796k15508J23617K63203J63772o2055q4116J43400
14982d5594K94957Q2793k15922k45437o5227o0280l4370R4868R1641O0346K09623
14971A67398J48935O9771j6055r6653n8479q477n3305k0766p5567j26063J44171
14960G4910L53400L53331K4112l36558j91444L9980K6827j02812k3424l76j13951
14949A03995Q166K74017K30732j07596k83092P6942K28642j2722r6585p7272n2859
$$ plain form
15023 3532 -67429 -32195 53281 328837 431387 238378 -37944 22264 179173 98362 199750
15012 199750 235570 107926 125071 18867 82340 113123 12111 186966 338109 405711
15002 405711 521317 505143 270151 143773 -37867 -187093 -188639 -169282 -361531 -305192
14992 -305192 -5767 37889 -377907 -593415 -469798 -206595 -42823 -104878 -188994 -45594
14982 -45594 249363 332156 116234 -129203 -194430 -254710 -289080 -194212 -102571 -42225 167398
14971 167398 316333 386104 370049 273396 214917 206440 153135 132369 56802 -69261 74910
14960 74910 428310 781641 805753 469195 277751 317731 344558 241746 218322 217946 103995
14949 103995 112161 386178 616910 509314 226222 303164 531806 519084 422499 345227 292368
14938B92368j52473k48994j06781N0760J64647J71860j33787k39805j80224j80732
14928e63161J27452J10131J13555J57627J5312j9727l5909j47834o3316Q4842
14918b21028K19040K11268J49192M7140J29810J64844m2986k40542k60227j16936
14908C9575l05643l90522j41713J75421J56428M0288J36024O2555j06090L09134
14898b4543L26129p6552k20667j5327K21755N8783j85629k55743P2944q0226k56790
14887d35866m3509P3999J27462j59354k418L34886K54443K525K907l2213l2631
14876I0231k1541q0811o5636n8111O2247O9692O8971K24668Q0662j62069k56450
14865d8147j87822j5900J9609p8064j43314q2606J15475K23114K60298K68650
$$ plain form
14938 292368 139895 -109099 -215880 -165120 -473 171387 37600 -202205 -382429 -563161
14928 -563161 -435709 -325578 -212023 -54396 -39084 -58811 -94720 -242554 -305870 -221028
14918 -221028 -1988 209280 358472 405612 535422 700266 657280 416738 156511 39575
14908 39575 -266068 -656590 -798303 -622882 -466454 -426166 -290142 -227587 -333677 -24543
14898 -24543 301586 225034 4367 -10960 210795 269578 83949 -171794 -98850 -179076 -435866
14887 -435866 -479375 -405376 -277914 -437268 -439686 -104800 149643 152168 155075 122862 90231
14876 90231 68690 -12121 -77757 -135868 -73621 -3929 65042 289710 370372 208303 -48147
14865 -48147 -235969 -251869 -232260 -310324 -453638 -536244 -420769 -197655 62643 331293
14855C31293J05919K3621J30115L4955j59265J42523j603j86080j7414k9879j62474
14844B11711j75902j40528m7728k6876k4439q6058J2302N5689p608K09572J44445
14833A24580O120O3132M6185K9969N7813j11956M786K4532J53239J41564j02872
14822D37092l68050k55104j06842L5663J6609m2384j5158k992j22951j64303j41422
14811g29842j51212J41048K59657K29150J41890J37376m8198j05140k08686J08997
14801b24960K37089K4410o6742j10693j2743N2318K17167J64384J47724j09356
14791C18598l35652j88038J50210L8935r2312J96853J47822m3762K715m5822j4850
14780A34697o292M8789R6094N8932q9235n5489O746j02221k73767j48868J06262
$$ plain form
14855 331293 437212 460833 590948 625903 466638 609161 607558 421478 404064 374185 211711
14844 211711 35809 -104719 -152447 -179323 -203762 -289820 -277518 -221829 -229437 -19865 124580
14833 124580 130700 193832 240017 269986 327799 215843 220629 245161 398400 539964 437092
14822 437092 69042 -186062 -292904 -257241 -240632 -283016 -298174 -301166 -424117 -588420 -729842
14811 -729842 -881054 -740006 -480349 -251199 -109309 28067 -20131 -125271 -333957 -224960
14801 -224960 12129 36539 -30203 -140896 -153639 -101321 115846 280230 427954 318598
14791 318598 -17054 -205092 -54882 -15947 -108259 88594 236416 192654 195369 149547 134697
14780 134697 128405 177194 273288 332220 242985 187496 194242 92021 -181746 -330614 -224352
14769b24352M9418j3855J18588J49472n9591q9468m9148l3809r4388l099j43621
14758c93853k40337k7461K35889J89427P5648J19229K31594J12987l8573n0331
14748B14219J2294K3182q8575j03950K7379J0614o824K5169k6489j07650q3867
14737a04498M5796n1964j08153l0249p4407j49287R7338J53530J9164m2747J64801
14726h0676J44250r6853j78933p5914J8436P4684J84429J0530k28685j0469j7964
14715b57165k36145j9733K71558J39425P0786m698l40844L918L92265J64610J76280
14704C60257J39240j81870j2803J19750n0129j48456J511J36003K1418K1255P2836
14693D79012q3111j50155p9036r1331j0143O8993R5627K1302j97143p3012o3414
$$ plain form
14769 -224352 -174934 -188789 -70201 79271 19680 -69788 -118936 -152745 -247133 -250232 -393853
14758 -393853 -634190 -661651 -425762 -236335 -160687 -41458 190136 303123 264550 214219
14748 214219 226513 249695 161120 57170 84549 95163 88339 113508 87019 -20631 -104498
14737 -104498 -58702 -110666 -218819 -249068 -323475 -472762 -375424 -221894 -202730 -245477 -80676
14726 -80676 63574 -33279 -212212 -288126 -269690 -195006 -10577 -47 -228732 -239201 -257165
14715 -257165 -493310 -513043 -241485 -102060 -31274 -35972 -376816 -372898 19367 183977 360257
14704 360257 499497 317627 304824 424574 374445 225989 227500 363503 384921 406176 479012
14693 479012 395901 245746 166710 75379 65236 134229 229856 251158 54015 -18997 -82411
14682h2411j65319j17120r633J21452L21442L26634J22720j17013l39980l47301
14672b86529k07416q765J25669N5212q0443m5644P9168o6385k14794j66929j23269
14661i40125j0761K65469K06759J85041K53638K14994J7277o9446j02360K5436
14651D5922m7175j09576k79j31077j32553J41203Q1503j86797r1133j33283N3740
14640e09505M14232L57705m8547k79281j31051o8986q016o6176p1268J74668L16450
14629H0225L48074J29742j39438k48444l79076j39948Q9146J54532L1167k14992
14619b89012l0307K57651K44415J03465K4916J6322m0081j60043k39772j74382
14609b86828j88859r0775K14823K87341J28907L7342k8146Q2099O4145j74147
$$ plain form
14682 -82411 -247730 -364850 -374483 -253031 68411 395045 517765 400752 60772 -286529
14672 -286529 -493945 -502710 -377041 -321829 -402272 -447916 -368748 -435133 -649927 -816856 -940125
14661 -940125 -950886 -685417 -478658 -293617 -39979 175015 192292 122846 20486 45922
14651 45922 -1253 -110829 -111108 -242185 -374738 -233535 -152032 -338829 -429962 -563245 -509505
14640 -509505 -95273 262432 213885 -65396 -196447 -265433 -273449 -339625 -410893 -236225 80225
14629 80225 428299 558041 418603 170159 -208917 -348865 -259719 -105187 -74020 -289012
14619 -289012 -319319 -61668 182747 286212 311128 327450 287369 127326 -112446 -286828
14609 -286828 -475687 -566462 -351639 -64298 64609 101951 73805 155904 220049 45902
14599D5902k67875n1392M5386k2446R5769K83800L51965K29054n608l06233l72620
14588B5702k13484R3709J20138j0990j0961j5958N5569n5922j02739k3794r9084
14577b37814M4236J07538K34424L86302J30358k58264k14580j71216j18214O6729
14567c0501N0884q8020M2047K21141Q9984j43233j16073J37311K02141J09o7363
14556B98427K9148J08724j03386j79124j30946l409R8307m4117k90393k05282
14546d22051K90750M25368K19330J6163j12122j90748j72023l8123K52581J62899
14536D32024k76760j95714L2623K30209j82359m08898j8513J83505j8462j1344
14526b33689J48147l6518k93755j46744Q0190J48813J32536K0118J06884J13119
$$ plain form
14599 45902 -221973 -273365 -227979 -250425 -154656 129144 481109 710163 704555 398322 25702
14588 25702 -187782 -94073 26065 15075 4114 -11844 43725 -12197 -114936 -138730 -237814
14577 -237814 -193578 -86040 148384 534686 665044 406780 192200 20984 -97230 -30501
14567 -30501 20383 -67637 -25590 195551 285535 142302 26229 163540 365681 365790 298427
14556 298427 327575 436299 332913 153789 22843 19434 117741 73624 -216769 -422051
14546 -422051 -131301 294067 513397 529560 417438 226690 54667 16544 269125 432024
14536 432024 155264 -40450 -7827 222382 40023 -368875 -387388 -203883 -222345 -233689
14526 -233689 -85542 -122060 -415815 -562559 -482369 -333556 -201020 -180902 -74018 39101
14516C9101K00473P8913L8061J62859M1212o1374n8533j05082k3750o7455k00967
14505D3458l84424k08087n7544Q2536R1892L9850J71150J52351k4495k34702k26432
14494e54447o6644L6419J7925M7869J27807q9182j9915j82498j82502R2385J11679
14483f61104R0016m0061L40527M11492M1494j4991r5171k29520j87013M6259K15334
14472h2738K74257J80934J0875p6498k17371l86487k61707q146K62870K21112
14462h2899N4513r8967j90584P9187J96226r6332k08462P5565K74574R4219o2620
14451C4420P3394J95762m2959j20297R4557R550m9393N6268j46729k25414k18260
14440c39101k15430N7998J04198P5589Q2041K5990N7352Q4000K14397o207l49960
$$ plain form
14516 39101 239574 318487 356548 519407 560619 499245 440712 335630 311880 244425 43458
14505 43458 -340966 -549053 -606597 -524061 -432169 -392319 -221169 -68818 -93313 -328015 -554447
14494 -554447 -621091 -584672 -566747 -518878 -391071 -480253 -500168 -682666 -865168 -772783 -661104
14483 -661104 -571088 -611149 -270622 140870 182364 167373 72202 -157318 -344331 -298072 -82738
14472 -82738 191519 372453 383328 306830 89459 -297028 -558735 -566881 -304011 -82899
14462 -82899 -28386 -127353 -317937 -238750 -42524 -138856 -347318 -271753 2821 97040 34420
14451 34420 107814 303576 260617 140320 234877 244427 195034 251302 104573 -120841 -339101
14440 -339101 -554531 -496533 -392335 -316746 -234705 -208715 -151363 -67363 147034 140827 -209133
14429b09133k7251P1191p7384n4187M1032j19388J5500Q5107k3020p4239R1237
14418b80535J19479k1250J8216k0077L3435K94209J61150Q7654j84498k33776
14408b5993q88M830K32498J50057k46500j97782K352J15002J22977m6852j59575
14397d9874j42522l516J10269p4702j32887J12065K05136o5002k08860j58392
14387d08285R3746L11464R6717J5376J24738k3835M8515J58917r5311l04988r1155
14376g4101J0629j39623k16124k31469l5734K50221J61689K75208K64256P8599
14366C43551n6862l70663j85303O7085J27744J80220M9254p2802j61753n2003
14356a31532J68924L0228l00731j35343K11138J81883J42794K24374N6794K1321
$$ plain form
14429 -209133 -236384 -165193 -242577 -296764 -255732 -375120 -359620 -274513 -297533 -371772 -280535
14418 -280535 -161056 -182306 -164090 -184167 -150732 143477 304627 392281 207783 -25993
14408 -25993 -26881 -22051 210447 360504 114004 -83778 -81426 33576 156553 109701 -49874
14397 -49874 -192396 -195912 -85643 -160345 -293232 -181167 23969 -41033 -249893 -408285
14387 -408285 -314539 -3075 93642 109018 233756 209921 258436 417353 322042 17054 -74101
14376 -74101 -63472 -203095 -419219 -650688 -686422 -436201 -274512 696 264952 343551
14366 343551 286689 -83974 -269277 -202192 -74448 105772 155026 82224 -79529 -131532
14356 -131532 37392 67620 -233111 -368454 -157316 24567 167361 391735 448529 469850
14346D69850m140N4J84945j60273l85790k37283j70045q4422K3678J08040l6692
14335b92078l6863J62090J87066K46882m2174k11645Q1373J44186l2823m5661
14325A60353K2660J54013O3343m2875j664j79615l95587m8182M9099n160J30505
14314i3110R6907q8785l16999j69872J34670J24264J12877L4027o6920o2974N3504
14303b42411J04312j35966j97493k5205J35511J78314K48767J66090j65845j18514
14293e2440K4423J05551N0141j01145j99299l19261j21447J74694L1151P1606
14283c36026K35506K34305J70560k2144j16003K820l3515j28396M2130J05079
14273A54316R8652r2798l04028j58423q6171J09451J55718m6496q5519J1561R6798
$$ plain form
14346 469850 465710 465764 650709 490436 104646 -132637 -302682 -387104 -363426 -255386 -292078
14335 -292078 -328941 -166851 20215 267097 224923 13278 94651 238837 206014 160353
14325 160353 183013 337026 400369 357494 355830 176215 -219372 -267554 -218455 -223615 -93110
14314 -93110 3797 -84988 -401987 -571859 -437189 -312925 -200048 -166021 -232941 -295915 -242411
14303 -242411 -138099 -274065 -471558 -496763 -361252 -182938 65829 231919 66074 -52440
14293 -52440 -28017 77534 127675 26530 -172769 -492030 -613477 -438783 -407632 -336026
14283 -336026 -100520 133785 304345 282201 166198 169018 135503 7107 49237 154316
14273 154316 252968 160170 -143858 -302281 -388452 -279001 -123283 -169779 -255298 -243737 -146939
14262a46939L2903K3276P206j7832k2087K0884K9711k4616n5305j05020j30800
14251c88619l2084J1408J20183K9264L6678K97818K80263L9860j60863r0819J3875
14240A56964r2782m06595l22179J8775k8386o7475J88562K32733K85494K16663
14230A81774J26568k33689l58493j18490Q4475J44060k8337o2964J15235K360
14220a47501k09680k5150J02624J18319k2047J01270O0509R254J35186M3864k1643
14209A45005K1681k120j33485p4068K1576m2246J2889m5315j68690R244K65725
14198A0196O841k04975j45605l9718J15441J06586O5196J0469Q9212k7694j06867
14187a20918r4151J1069N0297j8996j77024n9427J72271K61282P3772q7066q017
$$ plain form
14262 -146939 -114036 -90760 -83554 -101386 -123473 -102589 -72878 -97494 -152799 -257819 -388619
14251 -388619 -420703 -409295 -289112 -259848 -223170 74648 354911 394771 233908 143089 156964
14240 156964 64182 -342413 -664592 -645817 -674203 -741678 -553116 -320383 -34889 181774
14230 181774 308342 74653 -283840 -402330 -317855 -173795 -202132 -265096 -149861 -147501
14220 -147501 -357181 -382331 -279707 -161388 -183435 -82165 -21656 -12402 122784 166648 145005
14209 145005 166686 164566 31081 -42987 -21411 -63657 -50768 -96083 -264773 -255529 10196
14198 10196 17037 -187938 -333543 -373261 -257820 -151234 -86038 -75569 13643 -14051 -120918
14187 -120918 -215069 -204000 -153703 -172699 -349723 -409150 -236879 24403 98175 11109 3092
14176C092j4515j62591j9307O6961N8826K20669O2983l1523q6880j20277j9205
14165d1767l8874O457O7951k5530n9898n6418j2006J66476K21155j58652k22054
14154a53160o7202j84316k5709L6986j51858k06123p3839L25206L00258K4583
14144a75174N4114r3919j59013j5860L8782J06715K22348Q4904m668J09155j49158
14133A8226j29241j20652j87741r8470L864K733L86K1493Q9447J94612Q8458R2192
14121b4693J05002J16659L4284Q105Q6642J33857J03640J45594j21145k15122
14111C72823M468o625J6644p1444l6681k37648k29699n3206j48679j10639K0955
14100d79731k6371k8033J58872K30092N7510j00187j54663J27231K66207J85107
$$ plain form
14176 3092 -11423 -174014 -193321 -126360 -67534 153135 216118 184595 97715 -22562 -41767
14165 -41767 -80641 -74184 -6233 -31763 -91661 -148079 -160085 6391 227546 68894 -153160
14154 -153160 -220362 -404678 -430387 -393401 -545259 -751382 -825221 -500015 -199757 -175174
14144 -175174 -121060 -214979 -373992 -389852 -351070 -244355 -22007 62897 58229 167384 18226
14133 18226 -111015 -231667 -419408 -517878 -514014 -511281 -510895 -489402 -399955 -205343 -116885 -24693
14121 -24693 80309 196968 231252 239357 325999 459856 563496 709090 587945 372823
14111 372823 377291 370666 387310 315866 279185 41537 -188162 -241368 -390047 -500686 -479731
14100 -479731 -506102 -534135 -375263 -145171 -87661 -187848 -342511 -215280 50927 236034
14090B36034R5258j61047j95390L6599q1939j68367M201J83517L2712N0835R2555
14079A24968J1664m0666n8567r664q3535j01607m2494k5409j18826j92651J03763
14068d33024K18514K95211J12549j27747j87235j31327Q9247P4968r2218k52583
14058d33645j69013k7919p74J40303J70963r477j29225o1061Q3524J04034J99169
14047a33121P5894o8877k06405k47315j58539K47288K70198K06311o296l11032
14037c31894j94537j1210M7466J28254N6777j14830m522p0185J15280J55473J53502
14026g0426K73689J66946Q7800M6976m9579M3995j55276m98060j96658q7148J5926
14015d21815o616j82238o6780J80682j8413o0987M8720N2565N7516R4532R6038
$$ plain form
14090 236034 331292 170245 -25145 11454 -70485 -238852 -234651 -51134 -18422 32413 124968
14079 124968 136632 95966 37399 27735 -55800 -157407 -199901 -225310 -344136 -536787 -433024
14068 -433024 -214510 80701 193250 65503 -121732 -253059 -163812 -88844 -181062 -433645
14058 -433645 -602658 -630577 -631351 -491048 -320085 -329562 -458787 -519848 -436324 -332290 -133121
14047 -133121 -57227 -126104 -332509 -579824 -738363 -491075 -220877 -14566 -20862 -331894
14037 -331894 -526431 -537641 -490175 -361921 -305144 -419974 -424496 -494681 -379401 -223928 -70426
14026 -70426 203263 370209 458009 504985 455406 499401 344125 -153935 -350593 -437741 -421815
14015 -421815 -428431 -610669 -677449 -496767 -515180 -576167 -527447 -474882 -417366 -322834 -226796
14004b26796J60640p5600o3542K3524j17023J4560J9900j16097k07220K0536J86440
13993c80678K32738J58193O6857L4244L4048M1793m4668J78998J01101k50421
13983A72205j29728J25099J40722J11934o1819k275Q8289J920N3813M4760r0407
13972D54513j10666r259r749M0343j69303k73254j05645o7857K9786O3004J41020
13961a7067P0664q9883P7551k7597j66410Q0615K52931J0811o7075N4921L6260
13950B15721J36683O5302L4866R2835l082k47718l10293j07880N1640J48735j08235
13939c1426j30348L94J99508K74647k9674j63739j31756J43616J13161L2841j41608
13928A35616l3272J79237O2884j58172k73528j81095L2933K16217Q6445q0212
$$ plain form
14004 -226796 -66156 -141756 -205298 -181774 -298797 -284237 -264337 -380434 -587654 -567118 -380678
13993 -380678 -147940 10253 77110 111354 145402 187195 142527 321525 422626 172205
13983 172205 42477 167576 308298 420232 358413 356138 444427 446347 500160 544920 454513
13972 454513 343847 334588 324839 365182 195879 -77375 -183020 -250877 -221091 -158087 -17067
13961 -17067 53597 -36286 41265 13668 -152742 -72127 180804 191615 124540 179461 215721
13950 215721 352404 417706 452572 545407 542325 294607 -15686 -123566 -71926 76809 -31426
13939 -31426 -161774 -161380 38128 312775 283101 119362 -12394 131222 244383 277224 135616
13928 135616 102344 281581 344465 186293 -87235 -268330 -235397 -19180 67265 -12947
13918a2947j6387J36273R0346J99257P0824r5344j28671l48786j53951L712k0242
13907b75916J16530j056j17710l9023q863j45747J396R7330j50631J7114J75330
13896c31246K12532O6986p6586L7592j08248j70417o9173O2756J2254q6750J39010
13885c11290M4301k78712L5025L07642L9460k50997k52115K7759J08054K53081
13875b77792L13189J25552q055j30510k5823K44343J72575j14739J0764R6402
13865D05906j83340m24906k76231n9558J41843J33307N3428L34416J95268j74481
13855A45652k81305j32301J40606J19529Q2498R7279r3648j10305O6931n2172
13845a7236l3144Q250J6499L0122q8556k3111J39132j7555J83874Q2080q7876
$$ plain form
13918 -12947 -29334 106939 197285 396542 467366 372022 243351 -105435 -259386 -255674 -275916
13907 -275916 -159386 -160442 -278152 -317175 -326038 -471785 -470389 -373059 -523690 -506576 -331246
13896 -331246 -118714 -51728 -128314 -90722 -198970 -369387 -438560 -375804 -363550 -450300 -311290
13885 -311290 -266989 -545701 -510676 -203034 -163574 -414571 -666686 -638927 -530873 -277792
13875 -277792 35397 160949 152894 22384 -3439 240904 413479 298740 309504 405906
13865 405906 222566 -202340 -478571 -538129 -396286 -262979 -209551 124865 320133 145652
13855 145652 -135653 -267954 -127348 -7819 74679 171958 78310 -31995 34936 -17236
13845 -17236 -50380 -42130 -25631 4491 -84065 -107176 31956 14401 198275 280355 192479
13834A92479L1600k009l8191j55804j46289O7271K67546P1894p0760r8327j78047
13823e8637p2567n5602n0390j8005O4554j7490P110p0356k11979N8820J15599
13812c08943P0169K83111L13745K62464K4616k45593k38185j57267k97520Q4155
13802b09248K90097J64179j08661q7201J9308k38641j94011R7510J09574J71141
13792A4047K37047L9923j38462l43489j95001J98733K66336J54611J0660o787
13782B37618p9710j19974j05147n4674j64973j42360J23008K14946J29379M0038
13772G8151o3492M9853J26132l2496j79189j55397j34707n3246K36194L75920
13762B47723J84086O3653n1301j55131R21Q7710j4091k18982k50821k40493p883
$$ plain form
13834 192479 224079 222070 183879 28075 -118214 -50943 216603 288497 217737 119410 -58637
13823 -58637 -131204 -186806 -237196 -255201 -190647 -208137 -201027 -271383 -483362 -424542 -308943
13812 -308943 -238774 44337 358082 620546 645162 399569 161384 4117 -293403 -209248
13802 -209248 80849 245028 136367 49166 68474 -170167 -364178 -266668 -157094 14047
13792 14047 251094 291017 152555 -190934 -385935 -187202 79134 233745 244405 237618
13782 237618 157908 37934 -67213 -121887 -286860 -429220 -306212 -91266 38113 78151
13772 78151 14659 64512 190644 158148 -21041 -176438 -311145 -364391 -128197 247723
13762 247723 431809 495462 444161 289030 289951 377661 363570 144588 -106233 -346726 -354609
13751c54609o65J7487M8610J1821L9946J57570J51316J109j9637j8356k12212
13740a77620l0968J18904k611q6027M9744L25573K55353j28649j66111r5774j88760
13729a26946j41620L02253L30267j7417l51706l46842k20727P8485P9737j51185
13719e65701J32258L9656J1539J54291P1766N3451n731j24645q1345N0702J52497
13708a11262p3177l24663q4356N8812J2124J96605K05911K89548L39059J75005
13698F83606m0048k42547j79548k09384j17474J77639K39234Q4879j41983k23300
13688C1074k21849Q7013J41791n3226j2264j25730O4051Q4587j96347k89840n8291
13677e49031J95861J84535J33656N4128k00267j64461R9792J44612j67470k41400
$$ plain form
13751 -354609 -355274 -337787 -289177 -277356 -237410 -79840 71476 72585 52948 34592 -177620
13740 -177620 -208588 -89684 -92295 -178322 -128578 196995 452348 323699 157588 61814 -126946
13729 -126946 -268566 33687 363954 346537 -5169 -352011 -572738 -494253 -414516 -565701
13719 -565701 -433443 -393787 -382248 -227957 -156191 -102740 -108471 -233116 -314461 -263759 -111262
13708 -111262 -184439 -509102 -593458 -534646 -522522 -325917 -120006 169542 508601 683606
13698 683606 643558 401011 221463 12079 -105395 72244 311478 396357 254374 31074
13688 31074 -190775 -103762 38029 -15197 -27461 -153191 -89140 -4553 -200900 -490740 -549031
13677 -549031 -353170 -168635 -34979 19149 -181118 -345579 -245787 -101175 -268645 -510045
13667e10045Q2947O0704o4570o0970J45964L63606K30881j38137l1577K94820
13657C73623J26576j00214k1061k6406r8446q8871j24683j30653Q6900R9049P7079
13646A72893J71031J26370k03752j81715l218k41552j03166j08917K8702J91557
13636a51767J54684J15324m8366k66160q5744j7174O0875o9080j91939J02619
13626c96728K67971J81978K89090O8663k27603k42746L3442J67722j6886j9743
13616A05160K7207N1468q881m9690r1892j29010k89983p1864K20706N4066j53768
13605c36481P1778K14171L9875o9495J5020J56408K8407O3774Q2125m2616m7742
13594A75224J14313j10753j25521j55033k93849J18752J33395j92848j77191J59515
$$ plain form
13667 -510045 -427098 -366394 -430964 -491934 -345970 17636 248517 110380 78803 373623
13657 373623 500199 399985 378924 352518 254072 165201 40518 -90135 -3235 95814 172893
13646 172893 343924 470294 266542 84827 81609 -159943 -263109 -372026 -343324 -151767
13636 -151767 2917 118241 69875 -196285 -282029 -299203 -238328 -307408 -499347 -396728
13626 -396728 -128757 53221 342311 410974 183371 -59375 -25933 141789 124903 105160
13616 105160 132367 183835 174954 125264 33372 -95638 -385621 -457485 -236779 -182713 -336481
13605 -336481 -264703 -50532 -10657 -80152 -65132 91276 119683 183457 265582 222966 175224
13594 175224 289537 178784 53263 -101770 -395619 -276867 -143472 -336320 -513511 -353996
13584c53996L39086J50605J16715L5229P5320M5718r8883n3828j4914r2712k35854
13573h7514O7031K72045J88047J02609K2703K3224j13233l02203j75421p4638
13563g7350m214O3620J72158N9786q9007M1436J33160R0465M8796l3211j09200
13552B96439L0125L7842l32292l05384J91592L01836o618k1080J22440j94465
13542A20435l06626j2277K61174J95672Q8063j11982N3838K48220m3877j97948
13532B94692j33295j11091n4567J88836R5677l6580q372J52831J21705j53686
13522C56150k42242j96325N2870K77912K22792J42447j58249m13371l30527M3743
13512b44800L36309K32157k0302k43288n7647L4138J34534J49946q964k8636o2663
$$ plain form
13584 -353996 -14910 135695 252410 287639 362959 408677 309794 255966 241052 148340 -87514
13573 -87514 -20483 251562 439609 542218 564921 588145 474912 172709 -2712 -77350
13563 -77350 -81564 -17944 154214 214000 124993 166429 299589 390054 438850 405639 296439
13552 296439 326564 364406 32114 -273270 -81678 220158 213540 192460 314900 120435
13542 120435 -186191 -198468 62706 258378 346441 234459 288297 536517 492640 294692
13532 294692 161397 50306 -4261 184575 280252 243672 235300 388131 509836 356150
13522 356150 113908 -82417 -29547 248365 471157 613604 455355 41984 -288543 -244800
13512 -244800 91509 323666 303364 60076 2429 36567 171101 321047 312083 283447 220784
13501B20784J19752Q1682n1989o784r1384k53780j49308O4778K9599J0986J6104
13490i560J03055J13406O0010q537j35496N6373K0514q2438r5678j7660K6446
13479C0435J02204n2444q8016l3507j29266J43118m1189p6470J69354K5877j73361
13468a23265k27692q9475k490J36872J40687P8930J37047J10363k10680l04928
13458c54631J22209J60884Q5489Q2999J37800R1861Q8451N2734j37738k47707
13448H2351o0552n9439P5070K52543j0687o5954j9616j2444m5419O8791r0959
13437A13685l8497L2371J70947M99564L58244l4320l58882l93410q951K25508
13427E66259K39922j03044l39429k14950K2230o8579M1623K19660Q6202P7717
$$ plain form
13501 220784 340536 422218 370229 363445 272061 18281 -131027 -66249 -36650 -25664 -9560
13490 -9560 93495 206901 266911 258374 122878 179251 199765 117327 21649 3989 30435
13479 30435 132639 80195 -7821 -41328 -170594 -27476 -68665 -145135 24219 50096 -123265
13468 -123265 -350957 -440432 -442922 -306050 -165363 -86433 50614 160977 -49703 -354631
13458 -354631 -232422 -71538 13951 96950 234750 326611 415062 467796 330058 82351
13448 82351 21799 -37640 37430 289973 279286 213332 193716 181272 135853 204644 113685
13437 113685 75188 107559 278506 778070 1136314 1101994 743112 349702 340751 566259
13427 566259 806181 703137 363708 148758 170988 102409 144032 363692 449894 527611
13417E27611j76242k86547j67765p9423j9459j37115L7004L02831m0307L6484
13407b928J84816J50478Q2787j37947k08462n7147J03224N0818O5716O7083P7241
13396C75679j8249R9347J47713J52512J81874R4505p7478k20800j55299N5004
13386F34808L3830J7579l8062O8864L5121k21588l08897O9388J96785O1675j02939
13375D46564j36220n2796Q206K5062J49540k6488r5009j65499j93764o285J12933
13364F6244J99851K19354J77739N736K2361l5840j75957o1541P2397K1914o1624
13353D50634j14364N5555K00632J42148j0287k48855o4681n2365N0182L9507j16050
13342C32056j11479l31286r4459J26058M317N3149K03811J41884L4262m1760n711
$$ plain form
13417 527611 351369 64822 -102943 -182366 -201825 -338940 -301936 895 -39412 -2928
13407 -2928 181888 332366 415153 277206 68744 11597 114821 165639 231355 298438 375679
13396 375679 357430 456777 604490 757002 938876 1033381 955903 735103 579804 634808
13386 634808 668638 686217 648155 717019 752140 530552 221655 291043 487828 549503 446564
13375 446564 310344 257548 265754 290816 440356 413868 318859 153360 -40404 -46689 66244
13364 66244 266095 485449 663188 668924 691285 655445 479488 417947 490344 512258 450634
13353 450634 336270 391825 592457 734605 724318 475463 410782 358417 408599 448106 332056
13342 332056 220577 -110709 -205168 -79110 -74793 -21644 182167 324051 358313 316553 310842
13331C10842j6942J72510J61286Q2435L0701j41170k10224j5744N817j49426k66335
13320c6250k9069K98111K47435J46311L1806L7018J07262l2518j35252j4524m1275
13309E79055O8181P050J70261K43290p0663k86980k00540j87019q8290N0680j10733
13298A74292j55307j63535j30710j23257J82262L06032O1341O0093R8159j89909
13288A19461j95784j06775R1161K16927K40652J64980p39O4439O0908q7491m0552
13277E27187J2167M0206P7871N1570N4991o9291j82320j43573p727k4691j07356
13266B29034K1078M2393m7705k7462q5576n3274Q8550J00450j63508j99824R8187
13255B343L27361M04626k5971k03847j8818N808r0189j34455j96567O2316J78390
$$ plain form
13331 310842 293900 466410 627696 710131 740832 599662 389438 373694 379511 230085 -36250
13320 -36250 -65319 232792 480227 626538 658344 695362 802624 770106 634854 620330 579055
13309 579055 647236 654286 824547 1067837 997174 710194 509654 322635 234345 285025 174292
13298 174292 18985 -144550 -275260 -398517 -216255 89777 151118 211211 309370 119461
13288 119461 -76323 -183098 -91937 124990 365642 530622 529883 594322 655230 567739 527187
13277 527187 539354 579560 657431 709001 763992 694701 512381 368808 361081 336390 229034
13266 229034 250112 292505 244800 217338 131762 78488 167038 267488 103980 -95844 2343
13255 2343 329704 734330 708359 504512 485694 491502 401313 266858 70291 132607 310997
13244C10997O4666J29670J89612P2897r1055j79268L6344J46721J20033k2766
13234G77851k6078j1857j0383p7330k31353k24112J01038J75599K2135P6468J76764
13223G48742J52757K1516j2812l7297l2504m3618j32966k6697r630J23178l8294
13212G12375k57305j36020P3845K19386r5786L0093O9266j80748N403J04652j38718
13201D06443q9907J40954K67099J46637M1476j37124j14456k5386j58220k12411
13191B65105q8335J55834J45883r6515j09252J09888J02717J09208J3140p6607
13181E31066q6666L3855j83465Q5871L81261K95403K5402k03544k06710j21086
13171E51387l0377K7077P1494J08939J05809j65894l40446l17490j02951m6893
$$ plain form
13244 310997 375663 505333 694945 767842 676787 497519 533863 680584 800617 777851
13234 777851 751773 739916 729533 652203 420850 196738 297776 473375 495510 571978 748742
13223 748742 901499 923015 910203 872906 840402 796784 663818 637121 627491 750669 712375
13212 712375 455070 319050 392895 612281 516495 546588 615854 435106 440509 545161 406443
13201 406443 316536 457490 724589 871226 912702 775578 661122 635736 477516 265105
13191 265105 176770 332604 478487 381972 272720 382608 485325 594533 607673 531066
13181 531066 444400 478255 294790 380661 761922 1057325 1082727 879183 672473 551387
13171 551387 521010 548087 619581 728520 834329 668435 327989 10499 -92452 -139345
13161a39345J81157K02790K9281r1172j18390o3826k2146R4935K3539J33677K69097
13150D99597R0301K4200j51438m1505K80611L4436k34841l3450J14082l7372n5629
13139D88992J25234J52731J33501j27429j39009j5387L6539j10304j89308L4551
13129C90111n417l9042n5836J95531K68827o7361r8008N0714j39498q4425j31777
13118B83819j81843j3268J02294J80765K26950o8222j77776P1022j8646R261J55792
13107E70148J51153K65752R0046n7328o7729k50117K2212K34962N1695k8002O5638
13096A048430R8458n9991q4048n171j1691j90843k10236L04773L97925r4887j12592
13085A080127J33835J88791J42323Q4203o5005k89555k34985j20358j49415J08219
$$ plain form
13161 -139345 41812 244602 273883 182711 64321 495 -21651 73284 96823 230500 499597
13150 499597 589898 614098 462660 421155 701766 736202 501361 467911 581993 544621 488992
13139 488992 614226 766957 900458 773029 634020 618633 655172 544868 355560 390111
13129 390111 384694 345652 289816 485347 754174 686813 588805 639519 500021 415596 283819
13118 283819 101976 88708 191002 371767 598717 530495 352719 423741 405095 414356 570148
13107 570148 721301 987053 1077099 1019771 952042 701925 724137 959099 1010794 982792 1048430
13096 1048430 1146888 1086897 1002849 997678 985987 795144 584908 889681 1287606 1192719 1080127
13085 1080127 1213962 1402753 1545076 1629279 1564274 1274719 1039734 919376 769961 878180
13075H78180K44721j8876m454R6572J24667Q0245m5229q2892k12734l51698j81837
13064E26665k5464J76635L17531J67067M4840M5731n8900J9078L7617k5356j84982
13053A040462j00173j3058O8815J03655K54236M43895K15479K175j00794q1361
13043A833331j772j31325j03134l6924P0285J06797P2492K4404N5855J34466R9733
13032B124208J89370O2026o1074n9028N508M4348J31304K52527q5727j74600r9679
13021B329183r1469Q0940r7174J28186L77032J45402p66Q4799L4664L5438K40232
13010C266467K45857K18487J73539P97M4673K37180Q8456R9731K48860J18967
13000D743014K75622M08073L12800K11445L28022O48483O06800M09958N37556
$$ plain form
13075 878180 1122901 1104025 1099571 1196143 1320810 1401055 1355826 1272934 1060200 708502 526665
13064 526665 501201 677836 995367 1162434 1207274 1253005 1194105 1213183 1250800 1225444 1040462
13053 1040462 940289 927231 996046 1099701 1353937 1797832 2013311 2015486 1914692 1833331
13043 1833331 1831559 1700234 1597100 1560176 1630461 1737258 1809750 1834154 1890009 2024475 2124208
13032 2124208 2313578 2375604 2314530 2255502 2261010 2305358 2436662 2689189 2603462 2428862 2329183
13021 2329183 2237714 2318654 2221480 2349666 2726698 2872100 2871334 2956133 2990797 3026235 3266467
13010 3266467 3512324 3730811 3904350 3905147 3949820 4187000 4275456 4375187 4624047 4743014
13000 4743014 5018636 5426709 5739509 5950954 6278976 6927459 7534259 7944217 8481773
12991H481773P08604O61671Q79857J140364J312043J741241K649249L201792L884343
12982B4660937N102286O388556Q219179J1282230J5633647K1634178K9818133
12975A22739146M0293911M8363768M2638905J3542917k4051668m3737185m3372752
12968A56417042l5204220k6467156j9193328j3808864j0310246q364321o563950
12961C6504957m878004l870369l256185k752467k383359j910386j529576j436187
12953A4488424j266808j116128r75804r83016q66958p16969n33708m30958m06966
12944G191109l80658j70974l39974l28304o9910o5143O6419j90881m69000k52990
12934D989694j13294M3040O8686R6283J28150p2799o2620O033N4907K02992J86745
$$ plain form
12991 8481773 9190377 9852048 10731905 11872269 13184312 14925553 17574802 20776594 24660937
12982 24660937 29763223 36151779 44370958 55653188 71286835 92921013 122739146
12975 122739146 163033057 211396825 254035730 267578647 243526979 199789794 156417042
12968 156417042 121212822 94745666 75552338 61743474 51433228 43068907 36504957
12961 36504957 31626953 27756584 24500399 21747932 19364573 17454187 15924611 14488424
12953 14488424 13221616 12105488 11129684 10146668 9279710 8562741 8029033 7598075 7191109
12944 7191109 6810451 6639477 6299503 5971199 5901289 5836146 5902565 5711684 5242684 4989694
12934 4989694 4876400 4919440 4988126 5084409 5212559 5139760 5077140 5083173 5138080 5341072 5527817
12923E527817K004L53805M74745N39544O68997O98302R60464J418635J675572
12914A2319885J673166N84906r20697j287625r50589o24392k79162j6113K17460
12905A0716839L54832M88156N77527P19454R48227J179164J917485K651292L164845
12896B2717821M025584N039126O728259R057279J2417165J7200742K3882722L3096876
12888A34165574M4248813N0758479L8451325K013611l4220682m7402876m2548676
12881A45465568l2568774k3961024j7632607j3136369r866936p705291o016596
12874C4577971m534838l555156l103876k809312k245900j829886j670447j290054
12866A3538502j097886r20554q29198q45002r52730q41155m26800k37374k41883
$$ plain form
12923 5527817 5529821 5883626 6358371 6897915 7566912 8265214 9225678 10644313 12319885
12914 12319885 13993051 14577957 13657260 12369635 11419046 10794654 10515492 10499379 10716839
12905 10716839 11071671 11559827 12137354 12856808 13805035 14984199 16901684 19552976 22717821
12896 22717821 26743405 31782531 38510790 47568069 59985234 77185976 101068698 134165574
12888 134165574 178414387 229172866 267624191 269637802 235417120 188014244 145465568
12881 145465568 112896794 88935770 71303163 58166794 48299858 40594567 34577971
12874 34577971 30043133 26487977 23384101 20574789 18328889 16499003 14828556 13538502
12866 13538502 12440616 11520062 10690864 9845862 8893132 8051977 7625177 7387803 7145920
12857G145920k00274k38157k41013j31831j01589k38428k64871k06057j95720
12848E327980m54746m95256k66531O2638K34716J77978J53895L5650l17668l75940
12838D082716j78221J7159Q1231k1000J95031L04825K30122J47702K10624K82429
12828E352618R6097O3245J49183K15566J98559K37294N20166M66001M06827O47259
12818H352815Q48894R54868J014167J095628J173782J440635J975943K692980
12810A9549712L456052M445868N960846P668580R958729J3509744J8786635K6197277
12802A09533443L5866352M5752922M7448511K7885262r543723l8550088m5440868
12795A72951811l8967185k9810035k1898962j5955144j1774465q909199o878277
$$ plain form
12857 7145920 6945646 6707489 6466476 6334645 6233056 5994628 5729757 5523700 5327980
12848 5327980 4873234 4377978 4111447 4174085 4408801 4586779 4740674 4776324 4458656 4082716
12838 4082716 3904495 3921654 4002885 3981885 4176916 4481741 4711863 4859565 5070189 5352618
12828 5352618 5448715 5511960 5661143 5876709 6075268 6312562 6832728 7298729 7705556 8352815
12818 8352815 9201709 10156577 11170744 12266372 13440154 14880789 16856732 19549712
12810 19549712 23005764 27451632 33412478 41081058 51039787 64549531 83336166 109533443
12802 109533443 145399795 191152717 238601228 266486490 256942767 218392679 172951811
12795 172951811 133984626 104174591 82275629 66320485 54546020 45636821 38758544
12788C8758544n595658m514169l636033l017642k506146k260052j966400j661795
12780A3600649j326922j009633q13737q30891q19990q27061p34392m58632o08175
12771F171216n74925k91703j26295j42115l82167m03925l06973j17683j7693j94428
12761C613309k30494n0670k05513l66923j30892m9137K9138l2736m110j68031
12751B403941j21656j5941K0767J5870N0114j58585k20684J7237K9561k37112
12741A783512j07691o5668k70793j81526l3556l8353L6539J83271J9941P366l741
12730A329301o4137j76195j25836j8997j20838k22790j25321j24865k1435L0382
12720C59269R0280K11763J88945j43210k24341l8540J25427J51289L4655P4659
$$ plain form
12788 38758544 33162886 28648717 25012684 21995042 19488896 17228844 15262444 13600649
12780 13600649 12273727 11264094 10450357 9619466 8799476 7972415 7238023 6779391 6171216
12771 6171216 5596291 5304588 5178293 5036178 4654011 4250086 3943113 3825430 3807737 3613309
12761 3613309 3382815 3332145 3126632 2759709 2628817 2579680 2608818 2576082 2571972 2403941
12751 2403941 2282285 2266344 2287111 2302981 2353095 2194510 1973826 1991063 2020624 1783512
12741 1783512 1675821 1610153 1339360 1157834 1124278 1085925 1122464 1305735 1325676 1333042 1329301
12730 1329301 1265164 1088969 963133 944136 823298 600508 475187 350322 328887 359269
12720 359269 449549 661312 850257 707047 482706 444166 569593 720882 755537 830196
12710H30196K51969P6569n2965O0934J07790k748j18150p3143M873j38816Q0197
12699A026706K70713l0247k50693j42698J12042J86050l978n5937N1258l1974
12689A131242j87962j18272n765k95391k86952L09410N7979l24213k43358j35392
12679i8674L979K61698L07792N0442R967K54898L25249J64719j37332k63950j34565
12668G44223j16873k17297n9762J44586q1267j08536K08529J81889l4120n3566
12658F07806j60620k01850r1941l4205j9960L0703j43182J33991L05578K93468
12648G19788o9840r1871j4681j72359j94044j18029J11417N0225l3097N3437J07379
12637C48325K2562L1318k9855p5335k68698Q583l5384j29527J06373J93930R3524
$$ plain form
12710 830196 1082165 1158734 1105769 1166703 1274493 1271745 1153595 1080452 1085325 946509 1026706
12699 1026706 1297419 1267172 1016479 873781 985823 1171873 1167895 1111958 1163216 1131242
12689 1131242 943280 825008 819243 523852 236900 546310 604289 280076 36718 -98674
12679 -98674 -94695 167003 474795 525237 535204 790102 1115351 1280070 1142738 878788 744223
12668 744223 627350 410053 350291 494877 413610 305074 513603 695492 661372 607806
12658 607806 447186 245336 153395 119190 99230 129933 -13249 120742 426320 719788
12648 719788 649948 558077 543396 371037 176993 58964 170381 220606 187509 240946 348325
12637 348325 370887 402205 372350 297015 28317 36900 1516 -128011 -21638 172292 265816
12626B65816q4950q8559M8065K03432K34446P7887L3244l4757j62766q6778L6372
12615D41452j44713r1180N4408r2933k0997J58293L3383r8912P7114N7452k3465
12604C49902J72946K16595k8050j66210j3991o3254k65650l52073j2103l1593
12594a93481l1710M6269J37343J21131r1393j23812K27859M03343K54816m4959
12584G05406j96762k34776k40585J22462J47692L5050j03462o0621K6413j04952
12574I5865j50264j59145P2196L39868K00026J85660K05688j20489k15139j69619
12564B84647k45505l88569q1767N9712J25400K47565J18110k23126j50286M9883
12554b03936J26673K00794Q998j83293r5067K3636m7623J16478K48483Q2766k06560
$$ plain form
12626 265816 180866 92307 140372 343804 578250 656137 689381 654624 491858 405080 441452
12615 441452 296739 205559 259967 167034 146037 304330 337713 238801 315915 373367 349902
12604 349902 522848 739443 711393 545183 531192 467938 202288 -149785 -161888 -193481
12594 -193481 -225191 -178922 -41579 79552 -11841 -135653 92206 495549 750365 705406
12584 705406 508644 273868 33283 155745 303437 338487 235025 174404 200817 95865
12574 95865 -54399 -213544 -141348 198520 398546 584206 789894 669405 454266 284647
12564 284647 39142 -349427 -431194 -371482 -246082 1483 119593 -103533 -253819 -203936
12554 -203936 -77263 123531 132529 -50764 -145831 -122195 -169818 -53340 195143 277909 71349
12543G1349M3828J69205j794Q4579J29469j3918j08858p4301j05949j20560j86329
12532a13279r4025J1690J41276P6067m641r588j71007p4302K40182J53945j32984
12521B3334j55362O4732P4950j56270k2301o8757N6077Q0060P8311J11552K31097
12510C17423K20815o4159l16109j07747J14221R6226Q3490K4130n5582j68507
12500A44201k48486j48123O7696N4549p0878J9844J12062K13886L89536L58637
12490H92924j54838k38209j59231j36255N2432J94414J57121q4184l40777k09446
12480b6049m6234M5926l2762j11433j21167J09013K55659J921n293J03153K72966
12469D45700J25648k3884n775n9780l5485n8526m9218k9344k18K9038Q6214j40026
$$ plain form
12543 71349 115177 284382 282588 367167 496636 482718 373860 299559 193610 73050 -113279
12532 -113279 -207304 -195614 -54338 21729 17088 7500 -163507 -237809 2373 156318 23334
12521 23334 -132028 -67296 7654 -148616 -170917 -239674 -183597 -103537 -25226 86326 317423
12510 317423 538238 474079 157970 50223 164444 260670 344160 368290 312708 144201
12500 144201 -104285 -252408 -184712 -130163 -201041 -181197 -69135 144751 534287 892924
12490 892924 738086 499877 340646 204391 256823 451237 608358 524174 183397 -26049
12480 -26049 -72283 -26357 -59119 -170552 -291719 -182706 72953 74874 69581 172734 445700
12469 445700 571348 547464 541689 481909 446424 387898 338680 309336 309118 338156 424370 284344
12457B84344l17330j62226j10407L3246K53084K44235Q4209J82328K37163M4159
12447G72805k90461j53562O7501J49944p6910k32944j84658j10629R3310J69280
12437B03676Q489j93642l201K29408J33126k02388j72291k8327j7600m2690o2631
12426a48071j5114J15802J82093J37691J39331m2101l58942k19914P9048L2210
12416i7967q8332q1531Q3447J89733K39191O1407l01181l36403k99925M6240J80195
12405d05126J92411J52463j22556j97138P9673j7344J3690K00101K13883O2522
12395A72579q449o4687j91636N9639J59768P6927R9470M8884j14146n161N8376
12384B91564k26703M0119K53412J07818l5377o6983j8479p8845K2506j16583O5760
$$ plain form
12457 284344 -32986 -195212 -305619 -272373 -19289 224946 309155 491483 728646 772805
12447 772805 482344 328782 396283 546227 469317 236373 51715 -58914 34396 203676
12437 203676 212165 18523 15322 244730 377856 175468 3177 -25150 -42750 -85440 -148071
12426 -148071 -163185 -47383 134710 272401 411732 369631 10689 -209225 -130177 -97967
12416 -97967 -186299 -267830 -184383 5350 244541 305948 4767 -331636 -631561 -585321 -405126
12405 -405126 -212715 -60252 -182808 -379946 -300273 -317617 -303927 -103826 110057 172579
12395 172579 164130 99443 -92193 -32554 127214 204141 303611 352495 238349 233188 291564
12384 291564 64861 104980 358392 466210 430833 363850 345371 266526 289032 172449 238209
12373B38209L20336J53655k27459l06834j92141j67479M1714P9574m9625J41515
12363C1465K61530J47095J28142n5446j99919j34210j33866n9181m7508p3744
12353a35642l2452N1992K2488n9078Q8624J27016J67108J21613N5007K51614J33851
12342G92141k62127m6541k8229k85942k07227J24575J29562J47393j08835k22823
12332C1947O2099R3483J44380N169o8055J1376o832Q3396j01165p8855k492J53758
12320C28209N7108j94652l48522j09547J51882N762k6532j28576j63891m1841
12310d70600J05824Q8221L5360O546r0453O9075n9919m9099P7177j5556L52016
12299D8592L74685Q9638n4540N4616L7280k57027k98995j68956j50686j43984
$$ plain form
12373 238209 558545 712200 484741 177907 -14234 -181713 -139999 -60425 -110050 31465
12363 31465 292995 440090 568232 512786 312867 178657 44791 -14390 -61898 -135642
12353 -135642 -168094 -116102 -93614 -152692 -64068 62948 230056 351669 406676 658290 792141
12342 792141 530014 483473 455244 169302 -37925 86650 216212 363605 254770 31947
12332 31947 94046 187529 331909 337078 269023 280399 273567 356963 255798 176943 174451 328209
12320 328209 385317 190665 -157857 -267404 -115522 -109760 -136292 -264868 -428759 -470600
12310 -470600 -364776 -276555 -241195 -234649 -325102 -256027 -315946 -365045 -287868 -303424 48592
12299 48592 423277 512915 458375 512991 550271 293244 -5751 -174707 -325393 -469377
12289d69377J08332J84253Q0115n0554j73834j21179k6587K60144K33467J568
12279B6348m3509N4482N2971j04087p7651o971J61591Q6954k85320k57310J9033
12268c73469K32198K29691J9959k47689k90159j68646K15608L61902M03155J43
12258C82693j17075o291j871j32595j43182j42341L8733K40102O8828j6850J1221
12247A81372J03925J16756J4927l1038j33869k46731j31046N7743q6204L7974
12237a16191K82238K34667O1589J3195j23529j33299j39066o3264j24771Q4327
12227b4104J76858J10606N4526j28352m3816j08096j55488q8755j59717J60566
12217b05772J84648K1278k9739j7186Q6037K65082K38478j02630k46103k74857
$$ plain form
12289 -469377 -361045 -176792 -96677 -147231 -321065 -442244 -468831 -208687 24780 26348
12279 26348 -17161 37321 90292 -13795 -91446 -98417 63174 150128 -135192 -392502 -373469
12268 -373469 -141271 88420 108379 -139310 -429469 -598115 -382507 -20605 382550 382693
12258 382693 265618 259327 257456 124861 -18321 -160662 -121929 118173 187001 170151 181372
12247 181372 285297 402053 416980 385942 252073 5342 -125704 -67961 -154165 -116191
12237 -116191 166047 400714 462303 475498 351969 218670 79604 16340 -108431 -24104
12227 -24104 152754 263360 317886 189534 145718 37622 -117866 -206621 -366338 -205772
12217 -205772 -21124 154 -29585 -46771 39266 304348 542826 440196 194093 -80764
12207h0764l0410J22404K12978J05049j7409L1590p202Q7651J68560o9054j81211
12196C42182p178O0505r6461n7457m7001j53242J10021R0218R6557J8453j67523
12185A89074k15610j71454p1628J02309L13271K38591q0137k43674k99416k27590
12175d66264J79169K04875j67508l72064J55918L69420N4863j28907j78123M9344
12165b99277P6634K4086l0512O26K97202L6641O4885K10392o489n1348n8524k22732
12153D1584j64649J71724K61372Q8150k3933m3598r2511L9494J49049n1421k58734
12142A16527k11471j08938J1854P3881l7311J23661J31125j8080j16207m5965
12132h0924P5598l2049J4360N0176n0363O0243J05037m9967j66748p4124L1068
$$ plain form
12207 -80764 -111174 11230 224208 329257 311848 343438 336236 423887 592447 523393 342182
12196 342182 335004 395509 299048 241591 194590 41348 151369 241587 338144 356597 189074
12185 189074 -26536 -197990 -269618 -167309 145962 384553 304416 60742 -238674 -466264
12175 -466264 -287095 -82220 -249728 -621792 -465874 -96454 -41591 -170498 -348621 -299277
12165 -299277 -222643 -198557 -229069 -228443 68759 105400 170285 380677 374188 322840 264316 41584
12153 41584 -123065 48659 310031 398181 374248 330650 238139 277633 426682 375261 116527
12142 116527 -94944 -203882 -192028 -118147 -155458 -31797 99328 81248 -34959 -80924
12132 -80924 -5326 -37375 -23015 27161 -23202 37041 142078 92111 -74637 -148761 -117693
12121a17693N3692R0272Q0383R7983n1372r9345j14748j60367l8872K67880J85233
12110A93046N3484j86p0012O1009P3750L9953j82813j98808O6107J79188Q4614
12099B99332J33911N9611m1660j70549j55200m4507J4884J07825K89363L8542
12089E31552J54322K7653j33149q5417j61694j25674j22897j59981l9431K1984
12079i2732O457M1803k3721R915q5594j10416P4499K01365J19994J13702J6487
12068B71759j81888j61388o0930K10747K22955l3900r0314j2643K17004K32911
12058F14313J8190k39264j53876M5491j38142O888J19156K6637J8311N9274J02281
12047D79259K24122M7691k04496J0098M8762j12013j96621J2463l2322O5567j00043
$$ plain form
12121 -117693 -64001 26271 106654 204637 153265 53920 -60828 -221195 -260067 7813 193046
12110 193046 246530 246344 176332 237341 311091 351044 168231 -30577 35530 214718 299332
12099 299332 433243 492854 451194 280645 125445 80938 95822 203647 493010 531552
12089 531552 685874 713527 580378 494961 333267 207593 84696 -75285 -114716 -92732
12079 -92732 -86275 -44472 -68193 -58278 -143872 -254288 -179789 21576 141570 255272 271759
12068 271759 89871 -71517 -132447 78300 301255 267355 177041 164398 381402 614313
12058 614313 632503 393239 239363 284854 146712 153600 272756 299393 317704 376978 479259
12047 479259 703381 751072 546576 556674 605436 493423 296802 309265 276943 342510 242467
12036B42467l17488j93601k44770n7233K37301J75828J36881j1304J85267J85460
12026C38808k8224j96970j0584r2169r7532P7292L6951j22448O12J6692o7492
12015a45064L768j49355M1871K12924J57381m2788k6372Q5991J39089L6446j66035
12004A47856P9777j50151n03678j03626J4671O2045K13723k7818j95856r0826
11994e53883p1639J2133R9324K04158R4864m5258J28724L54487l1511l19826j80868
11983c09295n320L24328O7274r2481J13657N56K0280J65745P5008J14257J283
11972D75292j53371l13875k24800k66412j62605K96627L02064J44972K13721J59844
11962D71457R550J94544K34292o4396k65322j97823k01381j45110j4438j0775
$$ plain form
12036 242467 -75021 -268622 -513392 -570625 -333324 -157496 -20615 -31919 153348 338808
12026 338808 310584 113614 103030 10861 -86671 -9379 27572 -94876 -94264 -77572 -145064
12015 -145064 -141296 -290651 -248780 -35856 121525 78737 52365 138356 277445 313891 147856
12004 147856 227633 77482 -426196 -529822 -515151 -453106 -239383 -267201 -463057 -553883
11994 -553883 -625522 -613389 -514065 -309907 -215043 -260301 -131577 222910 191399 -128427 -309295
11983 -309295 -314615 9713 76987 -15494 98163 98719 118999 284744 359752 474009 475292
11972 475292 321921 8046 -216754 -483166 -645771 -349144 -47080 97892 311613 471457
11962 471457 481007 675551 909843 845447 580125 382302 180921 35811 21373 10598
11952A0598m7507R6563K12931j3703j66437r5818r0477l8971j7335L8512J68787
11941E7143O9454J27338o053p4222q0136k7646m1472J7216j10555k59627j7811
11930c46371L20832K42453q5227p2625r5314P6072J26978M8746m0700q2418N3832
11919A46258Q6934j18103m1120j29048L261J04990J35226N2742J90965k3137k44532
11908A64436j67738k6441q3212k28020J9199Q7448Q3981L2363R2329l57j16690
11897a42702P1355K40356J05841k49354j69834M2394J6286M733q661r5494j5107
11886b00187Q3941R3446j8455j17561j92410j58239P5000K53900j54094j71959
11876e06618l4534O96j55505J93549M56153L28969l4981l2613j0532n6418J83295
$$ plain form
11952 10598 -36909 59654 272585 258882 92445 -3373 -93850 -132821 -150156 -111644 57143
11941 57143 126597 253935 247882 173660 93524 65878 24406 41622 -68933 -328560 -346371
11930 -346371 -25539 216914 131687 59062 -36252 39820 166798 215544 174844 92426 146258
11919 146258 233192 115089 73969 -55079 -51818 53172 188398 241140 432105 408968 164436
11908 164436 -3302 -29743 -112955 -340975 -321776 -234328 -150347 -117984 -25655 -26012 -142702
11897 -142702 -71347 169009 274850 25496 -144338 -101944 -85658 -80925 -89586 -185080 -200187
11886 -200187 -116246 -22800 -41255 -158816 -351226 -509465 -434465 -180565 -334659 -506618
11876 -506618 -541152 -540456 -695961 -502412 -46259 282710 247729 215116 204584 148166 331461
11865C31461q7321k88681L1522M7270P5873n8832N764M6769k09860k53193n5925
11854d15153K8027Q5985P150J0247j85191k00518J08063J04363k4368M1452J40676
11843b99267J29107K71321J47298J2081j60784j07221M9980J37964Q98k18793
11833c7416r8577J30664j15640j32208j13411q2039n103J6226J43187K63785P8472
11822D7940J26200M9659k22107j27206R2512k60932k60890P0413J90749J52035
11812a41627j72734L674K9171j61713J2320k8380N5175R0793J99158J73396j14509
11801e5276m547Q5821j03425j82749p5530l282j42205k06771j94245P3779J82873
11790f25557K00444M85918L99576R7965Q1103J68958Q7833J31046j02857m22397
$$ plain form
11865 331461 244140 -44541 -13019 34251 110124 51292 57056 103825 -106035 -359228 -415153
11854 -415153 -387126 -301141 -293991 -283744 -468935 -669453 -561390 -457027 -481395 -439943 -299267
11843 -299267 -170160 101161 248459 260540 99756 -7465 42515 180479 181377 -37416
11833 -37416 -135993 -5329 -120969 -253177 -366588 -448627 -453730 -437504 -294317 -30532 47940
11822 47940 174140 223799 1692 -125514 -33002 -293934 -554824 -484411 -293662 -141627
11812 -141627 -314361 -310687 -281516 -443229 -430909 -459289 -404114 -313321 -114163 59233 -55276
11801 -55276 -59823 25998 -77427 -260176 -335706 -338988 -481193 -687964 -882209 -808430 -625557
11790 -625557 -425113 60805 460381 558346 639449 808407 896240 1027286 924429 502032
11780E02032l76120j48900q1013K6221J97367M7512N9899J75655J45418m2157
11770E05914j2042J66964J89066m7427l9111q7023m4369k606k91418k18116J11
11759A19943k3252n7741j06041j60700N4429J8063o5575m0353r5501m8033o638
11748d11399O5245K14227J84437Q165N599M0503J7934q094l2557k91266k78440
11737d85646L7370J9632O615N8459k25713j04055J44928K08512R0735J87336K29045
11726A67218M7627k2581K1318J09654j35753k82811Q3870J05971n0214l6220K01989
11715B10068L13234K90525J65695o52756j137367k38862L16944M8410l6979m0205
11705g61293K5385J11272o486J6577O8095J32373J37363q2193j33448K70415N10131
$$ plain form
11780 502032 125912 -22988 -104001 -77780 119587 167099 226998 402653 548071 505914
11770 505914 493872 660836 849902 802475 763364 676341 631972 629366 337948 119832 119943
11759 119943 96691 38950 -67091 -227791 -173362 -155299 -220874 -261227 -356728 -404761 -411399
11748 -411399 -346154 -131927 52510 60675 66274 106777 124711 116617 84060 -207206 -485646
11737 -485646 -448276 -428644 -422029 -363570 -589283 -693338 -548410 -339898 -249163 -61827 167218
11726 167218 214845 192264 213582 323236 187483 -95328 -11458 94513 44299 8079 210068
11715 210068 523302 813827 979522 326766 -810601 -1049463 -732519 -684109 -721088 -761293
11705 -761293 -735908 -624636 -631122 -614545 -546450 -414077 -276714 -358907 -492355 -221940 288191
11694B88191L07697j8575k99696k60629l9234J79629N16035L28161j02990j98634
11684F99955l6058j16657k61318k35631p3119J27928J82903K7634r446J1886O2730
11673C80807Q2940j17091j21493m0132L248P757J39835j18587l23837o4193J52059
11662a8687J38378J91369J11378l7884k48750j99048J08658J58754R3373K6737
11652C24278r0895n3940Q2927j4689l3430j62158j34659j77917k66473J81371
11642c45585J50757J95520L61899J0987r2449p5810j09722m5765J29597N2177
11632B31606l0968n5024j73382l9287J7395K4920N7198J97708j0626k70151j77672
11621b28283k7625P5838l8798r3592P0652J32420K29174J90746J9771k40334k5555
$$ plain form
11694 288191 595888 577313 277617 16988 -22246 157383 673418 1001579 898589 699955
11684 699955 663897 547240 285922 50291 -22828 105100 288003 315637 306191 318077 380807
11673 380807 463747 346656 225163 185031 188279 196036 335871 217284 -106553 -170746 -18687
11662 -18687 119691 311060 422438 384554 135804 -63244 45414 204168 297541 324278
11652 324278 233383 179443 262370 247681 214251 52093 -82566 -260483 -526956 -345585
11642 -345585 -194828 692 362591 373578 281129 205319 95597 49832 179429 231606
11632 231606 200638 145614 -27768 -67055 -49660 -24740 32458 230166 219540 -50611 -228283
11621 -228283 -255908 -180070 -218868 -312460 -241808 -109388 119786 310532 330303 89969 64414
11610F4414K47915J38063j56851k16581r4609j00713k54438j35410n4777l6117
11600e99104Q6144Q8184J20181J55592M7639r2816r888Q5883o1454l7458K29442
11589A2345J04850J31255j8361j3856K1046q6124o8640O2585O2255k16643k29349
11578b38637k7018r0896j27295R0281K58116K71165J79753k3862Q4411k30206
11568A45812l39859R317N1243O1389K64313J26187O0989J23357k25928l75063
11558i8243j05472j1602Q2175P5557J57616J74899J24054J1902k75893j81542
11548d6549n3593o9029j95790j40610k4818j05999r8939J51557M02040N01639
11538C19909P2554k32909j05514R7609J0751P3114j33055q1344J32936Q6344j07763
$$ plain form
11610 64414 312329 450392 293541 76960 -17649 -118362 -372800 -508210 -562987 -599104
11600 -599104 -512960 -424776 -304595 -149003 -101364 -194180 -204068 -118185 -179639 -217097 12345
11589 12345 117195 248450 230089 216233 237279 151155 82515 145100 207355 -9288 -238637
11578 -238637 -265655 -356551 -483846 -393565 -135449 135716 315469 291607 376018 145812
11568 145812 -194047 -184730 -133487 -72098 192215 318402 379391 502748 276820 -98243
11558 -98243 -203715 -215317 -133142 -57585 100031 274930 398984 410886 134993 -46549
11548 -46549 -100142 -169171 -364961 -505571 -530389 -636388 -735327 -583770 -181730 319909
11538 319909 392463 159554 54040 151649 162400 235514 102459 21115 154051 240395 132632
11527A32632k22609n1699J95166K02272j5590o4541j04858p2773r77P041k7795
11516b3731j26965n5340J37378J73719l2550J03994K06219M5774O0046j36116
11506C52428l08482k6179N6132J22132J87384P1082n339Q5575j26738l27378k35488
11495a54871P3207K53602K38207K3092l9542j26414k26244J3328K01962K3107
11485B79434k20036j24350j8796k16911j17052J80793k9691j94919j0042q9209
11475e60779K9828L02308L75299K15742q4151k70449k90897j06926j12742o1270
11465e64037R2718L8647J06281L78417M32289R5314k84927k47204M1391J42000
11455B30889R9574k23381n38195k27015J81791J57829J31272J83714J83000J15269
$$ plain form
11527 132632 -89977 -141676 53490 255762 240172 175631 70773 -2000 -2977 4064 -23731
11516 -23731 -150696 -206036 -68658 105061 72511 176505 382724 428498 488544 352428
11506 352428 43946 17767 73899 196031 383415 454497 449158 534733 407995 80617 -154871
11495 -154871 -81664 171938 410145 433237 393695 267281 41037 54365 256327 279434
11485 279434 59398 -64952 -83748 -300659 -417711 -236918 -266609 -461528 -471570 -560779
11475 -560779 -530951 -228643 146656 362398 278247 7798 -283099 -390025 -502767 -564037
11465 -564037 -471319 -432672 -326391 52026 484315 579629 294702 47498 88889 230889
11455 230889 330463 107082 -431113 -658128 -476337 -318508 -187236 -3522 179478 294747
11445B94747K6025l3400k04357k67157q7738J71667J37847R1287q6421k32001
11435a89501l6201R5529l1370j27981l06583k59410J6454K28975J94262j02172
11425e17998R7120K24251L6292p3814j22876k1870J4223m1813J0690K0402J15838
11414b59555K4516l9851j74633j90299K8267K57555L23937K04379k3132j15294
11404C5890L6625k658J31053N0508k77239l24198n9073J99735K67040J68920m4098
11393A82505j39646j29476p0314K55961J40990j46853k18617k02552J34931J64578
11383b8493k1052q4916j41618K6481L37749K27202j21803j99824j72792L5813
11373a43253J84462J67082j89685j51580k502k4831J31326K49352K22691J9936
$$ plain form
11445 294747 320772 287372 83015 -184142 -271880 -100213 37634 128921 42500 -189501
11435 -189501 -225702 -130173 -161543 -289524 -596107 -855517 -839063 -610088 -415826 -517998
11425 -517998 -420878 -196627 -160335 -234149 -357025 -378895 -364672 -406485 -395795 -375393 -259555
11414 -259555 -235039 -274890 -449523 -639822 -611555 -354000 -30063 174316 151184 35890
11404 35890 72515 69857 200910 251418 -25821 -350019 -409092 -209357 57683 226603 182505
11393 182505 42859 -86617 -156931 99030 240020 93167 -125450 -328002 -193071 -28493
11383 -28493 -49545 -134461 -276079 -249598 88151 315353 193550 -6274 -179066 -143253
11373 -143253 41209 208291 18606 -132974 -135476 -160307 -28981 220371 443062 462998
11363D62998l23502k94228l5236J29517J78238k5270J56682M65548J99880n1861
11353H62766j31757l47643l60038j71677j37307j31153n0155J9722J31309K11927
11343a04006N3515J6442O3081Q0592M0649j6433l7960J16131K75353Q6802k37049
11332C37117k75491k43455m7526P0209J26973L8074N6383M6926q5695j06737j22054
11321b05276l7972k149o1950l2198Q2170m8343J80280K45739N6389L0843M454
11310B11987R9326L315k48451k18567o2711Q5333J37630J42000N5590K8879j23452
11299A10879j11872L4034m110P6571J14896J87603L8377r4020j40347k55676k21890
11288b65555j07124R9398L51181L74370j10309k18169j08854j50113m9952J32913
$$ plain form
11363 462998 139496 -154732 -189968 -60451 117787 92517 249199 714747 914627 862766
11353 862766 731009 383366 23328 -148349 -285656 -416809 -466964 -447242 -315933 -104006
11343 -104006 -50491 -34049 29032 109624 150273 133840 95880 212011 487364 574166 337117
11332 337117 61626 -181829 -229355 -159146 -32173 5901 62284 109210 23515 -83222 -205276
11321 -205276 -243248 -245397 -307347 -339545 -257375 -305718 -125438 120301 176690 207533 211987
11310 211987 311313 314628 66177 -152390 -215101 -129768 7862 149862 205452 234331 110879
11299 110879 -993 33041 28931 105502 220398 408001 446378 352358 212011 -43665 -265555
11288 -265555 -372679 -273281 77900 452270 341961 123792 14938 -135175 -185127 -52214
11278e2214J15741P8504O8961M1589o2256J18485n4944k16727k4192L4947J42572
11267A90466K6231J908r5044j31803J3036l5761o7441J18319M9218J7708m0925
11256D5912k6307K1012J00569j25849j37600O0525N7913j62862o0712K09967q422
11245b5854j61665k37816j86175j68677r1169P0535K27462J79613o4161l2533
11235d90440K03465K02932n1781k06449p2729M3425l1179K1803L2267Q3484J99454
11224f5748J73331Q2575J4166N9824O9178p5828k15435l31024j1K29255j6947
11213g6664R2420K42240J66841K8902n0545L827j7674j37868q8862J742q2072
11202H2287N6932K47421J86854N5010j29244j44439j53524M7274J36270J17264
$$ plain form
11278 -52214 63527 142031 210992 252581 190325 308810 253866 37139 12947 47894 190466
11267 190466 216697 218605 123561 -8242 4794 -30967 -98408 19911 69129 86837 45912
11256 45912 19605 40617 141186 15337 -122263 -61738 -3825 -166687 -227399 -17432 -25854
11245 -25854 -187519 -425335 -611510 -780187 -871356 -800821 -573359 -393746 -457907 -490440
11235 -490440 -286975 -84043 -135824 -342273 -415002 -371577 -402756 -380953 -348686 -265202 -65748
11224 -65748 107583 190158 204324 264148 333326 257498 42063 -288961 -288972 -59717 -76664
11213 -76664 15756 257996 424837 453739 403194 407021 389347 251479 162617 164359 82287
11202 82287 139219 386640 573494 628504 499260 354821 201297 248571 384841 502105
11192E02105o9367p9206j02305o1997P4199j52878k95752o8358J32621M251L563
11181a13124j18628k22745J2756J96144k3214l1424K00035O4983N301J60656K71635
11170D02375P3416j22167j89452q9008J1543l7209r7913j12193j83420j31430
11160d75458j42366j67763q0930J70692K26419O1873J27288J07583j7275j36519
11150c26456j21620N6160J49880J31754j7686n1456J17348J53556M6987k16712
11140g8245R8943K63092j1338l4304J70655r2248j63764J47439J0745j11541J30717
11129C30151L763j60336m5439j9310J01423J08915J07177n8156l03026j35750
11119g0588l628r684l9899M018n8980n522J38883J20469k8018J23953k717k30166
$$ plain form
11192 502105 432738 353532 251227 189230 263429 110551 -185201 -253559 -120938 -116687 -113124
11181 -113124 -231752 -454497 -441741 -245597 -268811 -300235 -100200 -35217 -29916 130740 402375
11170 402375 475791 353624 164172 75164 86707 49498 -48415 -160608 -344028 -475458
11160 -475458 -617824 -785587 -866517 -695825 -469406 -407533 -280245 -172662 -189937 -326456
11150 -326456 -448076 -391916 -242036 -110282 -127968 -179424 -62076 91480 138467 -78245
11140 -78245 20698 283790 272452 238148 408803 316555 152791 300230 310975 199434 330151
11129 330151 333914 173578 128139 108829 210252 319167 426344 368188 65162 -70588
11119 -70588 -74216 -83900 -123799 -119781 -178761 -184283 -45400 75069 47051 171004 168287 -61879
11107f1879j09085J62020K74750O1788J378M0400K4326n1716o8601K5885J43129
11096D42395R8147j12028k9142j52167l15907M5657M33151J24537r5857j25438
11086C13348j81521L1111J41184j62581l23201k5751Q4754m6931k5161J35070
11076e9679k6731p8029o4111k7841N2173J59134R0670j04818j12872l0679L9727
11065a63056o1092q2866M6163j283J84987K55905m2879j78994p1453J997r3507
11054b06078l31839j52420K06094L57020K24579M5518M0554N1582K7072k1664
11044B40418K2385J61911r5351j17518L3477j01237j73294k5585r0560J2846K16950
11033H4442J70984J25707m0311n7001k21330k39154K8693J27292n9902j09073
$$ plain form
11107 -61879 -170964 -8944 265806 327594 328972 369372 393698 341982 273381 299266 442395
11096 442395 540542 428514 399372 247205 -68702 -23045 410106 534643 438786 313348
11086 313348 131827 162938 304122 141541 -181660 -207411 -122657 -169588 -194749 -59679
11076 -59679 -86410 -164439 -228550 -256391 -204218 -45084 45586 -59232 -172104 -202783 -163056
11065 -163056 -224148 -307014 -260851 -262134 -77147 178758 135879 -43115 -114568 -112571 -206078
11054 -206078 -537917 -690337 -484243 -127223 97356 142874 183428 235010 262082 240418
11044 240418 262803 424714 329363 211845 245322 144085 -29209 -54794 -145354 -132508 84442
11033 84442 255426 381133 340822 283821 62491 -176663 -147970 -20678 -80580 -189653
11023a89653J05958P4856r6473m546J44266K17158q3335j81282l5221J01824K93519
11012C47071P4783p3983J22901r9429k66365o4821j12354j22068O1526K73440
11002A40701J38814O1407K8144K7759n0103O2579k3691q0204k19520l37015j76645
10991d27774K1487J3306Q825P6681L1995J64014K37202K33336J72969j45834O0573
10980D46780K24134N2441k7284j83945j67314o8970p6702l8537r7718j00618k133
10969c9866j81900N8889K67737Q6188j48768j59702k28445j67251J24420J39382
10959b49316J62046J98358J75323Q7477j20081j62694J70292L64099j74659k97199
10949A53646o6639R5965K4521j18543n3521J04l4432M6067J51330K76634L64279
$$ plain form
11023 -189653 -83695 -8839 -105312 -109858 34408 251566 168231 -13051 -48272 53552 347071
11012 347071 421854 347871 470772 371343 104978 40157 -72197 -194265 -132739 140701
11002 140701 279515 340922 369066 396825 346722 409301 385610 305406 85886 -251129 -427774
10991 -427774 -406287 -392981 -384156 -307475 -275480 -111466 125736 359072 532041 386207 446780
10980 446780 670914 723355 696071 512126 344812 275842 199140 160603 62885 -37733 -39866
10969 -39866 -221766 -162877 104860 191048 42280 -117422 -345867 -513118 -388698 -249316
10959 -249316 -87270 111088 286411 373888 253807 91113 261405 625504 450845 153646
10949 153646 87007 182972 207493 88950 35429 35533 1101 47168 198498 475132 839411
10938H39411J36190j82271j21111J40149Q7189j70103k01181j21414k08153k36240
10928c7534r8794Q727J32686J26751j09332j88871j22645l5906J89281J97597
10918F1960J3245o363J03150K93094J7183l58090j85684J50388K36221m4103k65985
10907A5016L5472K69123R4658k6414k21975l34580p1699j25431j55206L3770J40753
10896c46513K29615K25313R6775r3998j25517N5085n0577m0085N8013J08521P1709
10885A88341q2057j77446j30588l3641j19223l6551J42218K04659j24319j55380
10875c23987L2586R9481P1867R7200K48440J89213J32880O1035k76728k79935
10865E2052J39189K32701J07134K36737r1895k83775j30153n0401J52917J87466
$$ plain form
10938 839411 975601 793330 672219 812368 899557 729454 528273 406859 198706 -37534
10928 -37534 -136328 -127601 5085 131836 22504 -166367 -289012 -324918 -135637 61960
10918 61960 75205 68842 171992 465086 482269 124179 -61505 88883 325104 281001 15016
10907 15016 50488 319611 414269 387855 165880 -168700 -240399 -365830 -521036 -487266 -346513
10896 -346513 -116898 108415 205190 111192 -14325 40760 -9817 -49902 8111 116632 188341
10885 188341 106284 -71162 -201750 -235391 -354614 -391165 -248947 -44288 -168607 -323987
10875 -323987 -291401 -191920 -120053 -22853 225587 414800 547680 608715 331987 52052
10865 52052 191241 423942 531076 767813 675918 392143 261990 211589 364506 551972
10855E51972k29773l24289L3897N9383M6590p3973K9254K10486K29787N5042J3920
10844F02296J32397q0779k72383j55350k5074M9224M6332J6876j88054j93515
10834f8030m7909N4654j04042r1181Q1693J49075Q7158J2386n7093k51873j91539
10823d26701N2067O0186J00785J86659L29853J47985j10690o6236o2231q4270
10813A27407k15024j86020n5371J97809L44030K67188m1974j11298j11924o6312
10803A48511N0253P3226j01745k98904j53687J42485L9995j81437j83941N0209
10793d15035J60997m1120J17697K25953J07109o6223q0481J01407K8843j34892
10783D255M9529J38607J58663J69004Q9722N3638Q4644j33734j73264j36049p8764
$$ plain form
10855 551972 322199 -2090 31807 91190 137780 63807 93061 303547 533334 588376 602296
10844 602296 734693 653914 381531 226181 201107 250331 296663 313539 125485 -68030
10834 -68030 -115939 -61285 -165327 -256508 -174815 -25740 61418 73804 16711 -235162 -426701
10823 -426701 -374634 -314448 -213663 -27004 302849 450834 340144 273908 211677 127407
10813 127407 -87617 -273637 -329008 -131199 212831 480019 438045 326747 214823 148511
10803 148511 198764 271990 170245 -128659 -282346 -139861 -99866 -281303 -465244 -415035
10793 -415035 -254038 -295158 -177461 48492 155601 89378 8897 110304 139147 4255
10783 4255 53784 192391 351054 520058 609780 663418 748062 614328 441064 305015 226251
10772B26251J13307R8392m3358k32019k48393L3672J89130j51231k41664l7111
10762b93024K68280K63130J57241o6573j45004m2799R6411J0690o1845j24545
10752F1962q9763J49257j7682N1634K38301L3111j53964j15048o6327j4246M2547
10741A19782m1028n9713J7662N0041k21526j55519J72345J91987P0895R0439N7305
10730B92670L5143J40208J04847k6475J7092n3647k40197l33341k50162o6515
10720c80377j4745R8672K9881k0174O2883J52898M00625K57151j80424l07017
10710I9373m45304p0370K15673J44044J02260k6124Q8622J22105q6725k57761
10700a14207o9355n5107j45325J8615K19262r295k29181L5343K84766L25662J16657
$$ plain form
10772 226251 339558 437950 394592 162573 -85820 -52148 136982 -14249 -255913 -293024
10762 -293024 -24744 238386 395627 329054 184050 141251 237662 248352 186507 61962
10752 61962 -27801 121456 103774 155408 393709 426820 272856 157808 91481 77235 119782
10741 119782 78754 19041 36703 86744 -134782 -290301 -117956 74031 144926 235365 292670
10730 292670 327813 468021 572868 546393 563485 509838 269641 -63700 -313862 -380377
10720 -380377 -395122 -296450 -266569 -286743 -223860 -70962 329663 586814 406390 99373
10710 99373 -345931 -416301 -200628 -56584 45676 19552 108174 230279 143554 -114207
10700 -114207 -183562 -238669 -383994 -365379 -146117 -155412 -384593 -349250 -64484 261178 377835
10689C77835J62370R3552l9402J02767J21051k0099k10813L020J05055j28786
10679E66550k36151k93709j89700Q3870L2287J8016K11326o3800m15126o0115
10669c46552J88586J34644l8326r8706L9637J35500R7979m3881m1346j26526j50254
10658b49245L3681K48792P2585j22897n0710R4159P3956j54983j51119J33736
10648g2045L3912J7893P7146Q3375L3131J20903P3301j29248J5337K1850k25631
10637D9924j64234j35701k68746l7563K40191J45426j54444j43734r443O0549
10627d17775O5003K4736j07669L352K07537J09418J07115J73194K92363K30688
10617F87962p8191j48819P6716K0244q8902r7106n9459L2316o9138l2548m0989
$$ plain form
10689 377835 540205 633757 594355 697122 818173 798074 587261 590281 695336 566550
10679 566550 330399 36690 -153010 -69140 -36853 -18837 192489 128689 -286437 -346552
10669 -346552 -157966 -23322 -61648 -160354 -120717 14783 112762 68881 27535 -98991 -249245
10658 -249245 -215564 33228 105813 -17084 -67794 26365 100321 -54662 -205781 -72045
10648 -72045 -38133 -20240 56906 140281 173412 294315 367616 238368 253705 275555 49924
10637 49924 -114310 -250011 -518757 -556320 -316129 -170703 -325147 -468881 -478324 -417775
10627 -417775 -352772 -328036 -435705 -432353 -224816 -115398 -8283 164911 457274 687962
10617 687962 609771 460952 537668 557912 469010 371904 312445 344761 275623 243075 202086
10606B02086q3993Q5499K64531J88421j11349k48104l055n3546k87321O4319J83269
10595B00757P5586N3233J36758L3189j73262k05173j82460l4518j3127j5690J47914
10584B3207K80988K46462L3768k87481m45276k69397m9639M3137O6092M8849k3879
10573c33169q3477m8959l5045J34145m991J1206J31696J02041J76140J00545q2987
10562F7145j25975k4610N7679P2038l3090P3906L1153j30820J43800K25615J4336
10551C71177q7013k05875l42176j78185M6074O352O1209O9120q6457l2548Q652
10540c69670L1380J69704J76667j9553K2619k3567J44361J69577j88044j12380
10530A094Q4010K06768J37506k6272j13189j96399k8991l2459j25768L9909N0059
$$ plain form
10606 202086 118093 203592 468123 656544 545195 297091 294036 240490 -46831 17488 200757
10595 200757 276343 329576 466334 499523 326261 121088 -61372 -95890 -109017 -124707 23207
10584 23207 304195 550657 584425 296944 -148332 -417729 -467368 -424231 -358139 -309290 -333169
10573 -333169 -416646 -465605 -500650 -366505 -371496 -360290 -228594 -126553 49587 150132 67145
10562 67145 -58830 -83440 -25761 46277 13187 87093 118246 -12574 131226 356841 371177
10551 371177 284164 78289 -263887 -442072 -395998 -389646 -328437 -259317 -345774 -378322 -369670
10540 -369670 -338290 -168586 8081 -11472 11147 -12420 131941 301518 113474 1094
10530 1094 85104 291872 429378 403106 289917 93518 64527 32068 -93700 -53791 -3732
10519c732K1077J39154L04057n4202k39971P3452N986j89345q7477K64191J89380
10508D22570r3007k41348p2806J06257K60279J68555m5990k10447j07576J20746
10498C07233L1800j88758l16142o9950Q6803K24276O2379l8057j03599k13548
10488b17563K4961K17184Q4103l8774k0723n8066N0423J7081o6942o9346M6959
10477c0703m8153n7827O1411J28196J65930P8942j85043k83819j94279m8173K2227
10466c91291K15643K49944K6967n2582l5066j57297k622r8237O1118L35684J01184
10455B53445q3422k18538P617J4721M1425J37453K03378j2755j33850P9944J74103
10444D63521j17493k05741p1107J84585k092j96714j03279r2432J67995N2408
$$ plain form
10519 -3732 17345 156499 460556 406354 166383 239835 245821 56476 -31001 233190 422570
10508 422570 329563 88215 15409 121666 381945 550500 504510 294063 186487 307233
10498 307233 339033 150275 -165867 -235817 -149014 75262 137641 99584 -4015 -217563
10488 -217563 -192602 24582 108685 69911 49188 -8878 41545 58626 -8316 -77662 -30703
10477 -30703 -78856 -136683 -75272 52924 218854 297796 112753 -171066 -365345 -413518 -391291
10466 -391291 -175648 74296 101263 48681 13615 -143682 -146304 -244541 -183423 152261 253445
10455 253445 170023 -48515 -40898 -26177 15248 152701 356079 343324 209474 289418 463521
10444 463521 346028 140287 69180 253765 251673 54959 -48320 -140752 27243 79651
10434G9651L9008K19815P1505j8095m8497j34972l17677l03670o3700j0259J55093
10423c31798M60989M62173J1621k07347l7703j29993k19317Q350J08206K6658
10413A51839p1308k6365k7399j8493R8513Q2165j8327l2069K06166O9595k4207
10402C90110k71533k41604Q5540R1935q0085M3190O0486j37162l39836k88161
10392f87120k3371J66141K09077J230k05142O2205K26058P5253l4748P000N7025
10381a46392N8791J28057m7949k12963j72452r6884K3830L2486J11733K10930
10371a10813J33644J38648P5750l11925j96338l925K7606p4661m5771K1295J5580
10360c30910J48355J78631J02098J49879o0749k56347j72105J55610J44048o1144
$$ plain form
10434 79651 118659 338474 409979 391884 343387 208415 -109262 -412932 -476632 -486891 -331798
10423 -331798 129191 591364 602985 395638 357935 227942 8625 16975 125181 151839
10413 151839 80531 54166 26767 8274 106787 188952 170625 138556 344722 414317 390110
10402 390110 118577 -123027 -37487 54448 -25637 17553 78039 -59123 -398959 -687120
10392 -687120 -710491 -544350 -335273 -334043 -539185 -476980 -250922 -175669 -210417 -203417 -146392
10381 -146392 -87601 40456 -7493 -220456 -392908 -489792 -465962 -433476 -321743 -110813
10371 -110813 22831 161479 237229 -74696 -271034 -274959 -247353 -322014 -367785 -346490 -330910
10360 -330910 -182555 -3924 98174 248053 187304 -69043 -241148 -85538 58510 -2634
10350b634n3743m009n4184j49964J45527J95662Q9173j54937k18881K82396K91901
10339C66307J15587o4109j15403L0436J723j68114k79780j88383R4287m7526J4830
10328b40145K59016m0013q2493J5720M0010J45735J43840K4091p3719j51923r5316
10317e5197j41433n1760J78338J99136R1148j15861j46771R3696K27056K27129
10307E05481O3424j1125j93806n2067l610p149Q7253L896Q6587Q7067j1649k180
10295E52122q1168j50486k37180j38365r071Q8060K33242J96820j0194q515j14736
10284C20529j03435r8423r3435M2460R0670O2788o4578j4799O1451k58011j22456
10273a77239K86615J20578m752L8598J7273K7323o0963M44j62947j13939J29075
$$ plain form
10350 -2634 -56377 -60386 -114570 -264534 -119007 76655 165828 10891 -207990 74406 366307
10339 366307 481894 417785 302382 332818 334541 166427 -113353 -301736 -207449 -254975 -240145
10328 -240145 18871 -21142 -103635 -87915 -47905 97830 241670 265761 192042 40119 -55197
10317 -55197 -196630 -248390 -70052 129084 220232 104371 -42400 51296 278352 505481
10307 505481 568905 557780 363974 311907 308297 301148 388401 392297 478884 565951 554302 552122
10295 552122 470954 320468 83288 -55077 -64148 23912 257154 453974 443780 435265 320529
10284 320529 217094 118671 25236 67696 158366 221154 156576 141777 203228 -54783 -177239
10273 -177239 109376 229954 225202 263800 281073 308396 247433 247877 84930 -29009 100066
10262A00066J12622L9927j08972j26143J68738K41438J73301J33990j47145k51381
10252C36441k24343l2975K2386M8191j05125k10397K4J44350J99518K12858P2937
10241D63865j38761j22820j59069k97236k20892q1421J11573K40439J74256N0719
10231B0653m883K0407j71539o4341P8450r0944j67214R358Q913k5081o6635M6232
10219d06624L42925J60718j1449L4068J70734j9984j34624P7131L06996J62637
10209F82528k22545j8198J17733P9509P9481K9919j16671o2901k70114l90567
10199i1826j09861N0202m210L288J02507K5874p0940k35918j6576P0100Q4504
10188a92856J23557j2390j64830j37139M167M2687p0531k9506J71671J53434j30082
$$ plain form
10262 100066 212688 252615 143643 17500 186238 427676 600977 734967 587822 336441
10252 336441 112098 79123 101509 149700 44575 -165822 -165798 -21448 178070 390928 463865
10241 463865 325104 202284 43215 -254021 -474913 -556334 -444761 -204322 -30066 20653
10231 20653 15770 36177 -135362 -199703 -121253 -212197 -379411 -370053 -361140 -386221 -452856 -406624
10219 -406624 -63699 97019 85570 119638 290372 270388 135764 212895 519891 682528
10209 682528 459983 441785 559518 639027 718508 748427 631756 568855 298741 -91826
10199 -91826 -201687 -151485 -155695 -152407 -49900 -24026 -94966 -330884 -347460 -277360 -192856
10188 -192856 -69299 -81689 -246519 -383658 -379491 -336804 -407335 -436841 -265170 -111736 -241818
10177b41818k16890q4199P4565J41559J89392J88839l4341k8753j98990k56955
10167d67591j36398J54341M92886L09748J5474j15425j25726J19590R851k19577
10157C7173j47955m868n2147j04414p9406j4915n6637J60565J22281j3384j1662
10146a65369J07620K50150k2461j82673j07007J17479J05800j53393l0625j07732
10136a88211j06536l2428J47825J86485J79047l7108j71379k84314j70307J84310
10126b92616J81894J04867m1696j33748O2877R584o5556M0442j16946l3536Q0566
10115b03868k36482j14360l89j0977k1441m4843L7992n2881K67132L55364r4908
10104a19661k35846o713N3544L0203l7777p2048j527K71576K28663J10274k7133
$$ plain form
10177 -241818 -458708 -542907 -468342 -326783 -137391 51448 17107 -11646 -210636 -467591
10167 -467591 -603989 -449648 43238 352986 368460 253035 127309 246899 256750 37173
10157 37173 -110782 -115650 -167797 -272211 -351617 -366532 -423169 -262604 -140323 -153707 -165369
10146 -165369 -57749 192401 169940 -12733 -119740 -2261 103539 -49854 -80479 -188211
10136 -188211 -294747 -327175 -179350 7135 186182 149074 -22305 -306619 -476926 -292616
10126 -292616 -110722 -5855 -47551 -181299 -118422 -108838 -174394 -133952 -250898 -284434 -203868
10115 -203868 -440350 -554710 -555099 -566076 -587517 -632360 -594368 -647249 -380117 -24753 -119661
10104 -119661 -355507 -362220 -308676 -278473 -316250 -388298 -389825 -118249 110414 220688 193555
10093A93555p7461l098J56443J46747J6615k54793j39955k7920o6315j94345j43775
10082c94302o0219P6087J70018J02020N6289K6788p4864n417n4276Q693P7801
10071g1382J21531j52916l28205k24003p0289Q8663K40788M54837K43737p3010
10061B29751j90988j74264J6841N3193j5614P8148J89698p1871k75862j20945
10051b81913k5914k4768J31641K27947q289j66197L6271K43631L8546R5273L0677
10040B96905J5578N0713n9182k48269m03640k04141K6297K80239J85931N2949
10030f620O6045J47055L22854P864k54962k21071j13356j71377n6421j5706j65907
10019d61602Q8451L26685m86k53209j29492R3494r7154j47072L3253J57330K26258
$$ plain form
10093 193555 116094 112996 269439 416186 432801 178008 38053 10133 -56182 -250527 -394302
10082 -394302 -454521 -378434 -208416 -106396 -50107 -23319 -98183 -103600 -157876 -149183 -71382
10071 -71382 50149 -102767 -430972 -654975 -725264 -636601 -395813 59024 302761 229751
10061 229751 38763 -135501 -118660 -65467 -81081 -2933 186765 114894 -160968 -281913
10051 -281913 -307827 -332595 -200954 26993 18704 -147493 -111222 132409 170955 266228 296905
10040 296905 312483 363196 304014 55745 -347895 -552036 -525739 -245500 -59569 -6620
10030 -6620 59425 206480 529334 537198 282236 61165 -52191 -223568 -279989 -295695 -461602
10019 -461602 -373151 -46466 -46952 -300161 -429653 -336159 -433313 -580385 -547132 -389802 -163544
10008a63544J71280p0284k44737k8624K18552L6767q8139n0975J05481K41440
9998A27217L1512j07044J23057J81823j20958k77643R53J62919J9406l9774n4989
9987D6479j8204j0326O8664l8133j97429j5050J53083R7494j50375j81963j1445
9976b57205l4382j63742j23449R1770Q2420K01803K78988R1494J6006Q5494o6319
9965B02878j93305j82691n4314J77347p797q3813O2112p6673J96496r9349n35984
9954e95093l29457P1688L7529K90551L55391K15448K5783o6808K867P1712j5433
9943F4178r2261O102K27752M22886L7579j35828j66771j73491J8492J17915K32671
9932E59224O372j78439k33089q8071n9745o4007J98075J48611r1959l02145j41985
$$ plain form
10008 -163544 7736 -62548 -307285 -335909 -117357 -80590 -168729 -219704 -114223 127217
9998 127217 158729 51685 174742 356565 235607 -42036 -41083 121836 141242 101468 46479
9987 46479 28275 17949 86613 48480 -148949 -163999 -10916 86578 -63797 -245760 -257205
9976 -257205 -291587 -455329 -578778 -487008 -404588 -202785 76203 167697 183703 269197 202878
9965 202878 9573 -173118 -227432 -50085 -57882 -141695 -79583 -156256 40240 -59109 -595093
9954 -595093 -924550 -852862 -815333 -524782 -169391 46057 71840 5032 7899 79611 64178
9943 64178 -28083 -21981 205771 628657 666236 530408 363637 190146 208638 326553 559224
9932 559224 565596 387157 154068 65997 6252 -57755 140320 288931 196972 -105173 -247158
9921b47158J74923J83384j27881q1939N6715O2334Q1710o8893j62301k05918j37413
9910d72437J71849K01883M904j26441N6675K83346J35042j24939j93403o4603
9900a28124J33677J52106K8275L0262R810r7622j76224n4928Q656R6041N4815
9889E6744L1929j6297j89553n3985K06807J54240J0838k8214R5031K0044k52593
9878C4991k19515j29235L7412J00320n7180j14018n733j9068m2274j73652o3690
9867f51642J52065J47458J94819N7478M0199J65592q733p0243j9855r342J01602
9856I9398J07991k4180J7368K9994q8281k02322N9812N7961n9174M1345J05068
9845A44980P1522o9823j29388j01152k8080P5530q1891q0901p7691j64990J2683
$$ plain form
9921 -247158 -72235 111149 -16732 -98671 -41956 20378 102088 33195 -129106 -335024 -472437
9910 -472437 -300588 -98705 -93801 -220242 -163567 119779 254821 129882 -63521 -128124
9900 -128124 5553 157659 185934 216196 226006 128384 -47840 -102768 -94112 1929 56744
9889 56744 88673 72376 -117177 -171162 35645 189885 200723 172509 267540 287584 34991
9878 34991 -184524 -313759 -276347 -176027 -233207 -347225 -352958 -372026 -414300 -587952 -651642
9867 -651642 -499577 -352119 -157300 -99822 -59623 105969 97236 26993 7138 -2204 99398
9856 99398 207389 183209 200577 230571 142290 -60032 -220 57741 -1433 39912 144980
9845 144980 216502 146679 17291 -83861 -111941 -36411 -118302 -199203 -276894 -441884 -429201
9834d29201K57377J15195J39240K70061l921N4411n3290j39793k3745r3031l41182
9823b47879j15074K34491J18883j06469k9625k7608r5017J43993Q131q8877o8657
9812b73708O6878J1548k34378p2498K07531Q5463j54357n3870Q3812J65551Q6502
9801h1526R6183N3912m4355R7847j8589L8142n1840j98784r8133L7595Q2595k06154
9789b93107j71774m6587j48450l582J15920Q998J4811j44334r7797N6110K32659
9778d77133K19566L8281q7059l0823L3338j30209j5693J60980J04190J10995K58126
9767A84559K05388N1912r4287N0707J53262j17892j76776j2355p6682j19924n2340
9756d428N858j69073j61952j79855j5693L28540K67816Q0019j05597j27597k04052
$$ plain form
9834 -429201 -171824 -56629 82611 352672 348751 403162 349872 210079 186334 93303 -247879
9823 -247879 -362953 -128462 -9579 -116048 -145673 -173281 -268298 -124305 -116174 -205051 -273708
9812 -273708 -206830 -195282 -429660 -502158 -294627 -209164 -363521 -417391 -333579 -168028 -81526
9801 -81526 14657 68569 24214 122061 103472 141614 89774 -109010 -207143 -169548 -86953 -293107
9789 -293107 -464881 -511468 -659918 -663500 -547580 -538582 -523771 -668105 -765902 -709792 -477133
9778 -477133 -257567 -219286 -306345 -337168 -303830 -434039 -449732 -288752 -184562 -73567 184559
9767 184559 389947 441859 347572 398279 551541 433649 256873 244518 167836 47912 -4428
9756 -4428 1430 -167643 -329595 -509450 -525143 -196603 71213 151232 45635 -81962 -286014
9745b86014j41542K43642K61681J7351J56970Q3321k03099K6363K11730j39724
9735B30679j34748N4977p2547j8938k1127j11890j40794o5287Q9388o9417k35114
9724d94818j70376j49042L1911K90420M03016L35822P3568k69928k23439Q2150
9714i0716J67017J14713M2171J5194N175j95166j72984o0338n7376j14771j0418
9703c57499J06038J18155J80993O1353L0751l0365Q904Q703O1001K11738J15080
9692E14852M3340k0678j55655k46280k12960r5266K26151K16267k0071k29922
9682A9778k2233q622j14759J31291L2452j08990j9210l5665j05378j67846n235
9671d04417J76865J40424N7935K73874J41230R5041J44110L2123k11288k69388
$$ plain form
9745 -286014 -427556 -183914 77767 95118 252088 335409 132310 158673 370403 230679
9735 230679 95931 150908 78361 59423 38296 -73594 -214388 -279675 -190287 -259704 -494818
9724 -494818 -665194 -814236 -782325 -491905 -88889 246933 320501 50573 -172866 -90716
9714 -90716 76301 191014 233185 248379 253554 58388 -114596 -174934 -232310 -347081 -357499
9703 -357499 -251461 -133306 47687 109040 139791 109426 118330 127033 188034 399772 514852
9692 514852 558192 537514 381859 135579 -77381 -172647 53504 269771 249700 19778
9682 19778 -2455 -11077 -125836 5455 37907 -71083 -90293 -125958 -231336 -399182 -404417
9671 -404417 -227552 -87128 -29193 244681 385911 480952 625062 657185 445897 176509
$$ [...]
##END NTUPLES=NMR SPECTRUM
##END=
