##TITLE=C13_SA_32.155
 CDCl3, 23000 sc

 19.11.2019
##JCAMPDX= 6.0         $$ Bruker NMR JCAMP-DX V2.0
##DATA TYPE= NMR SPECTRUM
##DATA CLASS= NTUPLES
##ORIGIN= UXNMR, Bruker Analytische Messtechnik GmbH
##OWNER= root
$$ XWIN-NMR		Version 3.5
$$ Wed Nov 20 13:44:11 2019 Russian Standard Time (UT+4h)  she@DPX200
##.OBSERVE FREQUENCY= 50.327896
##.OBSERVE NUCLEUS= ^13C
##.ACQUISITION MODE= SIMULTANEOUS
##.ACQUISITION SCHEME= undefined
##.AVERAGES= 19420
##.DIGITISER RES= 17
##SPECTROMETER/DATA SYSTEM= spect
##.PULSE SEQUENCE= zgpg30
##.SOLVENT NAME= CDCl3
##.SHIFT REFERENCE= (INTERNAL, CDCl3, 0, 222.624)
##AUDIT TRAIL= $$ (NUMBER, WHEN, WHO, WHERE, WHAT)
$$ ##TITLE= Audit trail, XWIN-NMR		Version 3.5
$$ ##JCAMPDX= 5.01
$$ ##ORIGIN= Bruker BioSpin GmbH
$$ ##OWNER= she
$$ F:/spectra/data/she/nmr/c13/1/pdata/1/auditp.txt
$$ ##AUDIT TRAIL=  $$ (NUMBER, WHEN, WHO, WHERE, WHAT)
(   1,<2019-11-20 10:46:53.84 +0400>,<she>,<DPX200>,
      <created by zg, POWCHK disabled, PULCHK disabled
       terminated by command 'halt'
       configuration hash MD5:
       00 E9 B6 7A A2 85 ED C7 34 08 36 98 17 FE 4E 26
       data hash MD5: 32K
       DB FB C0 7B 98 66 A0 24 3F 83 5C 76 62 B2 09 D1>)
(   2,<2019-11-20 13:42:24.81 +0400>,<she>,<DPX200>,
      <Start of raw data processing
       efp BC_mod = 2 LB = 1 FT_mod = 6 PKNL = 1 PHC0 = -240.1455 PHC1 = 38.20636 SI = 32K 
       data hash MD5: 32K
       8A 75 52 AD 45 F1 7C 05 49 71 4C 28 8E 55 A1 91>)
(   3,<2019-11-20 13:42:38.67 +0400>,<she>,<DPX200>,
      <pk PHC0 = 4.678916 PHC1 = 0 
       data hash MD5: 32K
       AE 02 4F 78 12 EC 94 48 3A B0 C6 53 8D ED FB A0>)
(   4,<2019-11-20 13:42:41.78 +0400>,<she>,<DPX200>,
      <abs ABSG = 5 
       data hash MD5: 32K
       FF 56 3C 05 8C C3 03 04 5E 58 EB CE EB F6 6C 33>)
(   5,<2019-11-20 13:43:18.70 +0400>,<she>,<DPX200>,
      <pk PHC0 = -2.480142 PHC1 = 2.000001 
       data hash MD5: 32K
       BE 94 A5 4B 15 14 58 07 05 AA 18 DE AD E6 13 26>)
(   6,<2019-11-20 13:43:21.93 +0400>,<she>,<DPX200>,
      <abs ABSG = 5 
       data hash MD5: 32K
       FA 8B 35 16 D1 DF 4B B5 DF E6 51 B0 7E 13 DB F6>)
$$ ##END=
$$ 
$$ hash MD5
$$ C0 49 30 60 B1 9F 49 1C 44 08 D1 92 F1 6B 17 AC
##$RELAX= 
##$RELAX= 
##$RELAX= 
##$RELAX= 
##$RELAX= 
##$RELAX= 
##$RELAX= 
##$RELAX= 
$$ Bruker specific parameters
$$ --------------------------
##$DU= <F:/spectra>
##$EXPNO= 1
##$NAME= <c13>
##$PROCNO= 1
##$TYPE= <nmr>
##$USER= <she>
##$AMP= (0..31)
100 100 100 100 100 100 100 100 100 100 100 100 100 100 100 100 100 100 
100 100 100 100 100 100 100 100 100 100 100 100 100 100 
##$AQSEQ= 0
##$AQ_mod= 1
##$AUNM= <au_zg>
##$AUTOPOS= <>
##$BF1= 50.322709
##$BF2= 200.13
##$BF3= 50.322709
##$BF4= 500.13
##$BF5= 500.13
##$BF6= 500.13
##$BF7= 500.13
##$BF8= 500.13
##$BYTORDA= 1
##$CFDGTYP= 0
##$CFRGTYP= 5
##$CHEMSTR= <none>
##$CNST= (0..31)
1 1 145 1 1 1 1 1 1 1 1 1 1 1 1 1 1 1 1 1 1 1 1 1 1 1 1 1 1 1 1 1 
##$CPDPRG= <waltz16>
##$CPDPRG1= <>
##$CPDPRG2= <waltz16>
##$CPDPRG3= <>
$$ [...]
##$SUBNAM4= <"">
##$SUBNAM5= <"">
##$SUBNAM6= <"">
##$SUBNAM7= <"">
##$SUBNAM8= <"">
##$SUBNAM9= <"">
##$SW= 239.972175391363
##$SWIBOX= (0..15)
0 1 3 0 0 0 0 0 0 0 0 0 0 0 0 0 
##$SW_h= 12077.2946859903
##$TD= 32768
##$TD0= 1
##$TE= 0
##$TE2= 300
##$TE3= 300
##$TEG= 300
##$TL= (0..7)
120 120 120 120 120 120 120 120 
##$TP= (0..7)
150 150 150 150 150 150 150 150 
##$TP07= 0
##$TPNAME0= <>
##$TPNAME1= <>
##$TPNAME2= <>
##$TPNAME3= <>
##$TPNAME4= <>
##$TPNAME5= <>
##$TPNAME6= <>
##$TPNAME7= <>
##$TPOAL= (0..7)
0.5 0.5 0.5 0.5 0.5 0.5 0.5 0.5 
##$TPOFFS= (0..7)
0 0 0 0 0 0 0 0 
##$TUNHIN= 0
##$TUNHOUT= 0
##$TUNXOUT= 0
##$USERA1= <user>
##$USERA2= <user>
##$USERA3= <user>
##$USERA4= <user>
##$USERA5= <user>
##$V9= 5
##$VALIST= <valist>
##$VCLIST= <CCCCCCCCCCCCCCC>
##$VD= 0
##$VDLIST= <DDDDDDDDDDDDDDD>
##$VPLIST= <PPPPPPPPPPPPPPP>
##$VTLIST= <TTTTTTTTTTTTTTT>
##$WBST= 1024
##$WBSW= 4
##$XGAIN= (0..3)
0 0 0 0 
##$XL= 0
##$YL= 0
##$YMAX_a= 70747071
##$YMIN_a= -114491246
##$ZGOPTNS= <>
##$ZL1= 120
##$ZL2= 120
##$ZL3= 120
##$ZL4= 120
##$ABSF1= 222.624
##$ABSF2= -17.3728
##$ABSG= 5
##$ABSL= 3
##$ALPHA= 0
##$AQORDER= 0
##$ASSFAC= 0
##$ASSFACI= 0
##$ASSFACX= 0
##$ASSWID= 0
##$AUNMP= <proc_1d>
##$AZFE= 0.1
##$AZFW= 0.5
##$BCFW= 0
##$BC_mod= 2
##$BYTORDP= 0
##$COROFFS= 0
##$CY= -3
##$DATMOD= 1
##$DC= 0
##$DFILT= <>
##$DTYPP= 0
##$F1P= 0
##$F2P= 0
##$FCOR= 0.5
##$FTSIZE= 32768
##$FT_mod= 6
##$GAMMA= 0
##$GB= 0
##$INTBC= 1
##$INTSCL= 4.134877e-10
##$ISEN= 128
##$LB= 1
##$LEV0= 0
##$LPBIN= 0
##$MAXI= 10000
##$MC2= 0
##$MEAN= 0
##$ME_mod= 0
##$MI= 0.1934396
##$NCOEF= 0
##$NC_proc= 2
##$NLEV= 6
##$NOISF1= 120.0001
##$NOISF2= 80.00006
##$NSP= 0
##$NTH_PI= 0
##$NZP= 0
##$OFFSET= 222.624
##$PC= 1.4
##$PHC0= -237.9467
##$PHC1= 40.20636
##$PH_mod= 1
##$PKNL= yes
##$PPARMOD= 0
##$PSCAL= 0
##$PSIGN= 0
##$REVERSE= no
##$SF= 50.3227315989248
##$SI= 32768
##$SIGF1= 140
##$SIGF2= 120
##$SINO= 11.81781
##$SIOLD= 32768
##$SREGLST= <13C.CDCl3>
##$SSB= 0
##$STSI= 32768
##$STSR= 0
##$SW_p= 12077.2946859903
##$SYMM= 0
##$S_DEV= 0
##$TDeff= 32768
##$TDoff= 0
##$TI= <>
##$TILT= no
##$TM1= 0
##$TM2= 0
##$TOPLEV= 0
##$USERP1= <user>
##$USERP2= <user>
##$USERP3= <user>
##$USERP4= <user>
##$USERP5= <user>
##$WDW= 1
##$XDIM= 32768
##$YMAX_p= 492414805
##$YMIN_p= -2563938
$$ End of Bruker specific parameters
$$ ---------------------------------
##NTUPLES= NMR SPECTRUM
##VAR_NAME=  FREQUENCY,     SPECTRUM/REAL,   SPECTRUM/IMAG
##SYMBOL=    X,             R,               I
##VAR_TYPE=  INDEPENDENT,   DEPENDENT,       DEPENDENT
##VAR_FORM=  AFFN,          ASDF,            ASDF
##VAR_DIM=   32768,         32768,           32768
##UNITS=     HZ,            ARBITRARY UNITS, ARBITRARY UNITS
##FACTOR=    0.368581032318806, 1,           1
##FIRST=     11203.0474431902, 0,            0
##LAST=      -874.247242800138, 0,           0
##MIN=       -874.247242800138, -2563938,    0
##MAX=       11203.0474431902, 492414805,    0
$$ Real data points
##PAGE= N=1
##DATA TABLE= (X++(R..R)), XYDATA
$$ [...]
15953g79012k48120J17454O87138M40389q0361n0463r995j00687m41788l1101
15943d96546j77926j86760J59083j05050m20915j22155L2286r572l533l9166L92519
15932i77735k1214k21609j49900J09506L56129N21249J63640l03361K1291O68044
15922A66040J62466l01136m37194n18700P8373L00910R7373j74911l12150j6120
15912i55049M63072L24652L01525M24616k9521m58747k59170K28847l29685p53082
15902a042542j03897M77701P28262K82974K51532J94129k99634n59090j63746
15893b34311K52113J34383j28565j12989j51426r352J5316j89098j72279J96535
15883c99673k01440m54546R7412J97571R9468j58974l05993l74632k52897J56543
$$ y = [-779012, -1027132, -909678, -222540, 217849, 137488, 87025, 77030, -23657, -465445, -496546, -674472, -861232, -702149, -807199, -1228114, -1350269, -1317983, -1327555, -1331088, -1370254, -977735, -998949, -1220558, -1370458, -1260952, -904823, -383574, -219934, -523295, -502004, 166040, 328506, 27370, -409824, -928524, -850151, -549241, -451868, -626779, -938929, -955049, -491977, -167325, 134200, 558816, 529295, 70548, -188622, 40225, -289460, -1042542, -1146439, -668738, 59524, 342498, 594030, 788159, 488525, -70565, -234311, 17802, 152185, 23620, -89369, -240795, -250147, -234831, -423929, -596208, -399673, -601113, -1055659, -958247, -760676, -661208, -820182, -1126175, -1500807, -1753704, -1597161]
15873a597161O94475M68871J39099q4831j5045L73020j41697l97200K4496J3955
15863e22018M0112L11467k04036J68657L71282J89756J80626J4489J18662J55100
15853H24097m84591o91583k23861L00349M28438J6689k58279l89360n7009p7596
15843f12706k46231l08628j2045L18915R5368q171K04054L10883K30977l23926
15833c51510j05149J79298K91442m1841m2481O8911J07234J57218q9944j29517
15823D3661l98778m13192j44089j08913P575L61918K02548j51084L06310K36424
15813e7620k58193l36935k78155l00672m3830N03705M20494j71949M597m8286
15803e66844j235M54330K82950j5789j44240m8967O5323J87231q1215k65066j83055
$$ y = [-1597161, -902686, -433815, -294716, -379547, -394592, -21572, -163269, -560469, -535973, -522018, -481906, -170439, -374475, -205818, 165464, 355220, 535846, 550335, 668997, 824097, 339506, -352077, -575938, -275589, 152849, 169538, -88741, -478101, -535110, -612706, -858937, -1167565, -1179610, -860695, -765327, -773498, -569444, -258561, -27584, -351510, -456659, -277361, 14081, -27760, -70241, -1330, 105904, 263122, 173178, 43661, -355117, -768309, -912398, -1021311, -1013736, -651818, -449270, -600354, -294044, -57620, -315813, -652748, -930903, -1231575, -1275405, -771700, -351206, -523155, -518558, -566844, -568079, -113749, 169201, 153412, 9172, -39795, 25528, 212759, 131544, -133522, -316577]
15792c16577J0902r8086l01476J59902K57554J52565L2650K53224J64387k82695
15782C2350k20748p9318o130j56114l63138j18096M58640L66503q2029J3490R5022
15771e9568K43515j14263l42646J11365M7312q8462K64316L18436J59705K97447
15761H37157M5555m01552l76353k30324J09815m4441k51835n8601Q9714j2790
15751b93655J15443K38121J60139L7505L4600J14389L3156J03928K94724N41241
15741A379591N2037l71599n11018J16540K96362O0323l65587m04898l04311j88659
15731b41219O4178L07587K25461j10134k1033J82681j8118k84696k48048L06416
15721A63075K33851j05355k29664K03587L60469K1897K2342L507m2401l62717
$$ y = [-316577, -305675, -403761, -705237, -545335, -287781, -135216, -102566, 150658, 315045, 32350, -188398, -267716, -273846, -429960, -793098, -911194, -452554, -86051, -168080, -154590, -59568, 183947, 69684, -272962, -161597, -114285, -202747, 61569, 380005, 539710, 837157, 882712, 481160, 104807, -125517, -15702, -60143, -311978, -370579, -280865, -293655, -178212, 59909, 220048, 257553, 292153, 406542, 439698, 543626, 838350, 1379591, 1431628, 1060029, 549011, 665551, 961913, 1022236, 656649, 251751, -52560, -241219, -177041, 130546, 356007, 245873, 224840, 407521, 389403, 104707, -143341, 163075, 396926, 291571, 61907, 265494, 625963, 647860, 670202, 673709, 631308, 268591]
15711B68591p0862J88336m6989l5742j22512j66255k54484r6675M13005j08811
15701c2398j39966K22210r9950O3026k31333l05733K74284L30827k33465o9327
15691b21825j94781k13550J75351J81733L94816K06768l35435m6667K50660J85154
15681C82224K03021L78064K2813l33390o9068j91312m84781k55067R2502J97858
15671e7136P7855k08770l85101m24792l52857j66841Q9565O5947R1298K11931
15661a058901N29510J05861l71375j08555L68697J39575j26663j26287n6063Q884
15651f95317L13229M30391M27248J4692n36660j45220K09398K47601K01502O0803
15641E27667r5478l80532j9931L97223J46981l28454k76768q3010L20612M08466
$$ y = [268591, 197729, 386065, 339076, 303334, 180822, 14567, -239917, -336592, 76413, -32398, -172364, 49846, -50104, 12922, -218411, -524144, -249860, 80967, -152498, -221825, -416606, -630156, -454805, -273072, 121744, 328512, -6923, -53590, 197070, 382224, 585245, 963309, 986122, 652732, 583664, 392352, -92429, -347496, -254994, -57136, 20719, -188051, -573152, -997944, -1350801, -1517642, -1428077, -1362130, -1270832, -1058901, -529391, -423530, -794905, -903460, -534763, -395188, -521851, -648138, -704201, -695317, -382088, 48303, 475551, 490243, -46417, -191637, 17761, 265362, 466864, 527667, 432189, 51657, 31726, 428949, 575930, 247476, -29292, -112302, 208310, 616776]
15631F16776k06333p55412o31847J81153M93874J70413j64386m25766k80806j15491
15621a117825K99849N32996K09020l78789o41942j31472M26717O25944P90173
15612F14671L25726l18027l98792l79283j2791N66259K11653m15978p89119l93066
15602i88747L56468J78802M68389L26510N9861k44469j60314J61449M01777L472
15592E63198l80746M6048p8710m12124o57784k76843M74134M52158j32752j34349
15582e37770j37097L889L60806L96593j0874K90844O89564P6472n91850l07311
15572B33266m25072l58737k7199j7241J44163J11720J67172M40524k2076k64884
15562a8364J21244J13691M3912k34470l37025o213L79996J83793j83256l90765
$$ y = [616776, 410443, -344969, -976816, -795663, -301789, -131376, -295762, -721528, -1002334, -1117825, -817976, -284980, -75960, -454749, -1096691, -1228163, -801446, -175502, 614671, 940397, 622370, 223578, -155705, -168496, 397763, 609416, 193438, -595681, -988747, -632279, -453477, 14912, 341422, 401283, 156814, -3500, 157949, 559726, 563198, 182452, 228500, 149790, -262334, -920118, -1196961, -722827, -270669, -403421, -537770, -674867, -670978, -310172, 86421, 75547, 366391, 1055955, 1132427, 540577, 233266, -191806, -550543, -577742, -594983, -450820, -339100, -171928, 268596, 246520, -18364, 102880, 216571, 260483, 26013, -311012, -317225, 62771, 246564, 63308, -327457]
15552c27457k80603J2741K40569j33849l90657J52838P76121L29085j60495o11211
15542c92918m94665j31045M2756L38736M97887L31989Q6830k74255n37995j8325
15532e51005m7340o9643O6918L2083j32437M9707J88100J13181L36845J622P4668
15521F2699r6757j94231l12028q1659p2031q6939j68893k9651R508K11617L39556
15510d18809M23127Q7463R4751K81190k58852m04471q0678J53057J54403O4646
15500I5827k4901k20584l55785l05445k20011K24160J44118j24663K8529J17234
15490f41521k74790q2423K87861J58597k6254m79849j89305L52542K97502L2939
15480e64701k5800M82408M69345J33930j71945j2334j20384k18740j99181K307
$$ y = [-327457, -608060, -595319, -354750, -488599, -879256, -726418, 49703, 378788, 218293, -392918, -887583, -1018628, -975872, -637136, -139249, 192740, 279570, 5315, -532680, -551005, -598345, -667988, -601070, -568987, -701424, -651717, -463617, -350436, -13591, -11969, 62699, -34058, -228289, -540317, -621976, -694007, -780946, -949839, -979490, -969982, -758365, -418809, 4318, 91781, 186532, 467722, 208870, -195601, -276279, -123222, 31181, 95827, 70926, -149658, -505443, -810888, -1030899, -806739, -662621, -787284, -758755, -641521, -916311, -998734, -710873, -552276, -578530, -1058379, -1247684, -895142, -597640, -564701, -590501, -108093, 361252, 495182, 323237, 310903, 190519, -28221, -227402, -225095]
15470b25095P6767j10700l71939j10385K55966K94588J02117o3766l98219q13684
15460a364350l79232M63052P02555K82168l24079j64353j63509m94049l30408
15451a772205K23744N82186N48823J55121K00855K00674n2174M11460M00174j80149
15441G18509p82437n90284m3587M69185M76232M88295k40335l52294r6396j28765
15431h1877o2234j7020J21582j62719m82460j42694L29438k8664j87576P0173
15421f44051K27255L86361Q7224j47604l01620l0405j02792j88182j15779J81709
15411f47884J56943k3686J15095J13588l04027j20718M10261J20085L12760O41657
15401G74074M6139K7718j87449k63923o3045n98245n98106J43509M86249J28357
$$ y = [-225095, -148328, -259028, -630967, -741352, -485386, -190798, -88681, -152447, -550666, -1364350, -1743582, -1280530, -577975, -295807, -619886, -784239, -947748, -1441797, -1772205, -1548461, -966275, -417452, -262331, -61476, 139198, 87024, 498484, 898658, 718509, -63928, -654212, -697799, -228614, 247618, 735913, 495578, 143284, 46888, -81877, -144111, -161131, -39549, -202268, -684728, -827422, -497984, -526648, -714224, -644051, -416796, -30435, 56789, -90815, -392435, -422840, -525632, -713814, -829593, -647884, -490941, -514627, -399532, -285944, -589971, -710689, -300428, -180343, 132417, 774074, 820213, 847931, 660482, 396559, 333514, -264731, -862837, -719328, -233079, -104722]
15391a04722Q0969j21396j16931j61214J48355J05311k453l38110N652J76122
15381c28417K37356J99559K30107j22485l58448l90262p7516j30605k02400N63119
15371c79992M23061j13072j50760q7371M3690J89695j23710j73997Q1408l40762
15361f31810k4103L8084K17542K42557J02367j97610K17709M4155l42628K66567
15351f7170J69497k29169n66263o46618k95050O86934R30607L10807J30901J63821
15341E88297K46229N7710j94106n0863J43605P8405j06875p0053N3525j14307
15331F31567r8824L3472j99685l26690o3090j39601k67538L971N7378l34304k89229
15320i92573n1802J03889J83824J30674J24960j94645j07921K80688L74781K36297
$$ y = [-104722, -23753, -145149, -262080, -423294, -274939, -169628, -172081, -510191, -504539, -328417, -91061, 108498, 338605, 216120, -142328, -532590, -610106, -740711, -943111, -379992, 43069, -70003, -220763, -308134, -264444, -74749, -198459, -372456, -291048, -631810, -655913, -617829, -400287, -157730, -55363, -252973, -35264, 8891, -333737, -67170, 102327, -126842, -693105, -1339723, -1634773, -947839, -17232, 293575, 424476, 588297, 834526, 892236, 698130, 647267, 790872, 869277, 762402, 692349, 745874, 631567, 532743, 566215, 366530, 39840, -23250, -162851, -430389, -426418, -369040, -703344, -992573, -1044375, -940486, -756662, -625988, -501028, -695673, -803594, -522906, -148125, 88172]
15310H8172l91283n05156l36654J18988K84309j050L24082J87706O053k0868n5900
15299c01601J15877J64041k0552j73067p7618K03509J99299J26538j38579k25439
15289a27592k19675j07298R8840J39109l4286K9210L88558L61041J29782m41403
15279B16286n43448r1998n218j69625N4885J24490K42206K46092K78733N876m18408
15268f0129l799L0732j92078j54862K41921j1652n5623j72320j12712J15066N34942
15257A59486O82079J40468j71959p1297m76021k65397J28275M5057q4761n1794
15247C4136k45110l7342K62966J47736l79503o7377N7336O5112J50583K91042
15237B79579L57375L04246j12472n22247n21785k50237n4974j23051J70333k09158
$$ y = [88172, -303111, -808267, -1144921, -1025933, -741624, -742674, -418592, -230886, -224833, -245701, -301601, -185724, -21683, -42235, -215302, -292920, -89411, 109888, 236426, 97847, -127592, -347267, -454565, -355725, -216616, -250902, -221692, 166866, 527907, 657689, 216286, -327162, -419160, -424378, -594003, -539118, -414628, -172422, 73670, 352403, 358279, -60129, -63928, -33196, -225274, -380136, -138215, -149867, -205490, -377810, -490522, -375456, 159486, 841565, 982033, 810074, 738777, 262756, -2641, 125634, 170691, 85930, 34136, -210974, -248316, 14650, 162386, -217117, -284494, -227158, -162046, -11463, 279579, 636954, 941200, 828728, 306481, -215304, -465541, -520515, -643566, -473233, -682391]
15227f82391l11102L24342R2564Q8906J48879k00851k68640J30789L04592K1514
15217c51398Q5768r9016j83086j34402j5129N9715J23705K17996K37832K20060
15207A62045p3331k22912l44838J85952L43687J09475k80912l74718L37482M11278
15197B53208j9725l07100K02812K06101R7407o8868j45014P8416K08845J14958
15187F21040k27039p18883o44709J32257J62631j5156J22677j697L7609k60597
15177g91867m8664J71107L8666K15698j05013j52603p2801Q3506O49856P86771
15167G74656K33542k71683k84621j24686j3537k30172j19962k20334j453M77425
15157B19175J37430R1243N3552k3265o6036l7671L60449j53398k72024j10134
$$ y = [-682391, -993493, -669151, -576587, -487681, -338802, -539653, -808293, -677504, -372912, -351398, -265630, -364646, -547732, -682134, -697263, -637548, -513843, -295847, -58015, 162045, 88714, -134198, -479036, -293084, 50603, 160078, -120834, -495552, -158070, 253208, 233483, -73617, 129195, 335296, 432703, 363835, 218821, 297237, 506082, 621040, 394001, -324882, -969591, -837334, -674703, -689859, -567182, -568879, -531270, -791867, -840531, -669424, -630758, -415060, -520073, -672676, -745477, -661971, -12115, 774656, 1008198, 736515, 451894, 327208, 313671, 83499, -36463, -256797, -258250, 219175, 356605, 447848, 501400, 478135, 412099, 374428, 734877, 581479, 309455, 199321]
15147A99321j27953n7147j70383o0117L51519K19552O9220K03510J80755k69559
15137E38718l17325m73727l39130m20838k13638K81328j04624k34677J58428L92340
15127g33145K98921j0810J7636J80380K43730K33780J04789j55541k52347J43094
15117G0487K596r5111l35873k8730P0049N2178O2094K87851L21312j49779j53748
15106A03326J64466j09226p3098j43191j44086q1901k39707M23357K14061P5425
15096A89426J92447k7841o57626m59405L26427L74761M9431n9530L81105M89938
15086G99133m5602j85650n05206l95634J55183j5657l50172j79042J11041L461
15076f08145J4765j42703J52553L43701N3145K04665J16181j59993O72j70154
$$ y = [199321, 71368, 14221, -156162, -216279, 135240, 354792, 424012, 627522, 808277, 538718, 221393, -252334, -591464, -1012302, -1225940, -944612, -1049236, -1283913, -1125485, -733145, -434224, -445034, -427398, -247018, -3288, 230492, 335281, 179740, -72607, 70487, 73083, -22028, -357901, -386631, -316582, -264404, -202310, 85541, 406853, 257074, 103326, 267792, 158566, 85468, -57723, -201809, -283710, -523417, -100060, 114001, 189426, 381873, 354032, -303594, -762999, -436572, -61811, -12380, -71910, 309195, 799133, 753531, 567881, 62675, -332959, -177776, -193433, -543605, -722647, -611606, -608145, -593380, -736083, -583530, -239829, -186684, 17981, 134162, -25831, -25159, -195313]
15066a95313o5521J08487J01574L28279K40180N8122l02116j39709l26541n74354
15056g66912L115N52422O05869L04609k46333l26704k0158L43253L62371k82291
15046E29241m06843J54085K30802o6239l63938j89020L01539K32022k51109o15803
15036d45263o33327j58179N7991J45598L32450l3825k59517M3326J10617K71684
15026e68445K60080j32086R9254M49990N41897j44530l18839r1925m941j82097
15016i1642l20938k7913P8385j60037k98904N7136L63296O5968J46494Q6408N5799
15005d5948M79636L50989j72742k68518p6228J8226k01014m49206l0006J67213
14995b27598J88979P0453J4373J29876K46799P5381m61684k61358Q3512J16994
$$ y = [-195313, -260834, -152347, -50773, 277506, 517686, 575808, 273692, 133983, -192558, -766912, -763797, -211375, 394494, 699103, 452770, 126066, 105908, 449161, 811532, 529241, 122398, 276483, 507285, 441046, 77108, -111912, 189627, 421649, 170540, -445263, -1078590, -1236769, -1178778, -1033180, -700730, -734555, -994072, -950746, -840129, -568445, -308365, -440451, -341197, 108793, 650690, 506160, 187321, 95396, 90455, -91642, -412580, -440493, -362108, -522145, -821049, -763913, -400617, -334649, -188155, -101747, -45948, 433688, 784677, 611935, 343417, 267189, 285415, 84401, -364805, -394811, -227598, -38619, 31834, 46207, 176083, 422882, 498263, 36579, -224779, -141267, -24273]
14985b4273K36380N2795r5319N5660L8095Q2749m44841k11591J53153k9394Q2807
14974a03779j32278j43992K8284j37796Q8088J14300m75131m38092k7709k98860
14964a526965m88968K02711M99081K01700L57096K76463R1694q7144m86517q7426
14954a048275L20347J76327K01872P8907M03422J74158m49784l09518l4701n7100
14944e44345N7892P9635L64027O56456J22625o31334p08668o04035n10811j45492
14934a864050K78467J96089L5514k14898j58037K43735L37357N75916N36584k82995
14924c16318o33787j06620M50062J32273m9871L95527K06866k69550q7562k74429
14914e53409k33372j1327j64393l0678K516r3695p8321M03913O64133J78944p9643
$$ y = [-24273, 212107, 264902, 169583, 225243, 263338, 346087, -98754, -310345, -157192, -186586, -103779, -236057, -380049, -351765, -489561, -401473, -287173, -762304, -1200396, -1228105, -1526965, -2015933, -1813222, -1314141, -1112441, -755345, -478882, -387188, -474332, -960849, -1048275, -727928, -551601, -349729, -270822, 132600, 306758, -143026, -452544, -487245, -544345, -486453, -406818, -42791, 613665, 736290, 104956, -603712, -1207747, -1718558, -1864050, -1585583, -1389494, -1353980, -1568878, -1726915, -1483180, -1145823, -569907, -33323, -316318, -950105, -1056725, -606663, -474390, -524261, -128734, 78132, -191418, -278980, -553409, -786781, -798108, -962501, -993179, -990663, -1084358, -1162679, -758766, -94633, 84311, 4668]
14903D668k6966k28766j66504p026l0276o6683N8030J81329K63817R8357K7702
14892A07682J3874q1934l46780q52188n43835N97924Q94364K93196j34246p8507
14882a30450J34807L8781J17879k23090l58116n063j661Q7421K21975J93178q6585
14871a0924k54624l79085l8570M7319J23631J98285m38914l28730q4623R1919
14861a074316P8604J02033Q0135j64595j3268M61779M49552k74148n30786j57082
14851a042092M98826N69688Q3592k72070K8342N7781j38063j03996K20994M0843
14841e6155J40226O3717J4618k56966l80131o3508K61715K72631J19260K0911
14831A36318j23748m09508q0559J08695J06688N2723J21656p7010j98541l37076
$$ y = [4668, -22298, -251064, -417568, -424594, -454870, -521553, -463523, -282194, -18377, 79980, 107682, 121556, 39622, -307158, -1159346, -1703181, -1105257, -210893, 82303, -51943, -130450, 4357, 43138, 161017, -62073, -420189, -425252, -426913, -339492, -117517, 75661, -10924, -265548, -644633, -683203, -635884, -512253, -313968, -752882, -1081612, -1166235, -1074316, -995712, -893679, -813544, -978139, -991407, -529628, -80076, -354224, -885010, -1042092, -543266, 26422, 110014, -162056, -133714, -75933, -213996, -317992, -96998, -56155, 84071, 147788, 162406, -94560, -474691, -538199, -276484, -3853, 115407, 136318, 12570, -396938, -477497, -368802, -262114, -209391, -87735, -164745, -363286, -700362]
14821g00362l2847L55153K05446K69644J19351L0048k05074j27753j44986m60378
14811f91758k79799J66132L4571J33048M38680L07261L17036L46551l65111p68930
14801c62319j3017m3602l90946k05220J33689j54479k12244J94006J78118k15753
14791a091767j81143k6044N00835P44805J23064J03158m5928k67178q2166l6057
14781b58421j5483k3196M17457K96848k07515l25646k05846l01818k03227K39029
14771e87818L9344J37425q500j64406L38121L94187L8847o7114R6823J97007l3182
14760C80734J1061o8432n9397j86413J78682K45453m92329l37238J4143L22559
14750H823N6047r6814K39463K4973n01461m31970p121P1820q0559L51173Q43905
$$ y = [-700362, -733209, -378056, -172610, 97034, 216385, 246433, 41359, -86394, -231380, -691758, -971557, -805425, -770854, -637806, -199126, 108135, 425171, 771722, 406611, -362319, -375336, -418938, -809884, -1015104, -881415, -1035894, -1248138, -1054132, -876014, -1091767, -1272910, -1298954, -798119, -53314, 69750, 172908, 126980, -140198, -222364, -258421, -273904, -297100, 120357, 417205, 209690, -115956, -321802, -623620, -826847, -587818, -548474, -411049, -419549, -583955, -245834, 148353, 187200, 120086, 216909, 413916, 380734, 391795, 323363, 263966, 77553, 256235, 501688, 9359, -327879, -313736, 8823, 64870, -31944, 207519, 232492, -268969, -700939, -708060, -636240, -716799, -365626, 478279]
14739D78279K19295m47428j48404p2214o3161q9361j98460m3904N5591M41440
14729A31673K6972j4618Q3774k0542k71385j79830J12775M36841K27598l13591
14719B19667k11210J0269J38580m9699L35447L3855p3145k46722n46208j14974
14709e04140J40213m0551N22859J91361j59479K57490j28107j76914O7366m4261
14699A25837L065J29910L25309L76484j08094j27615R1789M00702K2974l77046
14689H63315k45484j05859j30741K14750K59895K07053K04854J59399n39365l30626
14679E57191j05760j82572j03086k01125J94386L5842k70134N6839K22013o7700
14669A35894j19764k09307k13816p0556p4697j90432L826J04948k41808l55436
$$ y = [478279, 697574, 250146, 101742, 29528, -33633, -122994, -321454, -365358, -309767, 131673, 158645, 144027, 227801, 207259, -64126, -243956, -131181, 305660, 533258, 219667, 8457, 18726, 157306, 107607, 443054, 476909, 403764, 157042, -389166, -504140, -363927, -404478, 118381, 309742, 150263, 407753, 279646, 102732, 170098, 125837, 128902, 258812, 584121, 960605, 852511, 724896, 816685, 1217387, 1240361, 863315, 617831, 511972, 381231, 595981, 855876, 1062929, 1267783, 1427182, 887817, 557191, 451431, 268859, 165773, -35352, 159034, 194876, -75258, -18419, 203594, 135894, 16130, -193177, -406993, -477549, -552246, -742678, -738852, -633904, -875712, -1231148]
14659a231148O686K99340j95519l55363n76374n11560K40798L96256j101M96473
14649a431512O50026N14390J99170j50449o307k05097k17625K13066N573l1127
14639d59892P6435J54974L49049J25621n5293M590r5050j58836j96466j97717
14629d52585k8450K10467M11990J92396R8911j89470m57958m61673k05736J85737
14619f96371J21902q8598j74743L29397O04210J11189k19020n34352j21509M27047
14609b40848M08891Q7752n86537l78334k0325M75724P48403N83682J93781j82677
14599A089512r7126l01064m05465k31518j70750J38057N5087R9986J38966m0225
14589B75460N69j82609k62308j5611k59261l92901O1928j22144L07122O84332
$$ y = [-1231148, -1224462, -925122, -1120641, -1476004, -2052378, -2563938, -2323140, -1926884, -1927985, -1431512, -781486, -267096, -67926, -218375, -224682, -429779, -647404, -434338, -428765, -459892, -383457, -228483, 120566, 246187, 190894, 195484, 100434, -58402, -254868, -452585, -481035, -270568, 141422, 333818, 432729, 243259, -214699, -676372, -882108, -696371, -574469, -663067, -837810, -508413, 95797, 206986, -12034, -546386, -667895, -240848, 168043, 255795, -330742, -709076, -729401, -253677, 494726, 1078408, 1272189, 1089512, 992386, 691322, 285857, 54339, -116411, 21646, 76733, 176719, 315685, 275460, 276029, 93420, -168888, -184499, -443760, -836661, -774733, -896877, -589755, 94577]
14579I4577J00210P4024n6505m56719M966k52859k74041J16082q6653l04734m31672
14568a473324j49703J92231M60435O04866L68065q8028k89817j30133J54079M65401
14558A14072K46447J15543K92692J58994k43096n3344J15097k49647j10061J53925
14548E40622K98215O1904o10827o47058j43212J11628l35259k02523m5902K81763
14538f90649M21460K20189K18524L8384p1032K49154L24988j36417R506l97337
14528A86770j80333K3584p8257J35276L46886M18804k47387q51382n93065l71399
14518a210503m25370J94882M42095O39874L69672R3500N08396M84777m7085p70779
14508B79459j57734L35511k78535n557L69006K21135n0152l53539m47862m4202
$$ y = [94577, 194787, 268811, 212306, -244413, -239447, -492306, -766347, -650265, -736918, -1041652, -1473324, -1623027, -1430796, -970361, -365495, 2570, -85458, -375275, -505408, -351329, 114072, 360519, 476062, 768754, 927748, 684652, 631308, 746405, 496758, 386697, 540622, 838837, 900741, 289914, -357144, -500356, -388728, -723987, -926510, -972412, -690649, -269189, -49000, 169524, 207908, 136876, 386030, 711018, 574601, 584107, 186770, 6437, 30021, -48236, 87040, 433926, 852730, 605343, -246039, -839104, -1210503, -1635873, -1440991, -998896, -359022, 10650, 104150, 612546, 1097323, 1050238, 279459, 121725, 457236, 178701, 173144, 542150, 763285, 713133, 359594, -88268, -132470]
14498a32470p3882n5536m51R9504k81333p58251q2573Q73301O66989K08432K88205
14487G51935L43233K42251J2660j46953k40077n87154n31259M1644j12518m13799
14477f40037k72502k57474L6351L92302L43545K06704J00567J77668R6734j8875
14467A64983j2667j44641J20286N4644J77828L6052r8698J79330M5788o50205
14457a27300o11428J23701K04558O2732M4188j33510j28279J96601P5027j97135
14447d90845n9350J87237L28084J52440l7608K70208M69919l5482j81712K04060
14437H06951L07704r5501k09741j52239k02714j24637j35075K08441J57324Q0456
14427F40969l60646k37774k30405k33277j68373J9199J38746J41759J03531J17902
$$ y = [-132470, -206352, -261888, -262339, -162835, -444168, -1202419, -1284992, -411691, 255298, 463730, 751935, 1095168, 1337419, 1350079, 1203126, 963049, 375895, -155364, -113720, -226238, -640037, -912539, -1170013, -1133662, -741360, -397815, -191111, -90544, 87124, 183858, 164983, 152316, 7675, 127961, 182605, 360433, 396485, 297787, 477117, 522905, -127300, -738728, -615027, -410469, -347737, -303549, -437059, -565338, -368737, -293710, -490845, -550195, -362958, -34874, 117566, 79958, 350166, 820085, 784603, 602891, 806951, 1114655, 1019154, 809413, 657174, 454460, 329823, 194748, 403189, 560513, 640969, 280323, 42549, -187856, -421133, -589506, -570307, -431561, -289802, -186271, -68369]
14417f8369o7856O1181J13625k8654L0027j4875q2056l23391k23649L33127O72531
14406D01641M87145K60912j54433j38680n4105j29776j64958k14037k3643r9088
14396A70978j80816k86557l89832L775p8634k42314l6359L17309L6863m07567
14386a093154R7619J65537L26875N51578M0822m2661J43973K794J2852J76503
14376C82738R1794j77894l14602K29570K31507p1791J13235K34577j06789l98635
14366B13710k39044K5277J16808L70226k5540n75342l85675k35606M47546M61377
14356A73737J18237k7104j74671j5208k74093j67611J17289J00365j25087r5334
14346c69480K15905L2352j23295M1145K55740K56039J73405K156j71617j91523
$$ y = [-68369, -136225, -75044, 38581, 9927, 39954, 25079, -56977, -380368, -604017, -270890, 401641, 888786, 1149698, 995265, 856585, 802480, 672704, 507746, 293709, 270066, 170978, -9838, -296395, -686227, -682452, -761086, -1003400, -1039759, -722450, -685587, -1093154, -995535, -829998, -503123, 48455, 89277, 46616, 190589, 193383, 206235, 382738, 474532, 296638, -17964, 211606, 443113, 371322, 484557, 719134, 612345, 213710, -25334, -57, 116751, 486977, 461437, -113905, -499580, -735186, -287640, 173737, 291974, 264870, 90199, 74991, -199102, -366713, -249424, -149059, -274146, -369480, -153575, -121223, -244518, -203373, 52367, 308406, 481811, 483967, 312350, 120827]
14336A20827j46453o2909k1113j4239J23613J76422N337j60570O0478M033J48505
14325B33931J31064L22677j6096m6643J34908Q0484m43992o33347k28060O3049
14315d02025j08584J19303K22946Q2745K38803N05637P5009q3946L8284K09655
14305H97827K74780k87903l3803j69871m94441k78442j23386O6139O730n05926
14295f48296m20067l7423K53570L42997K01584k38711l61604k27480J99850L21535
14285f14045K51570M51929O7404k35429j79914j33819k8435J46891K03745J07733
14275C7630J31653J4777k8723J5275k94174l73252j89183L19969L05840K7585
14265c2603L1856k81782k59517K47821M63667j19941r3524k4224j29395N5666
$$ y = [120827, -25626, -88535, -109648, -123887, -274, 176148, 181485, 20915, 81393, 85426, 233931, 364995, 687672, 671576, 624933, 759841, 840325, 396333, -237014, -465074, -402025, -510609, -391306, -168360, -85615, 153188, 658825, 733834, 649888, 688172, 897827, 1172607, 884704, 850901, 681030, 186589, -91853, -215239, -149100, -142370, -648296, -1068363, -1105786, -852216, -509219, -307635, -546346, -907950, -1135430, -935580, -614045, -362475, 89454, 156858, -78571, -258485, -392304, -420739, -273848, -70103, 37630, 169283, 184060, 155337, 170612, -123562, -496814, -685997, -366028, -60188, -32603, -747, -282529, -542046, -294225, 169442, 49501, -44023, -68247, -197642, -141976]
14255a41976J59369R2872J72558M7148j56383o00496o27735l49068l9844J40O1889
14244a381526J32813M87748M46154J82943k04384j67189O4972K28382M18628J38869
14234C47410l40699k59902k16206L627L46315M39953J06364k69336k24742n2561
14224a19777m66014o63548l9082P8020J46374N94855j59662n85691O827K95327
14214i12371L91634O15076O87941Q2233n70593l07847j34917k98621M1148K88739
14204a17578L88881L72921O6815j00637l46834k93253k64687j0054L90194K78889
14194C64657j55289n20870k02847K67423R6305j1209J35657K9163j0812J32615
14184A24793L8042K98678p9805n37466j16141l6452K04521N00141J8616r7035
$$ y = [-141976, 17393, 110265, 282823, 329971, 173588, -426908, -1054643, -1403711, -1443555, -1443415, -1381526, -1248713, -760965, -314811, -131868, -336252, -503441, -438469, -210087, 208541, 347410, 6711, -253191, -469397, -465770, -119455, 320498, 426862, 157526, -67216, -119777, -585791, -1249339, -1288421, -1210401, -1064027, -469172, -628834, -1214525, -1207698, -912371, -520737, 94339, 782280, 864513, 293920, -13927, -148844, -447465, -406317, -117578, 271303, 644224, 711039, 610402, 263568, -29685, -294372, -304426, 85768, 364657, 209368, -311502, -514349, -246926, -150621, -161830, -26173, 2990, -7822, 124793, 162835, 461513, 381708, -155758, -271899, -308351, -103830, 396311, 414927, 317892]
14174C17892J96007K47908P9112l0337r2658k96043k53860L2863j11976l72007
14164b83099k92401K67618J88319j1569K17857m201J2913K48094j49947j95745
14154b161J07127j18553m79017j21672Q15053Q75100K05650k02133N1675k34685
14144H96384l02647k38255k9302O002K13538K50692P0283j08841m437l12492l98649
14133D2276k01174K7873K56370J58574m722L07624k7513m83034J58867O11604
14123H46745O7806l14334l86580k7658m4592l54757k17860K08282L51314p6717
14113E1649k20247k59380j74865J19390j70224k61385J78151L85415L9536J84140
14103a27820J82918j89227J07978L04261j70134n14018K8516P5371P2546L79413
$$ y = [317892, 513899, 761807, 840919, 810582, 717924, 421881, 168021, 200884, 88908, -283099, -575500, -307882, -119563, -131132, 86725, 82524, 95437, 343531, 193584, -2161, 104966, -13587, -492604, -614276, 200777, 1075877, 1281527, 1079394, 1131069, 896384, 593737, 355482, 326180, 332182, 545720, 796412, 866695, 757854, 753417, 440925, 42276, -158898, -131025, 125345, 283919, 279197, 586821, 559308, 76274, 235141, 846745, 914551, 600217, 213637, 185979, 141387, -213370, -431230, -222948, 128366, 51649, -168598, -427978, -602843, -483453, -653677, -915062, -736911, -351496, -311960, -127820, 55098, -134129, -26151, 278110, 107976, -406042, -377526, -302155, -229609, 149804]
14093A49804K36693q6796O801l15511r4996K01081J53676N8678o42305j15470
14083d48345P9394K53514m2979l81909k63796K49877M67806J23769J12717j56677
14073f629k96417k88014j79966M9411j9280j76510J89241O4290J22406N29779
14063a1689N40853O0514o2501l56560k01841O2910K43829N08334k33371p20549
14053a70071R2162N89371O66837J17877n79863p0852L25071k00671p14751q99505
14043h44395j33439N55658J88732j41547p9621M6924K42063K39610j91155m10784
14033e27954p4497K39968L61063O2802k57036m25049j04987R1710k68440n47600
14023a450020o1319M14502M53483M93474P7036l01214J51079M69542J52128j63567
$$ y = [149804, 386497, 299701, 306502, -9009, -104005, 97076, 250752, 309430, -332875, -448345, -368951, -115437, -158416, -540325, -804121, -554244, -86438, 37331, 150048, -6629, -303046, -591060, -771026, -721615, -740895, -917405, -728164, -663874, -541468, -11689, 529164, 589678, 527177, 170617, -31224, 31686, 275515, 783849, 550478, -170071, -77909, 511462, 1178299, 1296176, 716313, 645461, 970532, 769861, 55110, -844395, -977834, -422176, -233444, -374991, -454612, -407688, -165625, 73985, -117170, -527954, -602451, -362483, -1420, 61382, -195654, -620703, -725690, -633980, -902420, -1450020, -1511339, -1096837, -643354, -149880, -72844, -374058, -222979, 246563, 398691, 235124]
14013B35124j32976J58206K08498j79691l55125m47377j86622L15142L19876L22332
14003B57387K36786K67567J35494j62910k39779j4670r8554k1812m08575n26701
13993e75767k11345L49659M81968L68081K74533j79896n28731l79038m54132n4595
13983i09263O74421P58847M67364n5641l37944O1138k46329m49832k15911r764
13973b62914q1519m00251k42950j87119K78042O70216R5119J0913K99981J12937
13963B92455j41985k8975l86626m46604n2311O6575K8907J85804j107j1277J95874
13952b99270O5444L59409L89832k28957p53444m78437K9843M44294O00776J53524
13942B83014P2233k8215l42096l01643k68364K35561L21994J97430P7240l19477
$$ y = [235124, 102148, 260354, 468852, 289161, -65964, -513341, -699963, -384821, -64945, 257387, 494173, 761740, 897234, 734324, 494545, 479875, 381321, 359509, -49066, -575767, -787112, -437453, 44515, 412596, 687129, 507233, -21498, -400536, -854668, -909263, -234842, 524005, 991369, 935728, 597784, 658922, 412593, -37239, -253150, -262914, -344433, -744684, -987634, -1174753, -896711, -226495, -131376, -120463, 179518, 292455, 150470, 121495, -265131, -711735, -764046, -697471, -668564, -482760, -483867, -495144, -299270, -233826, 125583, 515415, 286458, -466986, -945423, -915580, -471286, 129490, 283014, 355247, 327032, -15064, -316707, -585071, -349510, -27516, 169914, 247154, -72323]
13932g2323l37872J07654L66196M62j11242j54306j06597M97634L08705j42737
13922C55574K57189M30612p5666l39850j61491l32322n51651j99075j84182j58621
13912i59483J65688L42217J44562L29977M64764M7238j2994k22279l13136k54883
13902b68329l38161j95810m5251L1329j06719K24074K41809L63420J55008j01741
13892d0371p5523n1860j94858j62298q2149j6077j85123k13975K8934K01261J73699
13881f18340k29080L8668L63082L74771J15512J42442J14238j10023k12500N7508
13871C6278K91281N85908K93676k72900l15632n01288j14626k37073o9419L12209
13861H414N2628J07449J72432j41395k35132n51730j86498J10524Q4539J70038
$$ y = [-72323, -410195, -302541, 63655, 64117, -47125, -201431, -308028, 189606, 498311, 355574, 612763, 1043375, 967709, 627859, 466368, 134046, -417605, -616680, -800862, -959483, -793795, -451578, -307016, 22961, 487725, 534963, 521969, 299690, -13446, -268329, -606490, -802300, -847551, -816222, -922941, -698867, -457058, -93638, 61370, -40371, -115894, -167754, -362612, -524910, -607059, -623136, -808259, -1022234, -993300, -792039, -618340, -847420, -808752, -445670, -70899, 44613, 187055, 301293, 191270, -21230, 36278, 327559, 913467, 1207143, 934243, 618611, 117323, 2697, -234376, -303795, 8414, 61042, 168491, 340923, 199528, -35604, -587334, -773832, -663308, -578769, -408731]
13851d08731M8375j69407m08045K30461M92648J40820j33101j73911j87696q9443
13841f58030m4261O5389M6555l098J75509O11372L54864M44919J93554m80933
13831G05840l71494j1969j6884M574k91347n29890K73787K67335m72838m03133
13821h46019J27231M15779J37735n2444j85023J51485M15780K88952n5447m3840
13811C54189j16589k70555j70446K39927K56304j8526J45474L25011O9576l21206
13801D93159j70884m9795l87543N1434M50355l9415k18957j72509P15355P03339
13791A374539J22159m14628m15139k74669m78594m35873J7299J86576L88957K80936
13781C51563j12742l91304l19596j65310p3844L33648P3680J41254J47235J03246
$$ y = [-408731, -360356, -529763, -937808, -707347, -214699, -73879, -206980, -380891, -568587, -658030, -702291, -636902, -590347, -593445, -417936, 193436, 548300, 993219, 1186773, 705840, 334346, 322377, 305493, 310067, 18720, -511170, -237383, 29952, -442886, -846019, -718788, -303009, -165274, -217718, -402741, -251256, 164524, 453476, 398029, 354189, 237600, -32955, -203401, 36526, 292830, 274304, 419778, 744789, 814365, 493159, 322275, 272480, -115063, -63629, 386726, 347311, 128354, -44155, 671200, 1374539, 1496698, 1082070, 666931, 392262, -86332, -522205, -504906, -318330, 70627, 351563, 238821, -152483, -472079, -637389, -711233, -377585, -303905, -162651, -15416, 87830]
13771H7830O5172m53214j22595R4273K87624J64956l5433J31573j1395l95219
13761a86428J44455M9451l34250P361L8863j17841L35876L01611n35659m33463
13751g30024J20687K72071L96844k36749n42235k75517n43806k22762K72371O82343
13741h06777O31903L13883J03207k97291m19830n00095l5806N61526P37947J05418
13731C94085q4389k58622k78649j39962K47485M23483j17936n58414m07402k50
13721g80571k76417m4677J99421L02906L69200K63292R1280Q4526q4105j49340
13711b4485L77Q8298J31789K72509J90026J87125k4630j5405r8854l47702m89617
13700a30569l34317k57890J48680L86576J10714o5123J72307M60041M6914l34741
$$ y = [87830, 153002, -300212, -422807, -328534, -40910, 124046, 88613, 220186, 208791, -186428, -41973, 7478, -326772, -319411, -280548, -398389, -62513, 239098, -296561, -730024, -609337, -337266, 59578, -177171, -719406, -994923, -1538729, -1761491, -1489120, -806777, -174874, 139009, 242216, -55075, -474905, -975000, -1010806, -449280, 288667, 394085, 309696, 51074, -227575, -367537, -120052, 303431, 185495, -372919, -780321, -780571, -1056988, -1101665, -902244, -599338, -230138, 33154, 124434, 208960, 124855, -24485, -24108, 64190, 195979, 468488, 658514, 845639, 821009, 805604, 706750, 359048, -130569, -464886, -722776, -574096, -187520, -76806, -141929, 30378, 490419, 537333, 202592]
13690B02592l39689k15482n42015n02111n4856K83836L69188K85992l8135m23965
13680i74645L4576K67193k22828L01186N26945Q5680l51198n81977j78861L13057
13670g80872L40293K42230j03145k41709O9329L89747K14560O9636K1312M0048
13660B61429m8733L50769J69448k92335j19618l66108m09793K33038N84710P0194
13650D33001l01502k70608K6097j25005k32185J33451J53161J71845j5576j51411
13640a78732r3822k64933O3180J90975k67373k54380k62475J23244N79643J82137
13630a82536l42422l02021L87499O04985L2848q7638O5888j56463j50524k45184
13620c75568j39684J91136K73816p3410j51646Q8535M85220M49550j7666n24398
$$ y = [202592, -137097, -352579, -894594, -1396705, -1451561, -1167725, -798537, -512545, -550680, -974645, -940069, -672876, -895704, -594518, -67573, 18107, -333091, -915068, -1093929, -780872, -440579, -198349, -301494, -543203, -473874, -84127, 130433, 200069, 221381, 261429, 212696, 563465, 732913, 440578, 320960, -45148, -454941, -221903, 362807, 433001, 131499, -139109, -113012, -238017, -470202, -336751, -183590, -11745, -27321, -178732, -272554, -537487, -474307, -283332, -550705, -805085, -1067560, -944316, -364673, -182536, -524958, -826979, -439480, 165505, 198353, 110715, 176603, 20140, -130384, -375568, -515252, -324116, -50300, -123710, -275356, -186821, 298399, 747949, 730283, 205885]
13610B05885n5544K06227j72413k20692k58851L9007K26793o3398r6755l24088
13600e13829l12835J56889L70374J39364J67918K16826Q7126p2408J12396J75771
13590E27592k28456l45859p2496K54023k6171k82847j75098o4210J75317k6994
13580b65199j08190O0575P256j2983L2770l2323K21234J80419J95311J15260m19838
13569b5708l26926j32947L682L13398J49669j296k14350l81240k56492J7695J14477
13558g40038K60394M19093L14331l15469n26945N0517J81817K30138J52896j30314
13548a03580J01041K89262M0531R8181P6772k57324l32041K28234L90807K74224
13538H06107L51212j18863n84421n60630j76664L78072K80928P3789l9244j66009
$$ y = [205885, 150341, 356568, 184155, -36537, -295388, -256381, -29588, -92986, -189741, -513829, -826664, -669775, -299401, -160037, 7881, 224707, 311833, 239425, 351821, 527592, 299136, -46723, -119219, 134804, 108633, -174214, -349312, -413522, -238205, -265199, -373389, -312814, -305558, -318541, -285771, -318094, -96860, 83559, 278870, 394130, -25708, -352634, -485581, -481899, -168501, -18832, -20128, -234478, -615718, -872210, -854515, -740038, -479644, -60551, 253780, -61689, -588634, -538117, -356300, -126162, 26734, -103580, -2539, 286723, 327254, 425435, 502207, 244883, -87158, 141076, 531883, 806107, 1157319, 1038456, 454035, -106595, -283259, 94813, 375741, 449530, 410286, 244277]
13528B44277l46782L4899M47374K82956k06334n14929M0013M08328L21167J03672
13518H14641J29410q9820m77911Q8942K64345L59569k1015m24615m75284m25614
13508b57352m18663j16117L21723Q7512k75658J81524J29915k56722J54099M00388
13498d9351L30686m18831l83522L42520K24718J4985Q5750J14234p4695P9801
13488B66295K84612L79135j07842j04026K35143Q9896j87865j08194n7196N9642
13478G49600r7074n99501j96734M32278K60972Q7614K2606j77522j65575J76355
13468D93019M55712K43380K12637k90234j99361J99462j9152k69072q3082N2857
13458G96166J59364K6803j83102j40171M636k82936k69285j17180K59193J12270
$$ y = [244277, -102505, -67606, 379768, 662724, 456390, -58539, -18526, 389802, 710969, 814641, 944051, 854231, 376320, 465262, 729607, 1089176, 1068161, 643546, 168262, -257352, -676015, -792132, -470409, -382897, -658555, -477031, -347116, -603838, -449739, -49351, 281335, -137496, -521018, -178498, 46220, 61205, 146955, 261189, 186494, 266295, 550907, 930042, 822200, 718174, 953317, 1043213, 855348, 747154, 689958, 749600, 652526, 53025, -143709, 288569, 549541, 637155, 659761, 482239, 316664, 493019, 948731, 1192111, 1404748, 1114514, 915153, 1114615, 1095463, 826391, 743309, 796166, 955530, 982333, 799231, 659060, 663696, 380760, 111475, -5705, 253488, 365758]
13448C65758j97866j90018O7216M94434K85260n6220j0514j33759k33663j72484
13438B18144j56247j57817k34452K23297L54018K74664L1222j34011k62203k88725
13428a32110K37574K94644K70616L2036j08770k85013j59709j8784K82323J14644
13418E27451k72941k09462j70351o3068L66949J63287k2833P0000K50630Q3889
13408G23551o1182K18194O6355m46117p04696k9363N76159J47588J30103J0310
13398F30902j558m78785l68525P9648m3390m6327J19020N3385K1846m6434J37169
13387E6951k3078o6143K20444J69282J42369j70233m29889j48052Q6628L0173
13377a31548J54959P69684Q03287J36504j76901r1732K20927j16555k61670l28800
$$ y = [365758, 167892, -22126, 45090, 539524, 824784, 768564, 758050, 624291, 390628, 218144, 61897, -95920, -330372, -107075, 246943, 521607, 552829, 418818, 156615, -132110, 105464, 400108, 670724, 702760, 593990, 308977, 149268, 130484, 412807, 527451, 254510, 45048, -125303, -188371, 178578, 341865, 319032, 389032, 639662, 723551, 662369, 880563, 946918, 500801, -203895, -233258, 342901, 490489, 620592, 630902, 629344, 150559, -217966, -138318, -181708, -228035, -109015, -55630, -33784, -80218, 56951, 33873, -32270, 188174, 357456, 499825, 329592, -100297, -248349, -161721, -131548, 23411, 793095, 1596382, 1732886, 1555985, 1464253, 1685180, 1568625, 1306955, 978155]
13367I78155m09064k62182n22483n09521R451L43651k39161n07955J82245L97171
13357e39693r5082o62105L95363J032592M90948m4797r2168l05833l85848n65741
13347g72364Q8592O76833M81727R2346k0524k05244l79922o1819Q6820J35560
13337A22005K76624J52133j89049k53467l6196j5919j82569l22488q8034M71647
13327f5313N92370L86940J31950k47150m09868j97236L68468l100J76069K08675
13317I41805J69814k0027k02149O387o4508j99558l4729k0066J4349K72439j55547
13306G08210l17482L35608L99842m71245l44195J78475M00627K59351L3204K64196
13296A446591J53058M598K94867j70446m79217K45239J80991l72241m51424o073
$$ y = [978155, 569091, 306909, -215574, -725095, -715644, -371993, -611154, -1119109, -936864, -539693, -634775, -1296880, -901517, 131075, 622023, 577226, 485058, 179225, -206623, -772364, -683772, -6939, 474788, 567134, 546610, 341366, -38556, -100375, -13555, 122005, 398629, 550762, 361713, 108246, 72050, 56131, -126438, -448926, -536960, -65313, 527057, 913997, 1045947, 798797, 388929, 191693, 560161, 557061, 733130, 941805, 1111619, 1091592, 889443, 895830, 831322, 631764, 597035, 576969, 591318, 863757, 708210, 390728, 726336, 1126178, 654933, 310738, 489213, 889840, 1149191, 1182395, 1446591, 1599649, 1604247, 1899114, 1728668, 1249451, 1494690, 1675681, 1303440, 852016, 845943]
13286H45943J05145p62711p87032P3836L45945K20316J81516O8603q1677J59201
13276C69085K55604m65367o03896m5131m7420K89532N95050J40253l41653r4507
13266E1550K93472J53383l01918k31231m1345N51J39963k1508l86551k43808L9484
13255e47958L32484O58196O46613k7595n81263Q8692L57470K36221L31950K02411
13245A697221R2248j08314k31550n91580n11120m79824j49123L47334M80194p2679
13235D72807j89027L55402P44706N14106L8971l18731j71512N1256j4137j35135
13225A348706o1234R9408J46164Q812m43733q0231K19232P9129r0891O4452R2891
13214A382705j42860K07494J76075m73624l83274L9992k3671j67697j38664K23755
$$ y = [845943, 951088, 188377, -598655, -524819, -178874, 41442, 222958, 291561, 209884, 369085, 624689, 159322, -444574, -489705, -537125, -247593, 347457, 487710, 146057, 51550, 345022, 498405, 196487, -34744, -76089, -75538, 64425, 42917, -343634, -587442, -547958, -215474, 442722, 1089335, 1061740, 480477, 569169, 926639, 1162860, 1494810, 1697221, 1789469, 1681155, 1449605, 858025, 346905, -132919, -282042, 65292, 545486, 472807, 283780, 639182, 1383888, 1897994, 1936965, 1618234, 1446722, 1497978, 1483841, 1348706, 1287472, 1386880, 1533044, 1541856, 1098123, 1017892, 1237124, 1316253, 1225362, 1289814, 1382705, 1239845, 1447339, 1623414, 1149790, 766516, 806508, 782837, 615140, 476476, 700231]
13204G00231M01911j56833q2839K06105O15490L56235k49648J61341J60628J914
13194B114535k74865k22435j728k26847l66474k05073j50442j3593R0108k55578
13184D87608l11344K10460J12498m1388R8181R7661J18005j5688k56709m19821
13174G9463j66213K71717J71940n7432l4493j08960j67390k55656n3173L57989
13164C7792N03419K75309m37117m03604M25441N72511K98297l19600n00681P5863
13154E27630O3362J42688J38328L4996R8076n6551j58711Q822J0895J58172N06802
13143A474509L17447o8816J21288J76198j18544K8840k31423k73885R6399J68854
13133A690867J19562Q7292j07588r3119j54083O8472j581j22313j34273L26576
$$ y = [700231, 1102142, 945309, 862470, 1068575, 1684065, 2040300, 1790652, 1951993, 2112621, 2114535, 1839670, 1617235, 1615507, 1388660, 1022186, 817113, 666671, 653078, 743186, 487608, 176264, 386724, 499222, 457834, 556015, 653676, 771681, 755993, 499284, 79463, -86750, 184967, 356907, 299475, 264982, 156022, -11368, -267024, -320197, 37792, 541211, 816520, 379403, -24201, 401240, 973751, 1272048, 952448, 451767, 527630, 590992, 733680, 872008, 907004, 1005080, 948529, 789818, 798640, 809535, 967707, 1474509, 1791956, 1723140, 1844428, 2020626, 1902082, 1930922, 1699499, 1425614, 1522013, 1690867, 1810429, 1897721, 1790133, 1697014, 1542931, 1611403, 1609822, 1487509, 1353236, 1679812]
13123A679812r5702n04720k99599J6603J02117K6829K23071J71542o4013J08041
13113A363981L72080L37859J2819j6199m0591k32151m62669O1344L14961m37718
13103A273716m89590p8374J26634L65375O52275K80162k72403j74559J21935Q9826
13093A894997J89841j2381j87602n7083J03839J78981K79811J40888o9059l01996
13083B160236j58453p3826l22855l21707L77279N12955N3413m5127j92325k23069
13073A766521j59043Q1476K48018L94673K76846k09219l65096K76680J11327J16821
13063B539004N25440J11290p2305m3668j76327k42014l05551J31141K85689K63516
13053C016215J17162J3359p9835r462j41660k20129K0184K28526r3427j58596
$$ y = [1679812, 1584110, 1079390, 779791, 796394, 898511, 925340, 1148411, 1319953, 1255940, 1363981, 1736061, 2073920, 2086739, 2070540, 2029949, 1797798, 1335129, 1396473, 1711434, 1273716, 784126, 705752, 832386, 1197761, 1850036, 2130198, 1857795, 1683236, 1805171, 1894997, 2084838, 2072457, 1884855, 1827772, 1931611, 2110592, 2390403, 2531291, 2462232, 2160236, 2001783, 1927957, 1605102, 1283395, 1660674, 2173629, 2227042, 2181915, 1989590, 1766521, 1607478, 1688954, 1936972, 2331645, 2608491, 2399272, 2034176, 2310856, 2422183, 2539004, 3064444, 3175734, 3103429, 3059761, 2883434, 2641420, 2335869, 2467010, 2752699, 3016215, 3133377, 3146736, 3066901, 3057439, 2915779, 2695650, 2715834, 2944360, 2850933, 2692337]
13043B692337R543K95662L13069K2957l15963K6288J90076J54695K2508L08655
13033C719827L10373j40379j34093j02126O5754k26157j91092j86418L09696N43697
13023C969082J17626R7825P1883L33196M34876L58351K78704j44655j0669j10857
13013E395362K17787N47070L0042l77801J24359M77835J92754K01114K58966K97903
13003G365391J30899L24925J76807M36553J071699R31682Q38361O44921O52421
12994A2573659R81934J375917J347385J860601K099657J925795K718128L209402
12986B8092478L659087M560570N559751P364140R844178J3018061J7963145K4878223
12978A14939633L4453018M7265988O4717238Q2163086Q4941267N0612236j6776970
$$ y = [2692337, 2701880, 2997542, 3310611, 3333568, 3017605, 3043893, 3233969, 3388664, 3411172, 3719827, 4030200, 3889821, 3755728, 3653602, 3719356, 3493199, 3302107, 3115689, 3425385, 3969082, 4086708, 4184533, 4256416, 4589612, 5024488, 5382839, 5661543, 5516888, 5506219, 5395362, 5613149, 6160219, 6190261, 5812460, 5936819, 6414654, 6607408, 6808522, 7067488, 7365391, 7496290, 7821215, 7998022, 8434575, 9506274, 10437956, 11276317, 11921238, 12573659, 13555593, 14931510, 16278895, 18139496, 20239153, 22164948, 24883076, 28092478, 31751565, 36312135, 41871886, 49236026, 59080204, 72098265, 90061410, 114939633, 149392651, 196658639, 261375877, 343538963, 428480230, 479092466, 462315496]
12971D62315496o9379129q2183604p0428415n2939861l8233392k8620657k1911407
12964I8619031j6316588j2484137r723185p394919n729740n065942m594268m303303
12956C3006949m040378k783490j991874k098530j886859j809114j504098j241700
12948A5650906q14328n11386n60879o41541l92190n50565p31719l07343k99669
12939A0841286m33956o00423l64069m7689j61024j71856k28636k19121Q8022K79432
12929H981966J43496P809j0714K19824M98510L98064J22621N50184J111177J080714
12919A3103651J205359J631591K265638K880062L194804K224264o6236k723003
12911B3716130k581038j241264o58211l44944j01613K13175N92319J278206J764182
$$ y = [462315496, 392936367, 310752763, 240324348, 187384487, 149151095, 120530438, 98619031, 82302443, 69818306, 60095121, 52700202, 46970462, 41904520, 37310252, 33006949, 28966571, 26183081, 24191207, 22092677, 20205818, 18396704, 16892606, 15650906, 14836578, 14325192, 13764313, 13122772, 12730582, 12180017, 11448298, 11140955, 10841286, 10407330, 9806907, 9442838, 9395149, 9234125, 9062269, 8833633, 8614512, 8702534, 8981966, 9125462, 9133271, 9122557, 9342381, 9840891, 10238955, 10361576, 10911760, 12022937, 13103651, 14309010, 15940601, 18206239, 21086301, 24281105, 26505369, 26439133, 23716130, 21135092, 19893828, 19235617, 18890673, 18789060, 19002235, 19594554, 20872760, 22636942]
12902B2636942K367879K505445K706741L978281N282585O330989Q482479J1169023
12894F5460364J4601437J9374560K6716818L7607446N2429920P1671499Q8406236
12887C76268280Q2867527L3278998l8848245q0849646q2544573o6682953m9430044
12880A74059344l5789718k6307722j9827985j5006512j1433901q779458p169358
12873D9744690n614293m640773m263926l608920k802706k408870k249081j896296
12865B2259825k063485j901716j247527j288730j068307q51204q08026q10952
12857A2219878p30167n50544p05697l71571k27292l36705l24442m19554J3068
12848H566974R5265K66840N15420K27632k29349o34587p25368k57725j13036J16916
$$ y = [22636942, 25004821, 27510266, 30217007, 34195288, 39477873, 45808862, 54291341, 65460364, 80061801, 99436361, 126153179, 163760625, 216190545, 287862044, 376268280, 459135807, 492414805, 453566560, 372716914, 290172341, 223489388, 174059344, 138269626, 111961904, 92133919, 77127407, 65693506, 56914048, 49744690, 44130397, 39489624, 35225698, 31616778, 28814072, 26405202, 24156121, 22259825, 20196340, 18294624, 17047097, 15758367, 14690060, 13838856, 13030830, 12219878, 11489711, 10939167, 10233470, 9861899, 9634607, 9297902, 8973460, 8553906, 8566974, 8662239, 8929079, 9444499, 9672131, 9442782, 8808195, 8082827, 7825102, 7712066, 7828982]
12838G828982K31291j91115j95312J77622M4735M96623O25489L94029K32079p9688
12828I564735J24335P5820P59617O00116J25610J094245J615246J073169Q41613
12819A5874506J032455J383525J323394J580009K257601K993255L494963M468206
12811C4407914N334674O858708R480872J2024615J6264482K2228279L0018676
12804A36618220M1247017N6934638P5900528Q7985323O9761150J0299117n4474605
12797D24271388q2209925p6271838n9742320m4764504l2783200k4005163j8140751
12790H6353687j3871339j0997292q465408o476541n661552m493320l922261l849741
12782B8616233l141334k893161k845122k154122j588816j177815j017813j012417
$$ y = [7828982, 8060273, 7869158, 7673846, 7851468, 7896203, 8392826, 9018315, 9412344, 9644423, 9564735, 9689070, 9764890, 10524507, 11124623, 11250233, 12344478, 13959724, 15032893, 15874506, 16906961, 18290486, 19613880, 21193889, 23451490, 26444745, 29939708, 34407914, 39742588, 46601296, 56082168, 68106783, 84371265, 106599544, 136618220, 177865237, 234799875, 310700403, 398685726, 468446876, 478745993, 424271388, 342061463, 265789625, 206047305, 161282801, 128499601, 104494438, 86353687, 72482348, 61485056, 53019648, 46543107, 40881555, 36388235, 32465974, 28616233, 25474899, 22581738, 19736616, 17582494, 15993678, 14815863, 13798050, 12785633]
12774A2785633r23027r56262j126919p27871n27914m50851l12514n16771o05025
12765F638479r63728q69733M4490O2713j28967j55012M5449L9423N1594o7447
12755D697261n03335p45421m73094o3277J35192L29475J83729M4195k90124j71200
12745C143401O5466k87266l38070l79521m12728n15449j34564R3444K00576J01607
12735A536896k44610J40610J61996j76982j41413N2984J77883L07987J84043j80446
12725A818948j83289j88954k58756o726J71590M5114k96720j32507N22201N38609
12715B029510n8222l89208m75074J48145L10240j8321l50095P7012J56107R458
12705A439552J06705j59962l92302k82666K03407J65775K23994J43030J5258l85136
$$ y = [12785633, 11862606, 10906344, 9779425, 9051554, 8523640, 8072789, 7760275, 7243504, 6638479, 5674751, 4805018, 4849508, 4912221, 4783254, 4628242, 4673691, 4713114, 4764708, 4697261, 4193926, 3448505, 2975411, 2912134, 3047326, 3376801, 3560530, 3604725, 3314601, 3143401, 3208867, 2921601, 2583531, 2204010, 1791282, 1275833, 1141269, 1234713, 1435289, 1536896, 1292286, 1432896, 1594892, 1417910, 1276497, 1329481, 1507364, 1815351, 1999394, 1818948, 1635659, 1446705, 1187949, 1181223, 1352813, 1397927, 1101207, 968700, 1490901, 2029510, 1971288, 1582080, 1107006, 1255151, 1565391, 1547070, 1196975, 1273987, 1430094, 1439552, 1546257, 1386295, 993993, 711327, 914734, 1080509, 1304503, 1447533, 1462791, 1077655]
12695A077655k76348O4242l12457m52535j61584K47817J89594l13253l33577K34049
12685c6397M01052J37423n13197n74193j98645L56346N77333P2217j23976k23314
12675a25351Q1594M32744J27919j79662l89080k26517J90690M77726L38191k03659
12665E24595l37199N0502L54962K68915J70927k79294m42170J95486J76382K54281
12655I37387K30546J1991l0092j27044Q1054J38099R2708k10462n56180m51121
12645A16886M0873K94835M21605J34358l47430n8805K78676M52511R23q9949j43439
12634A101044k17373j29905J88940K8907l41893m38370M7242M38770P0877k90580
12624D57659k98537k84047J23967K56918L5273P5683L1975j34276o33322n03936
$$ y = [1077655, 801307, 865549, 553092, 100557, -61027, 186790, 376384, 63131, -270446, -36397, 364655, 502078, -11119, -585312, -783957, -427611, 149722, 221939, 97963, -125351, -43757, 388987, 516906, 337244, -51836, -278353, -87663, 390063, 728254, 524595, 187396, 237898, 592860, 861775, 1032702, 753408, 311238, 506724, 683106, 937387, 1167933, 1179924, 1149832, 1022788, 1103842, 1241941, 1334649, 1124187, 568007, 116886, 157759, 452594, 874199, 1008557, 661127, 602322, 880998, 1333509, 1334432, 1244483, 1101044, 883671, 753766, 942706, 971613, 629720, 191350, 238592, 677362, 748239, 457659, 159122, -124925, -958, 255960, 291233, 366916, 398891, 264615, -368707, -872643]
12614h72643L75946M88337j14682j83505P0575Q5730m2295L79364N59586q8543
12604F57870l47283J79330K79543J96676j5980j44524j61803l93194j90963J80697
12594B40369J19590J19873M2707m36797m71882j75553j04531K40152M73305K96248
12584C43481R0493J57132K98294J79274J05917K81644J28031k45785p28476p78663
12574a68658m96176M5646J96467J56758m493l45289O4221J39832L5071Q7925j47417
12563d36113j92749r6729K3587N16503N45312r7137k94765k63941N3007N05395
12553B62370K27538o5013k18431n5863j19766j15221K16040k2135j75934K57517
12543A91102O39674M5254l78803n19589k55441J17647O5714J11978N84442P31548
$$ y = [-872643, -496697, -8360, -123042, -306547, -235972, -150242, -192537, 186827, 746413, 657870, 310587, 489917, 769460, 966136, 950156, 805632, 643829, 250635, 59672, 240369, 359959, 479832, 522539, 85742, -386140, -561693, -666224, -426072, 47233, 343481, 433974, 591106, 889400, 1068674, 1174591, 1456235, 1584266, 1338481, 610005, -168658, -664834, -619188, -422721, -265963, -270456, -615745, -551524, -411692, -376621, -288696, -436113, -628862, -725591, -702004, -185501, 359811, 262674, -32091, -296032, -243025, 262370, 489908, 424895, 206464, 150601, 30835, -84386, 131654, 109519, -66415, 191102, 830776, 876030, 497227, -22362, -277803, -160156, -94442, 17536, 601978, 1333526]
12533A333526l3998k85428m67114p29727j03077J52483q1313j55222K46665N95229
12523D72024K67547m48631m44488l02151k04154L41362M89694Q1580q5716k67010
12513i9943J03333L17271j1474j13411j47388K12685L72869j75556k25905k9672
12503B02809j74643p7285J39897L47076r4049l38587n01809o5126J68208K05966
12493a87543K97472J05797L54771L37556k22835k69061j12201j30073l42393Q6771
12483h1739j11830p1110l34213j91577j2347K67828L04577Q803J36025M371l8253
12472a19465o3716r8328N5509n09407j09718N24926O41936L74624J59320L65742
12462A221423O3082m90967m13611k99888M1848j72888K49064O78453k04119m61836
$$ y = [1333526, 1299528, 1014100, 546986, -182741, -285818, -133335, -214648, -369870, -123205, 472024, 739571, 290940, -153548, -455699, -659853, -318491, 171203, 252783, 167067, -99943, 3390, 320661, 309187, 195776, 48388, 261073, 633942, 458386, 232481, 202809, 28166, -49119, 90778, 437854, 343805, 5218, -496591, -561717, -393509, -187543, 109929, 215726, 570497, 908053, 685218, 416157, 303956, 173883, -168510, -81739, -193569, -264679, -598892, -790469, -802816, -534988, -230411, -221608, -85583, -81212, -119465, -183181, -281509, -226000, -735407, -845125, -320199, 321737, 696361, 855681, 1221423, 1284505, 793538, 379927, 80039, 121887, -51001, 198063, 876516, 672397, 210561]
12452B10561J2798k60708n60723J02616L21638M00990O8884k40162n52735j11759
12442f08600J96307N45839L23016j50233k8452O0136j2360k0633m8579n0705p2190
12431A33546M7236J67126K82190L21761L6828K36597K11481m75179j34700j08049
12421G18837j08241j35406l11659j43965M28273L09262Q5874m9718l44118k76079
12411A73060J18651l234q3327K70293L37828M9539o276k19530l09959o68780m47845
12400g89580K24018M1838J2560L57627N14427M89583J06161n22387m18691J343
12390A6899q9685p5712k69186K26214M29129K55766L2404j63274k41451j11913
12380I191K09802L2656j28958J75972K67119q9860j05486M13120N09170j44751
$$ y = [210561, 223359, -37349, -598072, -495456, -173818, 227172, 296056, 55894, -496841, -608600, -412293, 133546, 456562, 306329, 277877, 338013, 325653, 305020, 256441, 205736, 133546, 180782, 347908, 630098, 951859, 988687, 1225284, 1436765, 961586, 826886, 718837, 610596, 475190, 163531, 19566, 447839, 757101, 842975, 793257, 449139, 173060, 291711, 288477, 205150, 475443, 813271, 862810, 856534, 637004, 327045, -341735, -789580, -565562, -523724, -511164, -153537, 360890, 850473, 956634, 434247, 15556, 16899, -72786, -148498, -417684, -191470, 237659, 493425, 525829, 362555, 121104, 9191, 218993, 251649, 122691, 298663, 565782, 475922, 370436, 783556, 1292726, 1147975]
12370A147975m99253K66191J43662r4807j96192l01334J55623K51997k04499l22083
12360C47280k15635l18322k02688M18820P34869l52606m68062J92446K30919p3210
12350B93811J16892J74060j7530l64666k84005O3852J14584J58970n8556m92269
12340b94857k04433J81383K13998L54114K83582J10851n1733l41732l70782k13929
12330c33538k09291l72164l51142k6814L51518L75045L16638K38023J91751J37342
12320C17368J53377L85224N5517l56770n06383m00355j97192k12373j10658L10659
12310e61586N83155K33225j24354k6780K19235j45314j456L36335P2472j06005
12300D78927k63402l53739K42897M26234Q002o34090n42078P0943O20752K63465
$$ y = [1147975, 648722, 914913, 1058575, 963768, 767576, 466242, 621865, 873862, 669363, 347280, 131645, -186677, -389365, 29455, 764324, 411718, -56344, 136102, 367021, 293811, 410703, 584763, 567233, 202567, -81438, -17586, 96998, 255968, 197412, -294857, -499290, -317907, -103909, 250205, 533787, 644638, 592905, 251173, -119609, -333538, -542829, -914993, -1266135, -1292949, -941431, -566386, -249748, -11725, 180026, 317368, 470745, 855969, 911486, 554716, 48333, -352022, -549214, -761587, -872245, -561586, 21569, 254794, 130440, 103660, 322895, 177581, 176125, 512460, 584932, 478927, 215525, -138214, 104683, 530917, 538919, -95171, -637249, -566306, 54446, 317911]
12290C17911q771m40849l17312K85004J69296J72381J77045j48335k51168k42786
12280b87584L9117M72677L66383R3442k64717j41997K2599J35236M05807J32843
12270I73806P1348m591j40518l34854j32653K05573k30489l87056j42521k36831
12260c58786k97844L03999L78228O2245k20733k79300J04337j19787p80410m79719
12250a687770K42053N40043L69090L43117L18593J37280k00926k48229j77280
12241c64029k02598P9055K00506K67047K10520O324l54651l37404p1488L38089
12231b28629M25569J76419k89868n46337K62574O12025M96835q5262o64976m77271
12221c18921k89592o0942j30214l52089r9471N43874P56957K40551K9460K03413
$$ y = [317911, 309140, -131709, -449021, -164017, 5279, 177660, 354705, 206370, -44798, -287584, -248467, 224210, 590593, 684035, 419318, 277321, 299920, 435156, 840963, 973806, 1045154, 1040563, 900045, 565191, 432538, 638111, 407622, 20566, -121955, -358786, -656630, -352631, 25597, 87842, -132891, -412191, -307854, -427641, -1208051, -1687770, -1445717, -905674, -536584, -193467, 125126, 262406, 61480, -186749, -364029, -566627, -487572, -287066, -20019, 190501, 196825, -157826, -495230, -566718, -228629, 196940, 373359, 83491, -462846, -200272, 411753, 908588, 823326, 158350, -318921, -608513, -669455, -799669, -1151758, -1251229, -707355, 49602, 290153, 319613, 523026]
12211E23026o6551m08667l23240q1621k91298l93503j99570J65034L3659R848
12201a032883M46675L96212o1734k72804l6361K93915L22227J42412M899m13417
12191b10859j17596L28002J50687N4204o5972j30391K23853r489O0442L12192
12181E95073N9621j03324k74498p2635J00429K0017J16327j03257q0493K79980
12171E37240K91854K53417l79295m53671J28361J7086j98559k52629j69143k40576
12161d65915k1366K38661K69458K75483M2527l8333L7204j59960j47525p1253
12151d1019K16917j27181m02569j80389q587K28645K35521k7154j37599l27556
12141e70971m59234L3783N67759M54297N4888L14448M81880N7737Q5066J20378
$$ y = [523026, 456475, 47808, -275432, -357053, -648351, -1041854, -1241424, -1076390, -1042731, -1032883, -586208, -189996, -251730, -524534, -560895, -266980, 55247, 197659, 202558, -210859, -328455, -453, 150234, 204438, 138466, 8075, 231928, 222439, 282881, 595073, 654694, 551370, 276872, 204237, 304666, 324683, 441010, 337753, 257260, 537240, 829094, 1082511, 703216, 249545, 377906, 394992, 196433, -56196, -225339, -465915, -487281, -248620, 20838, 296321, 338848, 300515, 337719, 177759, 30234, -41019, 175898, 48717, -353852, -534241, -542828, -314183, -78662, -105816, -243415, -570971, -1030205, -996422, -428663, 25634, 80522, 394970, 876850, 934587, 1019653, 1140031]
12131A140031m42560o48101J16152K85841J43008L38622J27252k26375k80325
12122E53545O8423K75767J0939j80402j21176k2231l0115j77518j25701K27206
12112D78737J91376q8701j83632k49763l290J23601j2827K74590r35l35763K77378
12101D70771K43597j56927n29634k6177L05809Q5924J36235m41551l62955P3377
12091b01531J59618j04239j44398k0325j39822r3530R586J82697K34192J94786
12081G7034j4927J34081L0643l38011j12804M6172M08920L26848k96485m96883
12071b35412j86868L25135L75935K12643k45963J16804J49358K0482J87817p5043
12061F44888j2532j22373k92189k83453o8927j18994K93972N17433M43249L97848
$$ y = [1140031, 697471, 49370, 165522, 451363, 594371, 932993, 1060245, 833870, 553545, 621968, 897735, 908674, 728272, 607096, 584865, 554750, 377232, 251531, 478737, 670113, 581412, 397780, 148017, 144727, 268328, 255501, 530091, 529156, 193393, 470771, 714368, 557441, 27807, 1630, 307439, 393363, 529598, 88047, -274908, -201531, -41913, -146152, -290550, -310875, -450697, -544227, -534641, -351944, -117752, 77034, 62107, 196188, 226831, -111180, -223984, -177812, 231108, 557956, 261471, -235412, -422280, -97145, 278790, 491433, 245470, 362274, 511632, 532114, 719931, 644888, 632356, 509983, 217794, -65659, -134586, -253580, 40392, 557825, 1001074, 1398922]
12051A398922J97675m03536o74067m13761j5844K08910P8491J43950L33590O1189
12041I15519n3542J54894K37880J09297k6491j82205j95623K27409j01303n07167
12031E78668j71549M6335K6734j63953m74051m43628k59372j23693R9213q0385
12021i65681m31896j50605L25260M84693K99283r5618j72069j05639j34791l09013
12011a256076j24637O3417k02598Q2557N48129N52373N650p5587J09268K40425
12001e7079k12748l41570J37789J18021O8359p9858l13701j22278K2492P7885
11991g02688J46020L64699K87295j3215j56130q0639J62078M6013j64435L2154
11981g8848J31059K38985r9287j26603J3782k50694J68798K50234K71903J29351
$$ y = [1398922, 1596597, 1193061, 518994, 105233, 89389, 298299, 376790, 520740, 854330, 915519, 861977, 1016871, 1254751, 1364048, 1337557, 1155352, 959729, 1187138, 1085835, 578668, 407119, 453454, 480188, 316235, -157816, -601444, -860816, -984509, -885296, -965681, -1397577, -1548182, -1222922, -738229, -438946, -534564, -706633, -812272, -947063, -1256076, -1380713, -1317296, -1519894, -1437337, -889208, -336835, -331185, -406772, -297504, -57079, -269827, -611397, -473608, -355587, -287228, -367086, -680787, -803065, -780573, -702688, -556668, -191969, 95326, 82111, -74019, -154658, 7420, 53433, -111002, -78848, 52211, 291196, 191909, 65306, 79088, -171606, -2808, 247426, 519329, 648680]
11971F48680q1158j21526l22824k57922k97351l39334l77423L0901L85159M69014
11961b63784L39551L9635J6508k10786j3266o0063j2548p3762o31809l75495L36062
11950i09757P79042O72395K38825k50229m3287R5653k95387P1621K18287m02104
11940A75059M823l3214k98779l66879j78541K0908L75648L11719J5213l73588
11930c47631l01572j18067R7965K49177q6296m5977l2074r0350Q7399L52503M60104
11919B25181K70435k75152m18584j02791J56118j24405l0549K43137K05095J35898
11909B84383O1594j84908j40296k6224l4348J59380K26352K47121l85953k84478
11899g7377K97652K10115m822j03276k64765k90402j20151k1796M55885L58234
$$ y = [648680, 567522, 445996, 123172, -134750, -432101, -771435, -1148858, -1117957, -732798, -263784, 75767, 115402, 131910, -78876, -92142, -152205, -164753, -238515, -870324, -1245819, -909757, -130715, 541680, 780505, 530276, 486989, 582642, 287255, 358876, 577163, 175059, 179882, 146668, -152111, -518990, -697531, -676623, -300975, 10744, 25957, -347631, -649203, -767270, -669305, -420128, -506424, -552401, -584475, -674825, -587426, -234923, 225181, 495616, 220464, -198120, -300911, -144793, -269198, -299747, -56610, 148485, 284383, 345977, 161069, 20773, -5451, -39799, 119581, 345933, 593054, 207101, -77377, 220275, 430390, 425568, 322292, 57527, -232875, -353026, -374822, 81063, 439297]
11889D39297P4980K43715L41797j5061n5290o4459k14478j10711j68607L636r310
11878D65509k92669l48545j28310J52977Q1483K42558J42683q7186m03712J6556
11868a58656L77023q7130j46686r8625k34156J34178M5723j50626J64426J34800
11858a9729k28561k72164O7561K09816J51518J74832K61885n0201O7852J04101
11848D66910L92307M65686K0401j92916n37910m50241k82669n5709J55983K1214
11838C056J42148J94129L03150J23533l09527n52989l78124k2552K58753L70337
11828A31914J4701m8763J6959P7779J84567Q0744J7036j8128k97055l78495p1045
11817b89786n0543j17751k17409j79560J24146L3818J95771N44568L27378L44238
$$ y = [439297, 514277, 757992, 1099789, 1084728, 1029438, 964979, 750501, 639790, 471183, 474819, 465509, 172840, -175705, -304015, -151038, -69555, 173003, 315686, 228500, -175212, -158656, 218367, 131237, -15449, -114074, -348230, -214052, -168329, -318955, -154529, -19729, -248290, -520454, -452893, -243077, -91559, 83273, 345158, 294957, 362809, 466910, 859217, 1324903, 1345304, 1152388, 614478, 164237, -118432, -174141, -18158, 3056, 145204, 339333, 642483, 766016, 456489, -96500, -474624, -497176, -238423, 131914, 146615, 97852, 114811, 192590, 377157, 457901, 474937, 456809, 159754, -218741, -289786, -340329, -458080, -675489, -855049, -730903, -697085, -501314, 43254, 370632, 714870]
11807G14870K981o68367n02772n8461J48455m2985k9250k73900j56922K26488
11797f39863K82773K01091k79738k91401K22025j53754l00530j19993J8802L04572
11787g56016L04468o3822p473J45767P5155p4728l29086J1827O61026P72531K12259
11776I51908l00627m98078n66249L6773L65781n6087k37382K98198N69308j5337
11766E48208k32502K79962J94770k05170J26878J76114m65987m01589L78455L23489
11756G22628M5283j93213J1989M02921K35687q3973l27199k20516l87136k74415
11746f7944J19391J08109L81767n5278m81725j77655J38814K76734j80913k56330
11736a95030k28044p728L2907j4808k11961j64007K60294L44414J63759J3298
$$ y = [714870, 717851, 49484, -453288, -511749, -363294, -406279, -435529, -709429, -866351, -639863, -357090, -155999, -435737, -727138, -505113, -658867, -959397, -1079390, -1060588, -756016, -451548, -515370, -522843, -377076, -301921, -376649, -705735, -693908, -32882, 739649, 951908, 651281, 153203, -413046, -376273, -10492, -66579, -303961, -5763, 563545, 548208, 315706, 595668, 790438, 585268, 712146, 888260, 422273, 20684, 399139, 722628, 767911, 574698, 586687, 989608, 1225295, 1141322, 814123, 593607, 206471, -67944, 51447, 159556, 541323, 486045, 4320, -173335, -34521, 242213, 61300, -195030, -423074, -430802, -397895, -412703, -624664, -788671, -528377, -183963, -20204, -6906]
11726f906J91379P3240o4397J18048J15370M0267J2196k8500k6326L72229j20673
11715F75927k74443J75553J26063k9690j28188j69776l86375j91537q8957j87846
11705d79269j31866O9632J15361O3960K52708M07969K54460R9890q9104m0781
11695E22960K70139J12555J08043R9046j99804j62398j37857k83037k25327k66087
11685a61767m59097J18561Q3082j72778j54737P4207N52213M69586J30457l13567
11675A66160l04909k1680J08856k34126l43672L62385M63956k82043p42485m4769
11665h72327J48761L1888N28413P10481K88658J1989j29065k70616K0816K71408
11655G40406r5935K6799l6645m49958o66242k89079j67378J2839L14516J51609
$$ y = [-6906, 184473, 257713, 193316, 311364, 426734, 467001, 479197, 450697, 424371, 796600, 675927, 401484, 577037, 703100, 673410, 545222, 375446, -10929, -202466, -291423, -479269, -611135, -541503, -426142, -362182, -109474, 298495, 552955, 652845, 563741, 522960, 793099, 905654, 1013697, 1112743, 912939, 750541, 612684, 329647, 104320, -161767, -620864, -502303, -419221, -591999, -746736, -672529, -120316, 349270, 479727, 166160, -138749, -160429, -51573, -285699, -629371, -266986, 196970, -85073, -827558, -872327, -723566, -691678, -163265, 547216, 835874, 847863, 718798, 448182, 468998, 740406, 644471, 671270, 634625, 184667, -481575, -770654, -938032, -925193, -610677, -459068]
11645d59068l83398j93387L97042N06686L06242j38304K17229O37951j0962o04446
11635B75585n85892l7138L480O1792P2827O5475L47997p0843k19602j48878P4706
11624a60491J96495k66396j556N91700N49064N8529k83908m26073o95563j96528
11614f34727J71819K72870L18720J60377q1261J52759J51145j34834l51534N0867
11604G6201J76157P7009q6579n20110l56124J30984L11737K22556j8536j9409
11594f114L4501j83097j26406j88757j90170m9469k50033j73777L49770M30867
11584c52685K90902J30775Q46N827j36415J32710L13456J35659j02816n82408
11574a64149m60244o3795L18991M94137M29280P1329J15995l30280o48315l70114
$$ y = [-459068, -842466, -1035853, -638811, -132125, 174117, 35813, 253042, 890993, 880031, 275585, -310307, -347445, -343965, -282173, -209346, -143871, 204126, 133283, -86319, -235197, -160491, 36004, -230392, -231948, 359752, 908816, 967345, 683437, 257364, -438199, -634727, -462908, -190038, 128682, 289059, 207798, 360557, 511702, 376868, 25334, 76201, 252358, 329367, 242788, -277322, -633446, -502462, -190725, 31831, 13295, -6114, 28387, -154710, -281116, -469873, -660043, -709512, -959545, -1133322, -783552, -352685, -61783, 68992, 69838, 75665, -60750, 71960, 385416, 521075, 418259, -164149, -624393, -688188, -369197, 124940, 554220, 625549, 741544, 411264, -237051, -607165]
11564f07165k15743J14810J70234L66646N08825M60738o9656k00386l6739k1003
11554D70561K3646J9724j30324J97276o8125q5872J82522k67351k74471P8904
11544A46490R564Q3604K57867O319j27876J42275L50111r0132j02326J1638q0475
11533F07059l42426k36786J31041J96009k06028M1866K21053k06012j60114J75917
11523B21579p0640k79590o3428k37601m53429k48540L28255K46661r5405q4064
11513g36202K5224J52866J39101J1094l480J83146N0820l13576k55005K2935J9583
11502g03494k4188P2187J05313p3100J43071O25448L62007J96220K30933r598
11492I24799j74651O8997J87301M6868j92335j22168P3226k44247l28327r6125
$$ y = [-607165, -822908, -708098, -537864, -171218, 337607, 798345, 728689, 528303, 491564, 470561, 494207, 513931, 383607, 580883, 512758, 426886, 609408, 342057, 67586, 146490, 156054, 239658, 497525, 503844, 375968, 518243, 868354, 778222, 675896, 687534, 607059, 264633, 27847, 158888, 354897, 148869, 190735, 411788, 205776, 45662, 221579, 150939, -128651, -192079, -429680, -883109, -1131649, -803394, -556733, -652138, -736202, -710978, -558112, -419011, -407917, -411397, -228251, -177431, -491007, -746012, -723077, -703494, -727682, -655495, -550182, -623282, -480211, 145237, 507244, 703464, 934397, 924799, 750148, 819145, 1006446, 1053314, 860979, 738811, 812037, 567790, 239463, 143338]
11482A43338m4213L17289N94589k17236o17827m07521l23666r0698J96755P2852
11472c76338j3330N6717K25376K88161J67306L2023l02235l33479j97532L2109
11462d21222J90015R5872K00964N27414K37914m3225l39832l80661j77860N1305
11452e9316P0699p478L56872J54036m24773p526L99846L48658J05693k38068k19207
11441D79436J2482K16083k7128l68405j93329k31984k22767q3553r4123K63691
11431b49597J63456L63122J95874j94991J50246k3193m9312P7196R8550q0489
11421D50862k82527k93390L7035J22087l67524l78140L50969N28007J69982J81370
11411E18731J58336q4602k70657n21991m10211j12586L31398K56249q252m58672
$$ y = [143338, 99125, 416414, 1011003, 793767, 175940, -231581, -555247, -645945, -449190, -376338, -389668, -332951, -107575, 180586, 347892, 379915, 77680, -255799, -453331, -421222, -231207, -135335, 65629, 593043, 830957, 787732, 447900, 67239, -110621, -59316, 11383, 3905, 360777, 514813, 90040, 82514, 482360, 831018, 936711, 698643, 479436, 491918, 708001, 680873, 312468, 119139, -112845, -335612, -419165, -513288, -249597, -86141, 276981, 472855, 277864, 428110, 404917, 355605, 432801, 531351, 450862, 168335, -125055, -88020, 34067, -333457, -711597, -360628, 167379, 337361, 518731, 677067, 592465, 321808, -200183, -610394, -722980, -391582, -135333, -143585, -602257]
11401f02257n36337M7867M8615K18893M06066O14584K79398l20712j11980K03508
11391B47645l24948n00829l37711K11659L77045m03J42195J53691j72987l33459
11381e38102k88418m0427M38235L20922o9760k39084J52994L27040o0884k05247
11371b02731p8180j32853J07781K14021K88362M72395j56062j33763M05591M41360
11361A225921J1715j75217j55575l95916n81755n77161o8215J40047k65354j72022
11351a013532J55550L07760K98488J01278m6767J31166o9534j15172J70772n4872
11341a34863l94798j73437J98854j26633j96387L03480N30901O14456J85020l19973
11331D86620l73186j83224l0990N9838L67856L38573Q2924k04316k05560n0632
$$ y = [-602257, -1138594, -1090727, -1042112, -823219, -417153, 197431, 476829, 156117, 44137, 247645, -77303, -578132, -915843, -704184, -327139, -327542, -185347, -31656, -204643, -538102, -826520, -866947, -428712, -107790, -177550, -416634, -263640, 63400, 2516, -202731, -280911, -413764, -305983, -91962, 196400, 668795, 512733, 378970, 784561, 1225921, 1237636, 1062419, 906844, 510928, -70827, -647988, -716203, -576156, -841510, -1013532, -857982, -550222, -251734, -150456, -197223, -66057, -135591, -250763, -79991, -134863, -529661, -703098, -504244, -630877, -827264, -523784, 7117, 621573, 806593, 486620, 113434, -69790, -100780, -40942, 326914, 665487, 748411, 544095, 338535, 287903]
11321B87903k24279r1416J68247L54995L14852P9133j75551k53945J51715J10992
11311G22646l92785l20178l14677J18752K79926O8840j97203j6616L00453L1946
11301B81104L4533k4895j83854k62606J09803J28498m58250k96600j30162J98530
11291f03899N01883J92065p9444m8968q0499j21368n1496r6459j23215L1695K1078
11280d58627J31357L86105J25620L791l1726K3855J98618J93263r5673j61141
11270C15442J08160L2406l07989l32162l30578j65210J05896j08512k84007J02445
11260h64109N24396K27341l36521m47709k27664r3940J6723J42537J92209J0175
11250h56562j97550J54146M84841M43427Q8115J01963p2659k00917l29887k50423
$$ y = [287903, 63624, -27792, 140455, 495450, 810302, 889435, 713884, 459939, 611654, 722646, 329861, 9683, -304994, -186242, 93684, 162524, -34679, -51295, 249158, 281104, 315637, 290742, 106888, -155718, -45915, 82583, -375667, -672267, -802429, -603899, -102016, 90049, 10605, -38363, -118862, -240230, -291726, -388185, -511400, -479705, -458627, -327270, 58835, 184455, 188246, 156520, 180375, 378993, 572256, 476583, 315442, 423602, 456008, 148019, -184143, -514721, -679931, -574035, -682547, -966554, -864109, -339713, -112372, -448893, -896602, -1124266, -1218206, -1201483, -1058946, -866737, -856562, -1054112, -899966, -415125, 28302, 116417, 218380, 145721, -55196, -385083, -635506]
11240f35506J8421K19058N67057K9827r4817j96749N5917M40038l0636n78063
11230b05453o09578m34902l2234N10499L59006K23413K21024J97563j26151l60649
11220b57462K37829M80237M37047M33617O8074j29222m847m18689o74078j94218
11210b1712J22572m6788R5210J56492k91382n86738j43195k6368P6106N60039
11200a05764M00990J42869k12197o80688n94309Q8680P7844J11867N42638N89912
11190C61842N4135n51057k41289K08553j25111k95881j73225K65299M81252M40957
11180D25475K97423J07721K09090J30345J76637M58957l11208l71776k90421k13469
11170F18774l76898k90827r3698k26594k24058j6106J05216P5164K09120L95888
$$ y = [-635506, -617085, -398027, 169030, 198857, 104040, -92709, -36792, 403246, 372610, -205453, -815031, -1249933, -1282167, -771668, -412662, -189249, 31775, 229338, 103187, -257462, -19633, 460604, 897651, 1331268, 1399342, 1270120, 1265273, 846584, 172506, -21712, 100860, 54072, 149282, 305774, 14392, -572346, -715541, -741909, -665803, -105764, 295226, 438095, 225898, -454790, -1049099, -960419, -882575, -770708, -228070, 361842, 415977, -135080, -376369, -167816, -292927, -588808, -762033, -496734, -15482, 425475, 722898, 830619, 1039709, 1170054, 1346691, 1805648, 1494440, 1122664, 832243, 618774, 241876, -48951, -142649, -369243, -593301, -609407, -504191, -429027, -219907, 175981]
11160A75981K58809p2168j10261r9254J71483J43415L55132K23149j92866K94044
11150A147464K18314m50707m24002j66278j43608j16626j85408j37464K60912
11141B597M58262K50893j44097j48432j52228k72553J87004J39503k81960l44453
11131c05464j23553P8192q5471K00682K90428j14456n85950n91984L8528L57231
11121h41817O44657L84032k59539j54628j45347J77415q5999k67668P9488m2910
11111e12316j72555n2058Q8751J00890j50844p231K4619K12832Q6012l19479K00911
11100e00468L83163L4364j36260r5612o1836J57615K02119k07356j83714J35199
11090b72786J83151l70702k70777Q5927q3900K12077J43093o9968m6487q4118
$$ y = [175981, 434790, 362622, 252361, 153107, 324590, 468005, 823137, 1046286, 853420, 1147464, 1365778, 915071, 491069, 324791, 181183, 64557, -120851, -258315, 2597, 460859, 711752, 567655, 419223, 266995, -5558, 181446, 320949, 38989, -305464, -429017, -350825, -436296, -235614, 54814, -59642, -645592, -1237576, -1199048, -841817, -197160, 186872, -72667, -227295, -372642, -195227, -281226, -548894, -469406, -512316, -684871, -736929, -648178, -547288, -698132, -705363, -680744, -467912, -381900, -701379, -500468, -117305, -82941, -219201, -314813, -376649, -219034, -16915, -224271, -407985, -272786, -89635, -460337, -731114, -645187, -729087, -517010, -373917, -443885, -490372, -574490]
11080e74490K7634J9114J36486Q8943K53462K21175q1821o7357l04910k19113
11070e00877J7372j56087k65731q8842K54762L12428N52971M96679k08543n85120
11060a70988k91157j22043P81K10536q2867n89058k41856J89145J49879L15770
11050f31858M69176L51672M41117M72861K44412j19159j59603k3661p0695k75366
11040F98896o72364n04138P5283M18404M39015J89099m06384k83930M1797r0729
11030i5051k1168N7899K21902M10452K16991K93199m9710o67514j66114O5221
11020B66107k29330J62413K64871J31867K31074K56920K4933q1904l55768o05032
11010F6151j29360N36481L75091N3052k63045l64904n54402j00217M28063K35872
$$ y = [-574490, -546856, -527742, -391256, -302313, -48851, 172324, 90503, 23146, -281764, -500877, -483505, -639592, -905323, -994165, -739403, -426975, 125996, 622675, 414132, -170988, -462145, -584188, -583407, -372871, -455738, -1044796, -1286652, -1097507, -947628, -631858, -162682, 188990, 630107, 1102968, 1347380, 1228221, 1068618, 1044957, 974262, 698896, 26532, -477606, -402323, 16081, 455096, 644195, 237811, -46119, -4322, -95051, -116219, -58320, 163582, 574034, 791025, 1084224, 1034514, 367000, 200886, 266107, 36777, 199190, 464061, 595928, 827002, 1083922, 1108855, 1026951, 671183, 66151, -63209, 473272, 848363, 901415, 638370, 273466, -280936, -381153, 46910, 282782]
11000B82782J91484k4415p0614k00628k23142Q8989L83678k48377p09795n5209
10990e85247M12637L86506j11277k34934q3971J57220L56378J5736j82663Q9281
10980B19666J0967l46617k67273N8562O295j53652m13257J13296M44528O7732
10970b59753J07336L5137j75368j41902k59089k28175J4477K53220O29182K64072
10960B39137p3772m0157k32910j12338K00601M40512n2312m50273m41339p337
10950e30188K19282j75399J27612Q54220M26441j38760l78471m03059l57176m76402
10940h31900k03632o5785l29152k03495M71493N23215L18593K36765l41654j65244
10930e90796M71808j59831n64300J32214o2571k33477p5380j6749q9265O7606
$$ y = [282782, 474266, 449851, 379237, 178609, -44533, 44456, 428134, 179757, -530038, -585247, -172610, 213896, 102619, -132315, -216286, -59066, 297312, 313048, 130385, 219666, 230633, -115984, -383257, -324695, -318400, -472052, -885309, -772013, -327485, -259753, -152417, -117280, -292648, -434550, -693639, -921814, -907337, -654117, -24935, 239137, 165365, 125208, -107702, -220040, -19439, 421073, 368761, -81512, -522851, -530188, -310906, -486305, -358693, 495527, 921968, 783208, 404737, 1678, -355498, -831900, -1035532, -1101317, -1430469, -1633964, -1162471, -639256, -320663, -83898, -425552, -590796, -118988, -278819, -843119, -710905, -773476, -1006953, -1082333, -1099082, -1188347, -1120741]
10920a120741M54258O36068Q70527o3122m24068m84604o23889m76305k80856r5042
10910a607774k2345K13030J03985J52381N00296M15755l7750j26979m9908J30571
10900c28738M31625P2404J09470j29419p61135p68987o6201M5785J36640J78698
10890a079858J59308n1211J26061L81028M00150j3172j0364j02064k26153O5507
10880c50768L17835M84810J00438k55064k12726J79042J65948l9606m0760J41537
10870D90686J9084k04192k54507Q9178J07982J3383J3085J32417j11516l32745
10860c7145l14679k42156k93183j02300L03574P66782N98682J8575N0186J606
10850G49942j89503m26901k11203J31277N58143N60755M7118k29745q1428j53086
$$ y = [-1120741, -666483, -30415, 840112, 776990, 352922, -131682, -755571, -1231876, -1512732, -1607774, -1630119, -1417089, -1313104, -1160723, -660427, -244672, -282422, -409401, -459309, -328738, 102887, 175291, 284761, 155342, -605793, -1374780, -1440981, -1395196, -1258556, -1079858, -920550, -971761, -845700, -464672, -64522, -77694, -88058, -190122, -416275, -350768, -32933, 451877, 552315, 297251, 84525, 263567, 429515, 389909, 349149, 490686, 509770, 305578, 51071, 140249, 248231, 261614, 274699, 407116, 295600, -37145, -351824, -593980, -887163, -989463, -685889, 80893, 679575, 698150, 748336, 749942, 560439, 133538, -77665, 53612, 611755, 1172510, 1219628, 989883, 908455, 755369]
10840G55369j25146N3207J33811M3812k37122o29200n40287K30713N44128M24089
10830F53374K1528j26684O9828N505o0849M5128q6375n98850n24464N3522O47656
10819I9319Q61438M38035r2373M8332j16383l43167k89184l73931l35308m3564
10809a46786L39790K65148N1509j95772k1530K34254L88803Q0453k34072k86299
10799D75498r6160k13855k79674K97683K63903K27267J75401k77640J11388L68212
10789A052023J53472j10758k26295q4624K72675N10843K88795l50593o01295l77154
10779E27089m75165Q9682N72681M29239l19612m59158j13763j18042o5672R6731
10769A64010K25220N3698k11739l69501j05814j24467m14830j44375L38422L07206
$$ y = [755369, 630223, 683430, 817241, 861053, 623931, -5269, -545556, -314843, 229285, 653374, 674902, 548218, 618046, 623551, 562702, 607830, 521455, -77395, -601859, -548337, 99319, 960757, 1398792, 1306419, 1354751, 1238368, 895201, 606017, 232086, -103222, -146786, 193004, 458152, 509661, 313889, 292359, 526613, 915416, 995869, 761797, 475498, 379338, 165483, -114191, 183492, 447395, 674662, 850063, 572423, 683811, 1052023, 1205495, 1094737, 868442, 783818, 1056493, 1567336, 1856131, 1505538, 904243, 527089, 51924, 141606, 714287, 1143526, 823914, 364756, 250993, 132951, 67279, 164010, 389230, 442928, 231189, -138312, -244126, -368593, -783423, -927798, -589376, -282170]
10759b82170J11007L71099J86667k97200J71460L63568M3686j87330n0080j8170
10749D12537r1202K55093K41369j00432l8144J76435l9640k13055l40613J79008
10739D41356L55875j49767j67226p2117j0330k66336k62640L65900N9143J07556
10729D01414O479n07932n8000P5438K37756J70043p9523J41655O1287m28845k97962
10718b78190J4307O3865l14771o45150n12647O0912K75683L9180j19996m69942
10708a886749q9666N82533N22574N58420K17652J84899J96685J56086K4273j52097
10698C14610j31606K23682r8093l03275Q56L31703J23287o13534j89136j08421
10688d49927O7003J9303k88613j71410J9066K06177M19110K45310J15867r3237
$$ y = [-282170, -171163, 199936, 386603, 89403, 260863, 624431, 668117, 480787, 430707, 412537, 321335, 576428, 817797, 717365, 679221, 855656, 816016, 602961, 262348, 441356, 797231, 647464, 480238, 408121, 397791, 131455, -131185, 234715, 293858, 401414, 407893, -100039, -158039, -82601, 155155, 325198, 245675, 387330, 448617, 19772, -278190, -263883, -200018, -514789, -1159939, -1672586, -1611674, -1335991, -1296811, -1416807, -1886749, -1976415, -1393882, -871308, -312888, -95236, 89663, 286348, 442434, 466707, 314610, 183004, 406686, 308593, 5318, 6174, 337877, 461164, -152370, -341506, -449927, -382924, -363621, -652234, -823644, -804578, -598401, -179291, 66019, 181886, 88649]
10678H8649J73371K85014j99552O5664L32525k19646m04808j03406r123N2947
10668F1635o7104l91379k31327m9156L19564M98756P8236j66764N0854P8225j50808
10657C0732k06197l29341j51373P224l15157Q5438R29l00444K25502L88111N28918
10646c5658M74206k17528m90380j4814N08149J55409k39700n5625k62008l8145
10636b16094L27492J79930J74550o3198l26935j07039k58392J16802P0621K58754
10626A56491L62972k85331l68122o3748K68843M71645L83901j57546m77088n3504
10616B38513L81930q9932l16446P3492J75153J90307J05081l50593p6807Q0677
10606D11375j75158j94602q3669j13964J29087M70172L25113q7902m35834k77652
$$ y = [88649, 262020, 547034, 347482, 413146, 745671, 526025, 121217, 17811, 8688, 61635, -5469, -396848, -628175, -677331, -357767, 140989, 219225, 52461, 103315, 181540, 30732, -175465, -504806, -656179, -648955, -964112, -878674, -877745, -1178189, -952687, -564576, -35658, 438548, 221020, -269360, -284174, 223975, 379384, 139684, 84059, -177949, -216094, 111398, 291328, 465878, 402680, 75745, -31294, -289686, -172884, -102263, 156491, 519463, 234132, -133990, -197738, 71105, 542750, 926651, 769105, 292017, 238513, 620443, 530511, 214065, 287557, 462710, 653017, 758098, 407505, 330698, 411375, 236217, 41615, -42054, -156018, -26931, 443241, 768354, 680452, 244618, -33034]
10596c3034N0523Q3194j37846p2913j43228j53222o8866k60198P2764L07107J5193
10585c40526J73766M77375M59636J9914l29649l81647k88263l26931k0705M10286
10575a46744N07433n8010o3304J66923J81936m01117m60703m5968P8808J99304
10565d1442L26691K10091q4005M0891j46469J42753J28952j60511r5193J02931
10555D24689q8519j47900j69495k77138l64342M9064K36671m6776q3099J18918
10545c47927N91412M80809q9211l25094o7248L03223m0945n65594o32702Q2519
10535f10758O78121M48914J36342j69373m30289l80810R8016k7919k8803L29709
10525D3150P94880L21557k90724q501L0419k36840m62684k17935J32232J43421
$$ y = [-33034, 17489, 100683, -37163, -110076, -253304, -406526, -475392, -735590, -662826, -355719, -340526, -166760, 310615, 770251, 790165, 460516, 78869, -209394, -536325, -557030, -146744, 360689, 302679, 239375, 406298, 588234, 187117, -273586, -319554, -240746, -41442, 285249, 495340, 411335, 452226, 305757, 448510, 577462, 416951, 321758, 424689, 336170, 188270, 18775, -258363, -622705, -573641, -336970, -383746, -466845, -347927, 243485, 724294, 635083, 309989, 242741, 545964, 505019, -60575, -693277, -610758, 67363, 516277, 652619, 483246, 52957, -327853, -229837, -257756, -286559, 43150, 838030, 1159587, 868863, 860362, 890781, 653941, 191257, -26678, 105554, 248975]
10515B48975N7599K80419M17128R6350k07966j44135L4784j45393m76586n74514
10505d13339l16052n6343L44888L59777l4895l97718l69928K86231J15261m39606
10495i21724l7412O2532j55524m1548j17548o4206l0868L24945j42029O0724O20033
10484d42625L12561J07720O7840k6327j23182j98518L53097M23589J48680J22094
10474G44929k18918n20231k30250K75064L12727j77475m77810j28052j71880n5620
10464f47516M46426P20957M14275J67903j8424k38890n69801l04509l22851j77964
10454e30394n1515k44740n46693l06553N5229L92137Q7992j22005J97752J96698
10444h72092l03670k18997o3930L87139O12077K89114k30732J40980L36680k33786
$$ y = [248975, 306574, 586993, 1004121, 1100471, 892505, 748370, 783154, 637761, 161175, -413339, -729391, -785734, -440846, -81069, -115964, -513682, -883610, -597379, -482118, -921724, -959136, -896604, -1052128, -1093676, -1211224, -1275430, -1306298, -981353, -1123382, -1062658, -442625, -130064, -22344, 45496, 19169, -104013, -302531, 50566, 474155, 622835, 744929, 526011, 5780, -224470, 50594, 363321, 185846, -291964, -420016, -591896, -647516, -201090, 519867, 934142, 1102045, 1083621, 844731, 274930, -29579, -352430, -530394, -581909, -826649, -1373342, -1679895, -1624666, -1232529, -1144537, -1266542, -1068790, -872092, -1175762, -1394759, -1458689, -1071550, -459473, -170359, -401091, -260111, 76569, -157217]
10434a57217l75954l06062r4961K73267J80788O835k18754J43220L94092j49481
10424c04227m4097K12008K10050L34948K72451l78532l85770j78733O643K03219
10414e2040N4214j90434K9992R6518j4008p5168j90325L5593N8111k21976p1311
10403e40834N19581M59726j77046l91215j88422J20161j37307l1977j53229m64585
10393i85147l62404j13892m5992M50213O19987N15108J00390j09032m51494l98350
10383g80613j38189m01936Q0270M95654K90832K17200M0352M5740O6762K1678
10373f2250k64127n69773k05709J79634K62378K21235J17166R0828L2304n3444
10363b51758j80188Q4103j02089l95356q3290L05145J26550r2156k62918k62020
$$ y = [-157217, -533171, -839233, -934194, -660927, -480139, -473304, -692058, -548838, -154746, -304227, -348324, -136316, 73734, 408682, 681133, 302601, -83169, -261902, -255259, -52040, 2174, -188260, -158268, -61750, -75758, -150926, -341251, -305658, -247547, -469523, -540834, -21253, 438473, 261427, -129788, -318210, -198049, -335356, -367333, -520562, -985147, -1347551, -1461443, -1507435, -1057222, -437235, 77873, 178263, 69231, -382263, -780613, -918802, -1320738, -1240468, -744814, -453982, -236782, -196430, -150690, -83928, -62250, -326377, -896150, -1101859, -922225, -659847, -438612, -321446, -230618, -198314, -251758, -431946, -347843, -449932, -845288, -928578, -623433, -496883, -589039, -851957, -1113977]
10353a113977K14991P10357L70313j11177k94951j77820l74676r7680K87529M06093
10343a80998J61389O1220J60915L70336N35526m048p33377p04952N4329J14802
10333a64858J13096n0638K4975J57206n8219R3330M10939Q5742n31601p35383
10323f55411o8111L90686J12482j89701l28383m43909k53899K58600K96714N26158
10313c54774M56379j06233l00341l8942L01526O30041M51353L61728k7040q9553
10303A284144n9392l89299K9233n6248m03537m73079l21696O889N8498j50259
10293d74746J50815K17916L19103R8831l50454l39521J79423K19753j65858k57919
10283d02657j72862K48028J81019K38047L64366j12437p44786l71952M0212K15070
$$ y = [-1113977, -898986, -188629, 181684, 70507, -224444, -402264, -776940, -874620, -587091, -180998, -19609, 41611, 202526, 572862, 1108388, 1104340, 370963, -333989, -279660, -164858, -51762, -102400, -77425, 79781, 21562, 114892, 525831, 611573, 79972, -655411, -723522, -332836, -220354, -410055, -738438, -1182347, -1436246, -1177646, -880932, -354774, 101605, -4628, -304969, -343911, -42385, 587656, 1039009, 1400737, 1373697, 1284144, 1224752, 835453, 864686, 808438, 404901, -68178, -389874, -382985, -324487, -474746, -323931, -106015, 213088, 311919, -38535, -378056, -198633, 21120, -144738, -402657, -575519, -327491, -146472, 91575, 455941, 343504, -401282, -773234, -733022, -517952]
10273e17952K41284M7752j5991p1833j6281j09239k66846J31655K31535p4917
10263d20833J37726K24014J55109K00537P3515k81984l17836M25967N41357J50825
10253H88397J1336l71695l83030J60944L10623l3998q3010m22116k61120n1889
10243b35558L03150k8841k48766p9751n624K74270K55711j1815m25976k56274
10233d59474R4825J405J04459L42108J00242M2383K12915m95916n32091J15546
10223d73598J32269j30437k51035k24086q9082k10449K7220J21995q1825J25807
10213a053221L88242N13253M30707L58360n0649l13456k26045j13121J3499J25471
10203G3040o8041j28745j64827K49209N2697k1844J65370k61707m10528m1558
$$ y = [-517952, -276668, -228916, -244907, -316740, -333021, -442260, -709106, -577451, -345916, -420833, -283107, -59093, 96016, 296553, 370068, 88084, -229752, 196215, 737572, 888397, 899733, 528038, 145008, 305952, 616575, 582577, 499567, 77451, -183669, -235558, 67592, 38751, -210015, -289766, -295390, -21120, 234591, 222776, -203200, -459474, -364649, -363244, -258785, 83323, 183565, 225948, 438863, -57053, -589144, -473598, -341329, -471766, -722801, -946887, -1035969, -1246418, -1219198, -1097203, -1179028, -1053221, -664979, -151726, 278981, 637341, 586692, 273236, 47191, -65930, -52431, 73040, 4999, -123746, -288573, -39364, 13333, -8511, 156859, -104848, -515376, -556934]
10193e56934j8018k57965J36426N16609J29636J26180L72305J09364N4093k42947
10183C68749l05689k64006K08653M24378K23045J31824l03611j61740K86405K12303
10173H20311m60725m75943k84072m9324L97892J5987j46418K17130N6668l2696
10163E8810k91729j01773j27748M3191K42788l17305r5793N4493l1172J02504
10153d63734L5085k07271J00303J13730K89571N62556J6536m85056l81142k38412
10143f57834J54162N95954J57191l8908j09206k00204J73050J70832M03785K68597
10133I17419J2794k69556n00049l20858j23891N4629K40157k0298J87429m8499
10123A29277m44598J04652M79056L77328J38581j31149j39411L2077o2152j21822
$$ y = [-556934, -574952, -832917, -696491, -179882, -50246, 75934, 448239, 557603, 611696, 368749, 63060, -200946, 7707, 432085, 655130, 786954, 483343, 321603, 608008, 820311, 359586, -116357, -400429, -449753, -51861, -35874, -182292, 34838, 91506, 58810, -232919, -334692, -462440, -419249, -176461, -493766, -589559, -535066, -566238, -463734, -428649, -635920, -535617, -421887, -132316, 430240, 446776, -38280, -419422, -657834, -503672, 92282, 249473, 210565, 101359, -98845, 74205, 245037, 648822, 917419, 930213, 660657, 160608, -160250, -284141, -229512, 10645, -9653, 177776, 129277, -315321, -210669, 268387, 645715, 784296, 653147, 513736, 545813, 483661, 361839]
10113C61839j9181k58113j30037K70544K42120L06593L25788l96285n09075k47991
10103e3798l51857L1291N70139N67465j98633m45874m9570J46100k05457n7367
10093d7561K57923k2914J96436J96284j43168m82936k37484K47487M70164K03659
10083F37890k32223l80911q2961N33351J16814l72050j13370J57105j24456n46819
10073d07630k09741O03640N41467J84341K5363m13655l12789p1665l29658l46018
10063g36345K21627j67615k22446L26478L63823J26535j4453J28013J84114K64309
10053D74040L15471R9786m27186j66982R1667l30351o04259k44000Q7791M622
10043f99401J6650Q4518R4837M14731J19424J25863L30338r2009M2903K9417j74864
$$ y = [361839, 342658, 84545, -45492, 225052, 467172, 773765, 1099553, 703268, 194193, -53798, -405655, -374364, 195775, 763240, 564607, 118733, 69163, 215263, 9806, -47561, 210362, 187448, 383884, 580168, 437000, -45936, -283420, -35933, 434231, 637890, 405667, 24756, -58205, 475146, 591960, 219910, 106540, 263645, 139189, -407630, -617371, -13731, 527736, 712077, 737440, 323785, 10996, -60669, -390327, -736345, -514718, -682333, -904779, -578301, -214478, -87943, -102396, 25617, 209731, 474040, 789511, 889297, 462111, 295129, 386796, 56445, -547814, -791814, -704023, -699401, -682751, -598233, -503396, -88665, 30759, 156622, 486960, 394951, 437854, 467271, 292407]
10032B92407J4715j61033m67159N7414J68288m85734p5068O09143P122l88220
10022d28125k09572Q9946l1043r6100m6251m0151J32943l5288k79924o2753J53500
$$ y = [292407, 307122, 146089, -321070, -263656, -95368, -581102, -656170, -47027, -39905, -428125, -637697, -547751, -578794, -674894, -721145, -761296, -628353, -663641, -943565, -1006318, -852818]
$$ [...]
##END NTUPLES=NMR SPECTRUM
##END=
