##TITLE=C13_SA_31.186
 D2O, 27000 sc

 4.3.2020
##JCAMPDX= 6.0         $$ Bruker NMR JCAMP-DX V2.0
##DATA TYPE= NMR FID
##DATA CLASS= NTUPLES
##ORIGIN= UXNMR, Bruker Analytische Messtechnik GmbH
##OWNER= root
$$ XWIN-NMR		Version 3.5
$$ Thu Mar  5 13:41:48 2020 Russian Standard Time (UT+4h)  she@DPX200
##.OBSERVE FREQUENCY= 50.327896
##.OBSERVE NUCLEUS= ^13C
##.DELAY= (6, 6)
##.ACQUISITION MODE= SIMULTANEOUS
##.ACQUISITION SCHEME= undefined
##.AVERAGES= 16568
##.DIGITISER RES= 17
##SPECTROMETER/DATA SYSTEM= spect
##.PULSE SEQUENCE= zgpg30
##.SOLVENT NAME= CDCl3
##.SHIFT REFERENCE= (INTERNAL, CDCl3, 0, 225.262)
##AUDIT TRAIL= $$ (NUMBER, WHEN, WHO, WHERE, WHAT)
$$ ##TITLE= Audit trail, XWIN-NMR		Version 3.5
$$ ##JCAMPDX= 5.01
$$ ##ORIGIN= Bruker BioSpin GmbH
$$ ##OWNER= she
$$ F:/spectra/data/she/nmr/c13/1/audita.txt
$$ ##AUDIT TRAIL=  $$ (NUMBER, WHEN, WHO, WHERE, WHAT)
(   1,<2020-03-05 08:32:03.54 +0400>,<she>,<DPX200>,
      <created by zg, POWCHK disabled, PULCHK disabled
       terminated by command 'halt'
       configuration hash MD5:
       00 E9 B6 7A A2 85 ED C7 34 08 36 98 17 FE 4E 26
       data hash MD5: 32K
       95 38 42 15 FB D3 32 F8 6F 35 62 86 EC 06 46 9C>)
$$ ##END=
$$ 
$$ hash MD5
$$ C1 A5 07 FD F3 B5 D9 E1 F3 61 05 07 E8 49 5E 51
##$RELAX= 
##$RELAX= 
##$RELAX= 
##$RELAX= 
##$RELAX= 
##$RELAX= 
##$RELAX= 
##$RELAX= 
$$ Bruker specific parameters
$$ --------------------------
##$DU= <F:/spectra>
##$EXPNO= 1
##$NAME= <c13>
##$PROCNO= 1
##$TYPE= <nmr>
##$USER= <she>
##$AMP= (0..31)
100 100 100 100 100 100 100 100 100 100 100 100 100 100 100 100 100 100 
100 100 100 100 100 100 100 100 100 100 100 100 100 100 
##$AQSEQ= 0
##$AQ_mod= 1
##$AUNM= <au_zg>
##$AUTOPOS= <>
##$BF1= 50.322709
##$BF2= 200.13
##$BF3= 50.322709
##$BF4= 500.13
##$BF5= 500.13
##$BF6= 500.13
##$BF7= 500.13
##$BF8= 500.13
##$BYTORDA= 1
##$CFDGTYP= 0
##$CFRGTYP= 5
##$CHEMSTR= <none>
##$CNST= (0..31)
1 1 145 1 1 1 1 1 1 1 1 1 1 1 1 1 1 1 1 1 1 1 1 1 1 1 1 1 1 1 1 1 
##$CPDPRG= <waltz16>
##$CPDPRG1= <>
##$CPDPRG2= <waltz16>
##$CPDPRG3= <>
##$CPDPRG4= <mlev>
##$CPDPRG5= <mlev>
##$CPDPRG6= <mlev>
##$CPDPRG7= <mlev>
##$CPDPRG8= <mlev>
##$CPDPRGB= <>
##$CPDPRGT= <>
##$D= (0..31)
0 2 0.00345 0 0 0 0 0 0 0 0 0.03 2e-05 3e-06 0 0 0 0 0 0 0 0 0 0 0 0 0 
0 0 0 0 0 
##$DATE= 1583326136
##$DBL= (0..7)
120 120 120 120 120 120 120 120 
##$DBP= (0..7)
150 150 150 150 150 150 150 150 
##$DBP07= 0
##$DBPNAM0= <>
##$DBPNAM1= <>
##$DBPNAM2= <>
##$DBPNAM3= <>
##$DBPNAM4= <>
##$DBPNAM5= <>
##$DBPNAM6= <>
##$DBPNAM7= <>
##$DBPOAL= (0..7)
0.5 0.5 0.5 0.5 0.5 0.5 0.5 0.5 
##$DBPOFFS= (0..7)
0 0 0 0 0 0 0 0 
##$DE= 6
##$DECBNUC= <off>
##$DECIM= 12
##$DECNUC= <off>
##$DECSTAT= 4
##$DIGMOD= 1
##$DIGTYP= 9
##$DL= (0..7)
120 120 120 120 120 120 120 120 
##$DP= (0..7)
150 150 150 150 150 150 150 150 
##$DP07= 0
##$DPNAME0= <>
##$DPNAME1= <>
##$DPNAME2= <>
##$DPNAME3= <>
##$DPNAME4= <>
##$DPNAME5= <>
##$DPNAME6= <>
##$DPNAME7= <>
##$DPOAL= (0..7)
0.5 0.5 0.5 0.5 0.5 0.5 0.5 0.5 
$$ [...]
##$SUBNAM3= <"">
##$SUBNAM4= <"">
##$SUBNAM5= <"">
##$SUBNAM6= <"">
##$SUBNAM7= <"">
##$SUBNAM8= <"">
##$SUBNAM9= <"">
##$SW= 239.972175391363
##$SWIBOX= (0..15)
0 1 3 0 0 0 0 0 0 0 0 0 0 0 0 0 
##$SW_h= 12077.2946859903
##$TD= 32768
##$TD0= 1
##$TE= 0
##$TE2= 300
##$TE3= 300
##$TEG= 300
##$TL= (0..7)
120 120 120 120 120 120 120 120 
##$TP= (0..7)
150 150 150 150 150 150 150 150 
##$TP07= 0
##$TPNAME0= <>
##$TPNAME1= <>
##$TPNAME2= <>
##$TPNAME3= <>
##$TPNAME4= <>
##$TPNAME5= <>
##$TPNAME6= <>
##$TPNAME7= <>
##$TPOAL= (0..7)
0.5 0.5 0.5 0.5 0.5 0.5 0.5 0.5 
##$TPOFFS= (0..7)
0 0 0 0 0 0 0 0 
##$TUNHIN= 0
##$TUNHOUT= 0
##$TUNXOUT= 0
##$USERA1= <user>
##$USERA2= <user>
##$USERA3= <user>
##$USERA4= <user>
##$USERA5= <user>
##$V9= 5
##$VALIST= <valist>
##$VCLIST= <CCCCCCCCCCCCCCC>
##$VD= 0
##$VDLIST= <DDDDDDDDDDDDDDD>
##$VPLIST= <PPPPPPPPPPPPPPP>
##$VTLIST= <TTTTTTTTTTTTTTT>
##$WBST= 1024
##$WBSW= 4
##$XGAIN= (0..3)
0 0 0 0 
##$XL= 0
##$YL= 0
##$YMAX_a= 94146620
##$YMIN_a= -33717664
##$ZGOPTNS= <>
##$ZL1= 120
##$ZL2= 120
##$ZL3= 120
##$ZL4= 120
##$ABSF1= 240
##$ABSF2= -10
##$ABSG= 5
##$ABSL= 3
##$ALPHA= 0
##$AQORDER= 0
##$ASSFAC= 0
##$ASSFACI= 0
##$ASSFACX= 0
##$ASSWID= 0
##$AUNMP= <proc_1d>
##$AZFE= 0.1
##$AZFW= 0.5
##$BCFW= 1
##$BC_mod= 2
##$BYTORDP= 1
##$COROFFS= 0
##$CY= 12.400447845459
##$DATMOD= 1
##$DC= 1
##$DFILT= <>
##$DTYPP= 0
##$F1P= 154.2805161984
##$F2P= -2.91768707477254
##$FCOR= 0.5
##$FTSIZE= 32768
##$FT_mod= 0
##$GAMMA= 1
##$GB= 0.4
##$INTBC= 1
##$INTSCL= 1
##$ISEN= 128
##$LB= 1
##$LEV0= 0
##$LPBIN= 0
##$MAXI= 10000
##$MC2= 0
##$MEAN= 0
##$ME_mod= 0
##$MI= 0.1934396
##$NCOEF= 0
##$NC_proc= 0
##$NLEV= 6
##$NOISF1= 120.0001
##$NOISF2= 80.00006
##$NSP= 1
##$NTH_PI= 0
##$NZP= 1
##$OFFSET= 225.2625
##$PC= 1.4
##$PHC0= -234.478
##$PHC1= 30.40638
##$PH_mod= 0
##$PKNL= yes
##$PPARMOD= 0
##$PSCAL= 0
##$PSIGN= 0
##$REVERSE= no
##$SF= 50.3225993700027
##$SI= 32768
##$SIGF1= 140
##$SIGF2= 120
##$SINO= 80
##$SIOLD= 32768
##$SREGLST= <13C.CDCl3>
##$SSB= 0
##$STSI= 0
##$STSR= 0
##$SW_p= 12077.2946859903
##$SYMM= 0
##$S_DEV= 0
##$TDeff= 0
##$TDoff= 0
##$TI= <>
##$TILT= no
##$TM1= 0
##$TM2= 0
##$TOPLEV= 0
##$USERP1= <user>
##$USERP2= <user>
##$USERP3= <user>
##$USERP4= <user>
##$USERP5= <user>
##$WDW= 1
##$XDIM= 64
##$YMAX_p= 0
##$YMIN_p= 0
$$ End of Bruker specific parameters
$$ ---------------------------------
##NTUPLES= NMR FID
##VAR_NAME=  TIME,          FID/REAL,        FID/IMAG
##SYMBOL=    X,             R,               I
##VAR_TYPE=  INDEPENDENT,   DEPENDENT,       DEPENDENT
##VAR_FORM=  AFFN,          ASDF,            ASDF
##VAR_DIM=   16384,         16384,           16384
##UNITS=     SECONDS,       ARBITRARY UNITS, ARBITRARY UNITS
##FACTOR=    8.28000000000003e-05, 1,        1
##FIRST=     0,             0,               0
##LAST=      1.3565124,     0,               0
##MIN=       0,             -33717664,       0
##MAX=       1.3565124,     94146620,        0
$$ Real data points
##PAGE= N=1
##DATA TABLE= (X++(R..R)), XYDATA
$$ [...]
13250F2233o692r4687n6816K61642j66659n7679K69210n3284q6967j1798K461
13261F0964j23638J23353j47903P5928k5965J23201j40534n4986J40716j80112
13271a48976j26142K30305k23902L47912J76822j10263j76967l5855J26004o4606
13281e668j02809M6565J2598K02695k68947l6650J06960j30106K13942j7082O4861
13292H6359j19967J14573j18801M0623J62281l48267R6257k0406O7868J44279
13302A04799j73589j12596Q824L24479j72242k41302L24069l9541K22178K3574
13312B68653k58201j23287J24309j448K9505m6595M7838J67152j99575q0340L192
13323f8797J3670L3165k585j16776J52401j41603o6951J43557J6048O8332j32536
$$ plain form
13250 62233 55541 -39146 -95962 165680 -979 -58658 210552 157268 70301 58503 60964
13261 60964 -62674 60679 -87224 -11296 -37261 85940 -54594 -109580 31136 -148976
13271 -148976 -275118 -44813 -268715 79197 256019 145756 -31211 -67066 58938 -5668
13281 -5668 -108477 -61912 -49314 153381 -115566 -152216 -45256 -175362 38580 21498 86359
13292 86359 -33608 80965 -37836 2787 165068 -183199 -86942 -107348 -39480 104799
13302 104799 -68790 -181386 -172562 151917 -20325 -261627 62442 22901 245079 268653
13312 268653 10452 -112835 11474 10026 39531 -7064 40774 207926 8351 -71989 -68797
13323 -68797 -55127 -21962 -24547 -141323 11078 -130525 -197476 -53919 -37871 30461 -102075
13334a02075O4831l4343J43703o2522q289n7587L8335N2716k27245J33747K42744
13345A84015j3077p0366K1538o6706j84039J89040k79127K21937J46421n0358
13355I9278j80682J80904j85979N9226p5640K30628j60401K35903r8190J62491
13365B67538j38486j02729r6847j97406M518J25095J12486K47147j78931n7047
13375a4662J44002j19160m9998j97083Q7276L974L03697k0094j29989J45053j54985
13386a969q8358k7899J95313k08327J4614K55763K8353j12753r2931n3888k6332
13397a18414K03521k503j45561J22108n7105J2811K4601k66926J96628K6111j04962
13408a09691K22523l115Q2019p1386m0260j50750J5576m0876K0096J64212K8464
$$ plain form
13334 -102075 -37244 -71587 72116 9594 1305 -56282 -17947 34769 -192476 -58729 184015
13345 184015 170938 100572 122110 55404 -128635 60405 -218722 3215 149636 99278
13355 99278 -81404 99500 -86479 -27253 -102893 127735 -32666 203237 105047 267538
13365 267538 129052 26323 -70524 -267930 -263412 -138317 -25831 221316 42385 -14662
13375 -14662 129340 10180 -39818 -236901 -149625 -145651 158046 137952 7963 153016 -1969
13386 -1969 -90327 -118226 77087 -131240 -116626 139137 167490 54737 -38194 -92082 -118414
13397 -118414 85107 82604 -62957 59151 2046 14857 39458 -227468 -30840 -4729 -109691
13408 -109691 112832 109717 191736 120350 80090 -70660 -55084 -95960 -75864 88348 116812
13419A16812l794K7374j470k12040k61543L45144M616m9668J25150K81111l15727
13430E5965k02585j5954j29486J25670K09232M1094K72984p3910N2099l11696
13440B3413k00928J77437j36428m23J27688K48031j35264N0433k25223K00663
13450A29399j21357k62831K10494r6994K23696J14820j78075j32809l9106P5869
13460g6894k2953k00747L72991P5378j91336J46490J30601k87728R2377k2756
13470A5423m7736O0849J2101P3366q1041L0841l9846k6930k13375K40793p7048
13481e2603K20191r0611J40380k5255j01945M3217k93193j04426J36163L28894
13491B00812j8159j31073j6325j81831j52080L56645j87720L6413J49631J27066
$$ plain form
13419 116812 113018 140392 138922 -73118 -334661 10483 15099 -34569 90581 371692 55965
13430 55965 -146620 -162574 -292060 -166390 42842 83936 356920 283010 335109 23413
13440 23413 -177515 -78 -136506 -136929 -9241 238790 103526 153959 -71264 129399
13450 129399 8042 -254789 -44295 -141289 82407 197227 19152 -113657 -152763 -76894
13460 -76894 -99847 -300594 72397 147775 -43561 102929 233530 -54198 38179 15423
13470 15423 -32313 28536 40637 114003 32962 63803 23957 -2973 -216348 24445 -52603
13481 -52603 167588 76977 217357 192102 90157 133374 -159819 -264245 -128082 200812
13491 200812 182653 51580 35255 -146576 -298656 57989 -129731 -93318 56313 183379
13501A83379j45218L6004j32277k33065m94K22661L397J18013j6991M4891k49667
13512a69367K84445j91441l8587O1516K2018j67584L29964j5468o6522J80203
13522B29177j39378r7315Q9308k00775J79220l349O8409k5703n6979J11879k48894
13533i4400J19661n3907l3510k04189K61150J25926J0803L570j46690L6528q4099
13544e9157k5386K0300l5405K17533j70699N4995O0854k65094K06924o4602j19670
13555a79407L70721k11918K262J4391R1518j80381p013J39605j11349J11422Q2348
13566A22199j47318m7346j4845K59221m52991L53989L4658j43608P2426N6691
13576I3076j24181J12261P0448k89198J43241J3785j11820r9178K84813q3260
$$ plain form
13501 183379 38161 74165 -58112 -291177 -291671 -69010 -65613 52400 35409 80300 -169367
13512 -169367 115078 -76363 -114950 -53434 -31416 -199000 130964 115496 48974 229177
13522 229177 89799 -7516 81792 -118983 60237 56888 125297 99594 42615 154494 -94400
13533 -94400 25261 -28646 -62156 -266345 -5195 120731 131534 135104 -11586 24942 -59157
13544 -59157 -84543 -64243 -99648 117885 -52814 2181 63035 -202059 4865 -59737 -179407
13555 -179407 191314 -20604 -18342 -3951 87567 -92814 -99827 39778 -71571 39851 122199
13566 122199 -25119 -72465 -87310 171911 -281080 72909 107567 -36041 36385 93076
13576 93076 -31105 81156 151604 -137594 5647 19432 -92388 -191566 93247 9987
13586I987J80028j71578j17048L2662J46839k31902J47219m7877k5538K20976
13596A43768j51778L8077k30144K24635r7585j52878K11780j81355K08232K7230
13606C9982o7420J43290j15866j47414J12417J18073k80111J97446R1775q2721
13616I451m345L4907q814K49564k45099k48292R2560K71244k03842L48233k49354
13627D6213Q2330j26756q3536j92753K35051N9874J47950l23355L44358r1479
13637I7897k2914m1869p2960r3102R5665J54672J39901P966k51129L553n5314
13648c7634k05577K60554L8138n5761N0753R751K8648j64779j32367J87293n1571
13659g2552L3395J83340N4958j91743o592j89594J81290O1361l5470k2320R2041
$$ plain form
13586 9987 190015 18437 -98611 -65949 80890 -151012 -3793 -51670 -77208 143768
13596 143768 -8010 30067 -200077 24558 -73027 -225905 -14125 -195480 12752 39982
13606 39982 -27438 115852 -14 -147428 -35011 83062 -197049 397 92172 9451
13616 9451 5106 40013 31199 280763 35664 -212628 -120068 151176 -52666 295567 46213
13627 46213 128543 1787 -81749 -274502 -39451 20423 168373 -154982 189376 97897
13637 97897 74983 33114 -39846 -132948 -37283 117389 257290 265256 14127 17680 -37634
13648 -37634 -243211 17343 55481 -280 50473 60224 88872 -75907 -208274 -20981 -72552
13659 -72552 -39157 144183 199141 7398 806 -188788 -7498 53863 18393 -3927 88114
13670H8114j34513J70711k77799P2136q7869Q2307J4874R3451M1339p1559K16127
13681B07319l6757j66402j53914J74961l27453L37048l3217P220J62052J14679
13691B85536k75032j95544P613K4430j39589K77177K32223q9869o1957M9832k80549
13702a65729K80450j79126j24893L08462m615J74500k89361J99331l70976R3251
13712g8706P8442j85946L8207J15189J68732j46069J04176r0806r6099J19210
13722B6330j93172J59319J14109J2044J6055r0154j17061l16831L47183j57079
13732a99257J46627K0362Q3457j13892N6364j07594J40426j19616q7108J41510
13742c8721l893l0533J92552j32533j57234K7193j17188J30376j09261L29767
$$ plain form
13670 88114 -46399 124312 -153487 -81351 -169220 -86913 -72039 21412 62751 -8808 207319
13681 207319 170562 4160 -149754 25207 -302246 34802 1585 8805 170857 285536
13691 285536 10504 -185040 -177427 -152997 -292586 -15409 216814 126945 64988 114820 -165729
13702 -165729 114721 -64405 -189298 119164 114549 289049 -312 199019 -171957 -78706
13712 -78706 -264 -186210 -148003 -32814 135918 -10151 94025 3219 -92880 26330
13722 26330 -166842 -7523 106586 118630 134685 44531 -72530 -389361 -42178 -199257
13732 -199257 -52630 -32268 51189 -62703 -6339 -113933 26493 -93123 -180231 -38721
13742 -38721 -42614 -73147 119405 -13128 -170362 -143169 -260357 -129981 -239242 90525
13752I0525o5445J93896l4338j22485j92323Q4968j21479J838J65330K22343l7291
13763A85539j90581p0993r407q0784o7534J28201O1296J38510J23796m0556k49378
13774g1891o4851L1383j35896J47389J11301R0127J34013k90934M7887j10491
13784a11963j20683l5406J35686K78791j11748J80471j54412m1853j48656J14964
13794a4809j63772J13333K61755j95717j8135J04054j15770j6903o2309p3857
13804a82130K96244j03687j11528L81487k57367k8433n9598l3719J3656j07531
13814a92606K26351N2946L6900j5774r3703o9645k56534O8818J60248P6592n4246
13825f0653J11924K90106l13646R1982k78584J7492L966k68834N76755J547j75836
$$ plain form
13752 90525 25080 218976 184638 62153 -130170 -45202 -166681 -164843 487 222830 185539
13763 185539 -5042 -76035 -85442 -166226 -233760 -105559 -44263 94247 218043 177487 -71891
13774 -71891 -136742 -105359 -241255 -93866 17435 107562 241575 -49359 -1472 -111963
13784 -111963 -232646 -268052 -132366 146425 34677 215148 60736 18883 -129773 -14809
13794 -14809 -178581 -65248 196507 790 -17345 86709 -29061 -45964 -108273 -182130
13804 -182130 114114 10427 -101101 280386 23019 -5414 -65012 -98731 -85075 -192606
13814 -192606 33745 86691 123591 107817 14114 -55531 -312065 -243247 -82999 -6407 -60653
13825 -60653 51271 341377 27731 119713 -158871 -141379 -137413 -406247 170508 172055 -3781
13836c781O6367j67459O5648k29567P3481J38975j9865K88330j88797R7633O5238
13847A86203k53620N0160k36506L09419m9968o5846J97704j71771K32254l19440
13857a21411J86517j19480O1790O880Q9911K53l8962l5968q1605J834M3535K4195
13869A7489j98537K56682O9040l10785K46592q2082N1641k4243k9694J42924k34614
13880i5587Q421J58685J03588j71049j62084L9975N5465p0801K84920j41177K1981
13891C2337p3727K24853j57569j25876p0062J17312Q8247l462J16448j73655J73559
13902A48405j54082j33871k1413K30545J31863k37375P3993P6736l3913j77916
13912i7028P2714j18612J63028J09842p1603p2641r2582P0895J10051k3467p4350
$$ plain form
13836 -3781 62586 -104873 -39225 -268792 -195311 -56336 -76201 212129 23332 120965 186203
13847 186203 -67417 -17257 -253763 55656 5688 -60158 137546 -34225 198029 -121411
13857 -121411 65106 -54374 7416 14296 104207 104460 65498 29530 -52075 -50241 -6706 17489
13869 17489 -181048 75634 144674 -166111 80481 -1601 50040 25797 -3897 139027 -95587
13880 -95587 -87166 71519 175107 4058 -158026 -118051 -62586 -133387 151533 10356 32337
13891 32337 -41390 183463 25894 -99982 -170044 -52732 35515 32053 148501 -25154 148405
13902 148405 -5677 -139548 -160961 69584 201447 -35928 38065 114801 80888 -97028
13912 -97028 -24314 -142926 20102 129944 58341 -14300 -106882 -35987 74064 50597 -23753
13923b3753J07257j45080N5840R3060j25485Q8981M4911Q2732p3891n9177K5739
13934G1134k34428J3420K7122J366J70833J33358n4199j05112Q2345j07191j07878
13945a09230n123J20869n5366P1247O9290O5228r9930j5995j33085K54285p6407
13956H5783k7675R8805j97115q5484J7775K13065m1959R4909j29861J0822j96723
13967a57658K89725J7477j94616M2204l18M8571j50300O293N3393J8222O5326
13978C8319Q3386l00707J83724k03470Q9199J92054l577N0872Q1298k17126j17244
13989a23272O7812j68533N0926K03778J06998k27224J22658J09232k35355N1171
13999d1809p89j74865J57470K4319R2288k10978M25943k93619j74585L3915Q2173
$$ plain form
13923 -23753 83504 -61576 -5736 87324 -38161 50820 95731 178463 104572 45395 71134
13934 71134 -163294 -149874 -122752 -121386 49447 182805 128606 23494 105839 -1352 -109230
13945 -109230 -114353 6516 -48850 22397 91687 156915 56985 40990 -92095 162190 85783
13956 85783 58108 156913 -40202 -125686 -107911 105154 63195 158104 28243 39065 -157658
13967 -157658 132067 149544 -45072 -2868 -3186 45385 -104915 -98622 -45229 -27007 38319
13978 38319 121705 -179002 4722 -198748 -109549 82505 78928 129800 211098 -6028 -123272
13989 -123272 -55460 -223993 -173067 30711 137709 -89515 33143 142375 -92980 -41809
13999 -41809 -42598 -217463 -59993 -35674 56614 -154364 271579 -22040 -196625 -162710 -80537
14010h0537P7807J0163J92942j07819M0310j04410J1101J00750m68937J60829
14020a67801O0976P0544K18312j1005j57526L8340p9993j03287q5310N0898J29585
14031c6267J0672K41067n9230j97201j91642J51468j64863K69246L3318K19025
14041B75593j09355j33621j10904j1305K4541k4282J85912o2748K55975k01045
14051H8761K2178j65180m5931N3503n1176J85197L6246R5865J8921m8253j37878
14062E2253r3883j16439P2120k54071M08242L6591p0553j4636n2914k5356O4361
14073E715K2544j55357q4584J87402K31400j13318L9988n5215k10402K4373R283
14084i8171O2304J48768J70911q4280m2889j04581j87135J17784j4165j58760
$$ plain form
14010 -80537 -2730 7433 200375 92556 132866 28456 39557 140307 -328630 -167801
14020 -167801 -106825 -36281 182031 171026 13500 51840 -28153 -131440 -216750 -165852 -36267
14031 -36267 -25595 215472 156242 -40959 -232601 -81133 -245996 23250 56568 275593
14041 275593 166238 32617 -78287 -89592 -65051 -89333 96579 33831 289806 88761
14051 88761 110939 -54241 -100172 -46669 -97845 87352 123598 219463 238384 190131 52253
14062 52253 -41630 -158069 -85949 -340020 68222 104813 34260 19624 -33290 -58646 5715
14073 5715 28259 -127098 -211682 -24280 207120 93802 133790 78575 -131827 -107454 -98171
14084 -98171 -35867 112901 283812 199532 156643 52062 -135073 -17289 -31454 -190214
14094a90214j0476L79032k6808k98161K59563k39236p7072K71268k7035J79J85658
14105B26698m8763k3563q0030r744k21988J30059o1891J12605O9112q9294N7769
14116F0970n0507k6368o9858R1769M4859N9210o3250K5556P7241j8407k19764
14127h8549k3916K11980N1192J04538k12233Q3618n2924j5652n8226k17398J40003
14138g7567Q3260L3673p1428Q0853N7158l0390j33654O7080o5698j09683Q9043
14149g7353J06200J40487O8311k59084j40406M8894l7688j61441K24252K9363
14159e8465J18522M8528p3268j99399J00219R8899o3673p590J88845n9889j29761
14170c7032K33532l03637Q9794Q2130j54762q1200J37406O1236K5934M5139j21589
$$ plain form
14094 -190214 -200690 178342 151534 -146627 112936 -126300 -203372 67896 40861 41040 226698
14105 226698 177935 154372 74342 64598 -157390 -27331 -89222 23383 92495 3201 60970
14116 60970 10463 -15905 -85763 6006 50865 110075 46825 72381 149622 131215 -88549
14127 -88549 -112465 99515 150707 255245 43012 126630 73706 58054 -172 -217570 -77567
14138 -77567 5693 39366 -32062 48791 105949 75559 -58095 8985 -56713 -166396 -77353
14149 -77353 28847 169334 237645 -21439 -161845 -112951 -150639 -312080 -87828 -58465
14159 -58465 60057 108585 35317 -164082 -63863 35036 -28637 -36227 152618 92729 -37032
14170 -37032 196500 -107137 -17343 64787 -89975 -171175 -33769 27467 53401 98540 -23049
14181b3049n5679k7897K86471k35020P8032N0433j02669J60438j59562p4646j6496
14192a19644l6733N3162K21511J23509q9874j03595m1801j30296P4389O8217K1369
14203D0214R9373j02835Q7866p3643Q862J0482k05080R3921n1912m5900j118K85412
14215A45642k71130J18530K12704j31714k57572K09958p3440l4822M1245L01364
14225B60765j43233j50598J85774j70845J77383k17995j6732R5623K814J42102
14235A65058j16543j43804J30187K9461Q3491k48457K54584r0706n8393P6716
14245H1594r2704J2995j9230J19264j7788L3142j33263j38051R4599L1620P1262
14256D3440j16445K38032Q0327j88060j98487O1009j57423L54412K082q5357p5995
$$ plain form
14181 -23049 -78728 -106625 179846 -55174 22858 73291 -29378 131060 -28502 -103148 -119644
14192 -119644 -156377 -103215 118296 241805 151931 48336 6535 -123761 -49372 18845 40214
14203 40214 139587 36752 124618 50975 59837 70319 -134761 -40840 -92752 -138652 -139770 145642
14215 145642 -125488 -6958 205746 74032 -183540 26418 -47022 -81844 -40599 260765
14225 260765 117532 -33066 152708 -18137 159246 -58749 -75481 20142 22956 165058
14235 165058 48515 -95289 34898 64359 147850 -100607 153977 63271 4878 81594
14245 81594 -11110 1885 -17345 101919 84131 117273 -15990 -154041 -59442 -27822 43440
14256 43440 -73005 165027 245354 57294 -141193 -80184 -237607 116805 118887 33530 -42465
14267d2465K9864k24531K88765r9053r98J46749j20139L9104Q687m3821J37769
14278A19931k05982K5141J1166K01134K1544k18623O3895j35409J33293Q1181
14288I7271j93257J17989r037k27087J84013L3066K5453r4776o6299J90244J01217
14299A58797j95312j5014Q4380j12005P5871m7725l2735L7569p9962J70625N1418
14310I5907O9397l0105j77181O4666l7058k90345L46007m3361j8939R7286Q893
14321H5167M5738L1479l61676P2529P4314m7217J61969K05805J3857j03258k94764
14332a16057j61594J83708J29168j51237L32981j94233M6715k309p0145l7736
14342d0739K1057j4103j35287J59439O1976p3646J88633k03518m6154P4770q5192
$$ plain form
14267 -42465 -12601 -237132 51633 -47420 -48418 98331 -21808 17296 25983 -17838 119931
14278 119931 -86051 -60910 -49744 151390 172934 -45689 18206 -117203 16090 97271
14288 97271 -95986 22003 12966 -214121 -30108 2958 28411 -66365 -132664 57580 158797
14299 158797 -36515 -51529 32851 -79154 -3283 -51008 -83743 -46174 -126136 44489 95907
14310 95907 165304 135199 -41982 22684 -14374 -304719 41288 -2073 -21012 76274 85167
14321 85167 130905 162384 -199292 -126763 -52449 -99666 62303 268108 281965 178707 -116057
14332 -116057 -277651 -93943 35225 -116012 216969 22736 69451 67142 -3003 -40739
14342 -40739 -19682 -33785 -169072 -9633 52343 -21303 167330 -36188 -82342 -7572 -92764
14353i2764K33907r7825j54808K8991N0083J02924k31718J02028J18153j40562
14363h1591J41508k05985J56521j5723J16254k54826Q3628n7865o7710K03344
14373A7555O3938J3449J58853q8742j38906q9825p4366j23281K05683K43541J6553
14384B04452j23266n4824j33106n2963k765m2568N9461K51557K49263k56953p1192
14395B7096j46904K1290m0408Q4079j11588J41674p9541J46241M5306j9129j88055
14406a19939q9688K00244j58835R9856J58647J01919q9894J15570k54310L3780
14416b650q4464K3221J37995l3541J18141j0969n6601O6834j83583j82520K70623
14427F2486j00447J41310j26253Q9927j24068J58465j00493j51589r2081L83866
$$ plain form
14353 -92764 141143 43318 -111490 -82499 -32416 70508 -161210 -59182 58971 -81591
14363 -81591 59917 -146068 10453 -5270 110984 -143842 -60214 -118079 -185789 17555
14373 17555 81493 94942 253795 165053 26147 -63678 -138044 -261325 -55642 187899 204452
14384 204452 81186 26362 -106744 -159707 -162472 -205040 -145579 105978 355241 98288 27096
14395 27096 -119808 -98518 -138926 -54847 -166435 -24761 -104302 41939 87245 68116 -119939
14406 -119939 -209627 -9383 -168218 -68362 90285 192204 102310 217880 -36430 -2650
14416 -2650 -87114 -63893 74102 40561 158702 147733 91132 157966 -25617 -208137 62486
14427 62486 -37961 103349 -22904 67023 -57045 101420 927 -150662 -242743 141123
14437A41123O392j98019K99154l23773J89130k44389j29421k1570J49544J02485
14447b9344J01348J77378j86902j0071j55140j06855N7470J06536N5026J85542
14457A94988M3386j71899k28629M5531j3897l3561K29720j92133J44880J20350
14467A38736q4034l6730l0841p7407r09N758L0745n3776N6209J0005O8193o0755
14479c4806J77081l73260J06789K47902j46838L03944l47808J72783r1794O1521
14489G5514j17048J9514l1765k5162J95075q1779K06362m36848K61124j57774
14499i2787j70205M31103k48771J91879k0516l3980n7510j78202K32113j27043
14509g3919J86306k3689j02347Q4220L2963l39931Q0775q646Q5214K8722J38517
$$ plain form
14437 141123 147515 -50504 248650 -75123 114007 -130382 -259803 -281373 -131829 -29344
14447 -29344 72004 249382 62480 52409 -102731 -209586 -152116 -45580 9446 194988
14457 194988 238374 66475 -162154 -116623 -130520 -164081 65639 -126494 18386 138736
14467 138736 54702 17972 -12869 -90276 -91185 -85427 -54682 -108458 -52249 -42244 25949 -34806
14479 -34806 142275 -230985 -124196 123706 -23132 280812 -66996 105787 13993 75514
14489 75514 -41534 -22020 -53785 -78947 116128 34349 240711 -196137 64987 -92787
14499 -92787 -262992 168111 -80660 111219 90703 56723 -787 -178989 53124 -73919
14509 -73919 112387 88698 -13649 70571 103534 -236397 -155622 -164268 -79054 -50332 88185
14520H8185j24957K5534k1127R6438j32448J82532k93165k520J26203N9974l4185
14531b9536R920o0487J26320N7499l29518K83382k44399K32579M6854j97358J91763
14542H7019J05105k1491l9889j14944o4996J45124j50160L9835l3199J31474P1745
14553A55623j93401n9291J20282o3641j5844l2135O5130P6122j03615P2530O4393
14564H6153l19636M64792N274k29203J48427K8078j14099j58729J00641m204J36941
14575A44435j8094j03582j68844J22031J10905n1488L4431Q6396l30259J86268
14585A2199j01061K17768k36135J39013k1827K98088k44336M6123n7544k24940
14595a72652K32431m1418J02440q1147j50544o4167R8302m0906P6065J38106j90541
$$ plain form
14520 88185 -36772 -11238 -32365 64073 -68375 114157 -179008 -181528 -55325 4649 -29536
14531 -29536 -19616 -80103 46217 103716 -225802 57580 -186819 45760 92614 -104744 87019
14542 87019 192124 170633 130744 15800 -49196 95928 -54232 -14397 -47596 83878 155623
14553 155623 -37778 -97069 23213 -40428 -56272 -88407 -23277 52845 -50770 21760 86153
14564 86153 -233483 231309 236583 7380 155807 183885 69786 -88943 11698 7494 144435
14575 144435 126341 22759 -146085 -24054 86851 35363 69794 156190 -174069 12199
14585 12199 -88862 128906 -107229 31784 9957 308045 63709 109832 52288 -172652
14595 -172652 59779 18361 120801 39654 -110890 -175057 -76755 -117661 -41596 96510 -94031
14606i4031k9197J49990N7711j0680r1152Q6956j05855j57698K79102n4060K61247
14617B92333j52381j69105O5157j83155R0690l7268J12023k11159K25614m9343
14627a6594j38381K31866j16764J40458j44342l79254L50182R0760O1340N3927
14637A33198O6819Q41j90866p1958n4444K12961p6771k1526L6007J6357R3279
14648A43897q3002j71663j73861L53446j36801M9862J80055k38192k2763J14488
14658A5466k1003j20871K39013k10186J61296k08168K65222m38549L50835k9791
14668C264k05348L75549l9976r8144q0318J03169k36426R4804J26155k19268L09333
14679A32794m7661m675j9903k25935Q7228J9564j29780P2844J85277k4621P8481
$$ plain form
14606 -94031 -123228 26762 84473 73793 -17359 69597 -36258 -193956 85146 31086 292333
14617 292333 139952 -29153 36004 -147151 -56461 -93729 18294 -192865 32749 -16594
14627 -16594 -154975 76891 -39873 100585 -43757 -423011 -72829 17931 79271 133198
14637 133198 200017 200858 9992 -61966 -116410 96551 19780 -1746 34261 50618 143897
14648 143897 60895 -110768 -284629 68817 -67984 -18122 161933 -76259 -99022 15466
14658 15466 -5537 -126408 112605 -97581 63715 -144453 120769 -317780 33055 3264
14668 3264 -202084 173465 133489 35345 -44973 58196 -178230 -83426 42729 -176539 132794
14679 132794 85133 80458 60555 -165380 -78152 -58588 -188368 -115524 69753 45132 123613
14690A23613j17393K7886r3360N5520k57000J73412M1251L3746m7198J56672j4798
14701H2351R4585j55370n36j87429J74235M4177L0753N7623n257j37552R6254
14712I3834J2339l65447J92394K2227L1227J96056j15329n2439j50798j32485
14722b68421J85591K6469k08197L68939j10132K96135n3490k65408o6950K3399
14732g2065j05727R1628J32887Q5221j96149J28701L7739l18505K01118K3687
14742H535l3609N2032m4351J8041J02178r6943j87990R9543p0287K17662q4499
14753a9688K57746q7589K8268j09291j79530k09261K06563j09683J07350K00124
14763H5009j35234N1727J61072q9473k76318l2728Q8623N0239J73143J95783j81461
$$ plain form
14690 123613 6220 34106 -59254 -3734 -260734 -87322 -46071 -12325 -59523 97149 82351
14701 82351 176936 21566 21030 -166399 7836 52013 82766 140389 135132 -2420 93834
14712 93834 106173 -259274 -66880 -44653 -13426 182630 67301 14862 -135936 -268421
14722 -268421 -82830 -56361 -264558 104381 -5751 290384 236894 -28514 -95464 -72065
14732 -72065 -177792 -86164 46723 131944 -64205 64496 102235 -216270 -15152 8535
14742 8535 -25074 26958 -17393 648 102826 5883 -182107 -82564 -152851 64811 -19688
14753 -19688 238058 150469 178737 69446 -110084 -319345 -112782 -222465 -115115 85009
14763 85009 -50225 1502 162574 73101 -203217 -235945 -147322 -97083 76060 271843 90382
14774I0382j82153N2280j22506o247M6691J88003J14830n0760o8776K46438k83216
14785B4966l717l08685Q0597M8983l7263L41337p2922J5034q6704L2431j60253
14796a26196R3958p0883J41785j1061J71818k10045k6510j73245J52422r9445
14806a57402J24954Q5354K3885l6407O4937k15367J16175J13460j54299K2658
14816a2052J10841m1074j49450J47866M7241M0528j38069j86573J39818R6005
14826E5081j65972K21746J85295k53009l6573R743l29949J29909L3741J92958
14836D2970o7650K55180k10870k18228J05466J82347l18959P2914K21447K72677
14846C37294j2172l87017q1606R9559l9387M9632q8680J82020N0294p8829M6034
$$ plain form
14774 90382 -91771 -39491 -161997 -168244 -121553 66450 181280 130520 61744 308182 24966
14785 24966 21249 -287436 -206839 -157856 -195119 146218 73296 88330 1626 34057 -126196
14796 -126196 -32238 -103121 38664 27603 199421 -10624 -37134 -210379 -57957 -157402
14806 -157402 -32448 52906 76791 40384 105321 -110046 6129 119589 -34710 -12052
14816 -12052 98789 57715 -91735 56131 103372 143900 5831 -180742 -40924 55081
14826 55081 -110891 110855 296150 43141 6568 16311 -313638 -183729 -149988 42970
14836 42970 -24680 230500 19630 -198598 -93132 89215 -229744 -156830 64617 337294
14846 337294 325122 -61895 -143501 -43942 -83329 -33697 -122377 59643 109937 31108 77142
14857G7142q8902M062l1584R9369l5827m1501L5124q327N1698j22206O1396q9745
14869h9301J92445k37075J24241J91657k96842J12339j04903J89725J1093L2054
14879A25433j09152k48855R9467R1913J28749M7656q3743r6062J00655p6280o8240
14890h8459J38149J1799k57433J17482j16076J28759K12549j30060j42492J92991
14900F7209j56800q252R9883j1412j69906J88158L7690j9405j14075L12124k62844
14911c7630o8648Q5800K7447j46758M5417J83029j57719M0107J07184j68461p9329
14922a69561J75875q2919J84152r0895J07438p4093j5193j04310J69567m4767
14932E5294J15407K3188j93747j1862j55741J88247O808P6856r5363L3621q8108
$$ plain form
14857 77142 -11760 -7698 -39282 60087 24260 -17241 17883 9556 61254 -60952 444 -89301
14869 -89301 103144 -133931 -9690 181967 -114875 -2536 -107439 82286 93379 125433
14879 125433 16281 -232574 -133107 -41194 87555 135211 51468 -44594 56061 -20219 -88459
14890 -88459 49690 61489 -195944 -78462 -194538 -65779 146770 16710 -125782 67209
14900 67209 -89591 -97843 2040 -9372 -179278 8880 46570 27165 -86910 225214 -37630
14911 -37630 -106278 -20478 6969 -139789 -94372 88657 -69062 -28955 78229 -90232 -169561
14922 -169561 6314 -76605 107547 16652 124090 49997 34804 -69506 100061 55294
14932 55294 170701 193889 142 -11720 -167461 20786 27594 104450 9087 42708 -45400
14943d5400J40180j08226M1651r3499K9515k7219J17808J32642m372j74537n1141
14954d2598J4384k76593K01262m9786Q2505J37471j3851Q2829M7205k34527J77410
14965A25711j87201o0565J9645K42502k8169j71289J4401J21008k17267L35232
14975A94008l5649l19671K11177K9579k41759J28472n1694j08070P9650j34761
14985b48718J96560P4058J01823m0032N118K5064l78256N9010m6686K77653J80269
14996B05863l1138j36813R8731l74981J33737o6071j47214K09094J25435J1466
15006B8109J11190j15284o10O4333l05592J61035J4590K54155m7827l6437K6296
15017A53958j77782n9459j31186L1808L92842l33015J40496J80965M579j57272
$$ plain form
14943 -45400 94780 -13446 28205 -65294 -35779 -62998 54810 187452 183080 8543 -42598
14954 -42598 -28214 -304807 -103545 -153331 -70826 66645 52794 135623 182828 -51699 125711
14965 125711 -61490 -122055 -102410 140092 111923 -59366 -44965 76043 -141224 194008
14975 194008 158359 -161312 49865 79444 -162315 -33843 -85537 -193607 -113957 -248718
14985 -248718 -52158 21900 123723 83691 88809 113873 -264383 -205373 -252059 25594 205863
14996 205863 174725 37912 136643 -238338 -104601 -170672 -317886 -108792 16643 28109
15006 28109 139299 24015 23405 87738 -217854 -56819 -42229 211926 164099 127662 153958
15017 153958 -23824 -83283 -214469 -182661 210181 -122834 17662 198627 203206 45934
15027D5934j1817k88254L29957j20911l0363R7797J99336P9875j74975j89816
15037f3237j16145R0103l8592J19923r6521K01678K5189j60994J92824k10216
15047e5988j03228K18439j34944J10950J78868k7013m6421q3001j47006N1810
15057c7534K7008R7687J04313p1190J08934j83323j26913Q966j9309L6946o0870
15068a15285M62725j98187k72927p3960J43927O2604J74374j69794Q224P1186
15078I2887J04207k42028P2613P38j05362j17038J37994j80511L49901N7201j49656
15089B0946J09955M9778l80574O3151k9927J97421J27278J4782k36425o6898j877
15100a32390L11804n36510L16451J03309j55256J98271N13k21485K41065r7752
$$ plain form
15027 45934 34117 -254137 75820 -45091 -75454 22343 221679 301554 126579 -63237
15037 -63237 -179382 -89279 -127871 -7948 -104469 97209 122398 -38596 154228 -55988
15047 -55988 -159216 59223 -75721 35229 214097 187084 140663 57662 -89344 -37534
15057 -37534 -10526 87161 191474 120284 229218 45895 -81018 -72052 -91361 -54415 -115285
15068 -115285 347440 149253 -123674 -197634 -53707 8897 183271 13477 21701 92887
15078 92887 197094 -44934 27679 28417 -76945 -193983 -55989 -236500 113401 170602 20946
15089 20946 130901 180679 -199895 -136744 -166671 30750 158028 172810 -63615 -130513 -132390
15100 -132390 179414 -357096 -40645 62664 -92592 105679 106192 -115293 125772 28020
15110B8020k76437O6615K21677j24962O6248J89502n9415q7371j49587l1866l0804
15121a88380L28844q2341p1687R2931j69636J76699j68892l839q751J45683m9190
15132A441Q6765R009q9687n366k06348L5230Q8202m2100Q1089N869j29456K10574
15144D5222j02870J44957k26352K5194M8612M7251J9029J93514r4789j49299J35456
15155H5925m940n7504j39593P7462N3629Q3977J83043n5509k02189j25505J98726
15166I7522q8131J43236j57969N6761L816J17027k26842K6798K5034j51480K23953
15177F9725j28155Q1273K2561j03212K01209j36623j88613J95842j4259j319K35235
15188B33664l14074l3504M5191q9185L799R8195J77596q8398K6632j34751P4845
$$ plain form
15110 28020 -248417 -181802 39875 -85087 -18839 170663 111248 23877 -125710 -157576 -188380
15121 -188380 140464 58123 -13564 79367 -90269 86430 -82462 -86301 -95052 50631 1441
15132 1441 88206 97215 7528 2162 -204186 -168956 -80754 -122854 -41765 -35896 -165352 45222
15144 45222 -57648 87309 -139043 -113849 -65237 -17986 1043 194557 99768 -49531 85925
15155 85925 80985 23481 -116112 -38650 14979 98956 281999 226490 24301 -101204 97522
15166 97522 9391 152627 -5342 51419 55235 172262 -54580 -27782 -2748 -154228 69725
15177 69725 -58430 22843 45404 -57808 143401 6778 -181835 14007 -252 -1571 233664
15188 233664 -80410 -113914 -68723 -157908 -154109 -55914 121682 33284 59916 -74835 10
15199A0J52839k88512M0604r6953Q7638r2022J58981J32679k41996J45794p338
15210h276L1241j4174k7277K1635Q4125J4957j54750n9026R5916K63772j70764
15221G7379J01780j84113l0146K69320j65315j01445L0818N7273j31483J4228
15231f1704k9915K6794J7076J07804l00474K71566K5411j98342M8772j01146n2556
15242b46714J55484l5880M7202J20221q0803j43232L05234L2382j95730l3447
15252g5283l5717O1870N3958J29582j34179M964J05130j29437j20589K4203k7159
15263a42657O813K40226P3802k36763K2448J22270j70648J47055p2010k34489
15273b43953K22237K72913k99065K3858o5061Q6713o8333k3469k3549j4232K04526
$$ plain form
15199 10 152849 -135663 -95059 -192012 -104374 -196396 -37415 95264 -146732 -938 -8276
15210 -8276 22965 8791 -18486 3149 87274 102231 -52519 -111545 -15629 248143 77379
15221 77379 179159 -4954 -35100 234220 68905 -32540 -1722 55551 -75932 -61704
15231 -61704 -91619 -64825 -47749 60055 -240419 31147 56558 -141784 -93012 -194158 -246714
15242 -246714 -91230 -127110 -79908 40313 -40490 -183722 121512 153894 -41836 -75283
15252 -75283 -111000 -49130 4828 134410 231 5195 110325 -19112 -139701 -115498 -142657
15263 -142657 -135844 104382 178184 -58579 -36131 86139 -84509 62546 -9464 -243953
15273 -243953 -21716 251197 -47868 -24010 -89071 -2358 -70691 -94160 -117709 -131941 72585
15284G2585j5529P3016L6065j90491j36502J81403m4431k9581N9304K2921N6193
15295H4953q6552j53154J24765j83654K26515N5832j27635K04129j76622O0293
15305B8870J34110l46102J42893J20719j71633K02900j48134K18090l9933j97293
15315e5513r9711j51972L50270j82056K19606m8718J08448Q2818j71613j78816
15325a27257p179l0503K40634m6186k03488L67292j14471k2439o6262j42665q0412
15336b32936J81892R6765j10862J13121K18145k76321O5935j4209k47140J01933
15346a03677Q276J22667R8595o83j17111r703l1455j38372L06892j0316j06538
15357A8575J03456m6782o6617l0328m4464k5662j53515K61357L9147r4968K32938
$$ plain form
15284 72585 57056 130072 166137 -24354 -160856 20547 -23884 -53465 5839 28760 84953
15295 84953 -1599 -154753 -29988 -213642 12873 68705 -58930 145199 -31423 28870
15305 28870 162980 -183122 -40229 80490 -91143 111757 -36377 181713 141780 -55513
15315 -55513 -155224 -307196 43074 -138982 80624 31906 140354 223172 51559 -127257
15325 -127257 -134436 -164939 75695 29509 -173979 193313 78842 56403 -9859 -152524 -232936
15336 -232936 -51044 45721 -65141 47980 266125 -10196 55739 41530 -205610 -103677
15346 -103677 -95401 27266 125861 125178 8067 -1636 -33091 -171463 135429 125113 18575
15357 18575 122031 75249 8632 -21696 -66160 -91822 -245337 16020 55167 -39801 193137
15368A93137r6284l22296K24920j19935K0904L13788p5392j21791K49024j49794
15378A16281k00325O4102j04942j35346P1424K63786j14176M8964J08259j7024
15388A01003j97039J1197M7847O0689N7928o9512K13315J27840l34785j91004
15398a72521K70192l3734k13443K77850M8363m120l99354L97814k12673k13581
15408b55207R6963M0345O3838J33540M0947k9771n0015j36810K3151o0834J61713
15419B7860p690k2851J59872k46180K13952P6275l47266K09700o9440j48926J47744
15430f950R6223Q8680j12847M3760j18595n9168J40494l66394M06957r1309m6421
15441b5570L4398K9710p9444n6064R3030l7775k6649K37817k07861M2313j75312
$$ plain form
15368 193137 96853 -225443 -523 -120458 -99554 214234 138842 17051 266075 116281
15378 116281 -84044 -19942 -124884 -260230 -188806 74980 -39196 9768 118027 101003
15388 101003 -96036 -84839 -36992 23697 81625 12113 225428 353268 18483 -172521
15398 -172521 97671 63937 -149506 128344 176707 172587 -226767 171047 -41626 -255207
15408 -255207 -158244 -117899 -54061 79479 120426 90655 40640 -96170 -73019 -133853 27860
15419 27860 20170 -2681 157191 -88989 124963 201238 -146028 63672 -5768 -154694 -6950
15430 -6950 89273 177953 65106 108866 -9729 -68897 71597 -294797 112160 20851 -25570
15441 -25570 8828 38538 -40906 -96970 -3940 -41715 -68364 169453 -38408 3905 -171407
15452a71407J48542j19324J89092j91425K81282Q3688k34909r3192j77807K13243
15462g2217k2581N5670q1185J15347l1942J29879r1485N9041j44695K9045p2737
15473a27860J22855O1925O8368j08930r134n609J68193k06207o7207R4597K3487
15484A4478j7330r8109L13993k56993K3357K0745O7988k07718Q9883J03635j50057
15495i6128K69825l1595r5141O9718j51873r0058P4877J58660n0881R093k1683
15506D4814j87009L25888p8224k10374J81135J12011k07720R0852n8211J32542
15516A45704k72088J2067r7376K41758P8223q3446J5111j4363j83085N4347L6651
15527f6497J42368p4132O8082J49000l07260N4219J04581j29631n7947J96428
$$ plain form
15452 -171407 -22865 -142189 46903 -144522 136760 220448 -14461 -107653 -285460 -72217
15462 -72217 -94798 -39128 -120313 -4966 -36908 92971 1486 60527 -84168 -55123 -127860
15473 -127860 -5005 56920 125288 16358 7224 1615 169808 -36399 -103606 -9009 14478
15484 14478 -2852 -100961 213032 -43961 -20604 141 68129 -139589 -49706 53929 -96128
15495 -96128 173697 142102 46961 116679 -35194 -125252 -50375 108285 57404 66497 44814
15506 44814 -142195 183693 105469 -104905 76230 188241 -19479 71373 13162 145704
15516 145704 -126384 -114317 -211693 30065 108288 24842 39953 25590 -157495 -103148 -66497
15527 -66497 75871 1739 69821 218821 -88439 -34220 70361 -59270 -117217 79211
15537G9211j14238J50826j7304j48496J3921p6821N1000N7349k1676J43249j75292
15548e8271J17982o2553L9420j25714J06405R6517p8491j17025N5966m1728L3153
15559c4339k16382J59987K04268j90334M208O1298m829m9300K43882k10676R8835
15570F6618r1085j30141J03002m6071R9162j06189J8774q0401K5840O8441J52768
15581H0718o7635n9928J17985O3260j72539j22634J55955j64174J35269K8383
15591e340p7200J85705n689m5002j4665j29999K38621k32636J3325R8060N0676
15602G5856o84J7671L3141q6919k00002P5332J09710R2857q1240L4747k2844m2858
15614D767q8698J46661j1669r145n7467j1703O763j60920K83237k9223j47929
$$ plain form
15537 79211 -35027 115799 98495 -50001 -36080 -112901 -61901 -4552 -26228 117021 -58271
15548 -58271 59711 -2842 36578 -89136 17269 113786 35295 -81730 -25764 -67492 -34339
15559 -34339 -250721 -90734 113534 -76800 -72592 -11294 -16123 -65423 178459 -32217 66618
15570 66618 -24467 -154608 -51606 -97677 1485 -104704 -85930 -166331 -140491 -72050 80718
15581 80718 13083 -46845 71140 134400 -38139 -160773 -4818 -168992 -33723 -5340
15591 -5340 -82540 103165 97476 52474 37809 -92190 146431 -86205 -72880 25180 75856
15602 75856 75172 92843 125984 39065 -160937 -85605 24105 116962 35722 70469 47625 4767
15614 4767 -83931 62730 51061 41916 -15551 -27254 -20491 -181411 101826 72603 -75326
15625g5326N4247J10854J02292j70639J45394k31829q1302K2719J34043p5595
15635f5142K07568j2496q2409Q1373l09616J33057Q5873q3334j31869K39147K3696
15646H5848n0799n1149J87994j16600j16265N0295j88493R1010K87276j90575
15656a1458J42620R1311k65045N7364j22939j24742Q7139K83942j06864j9239
15666A2089K1575J53029m05283Q9980O0861K74343J3340j25662N22j62364K0385
15677d7185p0206J15934q6405R178K18843Q8376q8044k32534m7669q4699M1309
15688a83102J37953J47650K7110r787J7837k64378K18687o6531o3444K597J76787
15699A41379J0494R3816l3898k06872r1004j7376q146J30896J9587j18900l6525
$$ plain form
15625 -75326 -21079 89775 192067 21428 166822 -65007 -146309 -123590 10453 -65142
15635 -65142 142426 129930 47521 128894 -180722 -47665 38208 -45126 -176995 62152 85848
15646 85848 35049 -16100 171894 55294 -60971 -10676 -199169 -108159 179117 -11458
15656 -11458 131162 222473 -42572 14792 -108147 -232889 -145750 138192 31328 12089
15666 12089 33664 186693 -218590 -128610 -67749 206594 219934 94272 94794 -67570 -47185
15677 -47185 -117391 -1457 -87862 -78684 140159 228535 140491 -92043 -139712 -224411 -183102
15688 -183102 -45149 102501 129611 119824 137661 -126717 91970 25439 -38005 -35408 141379
15699 141379 151873 245689 211791 4919 -86085 -103461 -111607 19289 38876 -80024 -116549
15710a16549K23380N7404j96404j16638m6738j21423J76120L0818Q4479J86714
15720A61163m5782M3900r6074j85251n2975J64636j03568K7149K29557k1919M0624
15731A61460k61445J94479n5100j40603J82466J24098r9046K20632k56304O1091
15741A31728k67154J40388p8662J73331J61868j90411n9050K6648j86382Q4771
15751f2925P6187l4850J81427K1248k19886Q8317J42869k86656o8530J50256O407
15762f136O5616Q3577n9438K8036n2241k7864j57338P3573J81690l24294L29196
15773A34377j7405j24600J33445J3483k34668L0015o640M5500N6259J92917q8615
15784A34068j16456J13202k16835J30404j85355M3710K4590K95301j97638j13402
$$ plain form
15710 -116549 106831 164235 -32169 -148807 -195545 -316968 -140848 -110030 -25551 161163
15720 161163 115381 159281 63207 -122044 -175019 -10383 -113951 -86802 142755 120836 161460
15731 161460 -99985 94494 39394 -101209 81257 205355 106309 326941 70637 131728
15741 131728 -135426 4962 -73700 99631 261499 71088 12038 38686 -147696 -62925
15751 -62925 13262 -21588 159839 181087 -38799 49518 192387 -94269 -162799 -12543 -6136
15762 -6136 59480 143057 83619 111655 59414 31550 -125788 -52215 129475 -194819 134377
15773 134377 116972 -7628 125817 139300 -95368 -65353 -71993 -26493 29766 222683 134068
15784 134068 17612 130814 -86021 44383 -140972 -97262 -72672 222629 24991 -88411
15794h8411J50442k61925J51566r3470J2210J64518K5124J29023j69630j3095
15804F352K15285k32323m8837j1144l7475L45596j90646M0510j46343l4470K54198
15815A60703l41752K30436J51025j11666j49497J91322j91567j19197J05810L7651
15825c6732L7918p5854O7806j47321R4150k5401j9004K5810M5861J71742L8539
15836A77514k51778J12404j21568q510J30470R3263m8929j4997j00057J08027
15846G5839k48825K21979J05531n7178q0678N4858j60769r3480J54598r1645J41830
15857B2060M2450j08879r8232J43833m3338j72362J35869J28806j01557J30341
15867G8991k35810J41277R9231O5649j98167p3053L22594k79581K2733l7143K464
$$ plain form
15794 -88411 62031 -199894 -48328 -141798 -129588 34930 60054 189077 19447 6352
15804 6352 221637 -10686 -59523 -70667 -108142 237454 46808 87318 -59025 -93495 160703
15815 160703 -181049 49387 200412 88746 -60751 130571 -60996 -180193 -74383 -36732
15825 -36732 1186 -74668 -6862 -154183 -60033 -85434 -104438 -78628 -32767 138975 177514
15836 177514 -74264 38140 -83428 -91938 38532 131795 82866 67869 -32188 75839
15846 75839 -172986 48993 154524 97346 16668 71526 -89243 -182723 -28125 -119770 22060
15857 22060 64510 -44369 -142601 1232 -42106 -214468 -78599 50207 -51350 78991
15867 78991 -156819 -15542 83689 149338 -48829 -121882 200712 -78869 -56136 -93279 -90815
15878i0815j72886L05282j47291K00114k63643o751o5042L57291n5525M7602J09197
15889B17533r7470L985j40142j75489Q7849L15652k58162m2615J05114o2414L5935
15900a0224r2515m3733k1819J92351J37460j64008j45098K85900q0357l9270j39280
15911a20593J40928M3267k3428O3549j66635J11522j39873J02954q9512p5778
15921a53599J63723n3082J69443m6869r9580J9961l8095J45145j77218K63561
15931A93390n35536N02781o6749l9826o9505j09320j923K53154k63523K24452
15941H7395r0095J47171R6942j23391j06060m25248K59705J76896k5768j4871
15951a7324K62958j43804K57701j78930k53797M3172J9305K6824R8001k67090
$$ plain form
15878 -90815 -263701 41581 -105710 94404 -169239 -175990 -241032 116259 60734 108336 217533
15889 217533 120063 124048 -16094 -191583 -103734 211918 -46244 -88859 16255 -46159 -10224
15900 -10224 -102739 -146472 -168291 24060 161520 -2488 -147586 138314 57957 18687 -120593
15911 -120593 20335 63602 40174 103723 -62912 48610 -91263 11691 -77821 -153599
15921 -153599 10124 -42958 126485 79616 -19964 -3 -38098 107047 -70171 193390
15931 193390 -342146 160635 93886 54060 -15445 -124765 -126688 126466 -137057 87395
15941 87395 -2700 144471 241413 118022 11962 -413286 -153581 23315 -2453 -17324
15951 -17324 245634 101830 359531 180601 -73196 -30024 -10719 16105 114106 -152984
15961a52984K60432j11879J10970r2762o5543M7998n1226K10385j20789m3326
15971h724O7388M4955R8254k08024n6723j42231J73741K35349k73504K2009J3437
15982c4073J70299k36081J22881q6953j16145Q3944K18079j92360P7683L6440
15992D3714m4443p2713J02189J48056k22741m558J26780m5669O8561o8897k35018
16003b04739J56911J03643j39187K51541l9304p7630K61475k03828k35724l7824
16013a64666R5383n940J9589J22243r3081m1738q633j12651J57315J34065N5018
16024A56904l8429L7065j09186q0339m8710j11992Q2850J74628J03128p4818r8677
16035g576J25079p769j88884k8363k6036J12869j2673J91916r7948j1938M4895
$$ plain form
15961 -152984 107448 -4431 106539 13777 -51766 -3768 -54994 155391 34602 -8724
15971 -8724 58664 103619 201873 -6151 -62874 -205105 -31364 203985 -69519 -47510 -34073
15982 -34073 136226 -99855 23026 -63927 -180072 -96128 121951 -70409 7274 43714
15992 43714 -729 -73442 28747 176803 -45938 -50496 76284 30615 99176 30279 -204739
16003 -204739 -47828 55815 -83372 168169 128865 51235 312710 108882 -126842 -164666
16013 -164666 -69283 -75223 -55634 66609 -26472 -68210 -76843 -189494 -32179 101886 156904
16024 156904 118475 155540 46354 -33985 -82695 -194687 -111837 62791 165919 91101 -7576
16035 -7576 117503 109734 -79150 -107513 -133549 -20680 -33353 158563 60615 48677 93572
16046I3572j37563o1762r8180K74849J07865k20237N2358J24054O5843k44253
16056d3454J62135l46866M6175J71333J33844k5795k44116K93767k19735N0674
16066b2038r4240j42403K48904K37865j17046P6604m63847J68337R9703M1812
16076C3651n9850K32570j89863K18689r0744j64440J46341k07926J56427j26243
16086e1388J50306n7798j7202J65625j27907j22485J8199l1528n00m7478j3687
16097a35843K53384o9027O6116j11497q9912j17879J17397p9677M4449K36454
16107A13965q9509K1041J38963j49086r6193J5413m8084l23J96174J6070o1974
16118E6457p9503l7486j5960j20037M5273J55913n6113J06686Q7540k13593J6219
$$ plain form
16046 93572 -43991 -105753 -203933 70916 178781 -41456 10902 134956 200799 -43454
16056 -43454 118681 -228185 -182010 -10677 123167 97372 -146744 147023 -72712 -22038
16066 -22038 -116278 -258681 -9777 228088 111042 187646 -276201 -107864 -8161 33651
16076 33651 -26199 206371 16508 235197 144453 -19987 126354 -81572 74855 -51388
16086 -51388 98918 41120 23918 189543 61636 -60849 -42650 -74178 -74678 -122156 -135843
16097 -135843 117541 48514 114630 3133 -86779 -204658 -87261 -166938 -122489 113965
16107 113965 24456 45497 184460 35374 -60819 -45406 -93490 -93813 102361 118431 56457
16118 56457 -23046 -60532 -76492 -196529 -151256 4657 -51456 55230 142770 -70823 -54604
16129e4604k69q9056J85185q415m9443O9058J01144n7985m9056o6555k65454L95611
16141A10161N7640k7367q3147k897n1473o1893L4339l8318L6782J16719j69986
16152g9440J70482q5115j10035m7086Q4976l7367J18856N2058j73391Q9014O4603
16163D7555n6410j84348J19773J44957k07894J49862o6897L1583M6695O4088l9332
16174D9632O6947j92357O9253j1907J0326K8038N6662j21289l9877J67728L9633
16185A22789j47602j19243P1851r6686J07421J55072j04215J11250k93962K29010
16195C5685j26215M0686p430n4336J44747N086J45095l66403J63199K0626J36648
16206A37388k3545j22720k28086K98602l6383n7761Q6495K07788j02932M945j55748
$$ plain form
16129 -54604 -54873 -143929 41256 32841 -16602 52456 153600 95615 46559 -19996 -285450 110161
16141 110161 167801 140434 57287 54390 2917 -58976 -24637 -62955 -26173 90546 -79440
16152 -79440 91042 5927 -104108 -151194 -66218 -103585 15271 67329 -106062 -17048 47555
16163 47555 -8855 -193203 -73430 71527 -136367 13495 -53402 -21819 24876 88964 49632
16174 49632 116579 -75778 -6525 -18432 -8106 19932 76594 -44695 -84572 83156 122789
16185 122789 -24813 -144056 -72205 -168891 -61470 93602 -10613 100637 -193325 35685
16195 35685 -90530 -49844 -57274 -111610 33137 38223 183318 -183085 -19886 740 137388
16206 137388 113843 -8877 -236963 61639 25256 -32505 53990 261778 158846 163791 8043
16217H043j61456J48759J59538j36298J51847p7053j35783K10177n0810p2329
16227D4635k98183K85250J7248r8853Q9466J04827l05310K47266k21504J02043
16237c3115M6523k84124K56312J63810j07976k75901K69598j63291J19726R5893
16247H7455j26334K8181j23111K34772j31991l7620q4405M6800R5246R8047j31048
16258d4008K4852m6624Q1224K1895j00699r981N0985j48648K36633m0626M6133
16269G1136p4460O004j24769M5319r3487l6013K69113M6348r3567Q9228o1607
16280D3245k95204J98329j85588J99320P7174J93506n2211r1656K6847l01187
16290a87425J65235k78271K00119P1361J11682j11714o078K7292o532j33332J75691
$$ plain form
16217 8043 -153413 -4654 154884 18586 170433 93380 -42403 167774 116964 44635
16227 44635 -253548 31702 48950 -49903 39563 144390 -160920 86346 -135158 -33115
16237 -33115 13408 -270716 -14404 149406 41430 -234471 35127 -128164 -8438 87455
16247 87455 -38879 -10698 -133809 100963 -31028 -68648 -153053 -106253 -11007 87040 -44008
16258 -44008 -19156 -65780 15444 37339 -63360 -73341 -22356 -171004 65629 25003 71136
16269 71136 -3324 2680 -122089 -76770 -170257 -206270 62843 109191 15624 104852 43245
16280 43245 -251959 -53630 -239218 -39898 37276 230782 178571 86915 113762 -187425
16290 -187425 -22190 -300461 -100342 -28981 82701 -29013 -35091 -7799 -14331 -147663 28028
16301B8028J976N3723j68818K43327k44667Q6042K6420j72741O2605J33784K5661
16312G5340P2944q0157r3076K8943j2763q3752J50219j16043K7625J46585j14301
16323A564k4273M846R6077k37480J09422k86p969J99632m1868m9540M4957p2747
16335B2335j29120K3880j34954J28970P20l807L82680m29948J87828k7651n2607
16346c1674j13343J5606J73529M193l8159K5019m6325j53560k8829J60874K4659
16357h010j9693m5671K04499P7019l36694R5652r7219J16834K1021p6742M1012
16368b7992O1490J03595r4538j98668O8793J60469j83241R2713j3026l2979J73996
16379A10612r0103q4304K2326l7911
$$ plain form
16301 28028 30004 83727 -85091 158236 -86431 -389 26031 -146710 -84105 49679 75340
16312 75340 148284 68127 -24949 3994 -8769 -92521 57698 -58345 -30720 115865 1564
16323 1564 -22709 -17863 78214 -159266 -49844 -50130 -58099 141533 99665 50125 95082 22335
16335 22335 -106785 -82905 -217859 -88889 -88169 -91976 290704 -139244 48584 20933 -31674
16346 -31674 -145017 -129411 44118 48311 10152 35171 -11154 -164714 -193543 -32669 -8010
16357 -8010 -27703 -73374 131125 208144 -128550 -32898 -130117 -13283 7738 -69004 -27992
16368 -27992 33498 137093 42555 -156113 -87320 73149 -110092 -17379 -30405 -63384 110612
16379 110612 20509 -63795 -41469 -79380
16383g9380
$$ plain form
16383 -79380
$$ Imaginary data points
##PAGE= N=2
##DATA TABLE= (X++(I..I)), XYDATA
0@%%%%%%k313J1645k4276L1400l3922M1034n1770O4563p8936R4581j14106J35771
18G3671j60708J89245k21536K57892k98875L45006l96649M54069n17838N88812
28C13089o67234P53805q49374R54472j070009J196957j336252J488892j656262
37h71916J839982k041627K263184k506933K775756l073227L403396l771645M184734
46B201704m651131N182158n792741O503386p342980Q353263r597158J1173824
54F030325j3249606J6127067k0421473K7619484m2568668R9285600K1323891j27864284
62c3717664M7791140k4676411K2199910j7201897J4802686j2563381Q011909j0346163
70e699871O455219p138511P049196j257865O141418n127358K871726o453924L266632
$$ plain form
0 0 0 0 0 0 0 0 -2313 9332 -14944 16456 -17466 23568 -28202 36361 -42575 52006 -62100 73671
18 73671 -87037 102208 -119328 138564 -160311 184695 -211954 242115 -275723 313089
28 313089 -354145 399660 -449714 504758 -565251 631706 -704546 784346 -871916
37 -871916 968066 -1073561 1189623 -1317310 1458446 -1614781 1788615 -1983030 2201704
46 2201704 -2449427 2732731 -3060010 3443376 -3899604 4453659 -5143499 6030325
54 6030325 -7219281 8907786 -11513687 16105797 -26462871 72822729 94146620 -33717664
62 -33717664 14073476 -10602935 11596975 -5604922 9197764 -3365617 4646292 -5699871
70 -5699871 755348 -6383163 666033 -591832 5549586 422228 3293954 -3159970 106662
79A06662j030511Q59504l184532L063860l28158L466380n76555O67911m548964
88a504403q09667n82082J575533J983374J645602k632457J848930q7611j332976
97A04243j456869j027972L58696K024439J906161P87974j713139r08271j518264
106a443002r49915K374035p7880j362980K359572N82716O03053j25850k895667
115i35918j091168J08089O88696R43765O22353J837739n36933p58630J233264
124B111257l536985k204008Q93817K72311M662743K017972k200729j059187j804794
133h47603n16217k27220J6187J190216l84331J513235K293770j827567k81514
142I28956j507773k595146K767568J237377j460288P86174r75279J246791J386465
$$ plain form
79 106662 -923849 -64345 -3248877 -185017 -513175 2953205 2376650 3044561 -1504403
88 -1504403 -2314070 -2896152 -1320619 662755 2308357 -324100 1524830 1437219 104243
97 104243 -1352626 -2380598 -2021902 2537 1908698 2696672 983533 75262 -1443002
106 -1443002 -2392917 -18882 -96762 -1459742 899830 1482546 2085599 1959749 -935918
115 -935918 -2027086 -1918997 -1230301 -286536 335817 2173556 1636623 877993 2111257
124 2111257 -1425728 -3629736 -2735919 -2463608 2199135 4217107 2016378 957191 -847603
133 -847603 -1363820 -1591040 -1574853 -384637 -768968 744267 3038037 1210470 928956
142 928956 -578817 -3173963 -406395 830982 -629306 156868 -818411 428380 1814845
151A814845n02603n34230k310769l49331N66393L48855L185220j069535k089700
160i40855K282362j158860p95196N36894j797858J422007J542903j46365j14824
169H30208j593703J85662l55176P01801K220701j602730j266823J110832j227275
178i96503J272531O18739k596120J380722J076902j50925J22422p65920j37509
187a75661p91905N77940J244786j450199N93187j22663n13661K748693m92539
196A617978k861310J8262q3968O54640J411422K32517m90288q82515O07445n23447
206b99264j39865J250093j533043m4981K149537q84429p46968l17810m35921J319445
216C16794J351729n45757j370300n85344k67269n59182J528490J870134j655890
$$ plain form
151 1814845 1312242 778012 -1532757 -1882088 -1315695 -966840 2218380 1148845 -940855
160 -940855 1341507 182647 -612549 -75655 -1873513 -451506 1091397 945032 830208
169 830208 -763495 -577833 -933009 -231208 1989493 386763 -880060 230772 -996503
178 -996503 276028 894767 -1701353 -320631 756271 605346 727768 -38152 -175661
187 -175661 -967566 -389626 855160 -595039 -1852 -124515 -638176 2110517 1617978
196 1617978 -1243332 -1225070 -1309038 -654398 757024 989541 499253 -383262 224183 -299264
206 -299264 -439129 810964 -722079 -767060 1382477 498048 -248920 -566730 -1002651 316794
216 316794 1668523 1122766 -247534 -832878 -1100147 -1659329 -130839 1739295 83405
225H3405M81761L03451j148947N23570j048326p48834J082063J124170p7920o24486
235e0093L84506J84379o63464J229494n18951k070881P06505r63154R25257L068494
245B232092p30679q83302k69029n63621n40717q74211P59377M56113L88145K157459
255B131627r74742p24659L41230k925458P83792K280683j116320K46373L6392
264G8918k52005J092886m08104m38023q22262j83357J256545j144070J431247
273F11775R74910k600741J209222J9429j318988J428783q27565L19314J792170
282A608309p80352o74832j477299N7930O21739n02469K713884L96742j720391
291B43261Q67494k186908o81142J763140j359880R29504J748764q0421K6828j258846
$$ plain form
225 83405 565166 868617 -280330 243240 -805086 -1553920 -471857 652313 574393 -50093
235 -50093 334413 518792 -144672 1084822 565871 -1505010 -798505 -1761659 -836402 2232092
245 2232092 1501413 618111 349082 -214539 -755256 -1629467 -870090 -413977 -25832 2131627
255 2131627 1156885 432226 773456 -2152002 -1368210 912473 -203847 42526 78918
264 78918 -173087 919799 511695 73672 -748590 -931947 324598 -819472 611775
273 611775 1586685 -1014056 195166 214595 -1104393 324390 -503175 -183861 1608309
282 1608309 827957 153125 -1324174 -1266244 -644505 -1146974 1566910 1963652 243261
291 243261 1110755 -1076153 -1757295 5845 -1354035 -424531 1324233 1243812 1270640 11794
301A1794o7551n19521q20269J355737o93921K72365J545375j308696J194431J350149
311B319893k662170m51965m78171r60878J815110N06760J105340O79428l59006
320A514341q02469k222834m8777M51938m42977K379405J251096j109561J0294
329I80456j243244j323971J222147m9237N6105P63574Q32538l65613j668402R99044
339B03397n97463p91322J561307n98190N97345J193118j613899k00357L50578
348A04514j072662n48939O42092J281344N41210M94830M13527j790935q41702
357g76721m70047j793810K059289K098654l709J198109k24397j638320j721752
366a272704r41412N72334L79562J580062R71986m53682J736559j296642k578636
$$ plain form
301 11794 -55757 -575278 -1395547 -39810 -733731 -461366 1084009 -224687 969744 2319893
311 2319893 -342277 -794242 -1272413 -2233291 -418181 88579 1193919 1873347 1514341
320 1514341 711872 -1510962 -1559739 -1107801 -1550778 828627 2079723 970162 980456
329 980456 -262788 -1586759 -364612 -413849 -357744 405830 1238368 872755 -795647 203397
339 203397 -394066 -1185388 375919 -222271 375074 1568192 -45707 -246064 104514
348 104514 -968148 -1517087 -874995 406349 947559 1442389 1855916 64981 -776721
357 -776721 -1246768 -3040578 -981289 1117365 1113656 2311765 2087368 449048 -1272704
366 -1272704 -2214116 -1641782 -1262220 317842 1289828 836146 2572705 1276063 -1302573
375a302573Q61878j229648j53533J329868K92106J213454R07649l04148n19743
384A095310j478302m66801k041165p7818L503217Q59906O73312J025108k838506
393B54261p60340j059481j519773K029077J346846J137921N48029m44008j95500
402A337032k995780r65067J741147k83926K417646P08796j928434J504122r18368
411F17168k022280O74784n66983N33414P37104Q04111J410964j179272n41217
420D67793r76508j763346J743993o66887o01529L796741J00222n1125o1993k942594
430i55233j387220j28206K48648K536431J201322J328158j207828j306731Q33047
439A162388k814017j122636J269634l93287K564513J942075j101403M50775j110014
$$ plain form
375 -1302573 -440695 -1670343 -1823876 -494008 -201902 1011552 1919201 1615053 1095310
384 1095310 -382992 -849793 -2890958 -2968776 534441 1394347 2067659 3092767 254261
393 254261 -506079 -1565560 -3085333 -1056256 290590 1428511 1976540 1532532 1337032
402 1337032 -1658748 -2623815 -882668 -1166594 1251052 1959848 31414 1535536 617168
411 617168 -1405112 -730328 -1297311 -763897 -26793 777318 2188282 1009010 467793
420 467793 -508715 -2272061 -528068 -1194955 -1796484 2000257 2100479 2049354 1987361 -955233
430 -955233 -2342453 -2470659 -2222011 314420 1515742 2843900 1636072 329341 1162388
439 1162388 -1651629 -2774265 -1504631 -1897918 666595 2608670 1507267 1958042 848028
448H48028j635092o28178m65390L69205n8458J743544L107044p22297l09646k115817
458A32943l272116J273766P7299K92108K867642N87322j45423k83946j294787
467B34808j494959j374263R43072J412102J179811J967828k100040j862891J321190
476B26658o92990j78083Q11777q57325L19192Q54065M14563j63838l85750n87362
486b39093j297269J071836J328724j585107O47372R81538m22949P69032j091388
495A62696j964379O1970N55419J333951J177494R67897j206756k332551R57590
504b86669j03526j037422R36634k48893Q17998K439068j053897j502303k86469
513c25479q21665L44228J04061J117437n48341n92166K041046J61057k91777j1724
$$ plain form
448 848028 -787064 -1415242 -1880632 -1511427 -1569885 173659 3280703 2558406 2248760 132943
458 132943 -3139173 -1865407 -1788108 -1496000 1371642 1958964 1813541 1529595 234808
467 234808 -1260151 -2634414 -1691342 -279240 900571 2868399 768359 -1094532 226658
476 226658 -466332 -644415 167362 -689963 -370771 483294 897857 734019 348269 -239093
486 -239093 -1536362 -464526 864198 -720909 -73537 908001 485052 1254084 162696
495 162696 -1801683 -1739713 -1184294 149657 1327151 2295048 1088292 -1244259 -286669
504 -286669 -390195 -1427617 -490983 -739876 78122 2517190 1463293 -39010 -325479
513 -325479 -1147144 -802916 -698855 418582 -129759 -721925 1319121 1480178 1188401 1176677
523A176677l600687r6392K096806J22239J425050R4413o94104J40475m55250J1512
533B20739j221220n93380J254917m92913J935564O78114l084003J118673P77657
542E94148j99251R87188j768862j517854O83493J97457J790501N52992L2276m81391
552H70697k035778J435391n34700j851957J658972J57551J245098K019242k400176
561E64340j544038K44309m04034J156871L51492K07187p36042q69681J934026
570I04430k67258m92222N01347k573521J340513J765221j649899N71903J27872
579B28386l40870O71623j27901p74241p77926k44795J603561O25751J136677q29580
589A170685l219076O42392J293848o25555J371170k62304l53661J280581l75446
$$ plain form
523 1176677 -2424010 -2520402 -423596 -301357 1123693 1218106 524002 664477 209227 220739
533 220739 -1000481 -1593861 -338944 -831857 1103707 1781821 -1302182 -183509 594148
542 594148 394897 1382085 -386777 -1904631 -1221138 -1023681 766820 1319812 1352088 870697
552 870697 -1165081 270310 -264390 -2116347 -457375 -299824 945274 2964516 564340
561 564340 -979698 -735389 -1139423 17448 368940 576127 -159915 -1029596 904430
570 904430 637172 144950 646297 -1927224 -586711 1178510 -471389 100514 228386
579 228386 -112484 559139 431238 -343003 -1120929 -1365724 237837 863588 2000265 1170685
589 1170685 -2048391 -1405999 -112151 -737706 633464 371160 17499 1298080 922634
598I22634p98102j120301m38471J80847M43601K565021k10280j592834R86654
607I38769n33133k33058k02713k454683r5446K142967J610441J222955K13228
616B609327j271235k850853p01862R62370l86822R71710J666435K39617J964942
625C203629m56511l559407j409711j79544P54664J798554J080792L53152j554961
634C0657O94338O5110q60714L20332j916399r30850K951781R76308k95762K91665
644A326466j280667L2859m84198l32089m74876l94774J940353N71404Q71549J027298
654B803325l607141j811678J352244o6026K216106Q59435j323325M44649k40875
663F26714r01507j006094l47800J068554L8732J905935J599167k658202m63977
$$ plain form
598 922634 124532 -995769 -1434240 -1253393 -809792 1755229 1544949 -47885 938769
607 938769 405636 172578 -30135 -2484818 -2580264 -437297 1173144 2396099 2609327
616 2609327 1338092 -1512761 -2214623 -1252253 -1639075 -667365 999070 1238687 3203629
625 3203629 2747118 -812289 -2222000 -2401544 -1646880 151674 1232466 1585618 30657
634 30657 724995 790105 -70609 249723 -1666676 -2597526 354255 1330563 1034801 1326466
644 1326466 45799 78658 -405540 -737629 -1212505 -1607279 333074 904478 1776027 2803325
654 2803325 -803816 -2615494 -1263250 -1329276 886830 1746265 422940 867589 626714
663 626714 -274793 -1280887 -1628687 -560133 -521401 1384534 2983701 325499 -138478
672a38478p39684j177930K176967l27711j053099J705978R15004R05245q33046
681A433246j721945r95633j903627J645119J954788J11460K037252j095951j444149
690B0560J489051k539598j832868R42495O03385K778635J020713o99006r24272
699H59095j893364K84386k63235j0625J884213j888117N00921K609305j194856
708H87723J55932j047194j792469R11842N98594j43733L23659L21638R70101p62008
718D24085K58554k49890k649982M24091J760005N46724K003442j022734k441214
727i46919L49361k54806k07945P36551P66758P08810l06311M91720j065699k105847
737a834327K36912n3860J387047K872543r02949j441501K62859q93554l3855n75526
$$ plain form
672 -138478 -878162 -2056092 120875 -206836 -1259935 446043 1361047 2266292 1433246
681 1433246 -288699 -1284332 -3187959 -1542840 411948 523408 2560660 1464709 20560
690 20560 1509611 -1029987 -2862855 -1920360 -1316975 1461660 2482373 1783367 859095
699 859095 -1034269 -749883 -1013118 -1023743 860470 -1027647 -526726 2082579 887723
708 887723 1043655 -3539 -1796008 -884166 -285572 -429305 -105646 215992 1186093 424085
718 424085 682639 432749 -2217233 -1793142 -33137 513587 2517029 1494295 -946919
727 -946919 -597558 -852364 -1060309 -323758 443000 1151810 845499 1337219 271520 -1834327
737 -1834327 -1597415 -1651275 -264228 2608315 1705366 263865 526724 -366830 -400685 -976211
747i76211m82035K98312J098150J641763P1492j88398o65104k492863L6756J083070
757e75068n43374O20445J152981O92282R94631r90159j768761j754781K70690
766a901114R32941M82784K199760J65323j863400J006502r17840r32378O86738
775a40684j164866K39747J928079Q0457m2441q32077L98230o78838q18057J456427
785D25977j212100k00175J731610m00767R96038O1948k637890l13220L26116R52647
795b69816J109421J22154Q82086j499046r03825O2264j971403J458586J474533
804D64954l79416K460621j17151k706709n60062j169458K61222J567288J46983
813c1728J147396o16508Q43848o543k256857Q18091q37885j335743K357841Q6007
$$ plain form
747 -976211 -1458246 -1159934 -61784 1579979 1651471 1463073 797969 -1694894 -1658138 -575068
757 -575068 -1118442 -497997 654984 1347266 2341897 1351738 -417023 -2171804 -1901114
766 -1901114 -968173 -485389 1714371 1879694 16294 1022796 104956 -827422 -140684
775 -140684 -1305550 -1065803 862276 942733 900292 68215 466445 -212393 -1030450 425977
785 425977 -786123 -986298 745312 344545 1340583 1402531 -1235359 -1548579 -1222463 -269816
795 -269816 839605 961759 1843845 344799 -559026 -496762 -2468165 -1009579 464954
804 464954 85538 2546159 2429008 -277701 -837763 -2007221 -1745999 -178711 -31728
813 -31728 1115668 499160 1343008 1336465 -920392 -102301 -940186 -2275929 81912 167919
823A67919J76841J573482j635070L92808Q6494j696888o99477l05863J478717
832d61037J254467J37257J508440j713242j703064P10225j514453R45698J244657
841D08948j291316J535543P82880o50838n14365p13302J29015k15731j05791R20650
851B85693r45909J049101N52832j283065J368292n46455k131206J175490L82478
860i2749K15848P15049m36007j73244m55230P2811m68248k44176J659090j72035
870F21109p25548J019058j330016j081667J109028k01989J153946P22958r35614
879C51265n11968k32951L07845m41952K08195J240245j041400K8Q25222j225675
889e21146L89188O81230r43607J057753j01807j333487l23826M24973Q97832M7352
$$ plain form
823 167919 344760 1918242 283172 675980 762474 -934414 -1633891 -1939754 -461037
832 -461037 793430 930687 2439127 725885 -977179 -266954 -1781407 -835709 408948
841 408948 -882368 653175 1436055 785217 270852 -442450 -313435 -529166 -634957 285693
851 285693 -660216 388885 941717 -341348 1026944 480489 -1650717 -475227 -92749
860 -92749 123099 838148 402141 228897 -226333 -153522 -621770 -865946 793144 621109
870 621109 -104439 914619 -415397 -1497064 -388036 -590025 563921 1286879 351265
879 351265 -160703 -393654 -85809 -527761 -319566 920679 -120721 -120693 704529 -521146
889 -521146 -131958 549272 -394335 663418 561611 -771876 -1095702 -670729 227103 274455
899B74455Q19829j61016j038810K38085p10243j175428J991581l04384l36180
908d02111J111806Q429j68274n54522m5728j88839p19848N16052o70929J16486
918i97478K563641q50699J4041J047793k257512m07949j72867n92525J322068
927c31487O14338P08651K45356R954l14016k271968Q2391J336990j573140J207280
937b85651J036240q96932J817295m67008j163916J46251j451101o07773M80700
946a391895J053349J856952n90157Q96487n15104k468476N17728j337377o5049
955b043542K939758J59728K75087N09034j882446r60194o03556L88864J334610
964A17343K21258J071801o50715n28539P48770k485437k89391J979592p52090
$$ plain form
899 274455 1094284 933268 -105542 132543 -577700 -1753128 238453 -65931 -402111
908 -402111 709695 718124 549850 -4672 -50400 -239239 -959087 -443035 -1113964 -997478
918 -997478 1566163 715464 729505 1777298 -480214 -888163 -1061030 -1653555 -331487
927 -331487 282851 991502 1236858 1246812 932796 -1339172 -1256781 80209 -1492931 -285651
937 -285651 750589 -146343 1670952 1203944 40028 186279 -1264822 -1872595 -1391895
946 -1391895 -338546 1518406 928249 1824736 1309632 -1158844 -641116 -1978493 -2043542
955 -2043542 896216 1055944 1331031 1840065 -42381 -1002575 -1606131 -1217267 117343
964 117343 338601 1410402 759687 231148 979918 -1505519 -1794910 184682 -567408
973e67408J067240Q68281j001844N82977o89772p95392P478q00231L87225l98815
983a340261K015776K306968j891297O4803j244664k267481Q84067O3218P9303
992a329568K739349P88006j14805l56701j504104j740319j963550J561564J607645
1001c12483P63974J905880o11093p42562N45448k118634j749008M07939J073J260217
1011f49249J990112J312233m36484j231766r42561j636192n80129R60505o69077
1020a882608K255157K535339p20382n48309j600199k206142j46273Q90545J393804
1029b9068J031903P90568m10183j617644P07253p45498j941230J285585P98540
1038a29774M93974J232504q08831r05433K69020n29218k05441j81913M64714k17640
$$ plain form
973 -567408 499832 1368113 366269 949246 259474 -535918 -528440 -1328671 -941446 -1340261
983 -1340261 675515 2982483 1091186 1155989 -88675 -2356156 -1472089 -1408871 -1329568
992 -1329568 1409781 2197787 2082982 1726281 222177 -1518142 -3481692 -1920128 -312483
1001 -312483 451491 2357371 1746278 1003716 1549164 -569470 -2318478 -1910539 -1909466 -649249
1011 -649249 1340863 2653096 2216612 984846 42285 -1593907 -2174036 -1213531 -1882608
1020 -1882608 372549 2907888 2187506 1639197 38998 -2167144 -2313417 -1422872 -29068
1029 -29068 1002835 1793403 1383220 -234424 472829 -272669 -2213899 -928314 -129774
1038 -129774 364200 1596704 787873 -117560 151460 -377758 -583199 -765112 -300398 -518038
1048e18038K64036K404099n68481j299189n89401k028176N27928J956225k53475
1057a04472J279112P87974n31170q19639j570096m99575j127880Q60005K874079
1066A148338N54812R65328o84266l162584L85306O0884j295508J280484L95708
1075c51498J050295J221333k26506l89974j890909p92946m3854m13173K206090
1084C68858K65638r01654K229704m63685r13199m76263k305621J22616J458691
1093f14915R32981J379149l81138o85870r26809r29889J701205j042606n03060
1102a070952J503952p09333J102648N29266k441925N36433O63302j86431N65188
1111D92148l60139j43219o01438K52293J422514q16722l53144k57823j169652
$$ plain form
1048 -518038 -254002 2150097 1581616 282427 -306974 -2335150 -1807222 149003 -104472
1057 -104472 1174640 1962614 1431444 611805 -958291 -1457866 -2585746 -1725741 1148338
1066 1148338 1703150 2668478 1984212 -1178372 -793066 -732182 -2027690 -747206 -351498
1075 -351498 698797 1920130 1693624 1303650 -587259 -1380205 -1424059 -1837232 368858
1084 368858 634496 -267158 1962546 1498861 585662 109399 -2196222 -2073606 -614915
1093 -614915 318066 1697215 1316077 630207 -296602 -1226491 474714 -567892 -1070952
1102 -1070952 433000 -276333 826315 1355581 -1086344 -549911 113391 -73040 492148
1111 492148 132009 -11210 -612648 -360355 1062159 245437 -107707 -365530 -1535182
1120a535182K220923O22070j299637O26931o37394q49342M69442l10350J66054
1129e26485M19476J096842R65982j103727j20734k423246j334007K711647J006591
1138F92339m8182R16585j312273k73642L77497q60175j83479l85243O42382M38526
1148D335R14869P56038j720649p04404P71515m05963Q73335m83593j393991Q82812
1158e05696J101105K31241k61068l06620p59846o79819J156347P09444r79150
1167b94062N62591n02211m34682J568906n96572r03583O89993K74821J91962k53757
1177C03406m58684q72289l36192J810127L42768j06577K41741j749947L7850J954204
1187A166407j390778j61242J0410l53684J034274L12827J94292p27255l69166
$$ plain form
1120 -1535182 685741 1307811 8174 635105 -2289 -851631 -382189 -692539 -526485
1129 -526485 -107009 989833 1955815 852088 731354 -1691892 -3025899 -314252 692339
1138 692339 644157 1560742 248469 -25173 352324 -507851 -691330 -1076573 -434191 4335
1148 4335 919204 1675242 -45407 -749811 21704 -384259 489076 5483 -1388508 -505696
1158 -505696 595409 826650 565582 258962 -500884 -1180703 -24356 685088 -294062
1167 -294062 268529 -233682 -668364 900542 303970 -599613 90380 365201 557163 303406
1177 303406 -155278 -1027567 -1363759 446368 789136 682559 924300 -825647 -787797 1166407
1187 1166407 -224371 -385613 -375203 -728887 305387 618214 812506 85251 -283915
1196b83915N78415p30952N6624M02228k192500K106552J640153m11322L87188
1205A552471j812178j532610Q85900K37682O87887L30181J29504M49261j196126
1214b68028Q23202n2848k262819J543854N5139K77921J528208k098234p59040
1223a212645J253549J57806P17543m02648p85641k81165n99546J447635k15192
1232G9696o48111J149757j091336Q41274J495998k248434j72208L35990m08557
1241f65931J179132m45650m73456K20837K33875J090233n66448n10484l18644
1250b56536k086977J617142J692427q87183P63117m50342p92613J242940r08490
1259f6515o83709j17768N03829P89345j06506P32142o66474j548775J288200L39834
$$ plain form
1196 -283915 294500 -436452 -379828 22400 -2170100 -63548 1576605 1165283 1552471
1205 1552471 -259707 -1792317 -906417 -668735 19152 349333 478837 928098 -268028
1214 -268028 555174 502326 -1760493 -216639 -161500 116421 1644629 -453605 -1212645
1223 -1212645 40904 198710 916253 513605 -272036 -553201 -1152747 294888 79696
1232 79696 -568415 581342 -509994 331280 1827278 -421156 -593364 -257374 -665931
1241 -665931 513201 67551 -405905 -185068 48807 1139040 572592 62108 -256536
1250 -256536 -2343513 -726371 966056 78873 841990 391648 -400965 841975 -66515
1259 -66515 -750224 -867992 -364163 425182 318676 1050818 384344 -1164431 123769 463603
1269D63603n52626N36046j578994P0668J909391O4656j76820n90498n92616l80285
1279h27475L65913R62265j71480j68398N76820j002810J00849K41056j615377
1288a538637P06861J759531O80169o4776j117461j313227r12110O46666J079434
1297g3550M06869R58452o0215j122104P72511j102112j719634L76623N38618J140020
1307A15478J451806k58303m70638p61169L06908p94293q93809O60867o78003M05261
1317i15895K645114J8136n6883n84719k348391k48041K17863L46230N21903Q49185
1327D44502J395583k17101p34517k57465k707792K40595J024645O6433K200554
1336A455437m4705j309380O07199m16964o38189n84062o74891J293651J97191
$$ plain form
1269 463603 -89023 447023 -1131971 -1061303 848088 912744 735924 145426 -447190 -827475
1279 -827475 -461562 500703 329223 160825 737645 -265165 -164316 76740 -1538637
1288 -1538637 -831776 927755 1607924 1543148 425687 -887540 -1799650 -1152984 -73550
1297 -73550 333319 1291771 1231556 109452 881963 -220149 -1939783 -1563160 -1024542 115478
1307 115478 1567284 1308981 838343 77174 384082 -410211 -1304020 -643153 -1321156 -915895
1317 -915895 1729219 1747355 1690472 1105753 -1242638 -1490679 -1272816 -926586 -404683 444502
1327 444502 1840085 1622984 888467 631002 -2076790 -1836195 -811550 -745117 1455437
1336 1455437 1410732 101352 708551 291587 -346602 -930664 -1605555 -311904 -114713
1345a14713J492481N30916j535910J64419j286947j152800J595845k31974j28141
1354f66824K063556J1855J53645j191444k054975n05280L87982J832379J189395
1363A220289L34164J215594k306296j643153Q35479j918970O69421J498677J43136
1372D8341K004038Q1409j430911j038802r61909J97107k28868P0411J906689o21508
1382B5997J391158J025386j693932m29463j447157j941424J547188J078133Q68518
1391D24404J317537J69249j04827j542486j211645r80003q84570K083075J372325
1400F43059M04461J853456j633748j903470J57514r08568j40278P89863K73665
1409d64046J212658R67194L0628j272316j100222J71660j242445K82009J865117
$$ plain form
1345 -114713 1377768 1908684 372774 537193 -749754 -1902554 -306709 -538683 -666824
1354 -666824 1396732 1408587 1562232 370788 -1684187 -2189467 -1801485 30894 1220289
1363 1220289 1554453 2770047 463751 -1179402 -343923 -2262893 -1593472 -94795 48341
1372 48341 2052379 2133788 702877 -335925 -1297834 -1100727 -1329595 -1259184 647505 25997
1382 25997 1417155 2442541 748609 319146 -1128011 -3069435 -1522247 -444114 424404
1391 424404 1741941 1911190 1806363 263877 -947768 -1927771 -2812341 -729266 643059
1400 643059 1047520 2900976 1267228 -636242 -478728 -1387296 -1527574 -737711 -464046
1409 -464046 748612 1715806 1746434 474118 -626104 -454444 -1696889 -1414880 450237
1418D50237m07217R08011M66711r60779k26464r62339j140613P03931J380720
1427B12198J026722n04108J14944l25947j972811N26743L09104k54581J621803
1436G54067J82108l84302N65978r79096r42749n78241Q49478M58047k30147J028885
1446G24028k09886l11353J163375j526945m66180L70089j549152P06509J369697
1455B70182N54837N81952j24336m66938r07706j237372r2698n07802J628668J980166
1465A678953q08925N92384k02170k413730L21997j63695J72017J183183j95267
1474A64747O07806j38327l4342k19093j334309J100681m5626j126656J325086
1483B99967k93127m37164J549773q54894j83433O74777j392433l9606J15583P64289
$$ plain form
1418 450237 43020 951031 1417742 456963 230499 -731840 -1872453 -1168522 212198
1427 212198 1238920 734812 849756 523809 -1449002 -922259 -613155 -867736 754067
1436 754067 936175 551873 1117851 138755 -803994 -1382235 -532757 -74710 -304857 724028
1446 724028 514142 202789 1366164 -160781 -626961 -256872 -1806024 -1099515 270182
1455 270182 825019 1406971 1282635 815697 -92009 -1329381 -1422079 -1929881 -301213 1678953
1465 1678953 870028 1462412 1260242 -1153488 -831491 -995186 -823169 360014 164747
1474 164747 772553 634226 599884 380791 -953518 147163 101537 -1025119 299967
1483 299967 6840 -430324 1119449 264555 81122 755899 -636534 -676140 -560557 203732
1493B03732J37972q17511J138851l30077o09333J291397j545275Q7807J418807
1502I76370j851975N29766N94889q52758Q92358K72871K99031l33895j133560
1511f06903K11887n25849O84790J191498j342357P60671L36553j559559R30842
1520H1573n3445n15556R38123j64019j80890P1701o34521M3643j95007J341116
1530G32718M56289j491236O33092m89164o19038J356717p30615J049P04324p67028
1540b12892R2042K72075L5702O0822k46183P03353o48183r96044M40031p69144
1550a268421J376372J700448j048043Q5850l78431j883209R9443O06722O51633
1559e7636K92151L92466P13436q41896L11958j247701j564168J461804N06019
$$ plain form
1493 203732 341704 -475807 663044 332967 -276366 1015031 -530244 -442437 976370
1502 976370 -875605 -345839 249050 -603708 288650 561521 860552 526657 -606903
1511 -606903 -395016 -920865 -236075 955423 -386934 373737 710290 -849269 81573
1520 81573 28128 -487428 450695 286676 105786 177487 -457034 -413391 -608398 732718
1530 732718 1189007 -302229 330863 -158301 -777339 579378 -151237 -150188 554136 -212892
1540 -212892 -120850 151225 186927 247749 1566 704919 56736 -939308 -499277 -1268421
1550 -1268421 107951 1808399 760356 846206 467775 -1415434 -1315991 -709269 -57636
1559 -57636 234515 626981 1340417 498521 810479 -437222 -2001390 -539586 -33567
1568c3567l86696J252849r6390k65709K31703m11132n39367p21961j36810J03899
1578a003181Q13859K063858o72232j278349Q78626j658621k67451O34803l71384
1587h60072P63122P71326o362P5226o70297k69167j080776N37839J780888j243674
1597b01947J77105M72263j221278J481134j08277j358651O53400k80384K41086
1606a45549Q16653k07571J98023j190433J47451O03407j245716J007028k10102
1615b26809j5025K272212n25008j619060n84886j180561K86083J286305J150111
1624H43362R71241n58110l55271q19660j146997L41710j081958M19388K812832
1633A426537l36357J17376j2437k087756K69552J55369l26437O75035m07257P25204
$$ plain form
1568 -33567 -420263 832586 736196 470487 702190 291058 -248309 -970270 -1107080 -1003181
1578 -1003181 -189322 1874536 1202304 -76045 802581 -856040 -1123491 -488688 -860072
1587 -860072 -96950 674376 668014 743240 72943 -196224 -1277000 -739161 1041727 -201947
1597 -201947 -24842 447421 -773857 707277 599000 -759651 -106251 -386635 -145549
1606 -145549 671104 463533 661556 -528877 -381426 221981 -1023735 -16707 -226809
1615 -226809 -241834 2030378 1505370 -113690 -698576 -1879137 -1593054 -306749 843362
1624 843362 1814603 1256493 901222 81562 -1065435 -723725 -1805683 -1386295 1426537
1633 1426537 1090180 1207556 1195119 -892637 -623085 -467716 -794153 -119118 -526375 198829
1643A98829K70822M95056R24067k448958n67234P64480j091678J698480M91530
1652G35394q41539J180042j04283p68712k94242j037319J64643K87523J376821
1661F98328R24015j195061j41803r62042p54997J971901n44715m93821J304385
1670H06190o71604J69886L86820q74961p16031k48086P16025O59895K43203Q24088
1680A295425j364795j00783J027186j786502m97659M39661M7476J852832J213681
1689B126522k86669j194066j226038j055872m15120J231597J198321j41440J457268
1698A694503N77398j575283n82091j899607j001320J794672J221044Q84884L41122
1707A455322q3765r67674q44337O26625p98202r05330J039748J90118J020960
$$ plain form
1643 198829 469651 964707 1888774 -560184 -1127418 -362938 -1454616 243864 735394
1652 735394 -106145 1073897 969614 200902 -93340 -1130659 -966016 -678493 698328
1661 698328 1622343 427282 285479 -676563 -1431560 540341 -4374 -498195 806190
1670 806190 134586 304472 691292 -183669 -899700 -1147786 -431761 228134 471337 1295425
1680 1295425 -69370 -170153 857033 -929469 -1427128 -987467 -939991 912841 2126522
1689 2126522 1839853 645787 -580251 -1636123 -2051243 -819646 378675 237235 1694503
1698 1694503 2271901 696618 114527 -1785080 -2786400 -991728 229316 1114200 1455322
1707 1455322 1371557 403883 -440454 186171 -612031 -1517361 -477613 -287495 733465
1716G33465J368479j453851o45736j65040n76195K653l3710L76423N47090O45339
1726G98917J294927j509277p34410p38730j363133J599086J750533p40139P95783
1735A153557n20498p40227J28592j117364J48079l9938J116244J098378k55602
1744I71221L42556j175379j827718J261023J07137n67100J248638l65448Q26954
1753H21884J256723j156038j067414j586316j82182O22447P03707K394599N1804
1762A859214j021565N00637j648638r08202K19894j381865J538404K148043M69504
1771A775426K41248j384359j037146o92587l61925J278039k71722o260J281520
1780H22234p10022J402404j13766k346408L14676k87484j81173J170902k51312
$$ plain form
1716 733465 2101944 648093 2357 -162683 -738878 -736225 -769935 -393512 153578 798917
1726 798917 2093844 584567 -149843 -888573 -2251706 -652620 1097913 357774 1153557
1735 1153557 633059 -107168 21424 -1095940 -947861 -987799 128445 1226823 971221
1744 971221 1313777 138398 -1689320 -428297 -321160 -888260 360378 -5070 821884
1753 821884 2078607 922569 -144845 -1731161 -1913343 -1290896 -587189 1807410 1859214
1762 1859214 837649 1338286 -310352 -1218554 -998660 -2380525 -842121 1305922 1775426
1771 1775426 2016674 632315 -404831 -1097418 -1459343 -181304 -453026 -459286 822234
1780 822234 112212 1514616 1400850 -945558 -630882 -918366 -1099539 71363 -179949
1789a79949N22554O42024M1999q0484j503576m68185m36575j94997K639168O36409
1799A618388r54447M14787j792147J75901N44240p17751J9490P42849O25471J60564
1809H37345m43020L820j295724l60655J650885j48842K81017K06296j449484O91961
1819b6401Q91473r45312m15144q3475J2950N60823P13543M11769j135451j77959
1829a93184j66890o97115R88369j86748n65952J354346N97813l62529o44575q27092
1839g03557j69011K26482Q73560n3774k73761M55049n95090K02082J478877j172102
1849B68755o18226j20980n06127O60633M30268j32112L80764K58789N88108j007097
1859B02775r28106m0925j003036J228995J853788p03524J81303l88064r47068
$$ plain form
1789 -179949 342605 984629 1026628 946144 -557432 -1025617 -1462192 -1657189 981979 1618388
1799 1618388 663941 1078728 -713419 -537518 6722 -711029 -691539 51310 676781 837345
1809 837345 394325 398145 -897579 -1258234 392651 243809 524826 731122 -718362 -26401
1819 -26401 865072 -80240 -495384 -578859 -565909 -5086 708457 1120226 -15225 -193184
1829 -193184 -360074 -1057189 -68820 -255568 -821520 532826 1130639 768110 123535 -703557
1839 -703557 -872568 -646086 227474 173700 -100061 354988 -240102 -38020 1440857 268755
1849 268755 -349471 -470451 -976578 -315945 114323 -17789 362975 621764 1209872 202775
1859 202775 -725331 -766256 -1769292 -540297 1313491 609967 791270 403206 -543862
1868e43862P76528k78919m24647k42980L65534N15431l05060P81325J67581j154586
1878c43655R49956j20382j259616O22612j079570Q2884K035501L02398O4464r91213
1888B63379p48975k15982n79457R74523J96432k57826J575438p84973k61179P74537
1898I35917j958945j91091J153712j14256P62132j21859m95299L32164j36753
1907A65722L8513q71847k80981J009507o07894J330683Q04721j613322j96293
1916b21191k91518p75622J222105J4432L45311O45180R3577J07415j660509n17440
1926a038260q3884m63457J895116Q29005m03604Q57837j429900r00942Q33274
1935I5185r90505k11277L60060P26955R53812J27011K89206p07620j074397M8973
$$ plain form
1868 -543862 232666 -46253 -470900 -713880 -348346 167085 -137975 643350 810931 -343655
1878 -343655 606301 485919 -773697 -151085 -1230655 -1147771 887730 1190128 1254592 263379
1888 263379 -485596 -701578 -1281035 -306512 -110080 -367906 1207532 422559 161380 935917
1898 935917 -1023028 -1214119 -60407 -174663 587469 465610 -29689 302475 165722
1907 165722 204235 -667612 -948593 60914 -546980 783703 1588424 -24898 -221191
1916 -221191 -512709 -1288331 -66226 -51794 293517 938697 1032274 1139689 -520820 -1038260
1926 -1038260 -1122144 -1585601 309515 1138520 734916 1592753 162853 -738089 95185
1935 95185 -895320 -1106597 -746537 -19582 934230 1061241 1350447 642827 -431570 -382597
1945c82597j199961J49630J222993r7764J185265J755996j404982p98267j478026
1954a047713j279126N41727J207127J357422L48191P14035k53679j864758l34152
1963f10926l17423j186692J414787J093210M07174Q29822q98372j024609j89654
1972d82683N6368k93165k44577J030722N24218l04638J064424j043112p64242
1981d56685J25700r57293N00723J354885K8415J23878K6989r2783j033221r76739
1991a356131N90331q6590R43355J514282r35393L33078n83533j841416M74542
2000i47475J87625J47785O29983N88536P85685m70549m47937o16048j390688P93608
2010g39475J91722n78032J951696K33189k71332R63519j367882j255883l97922
$$ plain form
1945 -382597 -1582558 -1432928 -209935 -307699 877566 2633562 1228580 430313 -1047713
1954 -1047713 -2326839 -1785112 -577985 779437 1127628 1841663 1587984 -276774 -610926
1963 -610926 -928349 -2115041 -700254 392956 800130 1629952 731580 -293029 -482683
1972 -482683 -426315 -719480 -964057 66665 590883 286245 1350669 307557 -456685
1981 -456685 -330985 -1288278 -787555 567330 595745 719623 746612 653829 -379392 -1356131
1991 -1356131 -765800 -852390 90965 1605247 669854 1002932 419399 -1422017 -947475
2000 -947475 -759850 -612065 17918 606454 1392139 921590 473653 -142395 -1533083 -739475
2010 -739475 -547753 -1125785 825911 1059100 787768 1751287 383405 -872478 -1270400
2019a270400o26216R90990J279599J141908J77701j074265J81453j536849j416773
2028b152852J162350k17938J105641J819362p67873J11751p79824j370591M9431
2037a040543L90942P70132N5610l11525J075137o86777k89849N55079j578067
2046a059861Q13036L85991j093285J468166J35086p09444O32323n33850n4069
2055a5907n02309j19541R03535j51402J032537m32360j659887Q64179p43614l96785
2065a221554J539048Q2686N2764N54388q20696k70195o54730j86517J73367K22597
2075e28842J461406j34576o84292R34063j225691n8434n7834r86842M61030O97283
2085a22729L35297J050969L55167r00914j007414p91456K93888m82449P55809
$$ plain form
2019 -1270400 -1896616 -905626 373973 1515881 1693582 619317 800770 -736079 -2152852
2028 -2152852 -990502 -1208440 -102799 1716563 948690 1060441 280617 -1089974 -1040543
2037 -1040543 -649601 120531 176141 -135384 939753 252976 -36873 518206 -1059861
2046 -1059861 -246825 139166 -954119 514047 649133 -60311 572012 38162 -15907
2055 -15907 -518216 -637757 265778 114376 1146913 714553 -945334 -81155 -824769 -1221554
2065 -1221554 317494 400180 452944 1007332 186636 -83559 -738289 -924806 -751439 -528842
2075 -528842 932564 797988 113696 1047759 -177932 -236366 -294200 -1281042 -820012 -122729
2085 -122729 212568 1263537 1618704 717790 -289624 -1081080 -787192 -1269641 -513832
2094e13832J189501j04973J026356l76714j891573m6845l09211j45047J231422
2103E9084Q48316O6486o07288l82130k91003l00635P67370m31271k43627J307526
2113G92828n49789m70284M09561n68987J30664M27900n785J40538l94774J69289
2123H1161j24319L95391M34729j500448J33280N16310l48542R13984M37872p46727
2133A92691L5592m83232m46005j35385J21843P41072J19562J098702J88168j474185
2143d1177k05530n56400n73263J354289k6694o6952R88823l80878O6403j66137
2153C92484o07909l61780p84689J100240M05646l19997J236988p10113k88776
2162F2094J167113j807284n59701N26721k35379J188547N01150m4792m14013q40888
$$ plain form
2094 -513832 675669 570696 1597052 1220338 -671235 -718080 -1027291 -1172338 59084
2103 59084 907400 973886 366598 -15532 -306535 -607170 160200 -271071 -514698 792828
2113 792828 243039 -227245 182316 -386671 -256007 171893 166108 306646 -88128 81161
2123 81161 -43158 352233 786962 -713486 -580206 -63896 -412438 501546 939418 192691
2133 192691 228283 -254949 -700954 -836339 -714496 26576 146138 1244840 1433008 -41177
2143 -41177 -246707 -803107 -1376370 -22081 -48775 -115727 873096 492218 558621 392484
2153 392484 -215425 -577205 -1361894 -261654 143992 -176005 1060983 350870 62094
2162 62094 1229207 -578077 -1137778 -611057 -846436 342111 843261 798469 384456 -456432
2172d56432K00443l0367J25131Q44114j457602O34967P63472j250730P15786J91134
2182B79916o21700J101779m89638m12560l54120l01021N41152K25559Q78769K44720
2192A092856j698939K98686J82347n90896J296410o73172n18396J079231n86406
2201a18279k6904K27267J2481P0244j18019N51527k57267j018301K96508j71209
2211e51952Q15083J178209j569472l40108N37017n16335N55894J98282k57861
2220D8757j27417p8599M45729m18896P2094L84075p29841J031138M19669j515730
2230d69021R7067l30193j86212J227835R2607n0682P3386k02057k05614m22225
2240c75109N09640p90783p28950J486303L21894L17945O81405j281361k80723
$$ plain form
2172 -456432 -255989 -286356 -161225 682889 -774713 -139746 623726 -627004 88782 279916
2182 279916 -341784 759995 270357 -142203 -496323 -797344 -256192 -30633 848136 1092856
2192 1092856 -606083 -307397 -125050 -715946 580464 -92708 -611104 468127 -118279
2201 -118279 -145183 82084 94565 164809 46790 598317 341050 -677251 -380743 -551952
2211 -551952 263131 1441340 -128132 -468240 68777 -447558 108336 306618 48757
2220 48757 -78660 -157259 288470 -130426 -58332 325743 -404098 627040 1046709 -469021
2230 -469021 -371954 -702147 -888359 339476 432083 381401 454787 252730 47116 -375109
2240 -375109 134531 -656252 -1385202 101101 422995 740940 1422345 140984 -139739
2249a39739J22996r34693k40453L44353R23172Q77245N52317L16819j814949j254950
2259a247882q8127m16309J460746R48236m41281Q10132L07953q48931o16555p64203
2269h96221j68928J13675O57705J091069m85824M24352j08384r41517R62996q25273
2279a76350j529345Q81307R5002J067892J183908m20977m77182j288932r1227
2288g55904k77493p9384J625670k64069J48711J555725j397685j479045r3505
2297a016979j025390J533264J475088k5291J56873n86850m39679o13679o80101
2306a222744P35683p49132Q88322J868727o29076O34709q04814k133253N16045
2315h95533q842j73167J037064M10020R16549M99995p27387o14825k302182j32726
$$ plain form
2249 -139739 -16743 -951436 -1191889 -847536 75636 952881 1505198 1822017 7068 -1247882
2259 -1247882 -1336009 -1752318 -291572 656664 215383 1025515 1333468 484537 -132018 -896221
2269 -896221 -1065149 -951474 -293769 797300 311476 735828 627444 -314073 648923 -176350
2279 -176350 -1705695 -824388 -729386 338506 1522414 1101437 624255 -664677 -755904
2288 -755904 -1033397 -1112781 512889 248820 397531 1953256 555571 -923474 -1016979
2297 -1016979 -2042369 -509105 965983 940692 1097565 510715 71036 -542643 -1222744
2306 -1222744 -487061 -1236193 -347871 1520856 891780 1526489 721675 -1411578 -895533
2315 -895533 -904375 -1077542 -40478 369542 1286091 1786086 1058699 443874 -1858308 -1991034
2325a991034O53017L98533K622039P5988r75137M47322j325388p33969k24466
2334a053095p48278Q01438J114608J185892M36533r75406j6844j299274q57935
2343a412361J319399j174444K22355J385713K26505J202344O130j793636j155160
2352a173155l81388J78230P02376J041686J125351n64299J59064l27712j762915
2361a002762k78339j77666L75404K034054Q92996q65600n48323q41573n72511
2370i84320k0870O35180M26904r2732R62756q3234n65964m6263r27672p86921
2380a483136J201833L27813L93812K74320O3464j62310n72336j2359j110848n06057
2390a585804J175151J60521J307889R84930j529217o11801l17290p95273M63762
$$ plain form
2325 -1991034 -1338017 -939484 1682555 1758543 783406 1230728 -94660 -828629 -1053095
2334 -1053095 -1801373 -999935 114673 1300565 1737098 761692 744848 -554426 -1412361
2343 -1412361 -92962 -1267406 -1045051 340662 567167 1769511 1775641 -17995 -1173155
2352 -1173155 -1554543 -1376313 -673937 367749 1493100 928801 1087865 760153 -1002762
2361 -1002762 -1281101 -1458767 -1083363 950691 1843687 978087 429764 -411809 -984320
2370 -984320 -1005190 -370010 56894 -35838 926918 843684 277720 231457 -696215 -1483136
2380 -1483136 -281303 46510 440322 714642 778106 615796 43460 31101 -1079747 -1585804
2390 -1585804 -410653 -250132 1057757 2042687 513470 -98331 -415621 -1210894 -747132
2399g47132j09521M40018R81312O37086J66180j171607m66353m08732r83215J159417
2409e02547O79462k67180R22241m59827P4416N91231r42483j098095j52056K82120
2419h72718J122744K0185R74628l87111j052517N59404r21937o55592J050594
2428a62320m55407R19397J142602j019834l36080p46621l6160P90181K5992P38167
2438H59917o55037m89693M93842r71229N69490Q65930j396878J158372J99588
2447F34302o54469K86253r34761L9930O00904K88841J58196p26748N15606L6893
2457B44947p21310J227402k67334j351916P75695l46035L56668J063354q17963
2466A63508J3390K53159r0644m38240o30540K89156J88314J64344J133566p19330
$$ plain form
2399 -747132 -856653 -416635 564677 1201763 1367943 196336 -270017 -678749 -1661964 -502547
2409 -502547 176915 -90265 831976 372149 446565 1037796 95313 -1002782 -1154838 -872718
2419 -872718 250026 270211 1244839 857728 -194789 364615 -557322 -1212914 -162320
2428 -162320 -617727 301670 1444272 424438 88358 -658263 -694423 95758 121750 859917
2438 859917 204880 -284813 209029 -762200 -192710 673220 -723658 434714 634302
2447 634302 -20167 266086 -668675 -628745 -27841 261000 419196 -307552 208054 244947
2457 244947 -476363 751039 483705 -868211 -92516 -438551 -81883 981471 163508
2466 163508 176898 430057 339413 -98827 -729367 -440211 -251897 -87553 1046013 326683
2476C26683l45500L52707r01461M46241Q45846j092084O3734O1670J87175J85575
2486A30586k2922L65916n85486J12660L50587q45737N87416Q3360r02267J089017
2496C63130K0947p14988M43290l07795K81282M65515j92802n90317n70878K34231
2506e68385L17270K40323J098105m29001o59824J49847o91644l76856N35138n5181
2516d40208Q03103P16512O3923r20137q02081K66195n70392N09550Q88978n40174
2526b4731R1451N60037q51622O32606q6283q14699K44795k9745K82767k73192
2536b68616r71P13973m01515Q35805j97524j537131Q09107k45685l70116J464451
2546H01778l45681n68896J7374j71791N68593m90850N61716k77424l04630P33842
$$ plain form
2476 326683 -18817 333890 -567571 -121330 724516 -367568 -303834 -242164 -54989 130586
2486 130586 107664 473580 -111906 754 351341 -494396 93020 176380 -725887 363130
2496 363130 384077 -330911 112379 -195416 85866 551381 358579 -231738 -802616 -568385
2506 -568385 -251115 -10792 1087313 658312 -1512 148335 -543309 -920165 -385027 -440208
2516 -440208 362895 1079407 1143330 223193 -578888 -312693 -883085 -373535 515443 -24731
2526 -24731 66720 626757 -224865 407741 321458 -493241 -248446 -278191 4576 -268616
2536 -268616 -269587 444386 42871 878676 681152 -855979 -46872 -292557 -662673 801778
2546 801778 456097 -112799 -95425 -267216 301377 -189473 372243 94819 -209811 524031
2556E24031p58554o40476J024601m21061K72081J253486j005820P7719m05706
2565g9699n92168K80933J30820J88019m9574q9456J060590n61417p1760K59924
2575D76212j563492M00080J82977m85903J461980K89466k17877L96880p33564
2584B06759o29303q11008k826J335462l5480J081731M4084j348470L76220p34869
2594e17700o30127J171990j08310K98122O31954l76553l99982l82538j78026L21506
2604a69664N0329N95269m81792n29922J167037p32320j54116P53934j169098J39886
2614e30457M62509K0724N73464L9440j87589o83082j7253K80757r90139L90517
2624f41109J362827j13734O87798l21354j613246j54493m19065O9983J203780
$$ plain form
2556 524031 -234523 -874999 149602 -271459 622 1254108 248288 326007 -79699
2565 -79699 -671867 -390934 -260114 -72095 -121669 -211125 849465 288048 216288 476212
2575 476212 -1087280 -687200 -504223 -990126 471854 761320 543443 940323 206759
2584 206759 -422544 -1233552 -1236378 99084 63604 1145335 1189419 -159051 217169 -517700
2594 -517700 -1147827 24163 -84147 213975 845929 469376 69394 -313144 -491170 -169664
2604 -169664 -119335 475934 -5858 -535780 631257 -101063 -255179 498755 -670343 -530457
2614 -530457 -67948 -47224 526240 565680 378091 -304991 -322244 -41487 -1031626 -641109
2624 -641109 721718 607984 1295782 974428 -638818 -793311 -1212376 -1142393 61387
2633F1387Q38481R2394j66879N2159n83360j414731Q2038j54690L52049J867329
2643A026177K5906j53713L27325q48900q94701k31644l04661j85374P23904J405042
2653H89361M40852j3711j77564j889376n67238L98238m40182J197393J171595
2662A009368j29360L07442n09146q76085q06582k47578O31036M36063R30008L34918
2672A080084j137649L58334q7046j169169Q48087m93078j57425J008524P0546
2681C21208O63942l39151m97191o93984q25455Q56161J90903j75638J910027l47859
2691A062963k66027K27795k173676n71510N97615L24513J585150O78868K41694
2700A707385p21475j289885m32329p58316m2540J355567N1127J476677J013199
$$ plain form
2633 61387 899868 992262 825383 877542 294182 -1120549 -1038511 -1193201 -841152 1026177
2643 1026177 1052083 898370 1225695 376795 -517906 -749550 -1054211 -1239585 -515681 889361
2653 889361 1330213 1316502 1138938 -750438 -1317676 -919438 -1359620 -162227 1009368
2662 1009368 880008 1187450 678304 -197781 -1004363 -1251941 -620905 -184842 745166 1080084
2672 1080084 -57565 300769 213723 -955446 -107359 -600437 -757862 250662 321208
2681 321208 985150 645999 148808 -545176 -1370631 -514470 -323567 -499205 1410822 1062963
2691 1062963 796936 1024731 -1148945 -1720455 -1122840 -798327 786823 1465691 1707385
2700 1707385 985910 -303975 -736304 -1494620 -1537160 -181593 -130466 1346211 2359410
2709B359410j929068M815q56627j094145N32622L22534L33212R58519L97745N98622
2719A627639r48668o05090p43646j664785J345301R39394n793J641306l33989
2728A251669n64508R5196j469136n12920m7120M28215J025285L95616P94286n58268
2738H38315j354148N90541r36854N1548J014315q37946O82720J109907n79819
2747E78579m1409m12721o68870m57821K9395J046878P9463K61904O25274q19981
2757B20691J19881m61795j442192Q08628O96631K64919J154215l25086q91368
2766A44524r57336j87646L95134P7108R37053J75859j99955Q09793p29204j569541
2776a104211M97095k82740O47771Q15842r3036k38502J32374j3372j81859l22182
$$ plain form
2709 2359410 430342 435157 -421470 -1515615 -982993 -660459 -327247 631272 1029017 1627639
2719 1627639 678971 73881 -669765 -2334550 -989249 -49855 -55648 1585658 1251669
2728 1251669 687161 782357 -686779 -1199699 -1246819 -818604 206681 602297 1396583 838315
2738 838315 -515833 74708 -862146 -810598 203717 -634229 48491 1158398 578579
2747 578579 537170 124449 -544421 -1002242 -972847 74031 153494 415398 1040672 220691
2757 220691 340572 -121223 -1563415 -754787 -58156 206763 1360978 1035892 144524
2766 144524 -812812 -1000458 -605324 -528216 408837 584696 384741 1194534 465330 -1104211
2776 -1104211 -607116 -889856 -242085 573757 480721 242219 374593 361221 179362 -142820
2786a42820J53395j012213O711J089389K1650M67729J46048q12279K36304k69010
2796a15096o22099K89011j88302O37360N61025K06167J74614j253648J75653R9865
2806c5450m04089P41750l77945q16507J161593J12168J75462Q9805o65518j83689
2816b02420m55371L79600J25502m85141J211310l61280N6293Q89146j566891k83345
2826f92597M65229k93414P44531K47986o99514j00737J25870O15542n0840k96109
2836F5947L50773j279385J51077J186751r90088N23176N38029o60769R12065n93965
2846B03611r38567Q0178j41057R53685L63087P1473m2727j517302L88567M61984
2856a17068m14970J398849m88006n54672J124345q78039o47335N7722k16606R15165
$$ plain form
2786 -142820 10575 -1001638 -994927 94462 116112 583841 729889 -82390 153914 -115096
2796 -115096 -737195 -448184 -636486 874 561899 768066 942680 -310968 -135315 -35450
2806 -35450 -439539 302211 -75734 -892241 269352 381520 556982 646787 -18731 -202420
2816 -202420 -657791 -278191 -152689 -637830 573480 212200 268493 1157639 -409252 -692597
2826 -692597 -227368 -520782 223749 471735 -227779 -328516 -202646 412896 362056 65947
2836 65947 416720 -862665 -711588 475163 -514925 8251 546280 -114489 797576 203611
2846 203611 -734956 -654778 -795835 157850 520937 592410 549683 -967619 -579052 -117068
2856 -117068 -532038 866811 378805 -175867 948478 70439 -576896 -519174 -735780 179385
2866A79385K88378L19791k09608j046186M10502k68603k22063Q04267r79897K59890
2876d64144J068803L6378J80968k12118j092115j31549k52015M38899Q5911M05894
2886F4912Q49989k84772L67967q3285k069619M2356K78056N5664J403486R3030
2896G17784j73668J5680j15985k51682p02468r6090k70358q8135J377484P43483
2906A156045n69014L01003r54855n96333L84519m55930k48254R04771P64063N39054
2916A225069l71364m25846j265445o15135R27582J89859Q96890P12231q03759
2925D70082k62383J15318r34415j6680k39118Q45304P46796J33867k0741j177145
2935c39115k43785J89508l89519J051732M7707p46761R44677n9279k27219J03577
$$ plain form
2866 179385 467763 787554 577946 -468240 -57738 -326341 -548404 255863 -724034 -464144
2876 -464144 604659 641037 822005 609887 -482228 -613777 -865792 -426893 -340982 64912
2886 64912 914901 630129 998096 914811 -1154808 -1112452 -834396 -778732 624754 717784
2896 717784 544116 559796 443811 192129 -510339 -606429 -876787 -964922 412562 1156045
2906 1156045 587031 888034 -66821 -663154 -278635 -734565 -982819 -78048 686015 1225069
2916 1225069 853705 427859 -837586 -1452721 -525139 -335280 561610 1273841 470082
2925 470082 207699 323017 -611398 -628078 -867196 -21892 724904 858771 838030 -339115
2935 -339115 -582900 -393392 -782911 268821 316528 -430233 514444 455165 227946 331523
2945C31523q04197n54235M27881O42243K91280k81002J082266l87454j027099
$$ plain form
2945 331523 -472674 -1026909 -599028 43215 334495 53493 1135759 748305 -278794
$$ [...]
##END NTUPLES=NMR FID
##END=
