##TITLE=C13_SA_24.218
 DMSO-d6, 20000 sc

 6.8.2020
##JCAMPDX= 6.0         $$ Bruker NMR JCAMP-DX V2.0
##DATA TYPE= NMR SPECTRUM
##DATA CLASS= NTUPLES
##ORIGIN= UXNMR, Bruker Analytische Messtechnik GmbH
##OWNER= root
$$ XWIN-NMR		Version 3.5
$$ Fri Aug  7 10:02:48 2020 Russian Standard Time (UT+4h)  she@DPX200
##.OBSERVE FREQUENCY= 50.327896
##.OBSERVE NUCLEUS= ^13C
##.ACQUISITION MODE= SIMULTANEOUS
##.ACQUISITION SCHEME= undefined
##.AVERAGES= 20000
##.DIGITISER RES= 17
##SPECTROMETER/DATA SYSTEM= spect
##.PULSE SEQUENCE= zgpg30
##.SOLVENT NAME= CDCl3
##.SHIFT REFERENCE= (INTERNAL, CDCl3, 0, 222.661)
##AUDIT TRAIL= $$ (NUMBER, WHEN, WHO, WHERE, WHAT)
$$ ##TITLE= Audit trail, XWIN-NMR		Version 3.5
$$ ##JCAMPDX= 5.01
$$ ##ORIGIN= Bruker BioSpin GmbH
$$ ##OWNER= she
$$ F:/spectra/data/she/nmr/c13/1/pdata/1/auditp.txt
$$ ##AUDIT TRAIL=  $$ (NUMBER, WHEN, WHO, WHERE, WHAT)
(   1,<2020-08-07 10:01:49.57 +0400>,<she>,<DPX200>,
      <created by zg, POWCHK disabled, PULCHK disabled
       terminated by command 'halt'
       configuration hash MD5:
       00 E9 B6 7A A2 85 ED C7 34 08 36 98 17 FE 4E 26
       data hash MD5: 32K
       BE 5E 02 DB 7D C5 67 B1 A9 78 6D 23 3B C7 27 37>)
(   2,<2020-08-07 10:01:52.32 +0400>,<she>,<DPX200>,
      <Start of raw data processing
       efp BC_mod = 2 LB = 1 FT_mod = 6 PKNL = 1 PHC0 = -242.7977 PHC1 = 42.56238 SI = 32K 
       data hash MD5: 32K
       DA 3F 76 A3 EC D7 AA FE 3A 95 25 BE 0C B6 B0 78>)
(   3,<2020-08-07 10:01:55.17 +0400>,<she>,<DPX200>,
      <abs ABSG = 5 
       data hash MD5: 32K
       64 76 B2 FA B5 0B 6D C9 3F E9 AE 8F 69 AB 20 5B>)
(   4,<2020-08-07 10:02:19.81 +0400>,<she>,<DPX200>,
      <abs ABSG = 5 
       data hash MD5: 32K
       51 E4 EA 4E A3 C9 00 26 F7 1C 10 8F 6B F0 BA 68>)
$$ ##END=
$$ 
$$ hash MD5
$$ 10 A9 D1 85 12 26 FE 8E B1 79 66 C6 B0 00 79 64
##$RELAX= 
##$RELAX= 
##$RELAX= 
##$RELAX= 
##$RELAX= 
##$RELAX= 
##$RELAX= 
##$RELAX= 
$$ Bruker specific parameters
$$ --------------------------
##$DU= <F:/spectra>
##$EXPNO= 1
##$NAME= <c13>
##$PROCNO= 1
##$TYPE= <nmr>
##$USER= <she>
##$AMP= (0..31)
100 100 100 100 100 100 100 100 100 100 100 100 100 100 100 100 100 100 
100 100 100 100 100 100 100 100 100 100 100 100 100 100 
##$AQSEQ= 0
##$AQ_mod= 1
##$AUNM= <au_zg>
##$AUTOPOS= <>
##$BF1= 50.322709
##$BF2= 200.13
##$BF3= 50.322709
##$BF4= 500.13
##$BF5= 500.13
##$BF6= 500.13
##$BF7= 500.13
##$BF8= 500.13
##$BYTORDA= 1
##$CFDGTYP= 0
##$CFRGTYP= 5
##$CHEMSTR= <none>
##$CNST= (0..31)
1 1 145 1 1 1 1 1 1 1 1 1 1 1 1 1 1 1 1 1 1 1 1 1 1 1 1 1 1 1 1 1 
##$CPDPRG= <waltz16>
##$CPDPRG1= <>
##$CPDPRG2= <waltz16>
##$CPDPRG3= <>
##$CPDPRG4= <mlev>
##$CPDPRG5= <mlev>
##$CPDPRG6= <mlev>
##$CPDPRG7= <mlev>
##$CPDPRG8= <mlev>
##$CPDPRGB= <>
##$CPDPRGT= <>
##$D= (0..31)
0 2 0.00345 0 0 0 0 0 0 0 0 0.03 2e-05 3e-06 0 0 0 0 0 0 0 0 0 0 0 0 0 
0 0 0 0 0 
##$DATE= 1596777859
##$DBL= (0..7)
120 120 120 120 120 120 120 120 
##$DBP= (0..7)
150 150 150 150 150 150 150 150 
##$DBP07= 0
$$ [...]
##$SUBNAM4= <"">
##$SUBNAM5= <"">
##$SUBNAM6= <"">
##$SUBNAM7= <"">
##$SUBNAM8= <"">
##$SUBNAM9= <"">
##$SW= 239.972175391363
##$SWIBOX= (0..15)
0 1 3 0 0 0 0 0 0 0 0 0 0 0 0 0 
##$SW_h= 12077.2946859903
##$TD= 32768
##$TD0= 1
##$TE= 0
##$TE2= 300
##$TE3= 300
##$TEG= 300
##$TL= (0..7)
120 120 120 120 120 120 120 120 
##$TP= (0..7)
150 150 150 150 150 150 150 150 
##$TP07= 0
##$TPNAME0= <>
##$TPNAME1= <>
##$TPNAME2= <>
##$TPNAME3= <>
##$TPNAME4= <>
##$TPNAME5= <>
##$TPNAME6= <>
##$TPNAME7= <>
##$TPOAL= (0..7)
0.5 0.5 0.5 0.5 0.5 0.5 0.5 0.5 
##$TPOFFS= (0..7)
0 0 0 0 0 0 0 0 
##$TUNHIN= 0
##$TUNHOUT= 0
##$TUNXOUT= 0
##$USERA1= <user>
##$USERA2= <user>
##$USERA3= <user>
##$USERA4= <user>
##$USERA5= <user>
##$V9= 5
##$VALIST= <valist>
##$VCLIST= <CCCCCCCCCCCCCCC>
##$VD= 0
##$VDLIST= <DDDDDDDDDDDDDDD>
##$VPLIST= <PPPPPPPPPPPPPPP>
##$VTLIST= <TTTTTTTTTTTTTTT>
##$WBST= 1024
##$WBSW= 4
##$XGAIN= (0..3)
0 0 0 0 
##$XL= 0
##$YL= 0
##$YMAX_a= 127008982
##$YMIN_a= -32306753
##$ZGOPTNS= <>
##$ZL1= 120
##$ZL2= 120
##$ZL3= 120
##$ZL4= 120
##$ABSF1= 222.6606
##$ABSF2= -17.33621
##$ABSG= 5
##$ABSL= 3
##$ALPHA= 0
##$AQORDER= 0
##$ASSFAC= 0
##$ASSFACI= 0
##$ASSFACX= 0
##$ASSWID= 0
##$AUNMP= <proc_1d>
##$AZFE= 0.1
##$AZFW= 0.5
##$BCFW= 0
##$BC_mod= 2
##$BYTORDP= 0
##$COROFFS= 0
##$CY= -3
##$DATMOD= 1
##$DC= 0
##$DFILT= <>
##$DTYPP= 0
##$F1P= 0
##$F2P= 0
##$FCOR= 0.5
##$FTSIZE= 32768
##$FT_mod= 6
##$GAMMA= 0
##$GB= 0
##$INTBC= 1
##$INTSCL= 4.134877e-10
##$ISEN= 128
##$LB= 1
##$LEV0= 0
##$LPBIN= 0
##$MAXI= 10000
##$MC2= 0
##$MEAN= 0
##$ME_mod= 0
##$MI= 0.1934396
##$NCOEF= 0
##$NC_proc= 3
##$NLEV= 6
##$NOISF1= 120.0001
##$NOISF2= 80.00006
##$NSP= 0
##$NTH_PI= 0
##$NZP= 0
##$OFFSET= 222.6606
##$PC= 1.4
##$PHC0= -242.7977
##$PHC1= 42.56238
##$PH_mod= 1
##$PKNL= yes
##$PPARMOD= 0
##$PSCAL= 0
##$PSIGN= 0
##$REVERSE= no
##$SF= 50.322729756361
##$SI= 32768
##$SIGF1= 140
##$SIGF2= 120
##$SINO= 11.81781
##$SIOLD= 32768
##$SREGLST= <13C.CDCl3>
##$SSB= 0
##$STSI= 32768
##$STSR= 0
##$SW_p= 12077.2946859903
##$SYMM= 0
##$S_DEV= 0
##$TDeff= 32768
##$TDoff= 0
##$TI= <>
##$TILT= no
##$TM1= 0
##$TM2= 0
##$TOPLEV= 0
##$USERP1= <user>
##$USERP2= <user>
##$USERP3= <user>
##$USERP4= <user>
##$USERP5= <user>
##$WDW= 1
##$XDIM= 32768
##$YMAX_p= 288891618
##$YMIN_p= -1189285
$$ End of Bruker specific parameters
$$ ---------------------------------
##NTUPLES= NMR SPECTRUM
##VAR_NAME=  FREQUENCY,     SPECTRUM/REAL,   SPECTRUM/IMAG
##SYMBOL=    X,             R,               I
##VAR_TYPE=  INDEPENDENT,   DEPENDENT,       DEPENDENT
##VAR_FORM=  AFFN,          ASDF,            ASDF
##VAR_DIM=   32768,         32768,           32768
##UNITS=     HZ,            ARBITRARY UNITS, ARBITRARY UNITS
##FACTOR=    0.368581032318806, 1,           1
##FIRST=     11204.8891385315, 0,            0
##LAST=      -872.405547458802, 0,           0
##MIN=       -872.405547458802, -1189285,    0
##MAX=       11204.8891385315, 288891618,    0
$$ Real data points
##PAGE= N=1
##DATA TABLE= (X++(R..R)), XYDATA
$$ [...]
$$ plain form
10929 416387 260010 176430 134295 77680 19505 6563 2356 -107372 -231042 -274870 -226588
10918 -226588 -155333 -129229 -272956 -416208 -312139 -66987 39530 157147 193018 143870
10908 143870 123114 168335 180456 -44475 -387816 -483864 -495892 -387207 -167183 -57752
10898 -57752 -147280 -160784 -75470 32373 297567 443913 444167 375972 232000 181015 313006
10887 313006 323897 191089 52401 165555 420328 395835 327626 182676 103034 188714
10877 188714 210356 232013 209560 142927 304262 519704 437394 300000 92396 -194262
10867 -194262 -466181 -460446 -71914 345395 528344 516188 485170 441713 322675 151407
10857 151407 118403 244104 318822 336297 142153 -47448 -7019 -40710 -211596 -341584
$$ packed form
10929D16387j56377q3580m2135n6615n8175j2942m207j09728j23670m3828M8282
10918b26588P1255K6104j43727j43252J04069K45152J06517J17617L5871m9148
10908A43870k0756M5221J2121k24931l43341r6048j2028J08685K20024J09431
10898e7752q9528j3504Q5314J07843K65194J46346K54o8195j43972n0985J31991
10887C13006J0891j32808j38688J13154K54773k4493o8209j44950p9642Q5680
10877A88714K1642K1657k2453o6633J61335K15442q2310j37394k07604k86658
10867a94262k71919N735L88532M17309J82949j2156l1018m3457j19038j71268
10857A51407l3004J25701P4718J7475j94144j89601M0429l3691j70886j29988
$$ plain form
10847 -341584 -419641 -297157 -100423 -178846 -324679 -251979 -245775 -195618 -190957 -237116 -277357
10836 -277357 -245588 -193737 -134384 -213629 -343180 -221138 -27459 14399 49247 45290 -132169
10825 -132169 -338992 -335066 -24016 253221 219542 -53385 -183943 -315813 -427695 -427189 -535613
10814 -535613 -532801 -498035 -395836 -260610 -180456 -95180 -177695 -121414 10167 178029 202057
10803 202057 182307 -49209 -263469 -279620 -203467 -106347 -132328 -177661 -149645 -124480 -89946
10792 -89946 58841 209678 218868 71054 -77118 -92926 -66547 61579 219719 258951 141130
10781 141130 94942 81240 49117 129660 236861 296949 287630 244828 219287 -4886 -233408
10770 -233408 -53985 86813 73356 176832 471436 601987 528481 209501 38600 47309
$$ packed form
10847c41584p8057J22484J96734p8423j45833P2700O204N0157M661m6159m0241
10836b77357L1769N1851N9353p9245j29551J22042J93679M1858L4848l957j77459
10825a32169k06823L926L11050K77237l3679k72927j30558j31870j11882N06j08424
10814e35613K812L4766J02199J35226Q0154Q5276q2515N6281J31581J67862K4028
10803B02057j9750k31516k14260j6151P6153R7120k5981m5333K8016K5165L4534
10792h9946J48787J50837R190j47814j48172j5808K6379J28126J58140L9232j17821
10781A41130m6188j3702l2123Q0543J07201O0088r319m2802k5541k24173k28522
10770b33408J79423J40798j3457J03476K94604J30551p3506l18980j70901Q709
$$ plain form
10760 47309 16175 -53776 66002 -58926 -262087 -345087 -206156 34160 112348 155245 135648
10749 135648 162136 182745 63934 -113281 -162654 -149894 -10376 93095 198690 242792
10739 242792 290566 391707 361689 317514 236574 64389 -23419 -108395 -299731 -478006 -422736
10728 -422736 -270988 -221942 -259545 -180341 -211361 -356505 -180464 83521 123857 256269
10718 256269 161779 -142337 -480548 -600022 -563925 -564684 -543748 -296044 16635 161172 161465
10707 161465 51126 -185497 -200215 -115555 -80598 50915 169744 315748 316340 204702 74717
10696 74717 -99728 -113118 21065 64882 67107 41114 175395 239688 206680 205744 112619 170476
10684 170476 138667 4678 -100413 -266305 -525757 -443987 -207934 -188811 -218247 -235612
$$ packed form
10760D7309l1134o9951J19778j24928k03161q3000J38931K40316P8188M2897j9597
10749A35648K6488K0609j18811j77215m9373J2760J39518J03471J05595M4102
10739B42792M7774J01141l0018m4175q0940j72185q7808q4976j91336j78275N5270
10728d22736J51748M9046l7603P9204l1020j45144J76041K63985M0336J32412
10718B56269r4490l04116l38211j19474L6097p59K0936K47704L12679J44537K93
10707A61465j10339k36623j4718Q4660L4957J31513J18829J46004N92j11638j29985
10696G4717j74445j3390J34183M3817K225k5993J34281O4293l3008r36r3125N7857
10684A70476l1809j33989j05091j65892k59452Q1770K36053J9123k9436j7365
$$ plain form
10674 -235612 -273915 19683 332428 128500 -81097 -31885 2087 -225036 -252222 -221936
10664 -221936 -200449 -101563 -120863 -203088 -99572 -53070 -63766 -14195 100063 182275 -82466
10653 -82466 -265848 -104678 -26770 -92708 -116071 125933 229819 228260 432904 446938 353619
10642 353619 266197 173436 160944 208750 168949 -77244 -346478 -398734 -409424 -261708 -30977
10631 -30977 -94533 -350235 -619260 -661460 -622415 -746093 -789772 -821441 -821178 -673383 -639191
10620 -639191 -582164 -434585 -383411 -231784 -104444 76734 232780 113251 -62671 -369754
10610 -369754 -437817 -306350 -143510 68788 360869 370053 111094 -11261 50305 105220
10600 105220 174309 204030 34059 -137472 -272856 -199516 -103265 -89908 60546 346557
$$ packed form
10674b35612l8303K93598L12745k03928k09597M9212L3972k27123k7186L0286
10664b21936K1487R8886j9300q2225J03516M6502j0696M9571J14258Q2212k64741
10653h2466j83382J61170P7908o5938k3363K42004J03886j559K04644J4034r3319
10642C53619q7422r2761j2492M7806l9801k46193k69234n2256j0690J47716K30731
10631c0977o3556k55702k69025m2200L9045j23678m3679l1669K63J47795L4192
10620f39191N7027J47579N1174J51627J27340J81178J56046j19529j75922l07083
10610c69754o8063J31467J62840K12298K92081R184k58959j22355O1566N4915
10600A05220O9089K9721j69971j71531j35384P3340R6251J3357J50454K86011
$$ plain form
10590 346557 362547 277478 343589 194551 -131299 -273513 -228909 -183178 -111881 -78900 -229074
10579 -229074 -391210 -379214 -230023 498 104891 -123922 -356686 -172991 77765 82205
10569 82205 -106913 -240564 -19314 171259 255837 590332 824778 851438 747416 421038
10559 421038 154595 39478 28283 42235 -87172 -182720 -223477 -295841 -152102 -25370
10549 -25370 -76320 -135314 -121469 7934 102306 176283 59372 -231626 -313877 -170124 -15184
10538 -15184 50957 87125 172855 258729 289193 228415 312850 277085 176350 175509 238790 237429
10526 237429 239442 424473 566118 574061 350656 190872 213969 105792 -38257 -43940 -1
10515 -1 -57846 -90349 -187253 -352650 -272011 -195290 -144210 17311 106210 14835 -80516 -10752
$$ packed form
10590C46557J5990q5069O6111j49038l25850j42214M4604M5731P1297L2981j50174
10579b29074j62136J1996J49191K30521J04393k28813k32764J83695K50756M440
10569H2205j89118j33651K21250J90573Q4578L34495K34446K6660j04022l26378
10559D21038k66443j15117j1195J3952j29407r5548m0757p2364J43739J26732
10549b5370n0950n8994J3845J29403R4372P3977j16911k90998q2251J43753J54940
10538a5184O6141L6168Q5730Q5874L0464o0778Q4435l5765j00735q41O3281j361
10526B37429K013J85031J41645P943k23405j59784K3097j08177j44049n683M3939
10515an7845l2503r6904j65397Q0639P6721N1080J61521Q8899r1375r5351O9764
$$ plain form
10503 -10752 -62980 -160752 -146835 -107983 -71300 -65713 -256471 -618091 -814835 -629360 -458832
10492 -458832 -412233 -456566 -601134 -690248 -597664 -422413 -298922 -272076 -277130 -296717 -152295
10481 -152295 209443 427571 453010 304483 231740 38367 -218813 -333584 -348378 -357379
10471 -357379 -662521 -978329 -1138237 -943033 -379880 -21529 -119874 -229256 -263279 -242529
10461 -242529 -138859 -56574 -226036 -512545 -532692 -346644 -168114 -64593 110714 63980
10451 63980 -249294 -403705 -334930 -138668 861 73412 111866 68740 127733 158965 46562
10440 46562 8279 1444 -117228 -249023 -184337 -170461 -260148 -207087 -100511 18563 106332
10429 106332 138964 27934 -83777 115377 191334 -24090 -86440 -2865 -209010 -534282
$$ packed form
10503a0752n2228r7772J3917L8852L6683N587j90758l61620j96744J85475J70528
10492d58832M6599m4333j44568q9114R2584J75251J23491K6846n054j9587J44422
10481a52295L61738K18128K5439j48527p2743j93373k57180j14771j4794r001
10471c57379l05142l15808j59908J95204N63153L58351r8345j09382l4023K0750
10461b42529J03670Q2285j69462k86509k0147J86048J78530J03521J75307m6734
10451F3980l13274j54411O8775J96262J39529P2551L8454m3126N8993L1232j12403
10440D6562l8283o835j18672j31795O4686J3876q9687N3061J06576J19074Q7769
10429A06332L2632j11030j11711J99154P5957k15424o2350Q3575k06145l25272
$$ plain form
10419 -534282 -679090 -402422 -57931 -140088 -198368 -84418 -14537 -80897 -143026 -46589 91700
10408 91700 73567 108711 7880 15013 169844 -16627 -320929 -305832 -211656 -166336 -168017
10397 -168017 -20380 104956 239755 260024 165308 234621 340426 198840 -13147 -162049
10387 -162049 12315 108672 -11772 -200741 -187657 -50337 31400 80789 118961 183678 394679
10376 394679 550064 423490 332416 452923 447838 207292 94224 -35885 -143946 -240262
10366 -240262 -231914 -45023 69015 221994 295739 230805 287441 296767 298060 309327 391769
10355 391769 412828 231706 -88586 -312238 -324074 -418417 -557706 -605719 -608078 -536830 -479343
10344 -479343 -389145 -113011 161704 253969 225674 66119 -169300 -282925 -155870 -132507
$$ packed form
10419e34282j44808K76668L44491q2157n8280J13950O9881o6360o2129R6437J38289
10408I1700j8133L5144j00831P133J54831j86471l04302J5097R4176M5320j681
10397a68017J47637J25336J34799K0269r4716O9313J05805j41586k11987j48902
10387a62049J74364R6357j20444j88969J3084J37320Q1737M9389L8172O4717K11001
10376C94679J55385j26574r1074J20507n085k40546j13068j30109j08061r6316
10366b40262Q348J86891J14038J52979P3745o4934N6636R326J293J1267Q2442
10355C91769K1059j81122l20292k23652j1836r4343j39289m8013k359P1248N7487
10344d79343R0198K76134K74715R2265k8295j59555k35419j13625J27055K3363
$$ plain form
10334 -132507 -143681 -140676 -76130 -93993 -369280 -630004 -487331 -350561 -183303 -49321
10324 -49321 65683 390323 617872 479132 282168 271973 122239 8748 5661 113239
10314 113239 113507 77266 52941 -58793 -144420 157901 368403 107879 -153437 -332715 -502711
10303 -502711 -479792 -361545 -44515 359501 675641 660810 253394 -57291 -251302 -381941
10293 -381941 -262909 -12671 203179 307580 324446 248266 231791 124780 -89935 -195838
10283 -195838 -54905 168910 134424 131101 275686 162219 -23196 -34663 -93918 -154545 -34924
10272 -34924 -19040 -97573 -73381 -114527 -1260 214018 284741 328202 429371 443967 396355
10261 396355 388811 308397 163439 209578 415384 477211 355801 368077 340872 144058 14949
$$ packed form
10334a32507j1174L005O4546j7863k75287k60724J42673J36770J67258J33982
10324d9321J15004L24640K27549j38740j96964j0195j49734j13491l087J07578
10314A13239K68l6241k4325j11734q5627L02321K10502k60524k61316j79278j69996
10303e02711K2919J18247L17030M04016L16140j4831m07416l10685j94011j30639
10293c81941J19032K50238K15850J04401J6866p6180j6475j07011k14715j05903
10283a95838J40933K23815l4486l323J44585j13467j85415j1467n9255o0627J19621
10272c4924J5884p8533K4192m1146J13267K15278P0723M3461J01169J4596m7612
10261C96355p544q0414j44958M6139K05806O1827j21410J2276k7205j96814j29109
$$ plain form
10250 14949 176539 164272 111508 198341 295367 248363 210732 143243 170735 189400 140080
10239 140080 155184 169859 115574 -36570 -106999 25101 81634 141224 112310 111945 185580
10228 185580 205293 49049 -130611 -247960 -231205 -393645 -558541 -490706 -471776 -481961
10218 -481961 -516666 -610336 -652417 -402253 -57743 107529 261014 405315 152314 -91213
10208 -91213 -77942 70633 66175 -177886 -423334 -538529 -615089 -373732 -32303 132922
10198 132922 92052 19281 -20701 47518 19656 -11744 -46305 -88766 -21270 26779 -49967
10187 -49967 -29426 -31996 4678 178922 268383 304239 134935 9159 159729 338584 337394
10176 337394 146157 -29394 146439 339145 347984 215230 42235 35261 -39157 -32457 79032
$$ packed form
10250A4949J61590j2267n2764Q6833R7026m7004l7631o7489K7492J8665m9320
10239A40080J5104J4675n4285j52144p0429J32100N6533N9590k8914l65P3635
10228A85580J9713j56244j79660j17349J6755j62440j64896O7835J8930j0185
10218d81961l4705r3670m2081K50164L44510J65272J53485J44301k53001k43527
10208i1213J3271J48575m458k44061k45448j15195p6560K41357L41429J65225
10198A32922m0870p2771l9982O8219k7862l1400l4561m2461O7496M8049p6746
10187d9967K0541k570L6674J74244Q9461L5856j69304j25776J50570J78855j190
10176C37394j91237j75551J75833J92706Q839j32754j72995o974p4418O700J11489
$$ plain form
10165 79032 141318 -2785 -183070 -190499 -223623 -339061 -293912 -213242 -254987 -335415 -254889
10154 -254889 -20154 61765 84497 62497 -52530 -142971 -186744 -343772 -427768 -186898 136772
10143 136772 262239 73213 -26763 85970 182373 240247 227180 88340 -78917 -138062
10133 -138062 -17753 95908 170546 288794 437500 394372 276918 292350 284899 258040 58309
10122 58309 -210680 -341422 -240329 -45661 -108488 -289420 -331902 -347418 -370037 -280401 -270193
10111 -270193 -293736 -108203 20708 -49333 -288121 -435016 -192420 9663 22712 86822
10101 86822 154730 98814 -90420 -46541 -37748 -94863 -78020 170408 213572 165507 111390
10090 111390 85048 218549 322635 406590 562786 656240 603831 344218 142 -99127
$$ packed form
10165G9032O2286j44103j80285p429l3124j15438M5149Q0670m1745q0428Q0526
10154b54889K34735Q1919K2732k2000j15027r0441m3773j57028q3996K40870L23670
10143A36772J25467j89026r9976J12733R6403N7874j3067j38840j67257n9145
10133a38062J20309J13661P4638J18248J48706m3128j17454J5432p451k6859j99731
10122E8309k68989j30742J01093J94668o2827j80932m2482j5516k2619Q9636J0208
10111b70193k3543J85533J28911p0041k38788j46895K42596K02083J3049O4110
10101H6822O7908n5916j89234M3879Q793n7115J6843K48428M3164m8065n4117
10090A11390k6342J33501J04086Q3955J56196R3454n2409k59613l44076r9269
$$ plain form
10080 -99127 -44404 -61019 -69326 100953 62048 -120667 -181889 -285425 -335553 -298545 -333959
10069 -333959 -254533 48203 96278 35920 -135691 -270469 -91832 -32633 -107523 -188011 -237002
10058 -237002 -320437 -487311 -555312 -517454 -445590 -367718 -337183 -215378 -110448 -61223 -50705
10047 -50705 -91038 -193813 -369412 -545411 -677920 -783161 -831238 -782333 -735342 -628422
10037 -628422 -253848 -107789 -152614 -95086 496 -124 -78951 -136039 -192027 -206941 -136114
10026 -136114 -248684 -417633 -411335 -214697 -60339 26016 23306 37973 50829 111251 139697
10015 139697 197284 258596 154515 -27722 -257125 -278029 -17653 119386 36402 -102070
10005 -102070 -153672 -127505 -84615 -102044 -26109 25106 -31830 139359 323038 302861 148487
$$ packed form
10080i9127N4723j6615q307J70279l8905j82715o1222j03536n0128L7008l5414
10069c33959P9426L02736M8075o0358j71611j34778J78637N9199p4890q0488m8991
10058b37002q3435j66874o8001L7858P1864P7872L0535J21805J04930M9225J0518
10047e0705m0333j02775j75599j75999j32509j05241m8077M8905M6991J06920
10037f28422L74574J46059m4825N7528R5582o20p8827n7088n5988j4914P0827
10026a36114j12570j68949O298J96638J54358Q6355k710J4667J2856O0422K8446
10015A39697N7587O1312j04081j82237k29403k0904K60376J37039q2984j38472
10005a02070n1602K6167M2890j7429P5935N1215n6936J71189J83679k0177j54374
$$ plain form
9994 148487 113573 136907 199852 139857 45913 -81003 -147151 -234353 -320475 -144062 139151
9983 139151 150200 44205 31968 -19288 -173039 -123250 -48976 -65168 -189305 -125371 -119835
9972 -119835 -119655 57286 73410 -43548 -129178 -301740 -470258 -346994 -207291 84662 367281
9961 367281 376612 395484 449181 340029 144843 46969 -4490 -115676 -246926 -223005 -21092
9950 -21092 134659 149998 27121 -118480 -238676 -277316 -251553 -177519 -143221 -189931 -142724
9939 -142724 118946 239600 257990 379093 675269 839601 691149 265631 -179315 -274374
9929 -274374 -274947 -102155 19184 15757 -4661 -97729 -141960 -34477 138848 309661 313976
9918 313976 175852 74644 -208176 -357650 -395260 -220439 86186 205060 88015 -150113
$$ packed form
9994A48487l4914K3334O2945n9995r3944j26916o6148q7202q6122J76413K83213
9983A39151J1049j05995j2237n1256j53751M9789P4274j6192j24137O3934N536
9972a19835J80J76941J6124j16958q5630j72562j68518J23264J39703K91953K82619
9961C67281R331J8872N3697j09152j95186r7874n1459j11186j31250K3921K01913
9950b1092J55751J5339j22877j45601j20196l8640K5763P4034L4298m6710M7207
9939a42724K61670J20654J8390J21103K96176J64332j48452m25518m44946r5059
9929b74374n73J72792J21339l427k0418r3068m4231J07483J73325J70813M315
9918C13976j38124j01208k82820j49474l7610J74821L06625J18874j17045k38128
$$ plain form
9908 -150113 -225192 -67961 113488 129133 -27695 -111430 -157444 -33180 92652 94044 15469
9897 15469 -71179 -27242 20483 81131 127224 96643 126314 96519 14314 -163525 -295840
9886 -295840 -250507 -106611 -3665 -66498 -203179 -203923 -75107 -19148 -4325 152205 234940
9875 234940 98605 -97861 -317703 -369760 -255398 -129129 58460 186683 184379 -94597
9865 -94597 -363089 -262946 -84571 -69578 10922 1669 -57404 -4120 80502 6569 -114641
9854 -114641 -64440 -98347 9225 134731 204348 302925 258113 101240 -116875 -299064 -340485
9843 -340485 -168004 143004 260556 137415 -102633 -154477 -11106 40434 -69575 -226961
9833 -226961 -244558 -49655 90673 -72707 -375080 -610553 -781443 -591888 -250431 -68247
$$ packed form
9908a50113p5079J57231J81449J5645j56828q3735m6014J24264J25832J392p8575
9897A5469q6648M3937M7725O0648M6093l0581K9671k9795q2205j77839j32315
9886b95840M5333J43896J02946o2833j36681p44J28816N5959J4823J56530Q2735
9875B34940j36335j96466k19842n2057J14362J26269J87589J28223k304k78976
9865i4597k68492J00143J78375J4993Q0500r253n9073N3284Q4622p3933j21210
9854a14641N0201l3907J07572J25506O9617R8577m4812j56873k18115j82189m1421
9843c40485J72481L11008J17552j23141k40048n1844J43371N1540j10009j57386
9833b26961j7597J94903J40328j63380l02373k35473j70890J89555L41457J82184
$$ plain form
9823 -68247 54968 152194 107730 72649 27210 141352 315744 478060 372524 70044 -107431
9812 -107431 -274545 -411057 -354882 -277988 -322241 -480366 -558917 -529158 -481507 -442609 -257066
9801 -257066 104864 328811 384066 482005 670428 841735 688913 437707 292993 95019
9791 95019 24696 84784 296340 631710 767318 617141 387876 225813 209594 200888 122187
9780 122187 146808 159142 -32036 -41673 57737 209153 388629 268424 194468 248001 282830
9769 282830 147911 8138 -3370 108357 245881 254711 61241 20617 128002 252400
9759 252400 347398 305928 193933 83001 107648 120973 -97571 -219582 -191792 -223792 -128818
9748 -128818 -47229 -94831 47927 140305 156367 202626 101059 199270 333058 363787 412600
$$ packed form
9823f8247J23215R7226m4464l5081m5439J14142J74392J62316j05536l02480j77475
9812a07431j67114j36512N6175P6894m4253j58125p8551K9759M7651L8898J85543
9801b57066L61930K23947N5255R7939J88423J71307j52822k51206j44714j97974
9791I5019p0323O0088K11556L35370J35608j50177k29265j62063j6219q706p8701
9780A22187K4621J2334j91178r637R9410J51416J79476j20205p3956N3533L4829
9769B82830j34919j39773j1508J11727J37524Q830j93470m0624J07385J24398
9759B52400R4998m1470j11995j10932K4647J3325k18544j22011K7790l2000R4974
9748a28818Q1589m7602J42758R2378J6062M6259j01567R8211J33788L0729M8813
$$ plain form
9737 412600 562959 595270 521183 519068 632266 633102 398102 253421 259594 289924 250276 181969
9725 181969 95839 21645 -147542 -229481 -128936 -61042 -175427 -422927 -438568 -262384 -113633
9714 -113633 -171728 -149241 -72156 228524 464601 425995 327303 386744 533090 596588 510970
9703 510970 400738 250332 118126 67560 17115 -90747 -248907 -400925 -396916 -313476 -282176
9692 -282176 -165889 28833 81426 107369 184828 83118 -73363 -143511 -50999 58737 -16244
9681 -16244 -26787 -108434 -300607 -392384 -305483 -157329 -40291 -80114 -286228 -368286 -389912
9670 -389912 -446908 -511445 -557128 -456982 -379629 -358841 -240256 -225037 -196623 -124018 62913
9659 62913 146706 -132478 -490636 -520304 -454359 -394675 -274393 -121194 -35327 4843 -85922
$$ packed form
9737D12600J50359L2311p4087k115J13198Q36k35000j44681O173L0330l9648o8307
9725A81969q6130p4194j69187q1939J00545O7894j14385k47500j5641J76184J48751
9714a13633n8095K2487P7085L00680K36077l8606r8692N9441J46346O3498q5618
9703E10970j10232j50406j32206n0566n0445j07862j58160j52018M009Q3440L1300
9692b82176J16287J94722N2593K5943P7459j01710j56481p0148R2512J09736p4981
9681a6244j0543q1647j92173r1777Q6901J48154J17038l9823k06114q2058k1626
9670c89912n6996o4537m5683J00146P7353K0788J18585J5219K8414P2605J86931
9659F2913Q3793k79184l58158k9668O5945N9684J20282J53199Q5867M0170r0765
$$ plain form
9648 -85922 -161086 -47717 209027 380597 410446 442741 318676 290855 253318 228197 445708
9637 445708 396102 132575 24266 2328 -22119 -146793 -114059 52735 132060 172618 272492
9626 272492 399086 377161 401663 410802 396809 430177 517527 448445 274902 219917 252179
9615 252179 127936 116913 417994 535723 443419 234504 247406 196427 -76606 -388340
9605 -388340 -430521 -314659 -195926 -17596 39620 -75935 -74047 19413 -36934 -89976 -279991
9594 -279991 -473347 -538904 -383128 -65212 405471 585411 374589 125916 -11315 -123481
9584 -123481 -180713 -137040 -161067 -176122 -134370 -91605 -62835 -72895 13888 -6830 -173274
9573 -173274 -295992 -345552 -256111 -76876 -34394 -3085 167741 317860 314104 241187 131889
$$ packed form
9648h5922p5164J13369K56744J71570K9849L2295j24065k7821l7537k5121K17511
9637D45708m9606k63527j08309k1938k4447j24674L2734J66794P9325M0558R9874
9626B72492J26594k1925K4502R139j3993L3368Q7350o9082j73543n4985L2262
9615B52179j24243j1023L01081J17729r2304k08915J2902n0979k73033l11734
9605c88340m2181J15862J18733J78330N7216j15555J888R3460n6347n3042j90015
9594b79991j93356o5557J55776L17916M70683J79940k10822k48673j37231j12166
9584a23481n7232M3673k4027j5055M1752M2765K8770j0060Q6783k0718j66444
9573a73274j22718m9560Q9441J79235M2482L1309J70826J50119l756p2917j09298
$$ plain form
9562 131889 82407 55736 119650 235612 276051 166910 -50753 -178430 -82479 187172 224289
9551 224289 258311 140100 -29340 -132677 -179504 -157623 -127026 -2319 113987 98654 142771
9540 142771 141185 26806 84164 76133 -171384 -290764 -205789 -64028 -82556 -148769 -204531
9529 -204531 -284291 -302027 -256017 -97712 -137275 -180828 -180235 -44236 35763 82103 -39394
9518 -39394 -246527 -245624 -222196 -210831 -282805 -309859 -291405 -321911 -439212 -407521 -351311 -251172
9506 -251172 -300455 -346820 -386161 -405244 -552521 -484369 -191608 41283 10799 -74475 -87435
9495 -87435 -71423 45916 97662 102971 135070 -431 -208003 -464644 -486408 -307009 -185139
9484 -185139 -159416 -129860 -241490 -344448 -399919 -589805 -669008 -655952 -504144 -229560 -50687
$$ packed form
9562A31889m9482k6671O3914J15962M0439j09141k17663j27677R5951K69651L7117
9551B24289L4022j18211j69440j03337m6827K1881L0597J24707J16306j5333M4117
9540A42771j586j14379N7358q031k47517j19380Q4975J41761j8528o6213n5762
9529b04531p9760j7736M6010J58305l9563m3553N93J35999P9999M6340j21497
9518c9394k07133R03K3428J1365p1974k7054J8454l0506j17301L1691N6210J00139
9506b51172m9283m6365l9341j9083j47277O8152K92761K32891l0484q5274j2960
9495h7435J6012J17339N1746N309L2099j35501k07572k56641k1764J79399J21870
9484a85139K5723K9556j11630j02958n5471j89886p9203J3056J51808K74584J78873
$$ plain form
9473 -50687 3116 48852 -6622 -17879 99354 117378 -5473 153799 271900 352386 337442
9462 337442 131582 49485 110054 126930 57242 -82941 -73381 -4586 50262 132950 58852
9451 58852 -68904 -24578 56498 79994 118379 250580 120848 82473 41456 12487 197001
9440 197001 224774 132905 123295 88325 15477 36452 154124 269643 256777 176215 54293
9429 54293 -3846 -178083 -136100 88746 140196 127316 11241 -130696 -43645 141244 77819
9418 77819 -62678 -62907 109654 58475 -90689 -98200 44386 167940 149925 19518 -162422
9407 -162422 -68227 126008 218482 429842 458738 338819 198852 37611 -246160 -413805
9397 -413805 -437148 -529324 -513174 -413240 -398223 -162953 -80341 -206604 -392300 -340272 -166221
$$ packed form
9473e0687N3803M5736n5474j1257J17233J8024j22851J59272J18101Q0486j4944
9462C37442k05860q2097O0569J6876o9688j40183R560O8795N4848Q2688p4098
9451E8852j27756M4326Q1076K3496L8385J32201j29732l8375m1017k8969J84514
9440A97001K7773r1869r610l4970p2848K0975J17672J15519j2866q0562j21922
9429E4293n8139j74237M1983K24846N1450j2880j16075j41937Q7051J84889o3425
9418G7819j40497k29J72561n1179j49164p511J42586J23554j8015j30407j81940
9407a62422R4195J94235R2474K11360K8896j19919j39967j61241k83771j67645
9397d13805k3343r2176J6150R9934J5017K35270Q2612j26263j85696N2028J74051
$$ plain form
9386 -166221 132936 48141 -234716 -187516 -131969 -136433 -165740 -168960 -138566 107196 261832
9375 261832 265195 203393 135770 201226 217651 271075 329087 211893 133923 12848 41605
9364 41605 22256 91765 229023 234637 151773 139991 201147 131626 -67229 -137617 -178476 -424073
9352 -424073 -632040 -474134 -293282 -61175 35430 -26034 115376 274443 325977 265968
9342 265968 130908 174139 211281 192275 -1597 -23637 58142 57704 62529 -49523 50770
9331 50770 200801 273524 296340 319439 275843 232011 138955 -150883 -308159 -367837 -186220
9320 -186220 -151903 -236285 -74629 161242 315969 350182 416170 386051 339282 272297 172158
9309 172158 -19545 -114437 -83200 -28059 36046 -253727 -458347 -477642 -299127 -85140 -72646
$$ packed form
9386a66221K99157q4795k82857M7200N5547m464k9307l220L0394K45762J54636
9375B61832L363o1802o7623O5456J6425N3424N8012j17194p7970j21075K8757
9364D1605j9349O9509J37258N614q2864j1782O1156o9521j98855p0388m0859k45597
9352d24073k07967J57906J80852K32107R6605o1464J41410J59067N1534o0009
9342B65968j35060M3231L7142j9006j93872k2040Q1779m38M825j12052J00293
9331E0770J50031P2723K2816K3099m3596m3832r3056k89838j57276n9678J81617
9320a86220L4317q4382J61656K35871J54727L4213O5988l0119m6769o6985j00139
9309A72158j91703r4892L1237N5141O4105k89773k04620j9295J78515K13987J2494
$$ plain form
9298 -72646 -164543 -121581 85110 199140 103210 16282 300178 516551 368648 17537 -206271
9287 -206271 -353003 -339024 -281058 -196259 -151220 -350967 -453695 -535331 -492078 -367304 -250988
9276 -250988 -227598 -340467 -384534 -275273 -148621 -25588 149742 414107 427583 175754
9266 175754 19571 122505 432270 479174 184188 121914 200174 139785 53820 -115695 -242345
9255 -242345 -275364 -169325 -217704 -428148 -424770 -372802 -339602 -371286 -142182 13674 -63323
9244 -63323 -133340 12712 79017 -37167 -51244 -90676 -32912 -90277 -372296 -556042 -672022
9233 -672022 -780269 -815688 -757649 -675911 -511499 -447404 -411648 -183447 -239202 -328227 -149373
9222 -149373 -77309 -337724 -237247 159539 325750 407344 268716 190849 187423 19687 -48721
$$ packed form
9298g2646r1897M2962K06691J14030r5930q6928K83896K16373j47903l51111k23808
9287b06271j46732J3979N7966Q4799M5039j99747j02728q1636M3253J24774J16316
9276b50988K3390j12869m4067J09261J26652J23033J75330K64365J3476k51829
9266A75754j56183J02934L09765M6904k94986o2274P8260o0389q5965j69515j26650
9255b42345l3019J06039m8379k10444L378N1968L3200l1684K29104J55856p6997
9244f3323p0017J46052O6305j16184j4077l9432N7764n7365k82019j83746j15980
9233f72022j08247l5419N8039Q1738J64412O4095L5756K28201n5755q9025J78854
9222a49373P2064k60415J00477L96786J66211Q1594j38628p7867l426j67736o8408
$$ plain form
9211 -48721 52837 83036 -6949 6009 122940 158554 78405 118339 298929 273222 97827
9200 97827 57461 44650 -68438 -38138 6437 -16198 -40006 -28176 38597 21990 -26965 -273163
9188 -273163 -386985 -165095 102654 168027 278955 493046 553863 452201 310870 110318
9178 110318 11634 2407 -142061 -433001 -483023 -423866 -623873 -718327 -514993 -380318 -306587
9167 -306587 -158475 133136 363103 318504 127465 -55415 -137198 -17555 -203355 -413432
9157 -413432 -233323 30753 15078 -15983 75068 223972 75052 -130477 -184045 -77538
9147 -77538 -4019 41234 19131 93337 361009 495846 353936 208884 169820 191517 275726
9136 275726 484281 600954 559699 515196 414642 337181 333470 342662 282433 75413 187903
$$ packed form
9211d8721J01558L0199q9985J2958J16931L5614q0149L9934J80590k5707j75395
9200I7827m0366j2811j13088L0300M4575k2635k3808J1830O6773j6607m8955k46198
9188b73163j13822K21890K67749O5373J10928K14091O0817j01662j41331k00552
9178A10318r8684r227j44468k90940n0022N9157k00007r4454K03334J34675P3731
9167c06587J48112K91611K29967m4599j91039j82880q1783J19643j85800k10077
9157d13432J80109K64076j5675l1061R1051J48904j48920k05529n3568J06507
9147g7538P3519M5253k2103P4206K67672J34837j41910j45052l9064K1697Q4209
9136B75726K08555J16673m1255m4503j00554p7461l711R192o0229k07020J12490
$$ plain form
9125 187903 343121 354913 453341 378428 137774 28226 142088 209798 131396 182292 215043
9114 215043 32028 -3435 245857 477549 424640 286618 450142 550170 473126 385615
9104 385615 122992 62362 13406 -53170 -166711 -119549 30518 176431 202807 202936 172992
9093 172992 30451 -174019 -220167 -233493 -246618 -235810 -198723 -177531 -151647 -96809 -154783
9082 -154783 -284783 -514393 -700029 -607329 -490650 -305861 -122423 -97596 -184945 -315262
9072 -315262 -418751 -444258 -404631 -320937 -427364 -557895 -568790 -451973 -211982 -170655 -513982
9061 -513982 -687616 -528667 -385328 -103867 236078 207918 152202 139605 295072 434178
9051 434178 415757 225295 53340 -123557 -296751 -187479 159893 287278 222019 53177
$$ packed form
9125A87903J55218J1792R8428p4913k40654j09548J13862O7710p8402N0896L2751
9114B15043j83015l5463K49292K31692n2909j38022J63524J00028p7044q7511
9104C85615k62623o0630m8956o6576j13541M7162J50067J45913K6376J29k9944
9093A72992j42541k04470m6148j3326j3125J0808L7087K1192K5884N4838n7974
9082a54783j30000k29610j85636R2700J16679J84789J83438K4827q7349j30317
9072c15262j03489k5507L9627Q3694j06427j30531j0895J16817K39991M1327l43327
9061e13982j73634J58949J43339K81461L39945k8160n5716j2597J55467J39106
9051D34178j8421j90462j71955j76897j73194J09272L47372J27385o5259j68842
$$ plain form
9041 53177 -102133 -9828 181913 471159 295904 203525 205407 374611 609802 541291 240732
9030 240732 2799 12385 77558 162910 171449 73925 -63600 -30674 51913 62605 -82069
9019 -82069 -291241 -367555 -287228 -238392 -155072 -30835 65962 122239 98329 79630 -8409
9008 -8409 -119342 -151770 -335733 -616579 -802717 -955722 -742486 -341889 -194809 -223965
8998 -223965 26694 236087 273285 313225 19358 -214218 -356925 -310691 -14221 73762
8988 73762 92548 -145115 -401684 -333492 -208092 -219294 -158123 30869 126207 277413 347662
8977 347662 395710 246152 -27012 -78895 -285166 -523507 -422025 -323680 -176367 170077
8967 170077 202165 9297 -198801 -153114 35444 -50309 -134371 -187443 -174644 -54579 -26566
$$ packed form
9041E3177j55310R2305J91741K89246j75255r2379J882J69204K35191o8511l00559
9030B40732k37933R586O5173Q5352Q539r7524j37525L2926Q2587J0692j44674
9019h2069k09172p6314Q0327M8836Q3320J24237R6797N6277k3910j8699q8039
9008h409j10933l2428j83963k80846j86138j53005K13236M00597J47080k9156
8998b23965K50659K09393L7198L9940k93867k33576j42707M6234K96470Q7983
8988G3762J8786k37663k56569O8192J25400j1202O1171J88992R5338J51206P0249
8977C47662M8048j49558k73164n1883k06271k38341J01482R8345J47313L46444
8967A70077L2088j92868k08098M5687J88558q5753q4062n3072J2799J20065K8013
$$ plain form
8956 -26566 -225518 -398659 -293637 -117094 -140537 -134905 -98581 -109850 -122753 -62595 -136786
8945 -136786 -270982 -336466 -403964 -455806 -464334 -427647 -311585 -231607 -181298 40976 -105226
8934 -105226 -393762 -322767 -116575 26152 -78948 -306771 -376670 -359037 -389469 -473079 -428582
8923 -428582 -420591 -500578 -430484 -337435 -419832 -403322 -171368 -23895 19370 44703 3038
8912 3038 -105148 -278050 -263033 -299745 -429450 -491387 -511904 -462239 -485204 -334759 -167124
8901 -167124 -125208 -172066 -160661 -67085 -200613 -252513 -45586 125323 239839 230984 241868
8890 241868 266611 159294 72703 108356 247688 313286 287950 301468 403475 458226 322056
8879 322056 333390 491838 520608 659734 631711 438818 444914 349761 117436 76116 76146 -27343
$$ packed form
8956b6566j98952j73141J05022J76543k3443N632L6324j1269j2903O0158p4191
8945a36786j34196o5484o7498n1842q528L6687J16062P9978N0309K22274j46202
8934a05226k88536P0995K06192J42727j05100k27823o9899J7633l0432q3610M4497
8923d28582P991p9987P0094R3049q2397J6510K31954J47473M3265K5333m1665
8912C038j08186j72902J5017l6712j29705o1937k0517M9665k2965J50445J67635
8901a67124M1916m6858J1405R3576j33528n1900K06927J70909J14516q855J0884
8890B41868K4743j07317q6591L5653J39332O5598k5336J3518J02007N4751j36170
8879C22056J1334J58448K8770J39126k8023j92893O096r5153k32325m1320L0j03489
$$ plain form
8867 -27343 -119708 -144395 -148205 -254715 -338650 -451399 -488583 -419926 -305093 -483967 -851486
8856 -851486 -775535 -539868 -285617 -78745 -161381 -250727 -75173 105733 90912 -26586
8846 -26586 -153224 -289628 -297557 -216311 -103014 -152245 -133357 -18554 -14584 -28005 158018
8835 158018 248287 61294 -164585 -179316 -83863 41485 130453 185864 158495 151360 29435
8824 29435 60002 132158 -79543 -187793 -104661 75841 81900 73052 -182091 -498622 -409821
8813 -409821 -73086 225512 182950 -128196 -298809 -279022 -256026 -220876 -6941 104211
8803 104211 251773 388563 451560 415670 444342 504247 372643 257495 65704 36044 21839
8792 21839 -32138 -87949 -218234 -182876 -38925 115944 31854 -143425 -185429 -134094 -61534
$$ packed form
8867b7343r2365k4687l810j06510q3935j12749l7184O8657J14833j78874l67519
8856h51486P5951K35667K54251K06872q2636q9346J75554J80906j4821j17498
8846b6586j26638j36404p929Q1246J13297m9231J8888J14803L970j3421J86023
8835A58018R0269j86993k25879j4731R5453J25348Q8968N5411k7369p135j21925
8824B9435L0567P2156k11701j08250Q3132J80502O059q848k55143l16531Q8801
8813d09821L36735K98598m2562l11146j70613J9787K2996L5150K13935J11152
8803A04211J47562J36790O2997l5890K8672N9905j31604j15148j91791k9660j4205
8792B1839n3977n5811j30285L5358J43951J54869q4090j75279m2004N1335P2560
$$ plain form
8781 -61534 211007 342916 241702 65421 -72425 -98959 -19848 10593 -53589 -140680 -166886
8770 -166886 -60450 33104 91766 -2641 -214605 -196815 -136408 37565 153374 258417 320496
8759 320496 204338 91129 -35266 -48518 13413 -105335 -420342 -494950 -360884 -249015
8749 -249015 -130495 -53200 68563 351887 392498 291690 54449 -71009 -100013 -24493
8739 -24493 131469 221676 271057 161498 -65094 -256712 -137302 -19183 -107268 -161674 -111104
8728 -111104 -1467 -144713 -232307 -126257 -276855 -448468 -383035 -311804 -262939 -197116 -201880
8717 -201880 -180577 -115053 -100214 22042 -51109 -116083 -156499 -120381 18394 231151 383584
8706 383584 518150 567909 384030 261022 124028 72616 52065 -170820 -293498 -313616
$$ packed form
8781f1534K72541J31909j01214j76281j37846k6534P9111L0441o4182q7091k6206
8770a66886J06436R3554N8662r4407k11964J7790O0407J73973J15809J05043O2079
8759C20496j16158j13209j26395j3252O1931j18748l15007p4608J34066J11869
8749b49015J18520P7295J21763K83324M0611j00808k37241j25458k9004P5520
8739b4493J55962R0207M9381j09559k26592j91618J19410J18119q8085n4406N0570
8728a11104J09637j43246q7594J06050j50598j71613O5433P1231M8865O5823m764
8717b01880K1303O5524J4839J22256p3151o4974m0416L6118J38775K12757J52433
8706C83584J34566M9759j83879j23008j36994n1412k0551k22885j22678k0118
$$ plain form
8696 -313616 -50303 284530 404812 411940 344837 206867 307160 527045 682148 651429
8686 651429 580209 514160 391330 384757 509074 691086 689603 611937 487773 365746 46541
8675 46541 -57814 -23506 -105164 -269476 -453068 -601752 -422579 -70923 142892 156849
8665 156849 337393 489642 502574 390311 228375 211698 83271 -88123 -147652 -116624
8655 -116624 -112294 -186270 -273325 -214847 -125641 -144816 14278 269992 313158 142950 7536
8644 7536 108507 96914 -63908 -144308 -105583 -137089 -234512 -251317 -102311 151099 -35309
8633 -35309 -446320 -445128 -362052 -304082 -150545 133998 241807 177716 99936 85989 244783
8622 244783 406653 326792 208231 154066 87024 -17732 -33401 164426 171200 77478 43076
$$ packed form
8696c13616K63313L34833J20282P128o7103j37970J00293K19885J55103l0719
8686F51429p1220o6049j22830o573J24317J82012j483p7666j24164j22027l19205
8675D6541j04355L4308q1658j64312j83592j48684J79173L51656K13815J3957
8665A56849J80544J52249J2932j12263j61936j6677j28427j71394n9529L1028
8655a16624M330p3976q7055N8478Q9206j9175J59094K55714M3166j70208j35414
8644G536J00971j1593j60822q0400L8725l1506r7423j6805J49006K53410j86408
8633c5309m11011J192Q3076N7970J53537K84543J07809o4091p7780j3947J58794
8622B44783J61870p9861j18561n4165o7042j04756j5669J97827O774r3722l4402
$$ plain form
8611 43076 16584 59290 39523 -4565 29346 235681 340213 377696 504179 454843 300190
8600 300190 114194 76863 74828 34894 116562 265661 352367 430844 530952 567742 572356
8589 572356 396656 271826 188623 164551 396845 320789 88545 135849 204242 275845 405164
8578 405164 453623 505014 336139 25209 -114652 -192602 -290190 -369269 -292472 -268023 -256727
8567 -256727 -126729 110160 270359 344971 397264 211698 66694 41989 164387 311046
8557 311046 370164 352894 269044 125782 -153587 -217022 879 58285 -57317 -92336 -46344
8546 -46344 23020 322653 475154 494633 454403 409010 446376 563204 678069 807386 791752
8535 791752 627757 586507 486197 213506 -87640 -216609 -132755 3568 116036 372024
$$ packed form
8611D3076k6492M2706j9767m4088L3911K06335J04532L7483J26483m9336j54653
8600C00190j85996l7331k035l9934Q1668J49099Q6706P8477J00108L6790M614
8589E72356j75700j24830q3203k4072K32294p6056k32244M7304O8393P1603J29319
8578D05164M8459N1391j68875l10930j39861p7950r7588p9079P6797K4449J1296
8567b56727J29998K36889J60199P4612N2293j85566j45004k4705J22398J46659
8557C11046N9118j7270q3850j43262k79369o3435K17901N7406j15602l5019M5992
8546d6344O9364K99633J52501J9479m0230m5393L7366J16828J14865J29317j5634
8535G91752j63995m1250j00310k72691l01146j28969Q3854J36323J12468K55988
$$ plain form
8525 372024 436075 282734 71707 -56268 33430 176749 312291 329046 242262 22799
8515 22799 -63556 49576 124837 109921 -132782 -390394 -270840 -15556 77202 62530 68505
8504 68505 9956 -1511 -23996 4859 12715 21907 -125958 -125176 284230 549694 570160 488347
8492 488347 483508 569029 653253 551036 372277 211723 257712 212648 58031 -38000 14603
8481 14603 210338 355367 362543 420822 365537 347003 529821 420686 394967 386805 389065 502600
8469 502600 425046 222671 74589 103095 151086 120387 168060 193295 103763 43655 139927
8458 139927 185157 173751 222109 68714 -92445 20110 74413 -12851 -161095 -302685 -252522
8447 -252522 -130830 -160952 -65039 30067 -247759 -469366 -472841 -291192 -84211 100678 211134
$$ packed form
8525C72024O4051j53341k11027j27975Q9698J43319J35542J6755q6784k19463
8515B2799q6355J13132P5261j4916k42703k57612J19554K55284R2758j4672N975
8504F8505n8549j1467k2485K8855P856R192j47865P82M09406K65464K0466q1813
8492D88347m839Q5521Q4224j02217j78759j60554M5989m5064j54617r6031N2603
8481A4603J95735J45029P176N8279n5285j8534J82818j09135k5719q162K260J13535
8469E02600p7554k02375j48082K8506M7991l0699M7673K5235q9532o0108R6272
8458A39927M5230j1406M8358j53395j61159J12555N4303q7264j48244j41590N0163
8447b52522J21692l0122R5913R5106k77826k21607l475J81649K06981J84889J10456
$$ plain form
8436 211134 104776 98272 39020 -71273 -24790 135555 182456 45509 -273 142529 310686
8425 310686 290093 488098 648237 463712 338653 474982 546895 484664 556623 410479
8415 410479 237362 247482 138097 134897 428022 605254 659557 534665 421275 460178 387119
8404 387119 239277 328663 307520 63490 -30157 20311 -95092 -367460 -363306 -173464 -64260
8393 -64260 -221657 -142689 -26105 81330 52331 7879 -164737 -309255 -185474 -9753
8383 -9753 2656 -110912 -201793 -178456 -199801 -175158 -86339 9975 94691 -30494 -243447
8372 -243447 -395831 -283716 14148 372406 422135 365251 419936 335472 346461 429088 500399
8361 500399 682397 810818 460679 188748 122293 68193 274280 520302 755206 691651
$$ packed form
8436B11134j06358o504n9252j10293M6483J60345M6901j36947m5782J42802J68157
8425C10686k0593J98005J60139j84525j25059J36329P1913o2231P1959j46144
8415D10479j73117J0120j09385l200K93125J77232N4303j24892j13390L8903p3059
8404C87119j47842Q9386k1143k44030r3647N0468j15403k72368M154J89842J09204
8393f4260j57397P8968J16584J07435k8999m4452j72616j44518J23781J75721
8383i753J2409j13568r0881K3337k1345K4643Q8819R6314Q4716j25185k12953
8372b43447j52384J12115K97864L58258M9729n6884N4685q4464J0989Q2627P1311
8361E00399J81998J28421l50139k71931o6455n4100K06087K46022K34904o3555
$$ plain form
8351 691651 533779 626514 636453 536570 429636 390820 415809 509598 507759 335570 275311
8340 275311 310935 332362 392660 448560 267597 -2413 -105101 109899 436345 576402
8330 576402 559060 453433 532186 778196 945682 789254 502500 316236 386473 549884
8320 549884 492648 435768 378319 334458 480849 668501 671608 755803 851322 1006766 986804
8309 986804 801905 747259 854011 764008 576795 536036 645814 785942 885095 909856 830231
8298 830231 609993 434626 223196 -36899 -56510 170044 506300 589775 499880 549937
8288 549937 681903 851521 732300 408083 249498 418390 679538 641084 449659 450214
8278 450214 860259 1050341 999241 960072 1032073 1057571 920460 880782 870502 882601 738326
$$ packed form
8351F91651j57872R2735R939r9883j06934l8816K4989R3789j839j72189o0259
8340B75311L5624K1427O0298N5900j80963k70010j02688K15000L26446J40057
8330E76402j7342j05627P8753K46010J67486j56428k86754j86264P0237J63411
8320E49884n7236n6880n7449m3861J46391J87652L107Q4195R5519J55444j9962
8309I86804j84899n4646J06752r0003j87213m0759J09778J40128R9153K4761p9625
8298H30231k20238j75367k11430k60095j9611K26554L36256Q3475q9895N0057
8288E49937J31966J69618j19221l24217j58585J68892K61148l8454j91425N55
8278D50214M10045J90082n1100l9169P2001K5498j37111l9678j0280J2099j44275
$$ plain form
8267 738326 723894 808853 886488 906998 938627 1052483 1177250 1163919 1144797 1287290 1273713
8256 1273713 933319 557286 448870 445869 616633 678563 751076 1090886 1437487 1461710
8246 1461710 1174668 977625 920937 987672 1065332 884723 738368 687168 829569 1055493
8236 1055493 999808 1020282 1088648 1020290 997271 943167 833248 692003 800877 1200853 1353273
8225 1353273 1239190 1052744 947870 795987 564380 442077 524735 597157 517754 720408
8215 720408 928577 831031 699406 504886 349625 310090 293684 326117 285161 296822 294514
8204 294514 411364 497166 412406 527913 663979 894952 1145960 1171147 1160538 1205014 1036306
8193 1036306 956874 1006755 883756 726218 616538 673548 816936 819614 1017359 1161440
$$ packed form
8267G38326j4432Q4959P7635K0510L1629J13856J24767j3331j9122J42493j3577
8256A273713l40394l76033j08416l001J70764O1930P2513L39810L46601K4223
8246A461710k87042j97043n6688O6735P7660j80609j46355n1200J42401K25924
8236A055493n5685K0474O8366o8358k3019n4104j09919j41245J08874L99976J52420
8225A353273j14083j86446j04874j51883k31607j22303Q2658P2422p9403K02654
8215G20408K08169r7546j31625j94520j55261l9535j6406L2433m0956J1661k308
8204B94514J16850Q5802q4760J15507J36066K30973K51008K5187j0609M4476j68708
8193A036306p9432M9881j22999j57538j09680N7010J43388K678J97745J44081
$$ plain form
8183 1161440 895132 718015 752526 774018 886984 1106185 1089009 830225 707655 676322
8173 676322 673127 924549 873464 720649 717725 860005 1066239 978229 759771 678683 707787
8162 707787 920525 1067117 905292 783205 858738 976856 1103722 1169128 1087940 890444
8152 890444 834603 842295 984233 991076 760292 738894 648112 561828 693267 913141 912366 912259
8140 912259 1176601 1234473 982907 841700 776233 524885 277503 222763 415936 639430
8130 639430 713881 656537 629136 627955 764144 776273 697616 579180 465882 521627 708828
8119 708828 800325 894281 819096 814989 982375 982924 1154186 1220045 1121492 1081182 1142063 1206079
8107 1206079 1024912 820034 773134 851836 929908 909024 723970 596160 854766 1086128
$$ packed form
8183A161440k66308j77117L4511K1492J12966K19201j7176k58784j22570l1333
8173F76322l195K51422n1085j52815k924J42280K06234q8010k18458q1088K9104
8162G07787K12738J46592j61825j22087P5533J18118J26866O5406q1188j97496
8152H90444n5841P692J41938O843k30784k1398r0782q6284J31439K19874p75j07
8140I12259K64342N7872k51566j41207o5467k51348k47382n4740J93173K23494
8130F39430P4451n7344k7401j181J36189J2129p8657j18436j13298N5745J87201
8119G08828R1497R3956p5185m107J67386N49J71262O5859r8553m0310O0881O4016
8107A206079j81167k04878m6900P8702P8072k0884j85054j27810K58606K31362
$$ plain form
8097 1086128 1151120 1096421 1256463 1310871 1193078 998983 884082 986203 1132474 1129170
8087 1129170 1135165 1012002 923015 944321 947041 1025018 1139910 1267272 1370709 1404824 1307508
8076 1307508 1147518 991738 943123 1072035 1120239 1137246 1252706 1321305 1500982 1748563
8066 1748563 1702148 1566975 1539842 1474410 1366792 1284602 1169468 1145833 1317179 1532348
8056 1532348 1783175 1967417 2086492 2045123 1938683 1866772 1737446 1737361 1827930 1917143 1949538
8045 1949538 1956227 2067016 2016517 1745783 1646870 1632901 1660408 1901192 2175284 2279647 2291352
8034 2291352 2104368 1933180 1937862 1985714 2075837 2202804 2527450 2807946 2903758 2918288 2842751
8023 2842751 2745627 2623187 2543824 2581041 2624648 2791902 2981867 3070229 3233600 3390403
$$ packed form
8097A086128O4992n4699J60042N4408j17793j94095j14901J02121J46271l304
8087A129170N995j23163q8987K1306K720P7977J14892J27362J03437L4115r7316
8076A307508j59990j55780m8615J28912M8204J7007J15460O8599J79677K47581
8066A748563m6415j35173k7133o5432j07618q2190j15134k3635J71346K15169
8056A532348K50827J84242J19075m1369j06440p1911j29326q5R0569Q9213L2395
8045A949538O689J10789n0499k70734r8913j3969K7507K40784K74092J04363J1705
8034B291352j86984j71188M682M7852R0123J26967L24646K80496R5812J4530p5537
8023B842751r7124j22440p9363L7217M3607J67254J89965Q8362J63371J56803
$$ plain form
8013 3390403 3461155 3587874 3790661 3974652 4373034 5219104 6189969 6994993 7745280 8876139
8003 8876139 10602351 12665684 15218674 18487240 22543737 27471797 32552313 36985351
7995 36985351 40281680 41818555 41437477 39194449 35487634 31103772 26688276 22812514
7987 22812514 19717416 17241575 15108330 13406141 12192789 11471753 10953142 10352358 9654467
7978 9654467 9322018 9472951 9794258 10159721 10397650 10517097 10282720 9813257 9472200 9221652
7968 9221652 8869131 8319986 7939083 7623585 7360359 7105614 7058370 7050934 7161530 7329086
7958 7329086 7377524 7615085 8073213 8719376 9815748 10977366 11974645 13058164 14789391
7949 14789391 17117896 19770936 23283026 27979039 34221362 42446069 52958563 65720684
$$ packed form
8013C390403P0752J26719K02787J83991L98382Q46070R70865Q05024P50287J130859
8003H876139J726212K063333K552990L268566M056497M928060N080516M433038
7995C6985351L296329J536875l81078k243028l706815m383862m415496l875762
7987B2812514l095098k475841k133245j702189j213352p21036n18611o00784o97891
7978I654467l32449J50933L21307L65463K37929J19447k34377m69463l41057k50548
7968I221652l52521n49145l80903l15498k63226k54745m7244p436J10596J67556
7958G329086M8438K37561M58128O46163J096372J161618R97279J083519J731227
7949A4789391K328505K653040L512090M696013O242323Q224707J0512494J2762121
$$ plain form
7941 65720684 80453668 95851207 109792048 120078743 124810549 122975937 114977464 102697814
7933 102697814 88834971 75198456 62911918 52671715 44650079 38285511 33492707
7926 33492707 29759031 26891094 24670454 22934081 21759187 21043423 20950078 21349998 21838107
7917 21838107 22013039 21824748 21339552 20488614 19448011 18383355 17165100 15945503 14802223
7908 14802223 13934253 13615694 13512222 13503137 13519509 13556776 13635030 13836183 14463614 15383806
7898 15383806 16442196 17843578 19814427 21980963 24366183 27550613 31979105 37729770
7890 37729770 45081372 54670618 67156963 83561906 104524226 130029648 159301660
7883 159301660 189986605 217969366 238303638 247117408 242742228 226670090 202464268
$$ packed form
7941F5720684J4732984J5397539J3940841J0286695M731806j834612p998473j2279650
7933A02697814j3862843j3636515j2286538j0240203q021636o364568m792804
7926C3492707l733676k867937k220640j736373j174894p15764r3345L99920M88109
7917B1838107J74932j88291m85196q50938j040603j064656j218255j219597j143280
7908A4802223q67970l18559j03472r085J6372L7267P8254K01153O27431R20192
7898A5383806J058390J401382J970849K166536K385220L184430M428492N750665
7890C7729770P351602R589246J2486345J6404943K0962320K5505422K9272012
7883A59301660L0684945K7982761K0334272Q813770m375180j6072138k4205822
$$ plain form
7876 202464268 174339358 146403052 121716979 101284983 84753757 71769540 61833724
7869 61833724 54085434 47925013 42891156 38990416 36123163 34163260 33228334 32922938
7861 32922938 32846677 32960020 32915920 32308138 31074534 29326770 27222872 24856728 22644170
7852 22644170 20834185 19511915 18623916 17888031 17573483 17589212 17733413 17877199 18161010
7843 18161010 18796105 19563769 20534492 21867966 23674274 25986558 28979366 32730973 37609042
7834 37609042 44179724 52978768 64531022 79320849 98493466 122840068 152763247
7827 152763247 187086978 222941805 255426768 278847433 288891618 283494362 264060267
7820 264060267 234790808 201208193 168128319 138730412 114321087 95135817 80255882
$$ packed form
7876B02464268k8124910k7936306k4686073k0431996j6531226j2984217r935816
7869F1833724p748290o160421n033857l900740k867253j959903r34926l05396
7861C2922938p6261J13343m4100o07782j233604j747764k103898k366144k212558
7852B2644170j809985j322270q87999p35885l14548J5729J44201J43786K83811
7843A8161010O35095P67664R70723J333474J806308K312284K992808L751607M878069
7834C7609042O570682Q799044J1552254J4789827J9172617K4346602K9923179
7827A52763247L4323731L5854827L2484963K3420665J0044185n397256j9434095
7820B64060267k9269459l3582615l3079874k9397907k4409325j9185270j4879935
$$ plain form
7813 80255882 68538652 59493519 52434966 46585274 41845500 38205128 35423071 33418607
7805 33418607 32161996 31383630 30651011 29709910 28683244 27382699 25695630 23795944 22056528
7796 22056528 20499216 19054092 17807811 16801477 16191687 15873812 15753152 15979222 16164354
7787 16164354 16469112 17040778 17745898 18837526 20183003 21657049 23563713 26197496 29566464
7778 29566464 33921486 39690846 47158746 56847997 69572389 86271551 107352686 132619399
7770 132619399 161435362 191177111 218020860 237757542 245990392 240892586 223837566
7763 223837566 198642337 169841831 141556167 116604597 95922809 79443664 66554562
7756 66554562 56491209 48647872 42393769 37366212 33169645 29806237 27228451 25169559
$$ packed form
7813H0255882j1717230r045133p058553n849692m739774l640372k782057k004464
7805C3418607j256611p78366p32619r41101j026666j300545j687069j899686j739416
7796B2056528j557312j445124j246281j006334o09790l17875j20660K26070J85132
7787A6164354L04758N71666P05120J091628J345477J474046J906664K633783L368968
7778B9566464M355022N769360P467900R689251J2724392J6699162K1081135K5266713
7770A32619399K8815963K9741749K6843749J9736682Q232850n097806j7055020
7763B23837566k5195229k8800506k8285664k4951570k0681788j6479145j2889102
7756F6554562j0063353p843337o254103n027557m196567l363408k577786k058892
$$ plain form
7748 25169559 23601334 22550254 21780798 20715334 19403657 18178246 17183563 16209050 15156907
7739 15156907 14141051 13249578 12258437 11334880 10699712 10411097 10278130 10186948 10271311 10455999
7729 10455999 10657777 11055239 11590342 12060881 12619598 13438349 14740238 16332461 18414945
7720 18414945 21222041 24892460 29809792 36147038 44338004 54927334 67699123 81968584
7712 81968584 96644790 109877739 119374799 123151452 120375249 111672751 98916551 84479036
7704 84479036 70281109 57858070 47889073 39885955 33443789 28347674 24344474 21183497
7696 21183497 18542348 16228235 14239004 12526555 11097233 10047934 9333364 8646314
7688 8646314 7968493 7442374 7056809 6546526 6134859 5991129 5754275 5672103 5611183 5334235
$$ packed form
7748B5169559j568225j051080p69456j065464j311677j225411r94683r74513j052143
7739A5156907j015856q91473r91141r23557o35168k88615j32967r1182Q4363J84688
7729A0455999K01778L97462N35103M70539N58717Q18751J301889J592223K082484
7720A8414945K807096L670419M917332O337246Q190966J0589330J2771789J4269461
7712H1968584J4676206J3232949R497060L776653k776203q702498j2756200j4437515
7704H4479036j4197927j2423039r968997q003118o442166n096115m003200l160977
7696B1183497k641149k314113j989231j712449j429322j049299p14570o87050
7688H646314o77821n26119l85565n10283m11667j43730k36854q2172o0920k76948
$$ plain form
7678 5334235 4889046 4654339 4386403 4127891 4190649 4374311 4423108 4551085 4665048 4532953
7668 4532953 4650791 5064034 5672035 6440300 7222296 8226385 9291139 10604331 12499360
7659 12499360 15110660 18628743 22723190 27265537 32014590 36000219 38799659 40090503
7651 40090503 39318759 36359919 32154564 27489437 22931585 18968044 15598851 13087392
7643 13087392 11109327 9426002 8067704 6995726 6092541 5232088 4613693 4320958 4145873
7634 4145873 3741307 3217797 2941628 2725454 2309495 1943797 1967762 2011088 2017330 1989522
7624 1989522 1910927 1791202 1574064 1376637 1269305 1040247 1021927 1069533 998420 1021000
7614 1021000 942217 980234 1160486 1141614 928715 872445 848356 622023 435519 494279 630755
$$ packed form
7678E334235m45189k34707k67936k58512O2758J83662M8797J27977J13963j32095
7668D532953J17838M13243O08001P68265P81996J004089J064754J313192J895029
7659A2499360K611300L518083M094447M542347M749053L985629K799440J290844
7651D0090503p71744k958840m205355m665127m557852l963541l369193k511459
7643A3087392j978065j683325j358298j071978r03185q60453o18395k92735j75085
7634D145873m04566n23510k76169k16174m15959l65698K3965M3326O242k7808
7624A989522p8595j19725k17138j97427j07332k29058j8320M7606p1113K2580
7614A021000p8783L8017J80252j8872k12899n6270k4089k26333j86504N8760J36476
$$ plain form
7603 630755 639360 581137 670649 883478 996702 1220449 1330223 1329948 1280624 1077273 826122
7592 826122 871701 977111 1007288 794611 536249 381579 233747 2818 15932 257770
7582 257770 408315 540212 809279 948033 822065 559207 295298 331422 346941 114253
7572 114253 60882 99526 282632 464240 579003 522911 549460 682212 788878 903070
7562 903070 890420 838427 667394 592137 650766 645949 639884 620107 474135 496996 840440
7551 840440 1196297 1255160 1162257 1073159 796793 493425 420067 243420 117840 183161 324391
7540 324391 299683 382764 503542 533669 483662 555821 602846 642255 618337 576001 522888
7529 522888 144673 -96040 -56668 -2984 46330 -35953 -80038 139559 439862 537688 474937
$$ packed form
7603F30755Q605n8223Q9512K12829J13224K23747J09774k75m9324k03351k51151
7592H26122M5579J05410L0177k12677k58362j54670j47832k30929J3114K41838
7582B57770J50545J31897K69067J38754j25968k62858k63909L6124J5519k32688
7572A14253n3371L8644J83106J81608J14763n6092K6549J32752J06666J14192
7562I03070j2650n1993j71033p5257N8629m817o065j9777j45972K2861L43444
7551H40440L55857N8863r2903q9098k76366l03368p3358j76647j25580O5321J41230
7540C24391k4708Q3081J20778L0127n0007P2159M7025L9409k3918m2336n3113
7529E22888l78215k40713L9372N3684M9314q2283m4085K19597L00303R7826o2751
$$ plain form
7518 474937 386074 327293 456043 405635 277382 165651 26760 98147 407409 513044
7508 513044 426795 183302 26213 96532 101368 182146 199510 106786 157119 289173 333887
7497 333887 298188 409363 373879 134888 74433 171147 266776 382539 433111 550540 802670
7486 802670 1111994 1045198 777636 718164 807086 974281 724602 322773 201962 278021
7476 278021 351523 420879 600668 667997 416069 153934 52528 -12926 -74021 31670 167173
7465 167173 244932 286001 116480 -35433 21277 89349 23589 14383 39451 -91368 -23906
7454 -23906 106136 336223 535532 451289 126656 -286211 -512225 -474106 -344693 -211185
7444 -211185 -346337 -399427 -151081 119187 168334 222904 179949 164735 175900 45558 81724
$$ packed form
7518D74937q8863n8781J28750n0408j28253j11731j38891P1387L09262J05635
7508E13044q6249k43493j57089P0319M836Q0778J7364r2724N0333J32054M4714
7497C33887l5699J11175l5484k38991o0455R6714R5629J15763N0572J17429K52130
7486H02670L09324o6796k67562n9472Q8922J67195k49679m01829j20811P6059
7476B78021P3502O9356J79789O7329k51928k62135j01406o5454o1095J05691J35503
7465A67173P7759M1069j69521j51913N6710O8072o5760r206K5068j30819O7462
7454b3906J30042K30087J99309q4243l24633m12867k26014L8119J29413J33508
7444b11185j35152n3090K48346K70268M9147N4570m2955j5214J1165j30342L6166
$$ plain form
7433 81724 257793 286946 274837 314828 166716 -1453 25279 68295 92098 235592 145221
7422 145221 165827 360768 290795 163962 28379 -231177 -191673 -64137 6235 -26336 -144162
7411 -144162 -104783 -108773 -80295 13904 -108983 -142059 -33398 -57983 -244912 -476856 -506503
7400 -506503 -295593 34695 302814 477799 488211 310252 326869 535123 669636 603643
7390 603643 378907 115078 -39425 91794 136095 303135 588550 778675 758395 582507
7380 582507 420890 219834 168710 153867 -47918 -135685 226866 547060 476447 285908
7370 285908 257862 228497 184860 174917 198205 356040 386897 279620 144256 249651 317346
7359 317346 289307 278265 175527 -7133 -209681 -317372 -318943 -217104 -93657 17638
$$ packed form
7433H1724J76069K9153j2109L9991j48112j68169K6732M3016K3803J43494r0371
7422A45221K0606J94941o9973j26833j35583k59556L9504J27536P0372l2571j17826
7411a44162L9379l990K8478R4199j22887l3076J08661k4585j86929k31944k9647
7400e06503K10910L30288K68119J74985J0412j77959J6617K08254J34513o5993
7390F03643k24736k63829j54503J31219M4301J67040K85415J90125k0280j75888
7380E82507j61617k01056n1124j4843k01785q7767L62551L20194p0613j90539
7370B85908k8046k9365m3637r943K3288J57835L0857j07277j35364J05395O7695
7359C17346k8039j1042j02738j82660k02548j07691j571J01839J23447J11295
$$ plain form
7349 17638 84244 117267 214710 239681 297522 302692 210283 198138 316754 283636 136123 152851
7337 152851 254795 348166 307477 358966 208727 -235274 -344785 -331302 -569452 -692949
7327 -692949 -407779 151811 622938 717729 657655 601229 540559 577608 368458 142151 221091
7316 221091 143191 -31197 23531 165532 168249 149915 149926 252702 366004 405994 261991
7305 261991 -57424 -338600 -436950 -394705 -275349 -21290 139386 236978 425891 457433
7295 457433 267481 66654 -53724 51245 244790 408331 483675 401205 292590 163064
7285 163064 19529 -58261 -139215 -87427 -105697 -246868 -299997 -430361 -450548 -467574 -349379
7274 -349379 -334765 -291657 -76443 -33459 -64661 -169706 -199198 -256839 -163795 347709 687730
$$ packed form
7349A7638O6606L3023R7443K4971N7841N170r2409j2145J18616l3118j47513J6728
7337A52851J01944R3371m0689N1489j50239m44001j09511J3483k38150j23497
7327f92949K85170N59590M71127R4791o0074n6426o0670L7049k09150k26307P8940
7316B21091p7900j74388N4728J42001K717j8334J1J02776J13302L9990j44003
7305B61991l19415k81176r8350M2245J19356K54059J60676R7592J88913L1542
7295D57433j89952k00827j20378J04969J93545J63541P5344q2470j08615j29526
7285A63064j43535p7790q0954N1788j8270j41171n3129j30364k0187j7026J18195
7274c49379J4614M3108K15214M2984l1202j05045k9492n7641R3044N11504L40021
$$ plain form
7263 687730 633581 346730 73021 -177043 -327569 -298902 -202262 18502 143288 161827
7253 161827 119207 156692 111799 165979 154929 87423 -12747 -190580 -183179 -73055 125403
7242 125403 286706 308942 187086 46527 -10990 -20974 102914 238190 219885 33074 -158946
7231 -158946 -187549 -155869 -20653 60350 79566 97630 -51245 -110135 -196291 -379266 -294516
7220 -294516 -54872 99895 103942 35802 11610 107151 328815 549113 569564 593844 544077
7209 544077 315939 121666 3306 -121638 -326900 -303421 -45179 141857 312484 263157
7199 263157 20816 -100459 -403520 -540647 -403916 -99441 248756 261317 67374 66109
7189 66109 169691 357552 440411 367629 80752 -310744 -585636 -708039 -678903 -321989
$$ packed form
7263F87730n4149k86851k73709k50064j50526K8667R6640K20764J24786J8539
7253A61827m2620L7485m4893N4180j1050o7506j00170j77833P401J10124J98458
7242A25403J61303K2236j21856j40559n7517r984J23888J35276j8305j86811j92020
7231a58946k8603L1680J35216Q1003J9216J8064j48875n8890q6156j82975Q4750
7220b94516K39644J54767M047o8140k4192R5541K21664K20298K0451K4280m9767
7209E44077k28138j94273j18360j24944k05262K3479K58242J87036J70627m9327
7199B63157k42341j21275l03061j37127J36731L04475L48197J2561j93943j265
7189F6109J03582J87861Q2859p2782k86877l91496k74892j22403K9136L56914
$$ plain form
7179 -321989 104843 420783 389914 222326 87957 118656 159735 70927 197002 289751 247770
7168 247770 142969 12767 -104220 -56443 -46418 -100168 -162529 -289053 -96476 173868
7158 173868 19451 -196448 -335352 -510664 -494335 -313235 -203128 -156750 -92224 -155553
7148 -155553 -173656 -194634 -254569 -86459 -48311 -97374 27128 113415 135358 224584 239036
7137 239036 332120 265559 -108687 -319246 -348067 -332648 -111893 -62291 -198526 -237507 -74072
7126 -74072 -106568 -403477 -410442 -204064 -19388 -49368 -32464 55310 41823 -76173 -114320
7115 -114320 -158179 -63695 198935 352969 563414 578637 654348 596539 289032 167724 170807
7104 170807 120825 70440 -131776 -375064 -254193 -49324 -1297 -82345 -226233 -214983 -225937
$$ packed form
7179c21989M26832L15940l0869j67588j34369L0699M1079q8808J26075R2749m1981
7168B47770j04801j30202j16987M7777J0025n3750o2361j26524J92577K70344
7158A73868j54417k15899j38904j75312J6329J81100J10107M6378O4526o3329
7148a55553j8103k0978n9935J68110L8148m9063J24502Q6287K1943Q9226J4452
7137B39036R3084o6561l74246k10559k8821J5419K20755M9602j36235l8981J63435
7126g4072l2496k96909o965K06378J84676k9980J6904Q7774j3487j17996l8147
7115a14320m3859R4484K62630J54034K10445J5223P5711n7809l07507j21308L083
7104A70807m9982n0385k02216k43288J20871K04869M8027q1048j43888J1250j0954
$$ plain form
7093 -225937 -313488 -161681 -61561 -200196 -181191 54932 256790 373269 256510 190926
7083 190926 253075 358662 320703 288875 323686 115959 -14880 72417 216980 211935 23647
7072 23647 -66404 -29917 122497 242454 -49623 -179729 -32463 -89334 -104208 -41645 -200449
7061 -200449 -200568 -72626 -136331 -313439 -316702 -99683 -91936 -94769 -20244 42314 -101949 -28937
7049 -28937 322567 460294 525284 685748 547550 275520 53014 -81353 14844 248854
7039 248854 389126 387203 383095 290086 254129 112955 72012 129875 -20866 -260282 -168164
7028 -168164 -19936 134425 180641 281543 488362 533151 452830 319940 176231 149137
7018 149137 92734 75590 62936 137739 271399 387996 409173 233975 290459 505586 584283
$$ packed form
7093b25937q7551J51807J00120j38635J9005K36123K01858J16479j16759o5584
7083A90926O2149J05587l7959l1828L4811k07727j30839Q7297J44563n045j88288
7072B3647r0051L6487J52414J19957k92077j30106J47266n6871j4874O2563j58804
7061b00449j19J27942o3705j77108l263K17019P747k833P4525O2558j44263P3012
7049b8937L51504J37727O4990J60464j38198k72030k22506j34367R6197K34010
7039B48854J40272j923m108r3009l5957j41174m0943N7863j50741k39416R2118
7028a68164J48228J54361M6216J00902K06819M4789q0321j32890j43709k7094
7018A49137n6403j7144j2654P4803J33660J16597K1177j75198N6484K15127P8697
$$ plain form
7007 584283 434701 236822 -9766 -129762 -52929 149784 226355 155273 89434 58493 -42213
6996 -42213 7009 184217 248381 209772 240827 178978 -64769 -126427 -59584 -33839 -154179
6985 -154179 -278878 -180114 -204817 -331954 -341819 -85923 341394 583357 476416 341245
6975 341245 358710 403780 414428 439919 586203 632319 494425 531152 585050 522823 404757
6964 404757 111592 -138916 -374139 -574030 -692867 -829371 -890316 -743568 -480829 23349
6954 23349 307633 404059 309475 33197 -115909 -84084 -57176 -96798 97750 256398 396883
6943 396883 399310 226502 79426 117168 289524 225726 -133865 -319159 -249491 -271078 -85656
6932 -85656 53215 119399 126538 59951 -44237 2317 -7776 -175894 -239909 -361860 -331871
$$ packed form
7007E84283j49582j97879k46588j19996P6833K02713P6571p1082o5839l0941j00706
6996d2213M9222J77208O4164l8609L1055o1849k43747o1658O6843K5745j20340
6985a54179j24699R8764k4703j27137r865K55896M27317K41963j06941j35171
6975C41245J7465M5070J0648K5491J46284M6116j37894L6727N3898o2227j18066
6964D04757k93165k50508k35223j99891j18837j36504o0945J46748K62739N04178
6954B3349K84284R6426r4584k76278j49106L1825K6908l9622J94548J58648J40485
6943C96883K427j72808j47076L7742J72356o3798l59591j85294O9668k1587J85422
6932h5656J38871O6184P139o6587j04188M6554j0093j68118o4015j21951K9989
$$ plain form
6921 -331871 -95182 87599 -26305 -159107 -177882 -344870 -381084 -389179 -361760 -310416 -315148
6910 -315148 -306346 -217181 -68530 -4340 -48042 -309290 -399142 -324008 -140118 -22700 92009
6899 92009 182844 204707 229926 272716 303043 474142 650110 744946 841686 1004420 972152
6888 972152 879129 855027 859488 768825 662518 576023 270481 -119026 -527545 -809674 -661068
6877 -661068 -421407 -208384 -66747 -71262 24096 44419 30894 -126105 -145630 -117158 -186962
6866 -186962 -273875 -223080 -146567 -292979 -423400 -364652 -216062 -56975 -134086 -176946 -111697
6855 -111697 -20640 64519 16489 -47826 -49977 178025 467289 428136 351170 337328 239778
6844 239778 116079 136356 71265 35281 96242 177009 254531 295104 93595 -293147 -454050
$$ packed form
6921c31871K36689J82781j13904j32802j8775j66988l6214q095K7419N1344m732
6910c15148Q802Q9165J48651O4190m3702k61248q9852P5134J83890J17418J14709
6899I2009R0835K1863K5219M2790L0327J71099J75968R4836R6740J62734l2268
6888I72152r3023k4102M461r0663j06307q6495l05542l89507m08519k82129J48606
6877f61068K39661K13023J41637m515R5358K0323j3525j56999j9525K8472o9804
6866a86962q6913N0795P6513j46412j30421N8748J48590J59087p7111m2860O5249
6855a11697R1057Q5159m8030o4315k151K28002K89264l9153p6966j3842r7550
6844B39778j23699K0277o5091l5984O0961Q0767P7522M0573k01509l86742j60903
$$ plain form
6833 -454050 -432252 -475008 -650213 -558898 -315757 -318724 -364074 -273601 -137167 -3916 69782
6822 69782 65026 -82674 -120200 -7390 -44141 -74175 44690 153641 300755 463685 587190
6811 587190 823261 928651 684032 377474 177189 263209 512013 636178 666510 703197
6801 703197 765390 694538 499956 387758 570297 688847 793626 839123 611682 259008
6791 259008 137792 164542 266097 307794 218126 132933 213188 496264 417745 133268 -145270
6780 -145270 -259457 -188273 65889 290343 298954 324139 456869 537240 581642 616292 406929
6769 406929 187153 97662 -125372 -260985 -362904 -418051 -398457 -277961 -286931 -313355 -309243
6758 -309243 -93121 150630 211242 33070 -61458 -63200 11044 -82068 -304246 -445911 -373432
$$ packed form
6833d54050K1798m2756j75205R1315K43141k967m5350R0473J36434J33251P3698
6822F9782m756j47700l7526J12810l6751l0034J18865J08951J47114J62930J23505
6811E87190K36071J05390k44619l06558k00285Q6020K48804J24165L0332L6687
6801G03197O2193p0852j94582j12198J82539J18550J04779M5497k27441l52674
6791B59008j21216K6750J01555M1697q9668q5193Q0255K83076p8519k84477k78538
6780a45270j14187P1184K54162K24454Q611K5185J32730Q0371M4402L4650k09363
6769D06929k19776q9491k23034j35613j01919n5147J9594J20496q970k6424M112
6758c09243K16122K43751O0612j78172r4528j742P4244r3112k22178j41665P2479
$$ plain form
6747 -373432 -133496 26345 165541 78526 -145597 -158875 -80964 -47846 73869 -25882 -223306
6736 -223306 -116377 29464 156390 255356 168140 34983 -778 31527 56561 84084 22826
6725 22826 -193213 -249537 43412 359824 585126 512913 212589 -43470 -205249 -154943
6715 -154943 -210970 -287459 -381676 -404289 -95085 54735 18313 -138158 -198916 -115101 -11710
6704 -11710 -55468 -72572 -16491 173976 215613 135105 125050 62062 -29730 130202 81153
6693 81153 -52547 80987 331231 468743 417869 451672 491013 466482 353099 213999 100768
6682 100768 189628 272314 155607 220354 249191 418132 387689 191911 79458 -72164 -160145
6671 -160145 -74700 144522 301633 416796 477421 355798 268644 1892 -413160 -626717
$$ packed form
6747c73432K39936J59841J39196q7015k24123j3278P7911L3118J21715r9751j97424
6736b23306J06929J45841J26926R8966q7216j33157l5761L2305K5034K7523o1258
6725B2826k16039n6324K92949L16412K25302p2213l00324k56059j61779N0306
6715a54943n6027p6489r4217k2613L09204J49820l6422j56471o0758Q3815J03391
6704a1710m3758j7104N6081J90467M1637q0508j0055o2988r1792J59932m9049
6693H1153j33700J33534K50244J37512n0874L3803L9341k4531j13383j39100j13231
6682A00768Q8860Q2686j16707O4747K8837J68941l0443j95778j12453j51622q7981
6671a60145Q5445K19222J57111J15163O0625j21623q7154k66752m15052k13557
$$ plain form
6661 -626717 -480173 -344338 -148390 -81128 -92040 40342 127253 158436 182937 228926 354472
6650 354472 602534 786598 680645 324864 93183 -10724 -105070 -80606 40905 172501
6640 172501 177493 61195 139202 322907 346292 122636 28738 73330 116027 222058 340385
6629 340385 343816 436910 400145 199426 52766 -232118 -434401 -190058 65499 89378 -149846
6618 -149846 -371547 -287751 -41226 -81235 -137929 -178907 -435268 -660757 -581145 -215625 195938
6607 195938 339039 328777 208523 58428 123704 298726 50132 -171835 -191391 -177583
6597 -177583 3981 -82430 -237647 -380429 -429243 -294015 -229007 -233246 -161846 63205 47600
6586 47600 -71241 76260 360822 374590 260589 222193 139920 -4950 -239447 -290079 -19881
$$ packed form
6661f26717J46544J35835J95948O7262j0912J32382Q6911L1183K4501M5989J25546
6650C54472K48062J84064j05953l55781k31681j03907r4346K4464J21511J31596
6640A72501M992j16298P8007J83705K3385k23656r3898M4592M2697J06031J18327
6629C40385L431R3094l6765k00719j46660k84884k02283K44343K55557K3879k39224
6618a49846k21701Q3796K46525m0009n6694m0978k56361k25489P9612L65520M11563
6607A95938J43101j0262j20254j50095O5276J75022k48594k21967j9556J3808
6597a77583J81564q6411j55217j42782m8814J35228O5008m239P1400K25051j5605
6586D7600j18841J47501K84562J3768j14001l8396q2273j44870k34497n0632K70198
$$ plain form
6575 -19881 159665 20031 -152274 -129269 -21816 -21274 -76506 -168084 -212545 -137765 -124242
6564 -124242 -105994 -210084 -316470 -400199 -315208 -132455 -109157 -196000 -128678 -70746 -160290
6553 -160290 -321531 -370486 -295608 -298242 -322353 -359370 -246461 -3423 66467 40717 42142
6542 42142 3996 16015 19627 7905 -231280 -429583 -422062 -385084 -377656 -504147 -547878 -477688
6530 -477688 -325591 -170613 -113847 -120463 -2370 92563 -88376 -188780 -29762 85471
6520 85471 315766 516038 459426 370009 316479 151125 -80485 -219011 -263882 -161938 -59232
6509 -59232 106622 54300 18694 61357 -81432 -113635 -151750 -151740 -79315 -44793 8560 40130
6497 40130 5455 116899 229505 248728 271410 238074 188885 169399 -19054 -166977 -103951
$$ packed form
6575a9881J79546j39634j72305K3005J07453N42n5232r1578m4461P4780J3523
6564a24242J8248j04090j06386q3729Q4991J82753K3298q6843O7322N7932q9544
6553a60290j61241m8955P4878k634k4111l7017J12909K43038O9890k5750J425
6542D2142l8146J2019L612j1722k39185j98303P521L6978P428j26491m3731P0190
6530d77688J52097J54978N6766o616J18093R4933j80939j00404J59018J15233
6520H5471K30295K00272n6612q9417n3530j65354k31610j38526m4871J01944J02706
6509e9232J65854n2322l5606M2663j42789l2203l8115J0P2425L4522N3353L1570
6497D0130l4675J11444J12606J9223K2682l3336m9189j9486j88453j47923O3026
$$ plain form
6486 -103951 -92163 473 156448 145820 9854 -206603 -476122 -597897 -619491 -464210
6476 -464210 -147917 42666 -172385 -354471 -231042 -106190 -45185 -18630 -14113 -59376 -149103
6465 -149103 -289667 -129143 173122 191786 35797 -54089 -131505 -194175 -220518 -221643 -127281
6454 -127281 -246655 -445653 -487102 -445324 -299510 -208655 -91188 -93881 -205737 -336722 -410111
6443 -410111 -384518 -257871 47898 211942 100009 -88422 -28904 207953 435800 652342
6433 652342 814148 742657 670560 579079 449185 113317 -135709 39085 294827 338025
6423 338025 404718 442778 531664 707942 738356 814686 864759 735795 572303 487243 636595
6412 636595 743336 646587 522958 467141 562066 494572 243721 -51975 -290493 -405235
$$ packed form
6486a03951J1788R2636J55975j0628j35966k16457k69519j21775k1594J55281
6476d64210L16293J90583k15051j82086J23429J24852O1005K6555M517m5263q9727
6465a49103j40564J60524L02265J8664j55989q9886p7416o2670k6343j125R4362
6454a27281j19374j98998m1449M1778J45814R0855J17467k693j11856j30985p3389
6443d10111K5593J26647L05769J64044j11933j88431N9518K36857K27847K16542
6433F52342J61806p1491p2097r1481j29894l35868k49026J74794K55742M3198
6423C38025O6693L8060Q8886J76278L0414P6330N0073j28964j63492q5060J49352
6412F36595J06741r6749j23629n5817R4925o7494k50851k95696k38518j14742
$$ plain form
6402 -405235 -319048 -159636 -164612 -286334 -356252 -137058 -47946 -72691 -25024 10060 23697
6391 23697 -36361 857 65791 -19348 -160742 -138539 49214 374399 462261 287387 217595
6380 217595 398244 346930 435508 602390 616729 576483 363217 91841 -46331 -46166 -16788
6369 -16788 7989 -42504 30432 95917 -21432 -72809 48110 -53591 -78202 -6419 93800
6358 93800 192438 207775 167794 55418 -117618 -135721 -48964 -27643 55220 88296 814
6347 814 -58114 -64839 -175428 -122383 78273 255405 459502 505961 424703 268836 138236
6336 138236 55665 121309 339108 430996 235521 -71302 -300189 -364468 -166841 -10826
6326 -10826 -208580 -364923 -218503 -228479 -467736 -587021 -449764 -265446 -307623 -282336 -228409
$$ packed form
6402d05235Q6187J59412m976j21722o9918K19194Q9112k4745M7667L5084J3637
6391B3697o0058L7218O4934q5139j41394K2203J87753L25185Q7862j74874o9792
6380B17595J80649n1314Q8578J66882J4339m0246k13266k71376j38172J65K9378
6369a6788K4777n0493P2936O5485j17349n1377J20919j01701k4611P1783J00219
6358I3800R8638J5337l9981j12376j73036j8103Q6757K1321Q2863L3076q7482
6347H14n8928o725j10589N3045K00656J77132K04097M6459q1258j55867j30600
6336A38236q2571O5644K17799R1888j95475l06823k28887o4279J97627J56015
6326a0826j97754j56343J46420r976k39257j19285J37257J84318m2177K5287N3927
$$ plain form
6315 -228409 -144217 -32052 163046 3915 -189093 -392414 -522987 -477181 -448701 -568160
6305 -568160 -519302 -360410 -230471 -76674 -99465 -186209 -247766 -193084 -18620 216244 341263
6294 341263 204763 114612 195938 200388 154287 91083 30729 101560 188127 254221 384596
6283 384596 332169 298547 160453 67364 42517 226126 476389 492918 305882 203123 235415
6272 235415 296702 314187 149227 -85232 -89657 157530 333945 524860 765619 692643 511011
6261 511011 264073 63738 154869 400936 310044 53962 101846 312740 197944 11182
6251 11182 -124835 -160211 -35736 -61695 -95167 -267360 -269581 -145085 -21763 -6007 -236621
6240 -236621 -283918 -176287 -17077 129333 132940 117128 21237 -187408 -391133 -362818 -135135
$$ packed form
6315b28409Q4192J12165J95098j59131j93008k03321j30573M5806K8480j19459
6305e68160M8858J58892J29939J53797k2791q6744o1557N4682J74464K34864J25019
6294C41263j36500r0151Q1326M450m6101o3204o0354P0831Q6567O6094J30375
6283C84596n2427l3622j38094r3089k4847J83609K50263J6529j87036j02759L2292
6272B35415O1287J7485j64960k34459m425K47187J76415J90915K40759p2976j81632
6261E11011k46938k00335R1131K46067r0892k56082M7884K10894j14796j86762
6251A1182j36017l5376J24475k5959l3472j72193k221J24496J23322J5756k30614
6240b36621m7297J07631J59210J46410L607j5812r5891k08645k03725K8315K27683
$$ plain form
6229 -135135 128957 211739 6116 -222262 -151426 -157486 -272658 -371364 -579326 -621290 -359142
6218 -359142 -150072 -161751 -243101 -322087 -344398 -339789 -339314 -183040 -107171 -157377 -239004 -289318
6206 -289318 -328729 -503424 -646181 -529450 -387584 -298023 -162793 -140266 -142974 -57923 -43020
6195 -43020 -191286 -24650 337613 542526 448054 381915 274126 -29142 -110698 -28912 -115984
6184 -115984 -349872 -461536 -334664 -213043 -165115 -307444 -521533 -613049 -443921 -250767
6174 -250767 -284842 -362187 -323968 -75468 78625 30372 -38097 -39418 -48130 -175853 -169133 -23767
6162 -23767 -174700 -368439 -446626 -497477 -313174 -127563 -83131 -224343 -279736 -222739 -262322
6151 -262322 -333666 -407704 -373154 -217656 -10147 -36087 -200869 -266976 -236131 -19540 102075
$$ packed form
6229a35135K64092Q2782k05623k28378P0836o060j15172r8706k07962m1964K62148
6218c59142K09070j1679q1350p8986k2311M609M75J56274P5869n0206q1627n0314
6206b89318l9411j74695j42757J16731J41866Q9561J35230K2527k708Q5051J4903
6195d3020j48266J66636L62263K04913r4472o6139j07789l03268q1556Q1786q7072
6184a15984k33888j11664J26872J21621M7928j42329k14089r1516J69128J93154
6174b50767l4075p7345L8219K48500J54093m8253o8469j321q712j27723O720J45366
6162b3767j50933j93739p8187n0851J84303J85611M4432j41212n5393N6997l9583
6151b62322p1344p4038L4550J55498K07509k5940j64782o6107L0845K16591J21615
$$ plain form
6140 102075 -38030 -266728 -327012 -150917 109197 197741 325259 442394 391826 373053
6130 373053 400738 248078 97992 44424 111285 191342 321324 434497 374670 372359 349397
6119 349397 376837 185559 -200004 -350447 -146703 -139233 -224049 -183886 -32739 200260 182658
6108 182658 -43591 -185164 -160449 6500 247258 251227 -33381 -156574 -128197 -136512 -51727
6097 -51727 30703 193599 220080 124377 143227 289791 327211 350704 478727 580498 520570
6086 520570 545146 487118 271761 3955 -162961 -149687 95478 354649 352560 155116 -87785
6075 -87785 -292332 -288833 35819 367675 406856 272137 145477 154799 153011 19493 -62500
6064 -62500 -247657 -314717 -271520 -139804 -56354 50383 235767 75311 -22119 -42533 -92003
$$ packed form
6140A02075j40105k28698o0284J76095K60114Q8544J27518J17135n0568j8773
6130C73053K7685j52660j50086n3568O6861Q0057J29982J13173n9827k311k2962
6119C49397K7440j91278l85563j50443K03744P470q4816M0163J51147K32999j7602
6108A82658k26249j41573K4715J66949K40758L969k84608j23193K8377q315Q4785
6097e1727Q2430J62896K6481r5703J8850J46564L7420K3493J28023J01771n9928
6086E20570K4576n8028k15357k67806j66916J3274K45165K59171k089j97444k42901
6075h7785k04547L499L24652L31856L9181j34719j26660R322j788j33518q1993
6064f2500j85157o7060M3197J31716Q3450J06737J85384j60456r7430k0414m9470
$$ plain form
6053 -92003 37820 243421 275132 124805 115372 218567 137562 119014 233579 418279 480183
6042 480183 302400 205788 157130 57339 21880 119458 383029 457071 229718 35693 71812
6031 71812 136268 162631 251473 377080 361615 277372 73750 -133735 -76017 49546 154251
6020 154251 242410 305497 208338 -115292 -364561 -579854 -615905 -326349 -69742 -72431 -295012
6009 -295012 -239456 -157227 -141694 14431 344995 483270 334901 270550 290974 399050 513032
5998 513032 346715 142923 162338 160131 22305 51083 185678 218375 123304 64763 123808
5987 123808 320598 370068 305503 63847 -317714 -467525 -445934 -389315 -287489 -157414
5977 -157414 -193511 -342855 -328649 -196098 -252490 -357822 -393985 -420551 -228924 -102886 -240301
$$ packed form
6053i2003J29823K05601L1711j50327r433J03195q1005j8548J14565J84700O1904
6042D80183j77783r6612m8658r9791l5459R7578K63571P4042k27353j94025L6119
6031G1812O4456K6363Q8842J25607j5465q4243k03622k07485N7718J25563J04705
6020A54251Q8159O3087r7159l23630k49269k15293l6051K89556K56607k689k22581
6009b95012N5556Q2229J5533J56125L30564J38275j48369o4351K0424J08076J13982
5998E13032j66317k03792J9415k207j37826K8778J34595L2697r5071n8541N9045
5987A23808J96790M9470o4565k41656l81561j49811K1591N6619J01826J30075
5977a57414l6097j49344J4206J32551n6392j05332l6163k6566J91627J26038j37415
$$ plain form
5966 -240301 -403587 -462673 -173570 317553 558398 448170 246120 213127 119803 -4210
5956 -4210 61892 141512 194271 108604 -56520 -116451 -165349 -350379 -545034 -635731 -602013
5945 -602013 -429337 -338446 -348829 -406250 -402747 -266222 -142841 -326184 -467984 -356813 30481
5934 30481 115438 85427 78912 103075 122219 50396 79703 -76953 -234113 -267756 -354216 -416092
5922 -416092 -438492 -383408 -504245 -634641 -513423 -203838 5959 25085 -18819 -105498 -12465
5911 -12465 39242 21466 43988 -47382 -155430 -195336 -172447 -341099 -377753 -152696 3683
5900 3683 -30616 -107330 -97350 -96998 151342 349314 255742 87758 -32027 -228813 -367839
5889 -367839 -406843 -323363 -236126 -167651 -62164 101547 161362 -98139 -489046 -655703 -596709
$$ packed form
5966b40301j63286n9086K89103M91123K40845j10228k02050l2993r3324j24013
5956d210O6102P9620N2759q5667j65124n9931m8898j85030j94655r0697L3718
5945f02013J72676R0891j0383n7421L503J36525J23381j83343j41800J11171L87294
5934C0481Q4957l0011o515K4163J9144p1823K9307j56656j57160l3643q6460o1876
5922d16092k2400N5084j20837j30396J21218L09585K09797J9126m3904q6679R3033
5911a2465N1707j7776K2522r1370j08048l9906K2889j68652l6654K25057J56379
5900C683l4299p6714R980L52K48340J97972r3572j67984j19785j96786j39026
5889c67839l9004Q3480Q7237O8475J05487J63711N9815k59501l90907j66657N8994
$$ plain form
5878 -596709 -548453 -380335 -121376 81609 275591 268809 335808 313355 244480 277475 375767
5867 375767 214992 -169231 -261875 -29333 71832 115713 190262 112822 -73892 -252453
5857 -252453 -96043 111400 230176 200684 74363 -66965 -209955 -200702 -117149 -152869 -298205
5846 -298205 -392186 -485989 -392544 -177387 -258851 -485705 -507403 -313502 -208375 -198190 -168020
5835 -168020 -202327 -283069 -73809 139803 178113 383133 484914 413114 372184 340569 171262
5824 171262 49481 99936 261580 512983 782154 806195 451584 170606 59824 7708
5814 7708 53238 80354 167321 189119 176268 -11273 -252328 -268693 -62132 101447 103134
5803 103134 108353 -145218 -405622 -318897 -183070 -142056 -26154 185136 334535 422192 334231
$$ packed form
5878e96709M8256J68118K58959K02985J93982o782O6999k2453o8875L2995R8292
5867C75767j60775l84223r2644K32542J01165M3881P4549p7440j86714j78561
5857b52453J56410K07443J18776k9492j26321j41328j42990R253Q3553l5720j45336
5846b98205r3981r3803R3445K15157q1464k26854k1698J93901J05127J0185L0170
5835a68020l4307q0742K09260K13612L8310K05020J01781p1800m0930l1615j69307
5824A71262j21781N0455J61644K51403K69171K4041l54611k80978j10782n2116
5814G708M5530K7116Q6967K1798j2851j87541k41055j6365K06561J63579J687
5803A03134N219k53571k60404Q6725J35827M1014J15902K11290J49399Q7657q7961
$$ plain form
5792 334231 152433 -12167 -199737 -292210 -60289 245687 235911 198423 141592 126150 161198
5781 161198 164555 119002 -30511 -5701 103683 72852 73693 58780 54192 -46424 -207508 -42436
5769 -42436 43831 13050 -14235 -71527 -51599 -52438 -115566 -97221 -62071 -142144 -171274 -129097
5757 -129097 -104651 -157842 -84268 -29564 -3216 -24331 -149274 -134598 62141 -7688 -109396
5746 -109396 -145888 -218815 -225194 -76765 178286 326940 297736 324437 334073 359080 536540
5735 536540 471220 389662 521539 377639 -16359 -277051 -273834 -26154 94553 94374 98292
5724 98292 17306 -112860 -246185 -311244 -471883 -338387 -150173 -116813 99098 320265
5714 320265 142609 -14532 -68063 -125923 -202539 -361248 -242021 -24257 -93128 -79727 66687
$$ packed form
5792C34231j81798j64600j87570r2473K31921L05976r776l7488n6831j5442L5048
5781A61198L357m5553j49513K4810J09384l0831Q41j4913m588j00616j61084J65072
5769d2436Q6267l0781k7285n7292J9928q39o3128J8345L5150q0073k9130M2177
5757a29097K4446n3191P3574N4704K6348k1115j24943J4676J96739o9829j01708
5746a09396l6492p2927o379J48429K55051J48654k9204K6701R636K5007J77460
5735E36540o5320q1558J31877j43900l93998k60692L217K47680J20707j79L918
5724I8292q0986j30166j33325o5059j60639J33496J88214L3360K15911K21167
5714C20265j77656j57141n3531n7860p6616j58709J19227K17764o8871J3401J46414
$$ plain form
5703 66687 279733 416033 204073 36985 -70364 -231823 -229883 -62678 57584 -38432
5693 -38432 -201616 -221726 -104992 -110707 -99963 2372 -37397 -187765 -114275 -7282 187022
5682 187022 217849 173281 191873 102987 -104696 -448567 -550761 -659190 -648099 -340389 4648
5671 4648 300817 379477 191248 -128143 -245665 -165937 -178942 -314764 -421988 -397959 -298126
5660 -298126 -185697 -214112 -284052 -510315 -591936 -481284 -368709 -261051 -185903 -282865 -262892
5649 -262892 -175280 -122605 -120182 -139745 -195389 -94593 155374 265075 253450 225769 160599
5638 160599 220281 217299 77589 -42252 51237 104013 249975 266154 166381 324451 400927
5627 400927 243329 178509 229825 169840 -16675 -94787 -71349 -110660 -11869 215947 188205
$$ packed form
5703F6687K13046J36300k11960j67088j07349j61459J940J67205J20262r6016
5693c8432j63184k0110J16734n715J0744J02335l9769j50368P3490J06993J94304
5682A87022L0827m4568J8592q8886k07683l43871j02194j08429J1091L07710L45037
5671D648K96169P8660j88229l19391j17522P9728j3005j35822j07224K4029R9833
5660b98126J12429k8415o9940k26263q1621J10652J12575J07658P5148r6962J9973
5649b62892Q7612N2675K423j9563n5644J00796K49967J09701j1625k7681o5170
5638A60599N9682k982j39710j19841R3489N2776J45962J6179r9773J58070P6476
5627D00927j57598o4820N1316n9985j86515p8112K3438l9311R8791K27816k7742
$$ plain form
5616 188205 -71786 -230409 -233689 -194611 -134936 -87603 -25775 65105 121286 112269 109774 -10056
5604 -10056 32642 146866 177261 147949 15619 -28558 151779 138983 -33245 -229423 -224258
5593 -224258 -146140 -336451 -545794 -598583 -514520 -335549 -236277 -253511 -331173 -394764 -415052
5582 -415052 -466787 -558869 -551061 -488582 -474032 -408810 -440004 -306415 -278034 -385097 -299465
5571 -299465 -216346 -195021 -210539 -35860 134020 97348 143493 349832 243364 -113734 -375118
5560 -375118 -395953 -236385 -190268 -103731 -65521 -176644 -32735 166812 202624 219048 233883
5549 233883 231167 201596 251825 212062 195464 161792 210774 187774 234346 165910 140277 146845
5537 146845 36780 -79419 -301054 -514263 -632585 -592312 -504292 -454918 -442067 -361677 29284
$$ packed form
5616A88205k59991j58623l280L9078N9675M7333O1828R0880N6181r017k495j19830
5604a0056M2698J14224L0395k9312j32330m4177J80337j2796j72228j96178N165
5593b24258P8118j90311k09343n2789Q4063J78971R9272j7234p7662o3591k0288
5582d15052n1735r2082P808O2479J4550O5222l1194J33589K8381j07063Q5632
5571b99465Q3119K1325j5518J74679J69880l6672M6145K06339j06468l57098k61384
5560c75118k0835J59568M6117Q6537L8210j11123J43909J99547L5812J6424J4835
5549B33883k716k9571N0229l9763j6598l3672M8982k3000M6572o8436k5633O568
5537A46845j10065j16199k21635k13209j18322M0273Q8020M9374J2851Q0390L90961
$$ plain form
5526 29284 194565 189628 159940 168457 215700 249837 296648 403116 509677 402678 375012
5515 375012 339842 231953 41637 -141568 -130884 -9550 132461 190899 119469 148773 135148
5504 135148 45522 -129615 -366087 -491536 -497164 -428281 -397425 -206964 55570 55629 100372
5493 100372 233678 110233 38596 95451 -1835 -218149 -332340 -319720 -175630 169099
5483 169099 580177 661318 470062 341430 256267 224485 106484 59919 109455 46489 14221
5472 14221 117747 322930 369836 349066 443070 269932 40322 139059 264089 194338 99866
5461 99866 109142 47133 -93356 -138137 -69147 -18357 -117625 -382934 -600479 -635512 -550085
5450 -550085 -513192 -359337 -115761 26021 96425 65602 -51408 -84664 -55845 -21837 32121
$$ packed form
5526B9284J65281m937k9688Q517M7243L4137M6811J06468J06561j06999k7666
5515C75012l5170j07889j90316j83205J0684J21334J42011N8438p1430K9304j3625
5504A35148q9626j75137k36472j25449n628O8883L0856J90461K62534N9M4743
5493A00372J33306j23445p1637N6855r7286k16314j14191J2620J44090L44729
5483A69099M11078Q1141j91256j28632q5163l1782j18001m6565M9536o2966l2268
5472A4221J03526K05183M6906k0770R4004j73138k29610R8737J25030o9751r4472
5461I9866R276o2009j40489m4781O8990N0790r9268k65309k17545l5033Q5427
5450e50085L6893J53855K43576J41782P0404l0823j17010l3256K8819L4008N3958
$$ plain form
5439 32121 -41209 -252393 -289582 -179170 -190467 -43113 83961 85614 108175 62009 27493
5428 27493 -78886 -113432 -211880 -295627 -245165 -195938 -288368 -246878 -108960 -171255 -237277
5417 -237277 -215072 -363604 -430518 -371132 -235277 -119951 -170726 -253977 -133887 -71218 -91522
5406 -91522 -22341 -43351 -154435 -280205 -247621 -199404 -183658 -382702 -391027 -175719 -82718
5395 -82718 -118678 -130375 -153478 -200630 -156668 -43479 55286 50566 -85257 -248421 -250471 -223952
5383 -223952 -371964 -396867 -201750 -47126 -118744 -225076 -247699 -221190 -101791 32954
5373 32954 -51003 -116102 -278254 -546511 -804288 -868069 -725868 -631415 -655410 -519273 -451287
5362 -451287 -494549 -338299 -229219 -425770 -343686 -106301 4871 156169 -742 -103404
$$ packed form
5439C2121p3330k11184l7189J10412j1297J47354J27074J653K2561m6166l4516
5428B7493j06379l4546r8448q3747N0462M9227r2430M1490J37918o2295o6022
5417b37277K2205j48532o6914N9386J35855J15326n0775q3251J20090O2669k0304
5406i1522O9181k1010j11084j25770L2584M8217J5746j99044q325K15308R3001
5395h2718l5960j1697k3103m7152M3962J13189R8765m720j35823j63164k050K6519
5383b23952j48012k4903J95117J54624p1618j06332k2623K6509J19399J34745
5373C2954q3957o5099j62152k68257k57777o3781J42201R4453k3995J36137O7986
5362d51287m3262J56250J09080j96551Q2084K37385J11172J51298j56911j02662
$$ plain form
5352 -103404 -27440 -60695 -80329 -129358 -309976 -381737 -358138 -352045 -478878 -609986 -456848
5341 -456848 -357659 -301321 -203067 -225349 -323461 -342126 -174468 40834 147183 55119 -110285
5330 -110285 -194896 -118090 69796 274724 305226 269184 232033 191345 34845 -93880 -235
5319 -235 220606 244761 334712 403085 312251 279013 324488 376995 249521 151149 197884 -39040
5307 -39040 -216804 -171078 -214249 -160958 -36745 90523 140811 84578 70654 42592 63789
5296 63789 91901 40897 -37477 -60063 -87461 -185653 -280378 -247782 -177535 -90788 -205878 -253062
5284 -253062 -219259 -35958 148759 -30213 -137533 -176175 -162858 -193086 -347909 -307149 -121703
5273 -121703 -71596 -103523 -96688 -75242 -24933 26038 -242954 -486069 -481070 -326267 -65235
$$ packed form
5352a03404P5964l3255j9634m9029j80618p1761K3599O093j26833j31108J53138
5341d56848R9189N6338R8254k2282r8112j8665J67658K15302J06349r2064j65404
5330a10285q4611P6806J87886K04928L0502l6042l7151m0688j56500j28725R3645
5319b35K20841K4155Q9951O8373r0834l3238M5475N2507j27474r8372M6735k36924
5307c9040j77764M5726m3171N3291J24213J27268N0288n6233j3924k8062K1197
5296F3789K8112n1004p8374k2586k7398r8192r4725L2596P0247Q6747j15090m7184
5284b53062L3803J83301J84717j78972j07320l8642J3317l0228j54823M0760J85446
5273a21703N0107l1927O835K1446N0309N0971k68992k43115M999J54803K61032
$$ plain form
5262 -65235 -95933 -272725 -145856 88639 428607 596106 505819 299954 153487 120390
5252 120390 -53745 -156448 918 259214 358245 323900 365984 465545 476542 348150 226079
5241 226079 275768 497389 591994 535944 407088 297773 193608 223443 430674 560607
5231 560607 564154 364561 196227 175025 225146 198572 135637 70194 1180 61018 207062
5220 207062 316611 309076 169269 81273 -93304 -163415 -64603 27178 139810 80755 69156
5209 69156 346761 631694 694170 431891 194533 107579 137547 146122 30344 -179718 -152798
5198 -152798 124469 306496 431721 414641 164849 41561 121601 157449 102174 201994 322041
5187 322041 152929 45119 102568 110247 -42022 -112153 2194 171236 80783 -115394 -152380
$$ packed form
5262f5235l0698j76792J26869K34495L39968J67499r0287k05865j46467l3097
5252A20390j74135j02703J57366K58296R9031l4345M2084R9561J0997j28392j22071
5241B26079M9689K21621R4605n6050j28856j09315j04165K9835K07231J29933
5231E60607L547j99593j68334k1202N0121k6574o2935o5443o9014N9838J46044
5220B07062J09549p535j39807q7996j74577p0111R8812R1781J12632n9055j1599
5209F9156K77605K84933O2476k62279k37358q6954K9968Q575j15778k10062K6920
5198a52798K77267J82027J25225j7080k49792j23288Q0040L5848n5275R9820J20047
5187C22041j69112j07810N7449P679j52269p0131J14347J69042r0453j96177l6986
$$ plain form
5176 -152380 -21365 3996 -137500 -178074 -51190 131962 104634 -15927 67161 199971
5166 199971 222741 225316 193794 171068 183292 99200 37733 37361 106405 120226 79903 -45268
5154 -45268 -131671 -94218 212263 408067 350861 288410 330680 260081 58607 -131067 -132709
5143 -132709 78077 -23546 -340665 -596502 -640262 -506312 -278122 -187096 -229317 -12108
5133 -12108 141522 121835 375141 447088 192450 -65549 -137420 -112866 -76805 59167 149385
5122 149385 123637 116609 174603 233499 251793 356274 583669 801173 656852 320406 48363
5111 48363 -85899 -286547 -448216 -361571 -168348 29592 263080 324522 36125 -262101
5101 -262101 -199379 -39169 27500 -11328 -176240 -171676 21534 189382 219850 207676 74707
$$ packed form
5176a52380J31015K5361j41496m0574J26884J83152k7328j20561Q3088J32810
5166A99971K2770K575l1522k2726J2224q4092o1467l72O9044J3821m0323j25171
5154d5268q6403L7453L06481J95804n7206o2451M2270p0599k01474j89674j642
5143a32709K10786j01623l17119k55837m3760J33950K28190R1026m2221K17209
5133a2108J53630j9687K53306P1947k54638k57999p1871K4554L6061J35972R0218
5122A49385k5748p028N7994N8896J8294J04481K27395K17504j44321l36446k72043
5111D8363j34262k00648j61669Q6645J93223J97940K33488O1442k88397k98226
5101b62101O2722J60210O6669l8828j64912M564J93210J67848L0468j2174j32969
$$ plain form
5090 74707 -5955 -39390 -77078 -47875 -182067 -235518 -115230 40579 22816 -4885 -3962 19869
5078 19869 173896 203686 256011 194189 42762 98852 334292 407529 369656 393133 300703
5067 300703 22803 -206899 -226185 -66153 43771 221633 338373 372000 264505 201963
5057 201963 157780 160745 272703 327685 254948 209255 132072 -23540 -174758 -99941 148487
5046 148487 228076 73754 -26959 -53054 -36018 52496 244565 415017 278620 219883 263878
5035 263878 277674 424605 426292 192525 3292 -9798 160889 287185 251313 279764 241266
5024 241266 141711 165514 279643 310557 226226 163322 194022 435747 575394 476676 604106
5013 604106 747966 576636 354521 168535 62787 119550 279621 421983 592377 664283
$$ packed form
5090G4707q0662l3435l7688K9203j34192n3451J20288J55809j7763k7701R23K3831
5078A9869J54027K9790N2325o1822j51427N6090K35440P3237l7873K3477r2430
5067C00703k77900k29702j9286J60032J09924J77862J16740L3627j07495o2542
5057B01963m4183K965J11958N4982p2737m5693p7183j55612j51218P4817K48428
5046A48487P9589j54322j00713k6095J7036Q8514J92069J70452j36397n8737M3995
5035B63878J3796J46931J687k33767j89233j3090J70687J26296l5872K8451l8498
5024B41266r9555K3803J14129L0914q4331o2904L0700K41725J39647r8718J27430
5013F04106J43860j71330k22115j85986j05748N6763J60071J42362J70394P1906
$$ plain form
5003 664283 748694 744026 539227 335894 290293 280539 132818 185407 352575 157684 -65447
4992 -65447 -92940 -34777 -122202 -214335 -262543 -325924 -367125 -149644 131043 167633 280490
4981 280490 352107 271950 237067 316821 98667 -29905 76114 -13122 -45716 54564 -4958
4970 -4958 -58412 -12265 71822 84326 34135 29489 141292 145197 -42960 -120974 -126885 -51649
4958 -51649 27682 -98627 -134640 -53473 238878 555523 658451 828339 1099296 1462211
4948 1462211 1712447 1841773 2079618 2560977 3292923 4353472 5629013 7065109 8234157
4939 8234157 8498312 7665186 6280603 4970017 3893561 3083034 2551878 2270513 2071923
4930 2071923 1867789 1638013 1330427 1033560 785774 517528 270486 76484 40017 157912
$$ packed form
5003F64283Q4411m668k04799k03333m5601r754j47721N2589J67168j94891k23131
4992f5447k7493N8163q7425r2133m8208o3381m1201K17481K80687L6590J12857
4981B80490P1617q0157l4883P9754k18154j28572J06019q9236l2594J00280n9522
4970d958n3454M6147Q4087J2504n0191m646J11803L905j88157p8014n911P5236
4958e1649P9331j26309l6013Q1167K92351L16645J02928J69888K70957L62915
4948A462211K50236J29326K37845M81359P31946J060549J275541J436096J169048
4939H234157K64155q33126j384583j310586j076456q10527n31156k81365j98590
4930B071923k04134k29776l07586k96867k47786k68246k47042j94002l6467J17895
$$ plain form
4920 157912 87142 62335 158709 172548 167806 75504 -104216 -92387 -62420 69384 95335
4909 95335 43137 -99981 -317533 -295242 -46452 103277 -21785 -179835 -171877 -208214 -281129
4898 -281129 -49805 224470 369833 583650 669137 595814 506807 331692 70522 -109025
4888 -109025 -272691 -283142 -233110 -225052 -277008 -421565 -559123 -474839 -424792 -426425 -276686
4877 -276686 -224178 38776 243273 216275 125378 48829 -30957 45159 217389 487779 539146
4866 539146 360801 116809 -3119 128957 111462 -202022 -390337 -567110 -747490 -713742
4856 -713742 -582813 -328013 -145345 131586 268619 219468 168137 151675 226657 167105 133953
4845 133953 104975 36049 132532 96601 8957 -13563 -6925 -103822 -2876 -21704 -139532
$$ packed form
4920A57912p0770k4807R6374J3839m742r2302j79720J1829K9967J31804K5951
4909I5335n2198j43118k17552K2291K48790J49729j25062j58050P958l6337p2915
4898b81129K31324K74275J45363K13817Q5487p3323q9007j75115k61170j79547
4888a09025j63666j0451N0032Q058n1956j44557j37558Q4284N0047j633J49739
4877b76686N2508K62954K04497k6998r0897p6549p9786P6116J72230K70390N1367
4866E39146j78345k43992j19928J32076j7495l13484j88315j76773j80380L3748
4856g13742J30929K54800J82668K76931J37033m9151n1331j6462P4982n9552l3152
4845A33953k8978o8926R6483l5931q7644k2520O638r6897J00946j8828j17828
$$ plain form
4834 -139532 174186 447592 511295 504842 320175 107928 -69888 -290990 -246932 51539
4824 51539 154345 68514 8945 150 152387 32478 -122601 -104366 -14919 146085 56482
4813 56482 -183791 -358078 -142181 154404 110840 9234 44224 35409 -18884 59771 186587
4802 186587 161207 153497 77783 -74622 -32005 -123911 -204252 -255703 -309542 -354171 -349296 -166419
4790 -166419 59228 32607 -185916 -403784 -354999 -213043 -201091 -96688 36374 153747
4780 153747 141797 -25684 31760 80952 59294 -48297 -129792 -120484 2030 179428 179583
4769 179583 -29926 -189436 -74709 75216 233204 319398 67230 -197745 -285964 -103069
4759 -103069 63325 -20355 -160637 -137954 59555 199033 172108 203649 121118 21083 38738
$$ packed form
4834a39532L13718K73406O3703o453j84667k12247j77816k21102M4058K98471
4824E1539J02806q5831n9569q795J52237j19909j55079J8235Q9447J61004q9603
4813E6482k40273j74287K15897K96585m3564j01606L4990q815n4293P8655J26816
4802A86587k5380p710p5714j52405M2617r1906q0341n1451n3839m4629M875J82877
4790a66419K25647k6621k18523k17868M8785J41956J1952J04403J33062J17373
4780A53747j1950j67481N7444M9192k1658j07591q1495R308J22514J77398J55
4769A79583k09509j59510J14727J49925J57988Q6194k52168k64975q8219J82895
4759a03069J66394q3680j40282K2683J97509J39478k6925L1541q2531j00035J7655
$$ plain form
4748 38738 147199 275781 311880 328390 366418 285495 176038 292569 412554 279251 15755
4737 15755 -66664 -9630 59338 55361 39881 -49267 -180903 -94165 -8206 114951 231477
4726 231477 219780 238986 242032 349696 482847 613116 637850 486341 368334 430960 413663
4715 413663 350582 284391 224211 286871 160201 12937 63040 171964 269542 276906 191878
4704 191878 127686 131713 46765 -110442 -395102 -514790 -243740 58364 106614 46655 -116571
4693 -116571 -252214 -257813 -140842 -262653 -310335 -313893 -268596 -7503 41264 58478 224665
4682 224665 181738 156471 28566 -138290 -183196 -256285 -299058 -196226 -39685 89207 125129
4671 125129 55643 63971 266887 450873 640940 903331 1423503 2282879 3546859 5286623
$$ packed form
4748C8738J08461J28582L6099J6510L8028q0923j09457J16531J19985j33303k63496
4737A5755q2419N7034O8968l977j5480q9148j31636Q6738Q5959J23157J16526
4726B31477j1697J9206L046J07664J33151J30269K4734j51509j18007O2626j7297
4715D13663o3081o6191o0180O2660j26670j47264N0103J08924R7578P364q5028
4704A91878o4192M027q4948j57207k84660j19688K71050L02104M8250n9959j63226
4693a16571j35643n599J16971j21811m7682l558M5297K61093M8767J7214J66187
4682B24665m2927k5267j27905j66856m4906p3089m2773J02832J56541J28892L5922
4671A25129o9486Q328K02916J83986J90067K62391N20172Q59376J263980J739764
$$ [...]
##END NTUPLES=NMR SPECTRUM
##END=
