##TITLE=C13_SA_24.216
 DMSO, 21300 sc

 27.7.2020
##JCAMPDX= 6.0         $$ Bruker NMR JCAMP-DX V2.0
##DATA TYPE= NMR SPECTRUM
##DATA CLASS= NTUPLES
##ORIGIN= UXNMR, Bruker Analytische Messtechnik GmbH
##OWNER= root
$$ XWIN-NMR		Version 3.5
$$ Tue Jul 28 09:45:21 2020 Russian Standard Time (UT+4h)  she@DPX200
##.OBSERVE FREQUENCY= 50.327896
##.OBSERVE NUCLEUS= ^13C
##.ACQUISITION MODE= SIMULTANEOUS
##.ACQUISITION SCHEME= undefined
##.AVERAGES= 21302
##.DIGITISER RES= 17
##SPECTROMETER/DATA SYSTEM= spect
##.PULSE SEQUENCE= zgpg30
##.SOLVENT NAME= CDCl3
##.SHIFT REFERENCE= (INTERNAL, CDCl3, 0, 222.661)
##AUDIT TRAIL= $$ (NUMBER, WHEN, WHO, WHERE, WHAT)
$$ ##TITLE= Audit trail, XWIN-NMR		Version 3.5
$$ ##JCAMPDX= 5.01
$$ ##ORIGIN= Bruker BioSpin GmbH
$$ ##OWNER= she
$$ F:/spectra/data/she/nmr/c13/1/pdata/1/auditp.txt
$$ ##AUDIT TRAIL=  $$ (NUMBER, WHEN, WHO, WHERE, WHAT)
(   1,<2020-07-28 09:44:16.59 +0400>,<she>,<DPX200>,
      <created by zg, POWCHK disabled, PULCHK disabled
       terminated by command 'halt'
       configuration hash MD5:
       00 E9 B6 7A A2 85 ED C7 34 08 36 98 17 FE 4E 26
       data hash MD5: 32K
       9B AE 27 55 A5 ED 20 F7 E9 9F 11 93 E2 67 3B 57>)
(   2,<2020-07-28 09:44:19.21 +0400>,<she>,<DPX200>,
      <Start of raw data processing
       efp BC_mod = 2 LB = 1 FT_mod = 6 PKNL = 1 PHC0 = -261.5791 PHC1 = 67.56238 SI = 32K 
       data hash MD5: 32K
       CA E5 5E 1D 0E AD F9 26 8E C8 AC BF 36 30 CE FD>)
(   3,<2020-07-28 09:44:31.54 +0400>,<she>,<DPX200>,
      <abs ABSG = 5 
       data hash MD5: 32K
       EA C4 B0 94 6E 50 5E 5C EA 5F 5F 22 BC 5B A1 2D>)
(   4,<2020-07-28 09:44:52.53 +0400>,<she>,<DPX200>,
      <pk PHC0 = 0.5794145 PHC1 = 0 
       data hash MD5: 32K
       E0 1E CF EE 95 BA 01 44 C5 B3 85 16 F4 CB 70 4D>)
$$ ##END=
$$ 
$$ hash MD5
$$ 65 B7 77 D7 0C 1B C1 F5 6A F8 8E EE 32 04 7C DD
##$RELAX= 
##$RELAX= 
##$RELAX= 
##$RELAX= 
##$RELAX= 
##$RELAX= 
##$RELAX= 
##$RELAX= 
$$ Bruker specific parameters
$$ --------------------------
##$DU= <F:/spectra>
##$EXPNO= 1
##$NAME= <c13>
##$PROCNO= 1
##$TYPE= <nmr>
##$USER= <she>
##$AMP= (0..31)
100 100 100 100 100 100 100 100 100 100 100 100 100 100 100 100 100 100 
100 100 100 100 100 100 100 100 100 100 100 100 100 100 
##$AQSEQ= 0
##$AQ_mod= 1
##$AUNM= <au_zg>
##$AUTOPOS= <>
##$BF1= 50.322709
##$BF2= 200.13
##$BF3= 50.322709
##$BF4= 500.13
##$BF5= 500.13
##$BF6= 500.13
##$BF7= 500.13
##$BF8= 500.13
##$BYTORDA= 1
##$CFDGTYP= 0
##$CFRGTYP= 5
##$CHEMSTR= <none>
##$CNST= (0..31)
1 1 145 1 1 1 1 1 1 1 1 1 1 1 1 1 1 1 1 1 1 1 1 1 1 1 1 1 1 1 1 1 
##$CPDPRG= <waltz16>
##$CPDPRG1= <>
##$CPDPRG2= <waltz16>
##$CPDPRG3= <>
##$CPDPRG4= <mlev>
##$CPDPRG5= <mlev>
##$CPDPRG6= <mlev>
##$CPDPRG7= <mlev>
##$CPDPRG8= <mlev>
##$CPDPRGB= <>
##$CPDPRGT= <>
##$D= (0..31)
0 2 0.00345 0 0 0 0 0 0 0 0 0.03 2e-05 3e-06 0 0 0 0 0 0 0 0 0 0 0 0 0 
0 0 0 0 0 
##$DATE= 1595842281
##$DBL= (0..7)
120 120 120 120 120 120 120 120 
##$DBP= (0..7)
150 150 150 150 150 150 150 150 
##$DBP07= 0
$$ [...]
##$SUBNAM4= <"">
##$SUBNAM5= <"">
##$SUBNAM6= <"">
##$SUBNAM7= <"">
##$SUBNAM8= <"">
##$SUBNAM9= <"">
##$SW= 239.972175391363
##$SWIBOX= (0..15)
0 1 3 0 0 0 0 0 0 0 0 0 0 0 0 0 
##$SW_h= 12077.2946859903
##$TD= 32768
##$TD0= 1
##$TE= 0
##$TE2= 300
##$TE3= 300
##$TEG= 300
##$TL= (0..7)
120 120 120 120 120 120 120 120 
##$TP= (0..7)
150 150 150 150 150 150 150 150 
##$TP07= 0
##$TPNAME0= <>
##$TPNAME1= <>
##$TPNAME2= <>
##$TPNAME3= <>
##$TPNAME4= <>
##$TPNAME5= <>
##$TPNAME6= <>
##$TPNAME7= <>
##$TPOAL= (0..7)
0.5 0.5 0.5 0.5 0.5 0.5 0.5 0.5 
##$TPOFFS= (0..7)
0 0 0 0 0 0 0 0 
##$TUNHIN= 0
##$TUNHOUT= 0
##$TUNXOUT= 0
##$USERA1= <user>
##$USERA2= <user>
##$USERA3= <user>
##$USERA4= <user>
##$USERA5= <user>
##$V9= 5
##$VALIST= <valist>
##$VCLIST= <CCCCCCCCCCCCCCC>
##$VD= 0
##$VDLIST= <DDDDDDDDDDDDDDD>
##$VPLIST= <PPPPPPPPPPPPPPP>
##$VTLIST= <TTTTTTTTTTTTTTT>
##$WBST= 1024
##$WBSW= 4
##$XGAIN= (0..3)
0 0 0 0 
##$XL= 0
##$YL= 0
##$YMAX_a= 139482952
##$YMIN_a= -35847680
##$ZGOPTNS= <>
##$ZL1= 120
##$ZL2= 120
##$ZL3= 120
##$ZL4= 120
##$ABSF1= 222.6606
##$ABSF2= -17.33621
##$ABSG= 5
##$ABSL= 3
##$ALPHA= 0
##$AQORDER= 0
##$ASSFAC= 0
##$ASSFACI= 0
##$ASSFACX= 0
##$ASSWID= 0
##$AUNMP= <proc_1d>
##$AZFE= 0.1
##$AZFW= 0.5
##$BCFW= 0
##$BC_mod= 2
##$BYTORDP= 0
##$COROFFS= 0
##$CY= -3
##$DATMOD= 1
##$DC= 0
##$DFILT= <>
##$DTYPP= 0
##$F1P= 0
##$F2P= 0
##$FCOR= 0.5
##$FTSIZE= 32768
##$FT_mod= 6
##$GAMMA= 0
##$GB= 0
##$INTBC= 1
##$INTSCL= 4.134877e-10
##$ISEN= 128
##$LB= 1
##$LEV0= 0
##$LPBIN= 0
##$MAXI= 10000
##$MC2= 0
##$MEAN= 0
##$ME_mod= 0
##$MI= 0.1934396
##$NCOEF= 0
##$NC_proc= 3
##$NLEV= 6
##$NOISF1= 120.0001
##$NOISF2= 80.00006
##$NSP= 0
##$NTH_PI= 0
##$NZP= 0
##$OFFSET= 222.6606
##$PC= 1.4
##$PHC0= -260.9997
##$PHC1= 67.56238
##$PH_mod= 1
##$PKNL= yes
##$PPARMOD= 0
##$PSCAL= 0
##$PSIGN= 0
##$REVERSE= no
##$SF= 50.322729756361
##$SI= 32768
##$SIGF1= 140
##$SIGF2= 120
##$SINO= 11.81781
##$SIOLD= 32768
##$SREGLST= <13C.CDCl3>
##$SSB= 0
##$STSI= 32768
##$STSR= 0
##$SW_p= 12077.2946859903
##$SYMM= 0
##$S_DEV= 0
##$TDeff= 32768
##$TDoff= 0
##$TI= <>
##$TILT= no
##$TM1= 0
##$TM2= 0
##$TOPLEV= 0
##$USERP1= <user>
##$USERP2= <user>
##$USERP3= <user>
##$USERP4= <user>
##$USERP5= <user>
##$WDW= 1
##$XDIM= 32768
##$YMAX_p= 309666541
##$YMIN_p= -1208909
$$ End of Bruker specific parameters
$$ ---------------------------------
##NTUPLES= NMR SPECTRUM
##VAR_NAME=  FREQUENCY,     SPECTRUM/REAL,   SPECTRUM/IMAG
##SYMBOL=    X,             R,               I
##VAR_TYPE=  INDEPENDENT,   DEPENDENT,       DEPENDENT
##VAR_FORM=  AFFN,          ASDF,            ASDF
##VAR_DIM=   32768,         32768,           32768
##UNITS=     HZ,            ARBITRARY UNITS, ARBITRARY UNITS
##FACTOR=    0.368581032318806, 1,           1
##FIRST=     11204.8891385315, 0,            0
##LAST=      -872.405547458802, 0,           0
##MIN=       -872.405547458802, -1208909,    0
##MAX=       11204.8891385315, 309666541,    0
$$ Real data points
##PAGE= N=1
##DATA TABLE= (X++(R..R)), XYDATA
$$ [...]
10895F3731k5672k4940J5697k6402l03434l48388j52421m1172Q5391m1240L8780
10884g60070J75328J78834R336j15278n6876l2464Q5035L34321J56748l9433j31196
10873a95715K0695P4716j2580N175o2556k6400J39006L9918o3934L7392O1856
10862A7573o3972j8940R6901K8912m707L82378K74287k88673l72235l14485p7860
10851c40821J14950Q452l3289M4908Q0398K0006j1044Q2203N682r9834K6214J19717
10839A7542p8242l3145N055o6453m0202k945M9876J39694k541k39303R3938Q678
10827a48048k20299j47247j55794L0484J27820K68645K86899O2053k12469k80410
10817c88366n7779N1226R0179R1924R7321M0921M5274p3817K2129p2365k77635
$$ y = [63731, 38059, 13119, 28816, 2414, -301020, -649408, -801829, -843001, -757610, -798850, -760070, -584742, -405908, -396572, -511850, -568726, -601190, -516155, -181834, -25086, -64519, -195715, -175020, -100304, -112884, -107709, -170265, -196665, -57659, -17741, -81675, -44283, 17573, -46399, -65339, 31562, 60474, 55767, 438145, 712432, 423759, 51524, -262961, -340821, -225871, -217419, -250708, -205800, -125402, -105396, -116440, -34237, -28555, -128389, -102175, 17542, -60700, -93845, -88790, -155243, -195445, -198390, -148514, -8820, -11361, -250664, -156726, -148048, -368347, -515594, -671388, -640904, -513084, -244439, 42460, 104513, -107956, -388366, -446145, -394919, -304740, -212816, -115495, -74574, -29300, -103117, -80988, -153353, -430988]
10806d30988O8201J43765j9505l0493l9507k485K25972J34861j34160j84192j8139
10795b86670p2016J68452J41806J19603j21578k27152K0894K0210O622q287K12812
10784b5304K42447m7133k28180k95704k62177j29287J15426J82899K46700K24252
10774B3939L2695N001j416m1604j25149k58010P0154K39517m2544k29398j41837
10763d68652j14981J05454K64210J58116l0985k80974l61567p3013K37239J71688
10753c93465J74195J7151j51487j4482q6378Q41J71628L8578J66285K78638P6166
10742B77670L7299m7766J8209K6670J984K564n9051p1203k41781l36285k8750
10731d20440P2699J03630J50843K17124J59533m6016r4377k11926k80696j24918
$$ y = [-430988, -362787, -219022, -238527, -269020, -308527, -311012, -85040, 49821, -84339, -268531, -286670, -358686, -190234, -48428, 71175, -50403, -277555, -256661, -236451, -229829, -238116, -25304, 217143, 170010, -58170, -353874, -616051, -745338, -629912, -447013, -200313, 23939, 56634, 61635, 60219, 18615, -106534, -364544, -294390, -54873, -97417, -326815, -468652, -583633, -478179, -213969, -55853, -86838, -367812, -729379, -802392, -565153, -393465, -219270, -202119, -353606, -368088, -454466, -453625, -281997, -243419, -77134, 201504, 277670, 314969, 267203, 285412, 312082, 314066, 316630, 257579, 186376, -55405, -391690, -420440, -347741, -244111, -93268, 123856, 283389, 237373, 142996, -68930, -349626, -474544]
10721d74544r0820o5163J22351L6764j5422L326o803j16718j84616L2920K63703
10710d95022K2066j11739J72931K48772O1781M7298k928o0620j1765r2191J1469
10699b09948J72258J84044k2617j79752j34898j86969j37532j841K1594J8256
10689d77405j31454K620N0036J9843L7344J88726K63848n4707k04317j12074J42626
10678b74914L52182J21487j49423o0922P7336q6512N730R2010m0595r3388p1372
10667a28381J51439K42151P1688j17824k36469k66333j0111j32147k18352q7037
10657g31376N7853J49624K6200j09047l3654J7484k6513j3079J68345L43718K08984
10646E8539M0736j35836q7694n3591k3435j58648j06729J56865K86706J39320
$$ y = [-474544, -565364, -630527, -508176, -471412, -486834, -483508, -490311, -607029, -791645, -758725, -495022, -472956, -584695, -411764, -162992, -101211, -53913, -56841, -117461, -129226, -221417, -209948, -37690, 146354, 123737, -56015, -190913, -377882, -515414, -517255, -495661, -477405, -608859, -606239, -556203, -536360, -499016, -310290, -46442, -101149, -305466, -417540, -274914, 77268, 198755, 49332, -11590, 65746, -20766, -15036, 76974, 36379, -57009, -128381, 23058, 265209, 336897, 219073, -17396, -283729, -293840, -425987, -644339, -731376, -673523, -523899, -497699, -606746, -640400, -622916, -649429, -662508, -494163, -150445, 58539, 99275, -36561, -124255, -177846, -201281, -359929, -466658, -309793, -23087, 116233]
10636A16233j39648j82355p7706k15459q2057K00551J83806P2117J6923j7344
10626a24939k9685j8031p5091l36877j99663Q3629P7527J40868R9025o4353k80674
10615g28264r9598Q8611J30751J27676m9656R6921M2790j64460k70444j05586
10605i31259J01356P5968K59103K21388j8636p7339j09918k49656j41916j6869
10595h87778n128n7193J59337R4347j47021L6594J95734J11942n2548j12586o2842
10584g27142m819j7370J37722J60838K15487K56075L1145O6273O2013j24446j36784
10573h1008r578j92513l3459K68556L21819K2993j19893j69206k41421k2665l9673
10562b96048j57417j20363p1118k15308r4990K26022L16554L82547J20475q2036
$$ y = [116233, -23415, -205770, -283476, -498935, -580992, -380441, -196635, -124518, -107595, -124939, -154624, -172655, -247746, -584623, -784286, -700657, -623130, -482262, -383237, -447590, -728264, -827862, -739251, -608500, -480824, -530480, -433559, -390769, -555229, -825673, -931259, -829903, -753935, -494832, -273444, -292080, -369419, -479337, -728993, -870909, -887778, -892906, -950099, -790762, -696415, -843436, -806842, -611108, -499166, -551714, -664300, -727142, -731961, -749331, -611609, -450771, -235284, 20791, 51936, 118209, 180222, 55776, -81008, -90586, -283099, -316558, -48002, 273817, 296810, 176917, 7711, -233710, -256375, -296048, -453465, -573828, -644946, -860254, -955244, -729222, -412668, -30121, 90354, 8318]
10552H318j76649o4471J95611J42038p3367j29622j65516k06440j71790J29769
10542e12119L1372r8110K9976Q7741J18851j19314k6871J45580K36407p367q8001
10531b01855P6782k2991r7158n9903K6061j56515l82471j99593k212O0660K57002
10520g02193K34954J07685o2825L5906J42401M3801J9166J05264k2205L0407J68677
10509A01038J73339j66546j91920l2837j24711j96443L6198K12523K14328K06486
10499B31455k9765r9248j20770j24651J2326K31294P0240m4842j14207r4138j77449
10488b59755j57478N2312J87975M6168r2507j24328K9543J54127P0447O9623j16067
10477a39940j19915R5545J79550o6234o6385j00161J38043k1100n0229J02004
$$ y = [8318, -168331, -232802, -37191, 104847, 31480, -98142, -263658, -470098, -641888, -512119, -480747, -578857, -548881, -461140, -342289, -461603, -488474, -342894, -106487, -113854, -201855, -125073, -148064, -245222, -305125, -279064, -435579, -818050, -1017643, -1019855, -959195, -702193, -467239, -359554, -422379, -386473, -244072, -200271, -181105, -75841, -98046, -67639, 101038, 274377, 107831, -84089, -116926, -241637, -438080, -401882, -189359, 24969, 231455, 201690, 102442, -18328, -142979, -130653, 100641, 170881, 126039, 11832, -82306, -259755, -417233, -364921, -176946, -130778, -223285, -347613, -318070, -163943, -93496, -23873, -139940, -259855, -164310, 15240, -50994, -117379, -217540, -79497, -100597, -150826, -48822]
10467d8822p5165j53392n9552J03858J10895k8640k18666q6593j6708j06044J3766
10456e65063P6356J58569J18190N8186R8149m0117q2727q2070r6377p2859P6368
10445c53395K93055M2885q4384Q5140J26412m8953j59410j12522P2321l7438j11616
10434b87905n0198O3643J26527J34668N7550k7625J7081J83461K10398j29089
10424B98511l52383r948J45798j23313j5072p8737j2529N8880l8862J2371J91122
10413G5838J90162P4025p944n1604P0477Q748q7351j37159r6429j74582j76857
10402c12676m9576j06389j75663j18508J03412M27091J84906K3001J99867J32125
10392C07590j37503j72191P7405J15383j12033j03457L1484o0490l0402j6776
$$ y = [-48822, -123987, -277379, -336931, -233073, -122178, -150818, -369484, -456077, -472785, -578829, -565063, -488707, -330138, -211948, -153762, -55613, -95730, -178457, -260527, -356904, -429763, -353395, -60340, -17455, -101839, -16699, 109713, 60760, -98650, -211172, -138851, -176289, -287905, -338103, -274460, -147933, -13265, 44285, 16660, 33741, 217202, 427600, 298511, -53872, -63820, 81978, -41335, -56407, -135144, -147673, -88793, -127655, -115284, 75838, 266000, 340025, 332081, 280477, 350954, 359702, 272351, 135192, 38763, -135819, -312676, -362252, -468641, -644304, -762812, -659400, -232309, -47403, -24402, 175465, 307590, 170087, -2104, 75301, 190684, 78651, -24806, 6678, -53812, -84214, -100990]
10382a00990J55098N6644j68940j55267j12447k55930j65572K0264J37778k8844
10372f18206J92J16689N3400l4194R7357J74341J72483j08797k34501M3873P0775
10361b66588k03754k04529j93442K0279K11345J08230J75743J81760J26596K54726
10351B10366K32521m0249o7514j54050R9397J30733k6857O1761j36355k4040Q0967
10340C66680l5442k70222k11752m9650J93208J63403J45055o3084k42249k79821
10330b83874k42539j0647K83533P5689n3388p6730r2185p4576n8808j23268k1255
10319f78048K27893p3416P0327K25476M4051l7200j17756l4344N1283J08832N8035
10308a54867k02608l08245p9425O6916n5032O3553K51421K99018j37174l45538
$$ y = [-100990, 54108, 110752, -58188, -213455, -325902, -581832, -747404, -727140, -589362, -618206, -618014, -501325, -447925, -482119, -384762, -210421, -37938, -146735, -381236, -337363, -266588, -470342, -674871, -868313, -848034, -636689, -528459, -352716, -170956, -44360, 210366, 442887, 402638, 335124, 181074, 280471, 411204, 384347, 446108, 309753, 285713, 366680, 331238, 61016, -150736, -200386, -7178, 156225, 301280, 238196, -4053, -283874, -526413, -537060, -253527, -177838, -231226, -307956, -400141, -474717, -533525, -656793, -678048, -450155, -523571, -453244, -227768, -183717, -220917, -338673, -373017, -321734, -212902, -154867, -357475, -665720, -745145, -678229, -733261, -669708, -418287, -119269, -256443, -601981]
10298f01981J3833Q0995L5592K11044J95481r8419k04729n8281J95507J50237
10288h0721J18751J39192r1068l32539k32496M827K00171K10313r6757j95284
10278c55611j17288l2742m5417j08207J87078M48224L20351J33586l867j7054
10268D09053k11059k07196j39217j29640p3663M8440J03737j19403j2814J66513
10258a65249m5971o8668M9616j13761k59221M3316J99656K62873J16939j79884
10248a60354j46242J81266J31225j09136j65768n2506L4281K7181j17339L0958
10238c46434K07376M9326p0474P294J17251N8081J6823l8231j79982j91744m779
10227c75493p9358P665K45906J61610r2255j20248k11244o258K6823K3591J21480
$$ y = [-601981, -588148, -507153, -471561, -260517, -65036, -163455, -368184, -426465, -230958, -80721, 38030, 177222, 86154, -246385, -478881, -474054, -273883, -63570, -160327, -355611, -472899, -505641, -551058, -659265, -472187, -23963, 296388, 429974, 426107, 409053, 197994, -9202, -148419, -278059, -351722, -303282, -199545, -318948, -331762, -165249, -211220, -279888, -230272, -344033, -603254, -559938, -360282, -97409, 19530, -160354, -306596, -125330, 5895, -103241, -269009, -321515, -287234, -260053, -377392, -346434, -139058, -89732, -160206, -152912, -35661, 22420, 39243, 1012, -178970, -370714, -375493, -454851, -447186, -201280, -39670, -131925, -252173, -463417, -469675, -442852, -419261, -297781]
10216b97781J6035n1568k8925N0091n2642m0596N788Q0193K34616J20856j51841
10205a15774l4008J44053j04006j99057j70367k31933j2140J62916J62096K41361
10195a56859J87174n3920j78361l9644j5141l29j36717j40340n1329Q561J69568
10184d07337J95193K37299J75644N2835j52562k31760K2483J16697j40947k32374
10174c64829j66074N9286J67101J50622J8082J08005J58983m6438p1658L8590
10164E1670l187L7711q5375j9355m4510j00383J25898J09279j23114k54334p4321
10153c80021n2941J24025K97038R4042M2955N7663j47029j13432O631j40748k49132
10142d60949j44033M8320Q678J11980L08513J14112m0233k40174m6963J55991
$$ y = [-297781, -281746, -333314, -362239, -312148, -364790, -405386, -399598, -319405, -84789, 36067, -115774, -149782, -5729, -109735, -308792, -479159, -711092, -723232, -560316, -398220, -156859, 30315, -23605, -201966, -241610, -256751, -257080, -393797, -534137, -585466, -576905, -407337, -212144, 25155, 200799, 253634, 101072, -130688, -108205, 8492, -132455, -364829, -530903, -471617, -304516, -153894, -135812, -27807, 131176, 84738, 13080, 51670, 48483, 86194, 819, -18536, -63046, -163429, -37531, 71748, -51366, -305700, -380021, -432962, -308937, -11899, 82143, 125098, 182761, 35732, -77700, -71069, -211817, -460949, -604982, -556662, -547984, -436004, -127491, -13379, -53612, -293786, -340749, -184758]
10132a84758K10441J05840r307L0831J85759K2088k58753j86381j11941m2176
10122b38357M658j2668M86L6711L42884L52787O3442j52048k43786j50703K5649
10111B9055J08150k8737l7562Q1950J27060j36494j24737J22302O337N996k34420
10100h1100k43155M8517N577j29694o9855l2346j71693N6769J84559N4596o107
10089c83932M0572J06583M8298p7660q4443K6458j3967K8356J02595J37846J17753
10078D8459J8132j33647m2735J14743K958J17657P7968l0985k89728j87941K9016
10067b76103Q3161o127j13947Q2727J548q2707k53642l2773J06082j50932r9349
10056g42062K8005K66331K35915r5057k60848q2653k7078j27495P5164J61964
$$ y = [-184758, 25683, 131523, 122216, 153047, 338806, 360894, 102141, -84240, -196181, -238357, -233699, -246367, -245881, -209170, 133714, 486501, 549943, 397895, 154109, 3406, 29055, 137205, 108468, 70906, 152856, 279916, 143422, 18685, 140987, 147324, 153320, -81100, -324255, -275738, -270161, -399855, -469710, -502056, -673749, -616980, -432421, -377825, -383932, -343360, -236777, -188479, -266139, -350582, -324124, -338091, -309735, -207140, -69294, 48459, 66591, -67056, -109791, 4952, 7910, 125567, 203535, 172550, -117178, -305119, -276103, -192942, -199069, -313016, -230289, -228741, -311448, -565090, -597863, -491781, -642713, -742062, -714057, -447726, -211811, -306868, -567716, -650369, -677447, -804942, -729778, -567814]
10046e67814J74742Q8103j78969n5830J41658J18025k33959l46420j1341K21105
10036f50700K30808k4300l6323J23085q1138q1685O3959P334J3744p8482j31771
10025f45469R1846J50848J1529n0497j6548O2558J91608L46001K23491j76908
10015A88459k94403j52444p2104m3997j1985l0450O721K10693Q9675n978K06093
10004I0280K81053K17182L2070j24723k49918j77342k48577j62943M6866J46127
9994a49925K45271J09521n2637p2362k06376p1395N9887J67336K0017l23212m78181
9983g52056l27956q6591L44239L65178J05371J5884N6231K1154L1857J19872O7015
9972c9802K4202p4162j5399p388j4233l0332j61133l41180j06267J44469N0372
$$ y = [-567814, -393072, -304969, -483938, -539768, -398110, -280085, -514044, -860464, -871805, -650700, -419892, -444192, -480515, -357430, -438568, -520253, -456294, -448960, -435216, -513698, -645469, -553623, -402775, -391246, -441743, -458291, -395733, -204125, 141876, 365367, 188459, -105944, -258388, -330492, -374489, -386474, -416924, -410203, -199510, -109835, -115813, 90280, 371333, 588515, 620585, 495862, 245944, 68602, -179975, -342918, -296052, -149925, 95346, 204867, 152230, 79868, -126508, -197903, -138016, 29320, 49337, -273875, -752056, -1080012, -1166603, -822364, -457186, -351815, -335931, -279700, -258546, -226689, -106817, -39802, -15600, -89762, -105161, -112549, -126782, -157114, -318247, -659427, -765694, -621225, -570853]
9961e70853J16560R8451P9324j66714j11696J39029L92903K00927k32647k12834
9951b67550o3090J32442O2491q858K9027q4183p8435n1759N0162J74752o8342
9940a73343k8467K24290l0141q6579J75049o698k43680j1647J65010J20839Q1250
9929A85883K3662j9991k58752j63874R2512j09978q8982m2362j24589m3210O4529
9918d85152J41179J07627k9685n3300N0708J7288j77365l6512K28284J22322R6775
9907a7831K107j23772k37048q5371L2219P7901J22198J66033Q3439K3649Q3805
9896A27329J30637j77247k31670J57476K42423R2901q0655k14531k84041M1195
9886a96183J71598M847j25206p9141m8180n1847l627J14670J32632J75426K07715
$$ y = [-570853, -454293, -355842, -276518, -443232, -554928, -415899, -22996, 177931, -54716, -267550, -330640, -198198, -135707, -144565, -115538, -199721, -278156, -329915, -279753, -105001, -173343, -201810, 22480, -7661, -94240, 80809, 74111, -169569, -181216, -16206, 104633, 185883, 209545, 189554, -69198, -233072, -140560, -250538, -339520, -381882, -506471, -549681, -485152, -343973, -236346, -266031, -319331, -268623, -251335, -428700, -465212, -236928, -114606, -17831, -15724, -139496, -376544, -461915, -429696, -351795, -229597, -63564, 19875, 43524, 127329, 257966, 80719, -150951, 6525, 248948, 341849, 261194, 46663, -237378, -196183, -24585, -19738, -144944, -224085, -272265, -324112, -327739, -213069, -80437, 94989, 302704]
9875C02704j16302l35351l64222k22202o6300L4583j8261P2396M5826n5703L5968
9864f86864J91884J82774l0674o7002l9974o1492m674J07869M56017L27806L6332
9853D12002l9365k43990k07192j37783l5169n3325q3224J34889L18628P2772j33717
9842D526r5289m081R3016q6127j37955m7545p6053m3563O7457O4102n0405m8545
9830c60462J40752Q6712k7834L7079J54346j0800k39381j50636r0919q5861J12339
9819d34665K0822l8251r4176j14351J6205K74339L20651K1148j63097j1890K04755
9808A490K15689K9736l05988l86487j54308n5269l5334k8294k453Q7756J3953
9797f19509j3245P1918J49419J78759L8556j49654k28851l4261o9736K42896L02178
$$ y = [302704, 186402, -148949, -513171, -735373, -801673, -767090, -785351, -712955, -667129, -722832, -686864, -494980, -312206, -342880, -409882, -449856, -511348, -516022, -408153, 47864, 375670, 412002, 372637, 128647, -78545, -216328, -251497, -304822, -388046, -253157, 65471, 138243, 4526, -90763, -94844, -1828, -87955, -225910, -273455, -349508, -393071, -325614, -261512, -311917, -360462, -219710, -132998, -160832, -123753, 30593, 19793, -219588, -370224, -461143, -547004, -434665, -413843, -452094, -546270, -660621, -644416, -370077, -49426, -28278, -191375, -203265, 1490, 217179, 246915, -59073, -445560, -599868, -655137, -690471, -718765, -721218, -633462, -619509, -632754, -560836, -411417, -232658, -194102, -343756, -572607, -606868, -676604, -433708, -131530]
9786a31530N7766J8675j35750o2122Q5055o4509j36009N3993L12455K26550r6213
9775A28361j89089q9983k8049Q0495J64576J21060k4752j44133j52026q9951o3504
9764b86995L2290j07791n349M4069q8102J15332J86831J4882k4808k9003O3518
9753h5126K743q33J13458K20241M9088j69586j38123l30942k69661p9581J24832
9742e63490N9366N144O2199K4915Q7549p1669P9566K94514L1197j72968j45317
9731c08994P2594O3427J96339J45609r7085k23333k38052q6196k09732n9590J09258
9720f35755L6597O0417j52544r0592m2500J57017K46350J30542J70839K05045
9710H5416N697P6789J72984P2809J39570J25209n6056j21913o3308k39031j23088
$$ y = [-131530, -73764, -55089, -190839, -252961, -167906, -232415, -368424, -314431, -1976, 224574, 128361, -60728, -150711, -178760, -98265, 66311, 187371, 162619, 18486, -133540, -223491, -286995, -254705, -362496, -367845, -323776, -411878, -296546, -109715, -94833, -119641, -148644, -85126, -82383, -83216, 30242, 250483, 299571, 129985, -8138, -339080, -608741, -688322, -563490, -504124, -498980, -436781, -411866, -324317, -395986, -316420, -21906, 9291, -163677, -308994, -236400, -172973, 23366, 168975, 71890, -151443, -389495, -475691, -685423, -745013, -635755, -599158, -538741, -691285, -781877, -824377, -667360, -421010, -290468, -119629, 85416, 91113, 167902, 340886, 413695, 553265, 678474, 622418, 500505, 437197, 198166, 75078]
9699G5078K4410n6628m595P8456K11354M8463J8443K457j61844l70823k16542
9688c51771o8495J95260L27145K13140j00651l19931j50790J87045J7015r0635
9678a42668R6977M4327M9104K5717l059m4542r6083k62426k12027Q8473J09851
9667c46356J25770L5798K05806K9932q6769j478k08031m31356j68995J84876P9607
9656e81196J12116k0351P7358L04061J64006j44287j18402k10723K0844R4335
9646c02239P108J03239n2469j56680M183J03141J16611K22260J08115j14993M1932
9635H0208J66490K43395J87307M0331j94581k34567j2833J90197K3828j06554
9625C83221j7541L8319N6978j94352k09240k6091K5824j27349o1131R7865j202
$$ y = [75078, 99488, 42860, 38265, 116721, 328075, 376538, 394981, 397438, 235594, -135229, -351771, -420266, -225006, 102139, 315279, 214628, -105303, -256093, -69048, -52033, -142668, -45691, -1364, 47740, 73457, 70398, 25856, -70227, -332653, -544680, -456207, -346356, -220586, -184788, 21018, 50950, -35819, -37297, -245328, -676684, -845679, -660803, -581196, -469080, -489431, -412073, -108012, 55994, -88293, -206695, -417418, -396574, -302239, -295131, -191892, -244361, -401041, -396858, -293717, -177106, 45154, 153269, 38276, 80208, 246698, 490093, 677400, 717731, 523150, 288583, 275750, 465947, 489775, 383221, 365680, 403999, 460977, 266625, 57385, 31294, 57118, -70231, -131362, -33497, -34699]
9614c4699n6881N7892J05559J8956k13112j71740o0025r4084k01836P4843L68819
9603b06308L38426l0538j04681K05713J89597n4361r4878Q2976J49935J7483j42095
9592C51269O547j05792k50786k89327r7289J20582K88144L08331L3787J09560
9582D75026J95673m0489l3108J9401m6839j24180l11256j72649J18982O4298j10272
9571C4587n2636K5522J32528J10029m7091m8498Q9092K22537P7536j21135k9472
9560C92999r4097j07327n2530J8227J23099M6414m7875j0591j54744m99120j47389
9549e32934K25125K96805J80918o4036j99766q2577O9825l732J9216K04430K42482
9538C55756J66023M0846r1853j95294k72148j90743p1391N4248J20184J17554
$$ y = [-34699, -91580, -33688, 71871, 90827, -122285, -294025, -354050, -448134, -649970, -575127, -206308, 132118, 101580, -3101, 202612, 392209, 337848, 242970, 325946, 475881, 493364, 351269, 357816, 252024, 1238, -288089, -385378, -264796, 23348, 331679, 365466, 475026, 670699, 630210, 597102, 616503, 569664, 445484, 134228, -38421, 80561, 144859, 34587, -18049, 7473, 140001, 250030, 202939, 154441, 243533, 466070, 543606, 422471, 392999, 298902, 191575, 139045, 157272, 280371, 326785, 278910, 268319, 113575, -385545, -532934, -307809, -11004, 169914, 105878, -93888, -176465, -106640, -110372, -91156, 113274, 355756, 521779, 562625, 470772, 275478, 3330, -187413, -258804, -204556, -84372, 33182]
9528C3182n2322o8946J78758r379j80110j76182J25587J39022N6993J6165q200
9517E4568k05670L4801J76072L6891j8715N1743O6901n3987M2313r4022j34911
9506d4016j8872J87011j2484k03506j16785j00076O9341K20206J4241j11647j3182
9495a29769J31187K34186K21641K10418P5076l07511j71405J18040J00754k33666
9485B48951l13933k12437O6006K22583K09779J03176J08874L50464L41511J69619
9475A294593J52437L18541Q10859J145321Q45192l95086j180426r84556m12948
9466A593927k71045k46506k19307j45804j7136l2343j63253j16410k36505j83166
9456c7548L8563R0867M1284j77586j02838K67366O1845j67917j59845k34364K3133
$$ y = [33182, -19140, -88086, 90672, 81293, -98817, -274999, -149412, -10390, 46603, 62768, 54568, -151102, -116301, 59771, 96662, 77947, 129690, 196591, 142604, 184917, 90895, -44016, -62888, 124123, 111639, -91867, -208652, -308728, -239387, -19181, -4940, -116587, -129769, 1418, 235604, 457245, 667663, 742739, 435228, 263823, 381863, 482617, 248951, -64982, -277419, -211413, 11170, 220949, 324125, 432999, 783463, 1124974, 1294593, 1447030, 1765571, 2576430, 3721751, 4566943, 4171857, 2991431, 2006875, 1593927, 1322882, 1076376, 857069, 711265, 694129, 661786, 498533, 382123, 145618, -37548, 1015, 91882, 133166, -44420, -147258, 120108, 181953, 14036, -145809, -380173, -357040]
9445c57040p5460j05400j4969J42886J83362J37105M2591J76334J92583k6293
9435B95699r2296l2039n9883n3007m1136j40823j39083M8061j3097j21098j34345
9424d83047M2906K15319L1286k35842j88990N6761R5335J54419K89324j14837
9414a37366j65525p3210k4673n1193j02328j19379m3143K24532K41339L36209
9404H5263J83371j94134l08440k39112k466K120m2007J29322N0552J16253M14742
9393A95464J76303k52444j78628k1824j68354q3147K35305K87464K59267J71092
9383F20498j42191k19294k19594j98651j18858R0449J24777J72736K28750p429
9373C31193k90041n1500l6714j9277J27514M9783K7125J88897O2920L8732r4324
$$ y = [-357040, -432500, -537900, -552869, -409983, -226621, -89516, -46925, 129409, 321992, 295699, 203403, 171364, 111481, 58474, 17338, -123485, -262568, -214507, -227604, -348702, -483047, -440141, -224822, -193536, -429378, -618368, -561607, -466272, -311853, -22529, -137366, -302891, -376101, -400774, -451967, -554295, -673674, -716817, -492285, -250946, 85263, 268634, 74500, -233940, -473052, -475518, -473398, -515405, -386083, -335531, -219278, 195464, 371767, 119323, -59305, -81129, -249483, -332630, -97325, 190139, 449406, 620498, 478307, 259013, 39419, -159232, -278090, -187641, -62864, 109872, 338622, 331193, 41152, -10348, -47062, -66339, 61175, 110958, 138083, 326980, 389900, 428632, 334308]
9362C34308j91323j13898j45434K1536j7733o4358J7691M1552j18789k33342r6163
9351e65953K9912J187L2935M7769l9123J00740M48286J72346m0957l8498K9312
9340A77956k8555q0357n5083n5744R0635J12416j22548j54717l4628P1581L7839
9329d1205J41768J86251l6643j992o3637j73813l2643k7238j02831m6073K08548
9318A0492Q9094j67946k81861r6738M7847l3561l2427q0178J11216J50564P2132
9307b11366J3678j95581k7674L6399j07762r9300j11031o2854l5798N3296J9602
9296g28391M635K12038J10896M0605p2721k44176j97340J0115K83273J86762J73337
9285b20967K28998J62948L1360L8408m8881j94786R4069J47661j61108j59009
$$ y = [334308, 142985, 29087, -116347, -94811, -112544, -176902, -159211, -117659, -236448, -469790, -565953, -536041, -534854, -501919, -454150, -493273, -392533, 55753, 228099, 187142, 148644, 177956, 149401, 69044, 13961, -41783, 48852, 161268, 38720, -115997, -150625, -79044, -41205, 100563, 286814, 250171, 248179, 184542, 10729, -21914, -49152, -151983, -198056, 10492, 99586, -68360, -350221, -446959, -399112, -432673, -465100, -545278, -434062, -283498, -211366, -197688, -393269, -420943, -384544, -492306, -591606, -702637, -765491, -801289, -747993, -728391, -723756, -511718, -400822, -360217, -432938, -677114, -874454, -864339, -581066, -394304, -220967, 8031, 170979, 202339, 240747, 191866, -2920, 91149, 238810, 77702, -81307]
9275h1307R361M5552K85217L65409L7550j99054k43052k57616j60039p4040o9773
9264c41792Q2650J65790J98235J2706J4167L5994j66635r0214Q1169R7373j7279
9253G2164j92859k86457k8889J30571P834j17097J33565J27844p7763l7655l9043
9242c07785j44798q3412J4867M2913j576p0094J90420J98868L8106K350J61252
9231D1111K58899j38516r8662J5370n3650r5850m6526n0666m2122j09381J1004
9220c08989J26143J49253M139n5370j86601N2238J89918L3094q2446r1459j60920
9209c31000O0888N7413j43691J65282J21922o2278L2143J21967M8324L9472Q9195
9198A99637O6833j96495n1366j53713j22313J14405j26161k40751m6818J25781
$$ y = [-81307, -71946, -26394, 258823, 624232, 661782, 462728, 219676, -37940, -197979, -272019, -341792, -259142, -93352, 104883, 117589, 131756, 167750, 1115, -89099, -7930, 89443, 72164, -120695, -407152, -436041, -305470, -297636, -414733, -281168, -153324, -231087, -268742, -307785, -452583, -535995, -521128, -478215, -479791, -549885, -359465, -160597, -122491, -120141, 41111, 300010, 161494, 62832, 78202, 24552, -71298, -117824, -168490, -210612, -319993, -308989, -182846, -33593, -29454, -84824, -271425, -219187, -29269, 3825, -78621, -170080, -331000, -270112, -212699, -356390, -191108, -69186, -131464, -99321, 22646, 70970, 110442, 199637, 266470, 69975, 18609, -135104, -257417, -143012, -269173, -509924, -556742, -430961]
9188d30961k4255p3486K1332J04286J99438j7657j58553L2903p1634r1224K39599
9177b70212J77461J6773J39337O6843n2834l4320J59199K9814l24655l90814k53008
9166g36416M61J49007J49079K05797K39224N0917j16132j76439L4579K047M1169
9155a56707J7274j08802j5366Q1302m0187k47913M7727K82891K49241L8386r5039
9144E2807p3609L9612j07477j32332L1694M3273P314j26752j00435j3762j50678
9133e30345q1699P6932o2000J50100J13740j79163k52323J00230J41189Q5268
9123d38071J46596K97150K51735J34978j12108j97188o2764k3377O3661J28645
9113A89257j38764J8369N3147M4697j38767l40040m7855J22498o2234j50994J946
$$ y = [-430961, -455216, -528702, -507370, -403084, -203646, -221303, -379856, -346953, -418587, -509811, -270212, -92751, -75978, 63359, 130202, 77368, 43048, 202247, 232061, -92594, -483408, -736416, -735955, -586948, -437869, -232072, 7152, 58069, -58063, -234502, -199923, -197876, -156707, -139433, -248235, -263601, -182299, -222486, -470399, -422672, -139781, 109460, 147846, 52807, -20802, 18810, -88667, -220999, -189305, -146032, -138718, -265470, -365905, -379667, -530345, -612044, -535112, -597112, -447012, -333272, -512435, -764758, -664528, -523339, -438071, -291475, 5675, 257410, 392388, 280280, 83092, 20328, -3049, 60612, 189257, 50493, 68862, 122009, 166706, 27939, -312101, -359956, -237458, -299692, -450686, -448740]
9102d48740Q2624K1025l3931p7269k82255k09993L0531N4496J55642J76778P2919
9091d58173J1038q2019M163Q1523j19487k09055J10337J97656J64351M6966R3282
9080a59418j22389j96583J24126J08625q2231l5310M4489j5516Q10k1010j04589
9069d58996l9229Q6779o5619j09008q1256J30021J51918K43463J25809J17055
9059A00937J62820J927k4850o4266k16317k18095j23378j8386J32647J73469J72483
9048G8991j13198k31112n2182J80019N3781J4502O3760M5195J28057j14332k19812
9037a66331o8783q892M0678J44788q1290k27415j60361n3114L5455K69054L49516
9026G3305K91341P9481k21059l09498j88516j52377L042K6475L9483J40700J42963
$$ y = [-448740, -366116, -345091, -379022, -456291, -738546, -948539, -918008, -863512, -707870, -531092, -458173, -447135, -529154, -524991, -443468, -562955, -772010, -661673, -464017, -299666, -252700, -159418, -281807, -478390, -354264, -245639, -327870, -363180, -318691, -334207, -333397, -354407, -458996, -498225, -411446, -477065, -586073, -667329, -537308, -385390, -141927, -16118, 100937, 263757, 265684, 240834, 176568, -39749, -257844, -381222, -399608, -266961, -93492, 78991, -34207, -265319, -317501, -137482, -83701, -69199, -5439, 39756, 167813, 53481, -166331, -235114, -244006, -203328, -58540, -139830, -367245, -527606, -580720, -545265, -276211, 73305, 364646, 444127, 223068, -86430, -274946, -427323, -424281, -397806, -358323, -217623, -74660]
9015g4660k104j35987l3337J7339j2141N4527K04686L020j81826j53834O6416
9004b47901K5790Q5337L5335J6758j03829k77620j57103J08063J53289K3897j362
8993c39346K8333J06757K52792J71868m3888k91833j90755p9506L0281L3037N7518
8982b64742J21755J55296P5378N7589M7572Q6043r5626j56049L9790J38985R1609
8971B97600K2661R7203J0808L0793j9962k04467k82006n7357K90326J24938n0418
8960B60119j69450k76668q3044j32622j44916j09939j45744q1637J0549J21477
8950g51875K54566K75312K93149p921j15936j10986o7971r576j67338k26108n6805
8939f91489J08167K48437J97322j32940j25326M9023l7727k9727J8812J49323
$$ y = [-74660, -76764, -212751, -246088, -228749, -240890, -186363, 18323, 21343, -160483, -314317, -247901, -222111, -136774, -101439, -84681, -188510, -466130, -623233, -515170, -361881, -337984, -339346, -311013, -204256, 48536, 220404, 176516, -115317, -306072, -385578, -355297, -322260, -264742, -142987, 12309, 87687, 145276, 192848, 278891, 183265, 27216, 67006, 205991, 297600, 320261, 417464, 428272, 459065, 439103, 234636, -47370, -104727, 185599, 310537, 260119, 90669, -185999, -269043, -401665, -546581, -656520, -802264, -883901, -873352, -751875, -497309, -221997, 71152, 63231, -52705, -163691, -231662, -241238, -408576, -634684, -691489, -583322, -334885, -137563, -270503, -395829, -346806, -384533, -414260, -395448, -246125]
8929b46125L10580K06776m3872j52810J63045l5098k68751k37950l53621l17402
8919i75228K2058J67016L9562J08602J18012J06177K91858K66021J39714k55905
8909B7887l55113m6619R8013p8238k6518J75691K1861O678R6517k5278o5423O9578
8897a00964j01407j31218M4126K61920K69917j14863l02181r362O3544M2957m8524
8886a26055M4736O3207o3329J04930L8060r828r3686j45030j43994j35409J21063
8875c45335K85240K08217J30170k17424k41736q4088J03770J85730J00884J48160
8865B73588O6595k11154l36964l14816j14972M2774l2095P3010K81366J64091
8855a08577N4726P8431r2966k47224n1299N8408o332j24665k7348K47469J85627
$$ y = [-246125, 64455, 271231, 227359, 74549, 237594, 202496, -66255, -304205, -657826, -975228, -953170, -786154, -746592, -637990, -519978, -413801, -121943, 144078, 283792, 27887, -327226, -373845, -275832, -354070, -380588, -204897, -183036, -176358, -79841, -105119, -170542, -100964, -202371, -333589, -289463, -27543, 242374, 127511, -174670, -184032, -120488, -77531, -126055, -81319, -18112, -81441, 23489, 61549, 51721, -41965, -186995, -330989, -466398, -345335, -60095, 148122, 278292, 60868, -180868, -264956, -161186, 24544, 125428, 273588, 340183, 129029, -207935, -522751, -637723, -594949, -627044, -554034, -272668, -108577, -53851, 24580, -68386, -315610, -366909, -308501, -314833, -439498, -466846, -219377, -33750]
8844c3750J03698j13896k70265j63695M4871J49952J88705J69858J22467k248
8834A95697q5927j58864k83208k85873j44160j05988j44475j13389j949l515J73580
8823i58071R8973k00611j48418J97568M44568M33728J85502l4837k54994j17477
8813c54069m3951j36923j55082O084J36857J55121M6533k47681n6135J57729K86664
8802b04853J96718j21777j92484l9509J44354J21185p7886j09434q1907o1441
8792d27034L6852O9864J942j53259k26255n0409R9839J05487j29481k4890N182
8781f92162j3126K75735J41714j27795q8028m7690J15950J9494j62725P0148J07595
8770d00890n3929J03360K80537K27855J38528Q0280j20555k53007l06491l1089
$$ y = [-33750, 69948, -43948, -314213, -477908, -433037, -283085, -94380, 75478, 197945, 195697, 109770, -49094, -332302, -618175, -762335, -868323, -1012798, -1126187, -1128136, -1131651, -958071, -859098, -1059709, -1208127, -1010559, -565991, -132263, 53239, 18402, -236592, -354069, -398020, -534943, -690025, -683941, -547084, -391963, -345430, -593111, -649246, -491517, -204853, -8135, -129912, -322396, -361905, -217551, -96366, -174252, -283686, -365593, -427034, -390182, -320318, -318376, -471635, -697890, -748299, -648460, -542973, -672454, -697344, -692162, -705288, -429553, -287839, -415634, -503662, -551352, -435402, -415908, -578633, -508485, -400890, -454819, -351459, -70922, 156933, 295461, 375741, 255186, 2179, -304312, -335401]
8760c35401J2937k04957q0862J26415J67409J73635J19669q0599k65165j31379
8750d98298p0115p7979n2812M441R8256R6854J4036J9942N4358O1288J48696J28899
8738g2434K7416j05042j87085n3090R1110J95554N6182J5148j27474o1375k1930
8727b43020j27752J09411J27886J29050p1133k18183L5854J75887k3720j47772
8717b53492K6646o9753j55197K3827O9750J57192p4471k28149N2717J45879P7051
8706b28000J28435K7793j59815j27010k53652q8050J91076J01713j41553j70124
8696g19187J06977K75448K99205J25552j49275j93371j81156o8100r7507k390
8686f03804O9466K00287J10470j4854J17976m5517j17031J20284P9241j05744
$$ y = [-335401, -322464, -527421, -608283, -481868, -314459, -140824, -21155, -101754, -366919, -498298, -568413, -646392, -699204, -694763, -596507, -499653, -485617, -465675, -411317, -350029, -201333, -72434, -45018, -150060, -337145, -390235, -299125, -103571, -47389, -32241, -159715, -221090, -243020, -370772, -261361, -133475, -4425, -75558, -293741, -257887, -82000, -105720, -253492, -226846, -296599, -451796, -427969, -358219, -201027, -275498, -503647, -450930, -305051, -228000, -99565, -71772, -231587, -358597, -612249, -700299, -509223, -407510, -549063, -719187, -612210, -336762, -37557, 87995, -61280, -254651, -435807, -503907, -601414, -603804, -534338, -334051, -223581, -238435, -120459, -165976, -283007, -162723, -83482, -189226]
8676a89226R0369q4351o3215P8473Q6995R3305K07692J48884l971q8413k07875
8665F8667p0608o4739m1756L7565j18961j74274Q0251J10001j09382j45148r4176
8654e22560J05380p1585o9566j58576j16381J63285K80514K42682J6849q3610
8644b13568K7163L9454J98468J98632R4601J6475P9930r2247j62670j16966n6524
8633A2748K14450J05620k70567l91269J7095J74958O8357K5802o9039K1425O9457
8622b0963o059j38433L8490O2936q6700j72666j37024L6694K96060K32531q8907
8611A5959k58354p7491M9262N2383R9812M2381r5673o5361k28917o100K84904
8600a87195J21287o1536j03530l1259j03356q965J23489M5022R8482K32130J24197
$$ y = [-189226, -98857, -183208, -246423, -167950, -80955, 12350, 220042, 368926, 364955, 276542, 68667, -1941, -66680, -108436, -70871, -189832, -364106, -283855, -173854, -283236, -428384, -522560, -417180, -488765, -558331, -716907, -833288, -670003, -389489, -146807, -129958, -213568, -186405, -146951, 51517, 250149, 344750, 361225, 441155, 348908, 186238, 69272, 12748, 227198, 332818, 62251, -329018, -311923, -136965, -68608, -42806, -111845, -90420, -20963, -27022, -165455, -126965, -64029, -150729, -323395, -460419, -423725, -127665, 104866, 15959, -242395, -319886, -270624, -218241, -118429, -76048, -171721, -237082, -465999, -472099, -187195, -65908, -127444, -230974, -262233, -365589, -374554, -251065, -206043, -107561, 124569, 248766]
8589B48766j52842k08696r6482r5644q3223R4657N85J3539J5770k01138o4250
8578e28958N5771J22417J44141K38774K09960r968o5769P570M0210K744j29115
8567H7777j75822L1262R8342o4005j70148j47434j41874o1895N0052L37489K72618
8556A16362l1398j71862q9344J55574R0648K5783J20539J06066l2063j72474o5843
8545E1988J5470j05903j51187j6206J9204k6208k17663p9438J38554L1230J80509
8534a59650N5192j41152n5728K0929K13345J22212j00050r5285o9868r8661m3825
8523c52541l8092j53979N8437J91514K92875J25438j11948q0094P948K1940J4253
8512b4249M947j3866L4998K8783j55725k5609J15248K74340p6876j93812n8053
$$ y = [248766, 95924, -112772, -209254, -304898, -388121, -293464, -292879, -279340, -263570, -464708, -528958, -473187, -350770, -206629, 32145, 242105, 232137, 166368, 173938, 214148, 216892, 87777, -88045, -56783, 41559, -22446, -192594, -340028, -481902, -543797, -493745, -156256, 116362, 84964, -86898, -176242, -20668, 69980, 95763, 216302, 322368, 290305, 117831, 51988, 67458, -38445, -189632, -205838, -186634, -212842, -430505, -509943, -371389, -340159, -159650, -104458, -245610, -301338, -280409, -67064, 55148, -44902, -140187, -210055, -308716, -352541, -390633, -544612, -486175, -294661, -1786, 123652, 11704, -68390, -60442, -38502, -24249, -19302, -33168, 1830, 30613, -125112, -150721, -35473, 238867, 161991, -31821, -89874]
8501h9874l377R4087p1025l97150o4839K56629Q4778p5959n7212n0920M8517M7594
8489b78751q6948k256K00325P4642J01083K02795o1887r9350j8147r0680q4330
8478a43504K07776J26459K14o0286r3340j89660j24899J09834J00525O09J15934
8467D9662J92358m7118j50719L5128J45614j9379j17353J21934J27513J47034
8457D84674K63731j03490j97601m6665k25589L6835J09272k15244k40341j24256
8447b58674K7829J47442R5299J64966J71427J82698l4999k59189k77239j98535
8437b38975K3593J58022O6415J00738N771N6331K20957j40984l23260L3702J97751
8426A60061J05651J03258j93165j86129P9703J86302j95248j66295P8507J88501
$$ y = [-89874, -93251, 836, -70189, -467339, -532178, -275549, -190771, -266730, -323942, -374862, -326345, -278751, -365699, -367955, -167630, -92988, 8095, 210890, 149003, 49653, 31506, -59174, -143504, 64272, 190731, 190945, 130659, 37319, -152341, -277240, -167406, -66881, -66272, 49662, 242020, 194902, 44183, 79311, 224925, 205546, 88193, 210127, 337640, 484674, 748405, 644915, 447314, 400649, 175060, 211895, 321167, 105923, -134418, -258674, -230845, -83403, 11896, 176862, 348289, 530987, 495988, 236799, -40440, -238975, -215382, -57360, 9055, 109793, 115564, 171895, 392852, 251868, -71392, -37690, 160061, 265712, 368970, 175805, -10324, 69379, 255681, 60433, -105862, -27355, 161146]
8416A61146K29089J54918N6617n9218o3693l2617j94411j97995l3918J49415l7504
8405A31829j75892K9941J28040j58142j23040R7689o2199k6205k0169K164O2489
8394a13495K1616P962m4411N4074q5233r5354J32931L74846J39207j39839L0944
8383B83248L0930J1959J15043P7638k0762j07040j35199r3286r7826l1936m341
8372B8428M9629L1969j37994q1341J58879K33802j70501k71021M1259J54177J2213
8361D9499q9401P276M1552Q1045J48171n6133j60602J29081J48296J64149J51808
8350F14741p3069j30096j82693j20218o2446m0669J49509K90204R3930p2181j96067
8339B70945k08647k7162K10557K28142J20233N8102o0283j56675l82251l14789
$$ y = [161146, 390235, 545153, 601770, 542552, 478859, 446242, 251831, 53836, 19918, 169333, 131829, -44063, -14122, 113918, -44224, -167264, -69575, -131774, -157979, -178148, -175984, -113495, -91879, -83917, -128328, -74254, -159487, -254841, -121910, 252936, 392143, 252304, 283248, 314178, 326137, 441180, 518818, 498056, 391016, 255817, 162531, 64705, 32769, 28428, 78057, 110026, -27968, -109309, 49570, 283372, 112871, -158150, -116891, 37286, 49499, -39902, -32626, 8926, 89971, 238142, 182009, 21407, 150488, 298784, 462933, 614741, 541672, 411576, 228883, 108665, 46219, 5550, 155059, 445263, 539193, 467012, 270945, 62298, 35136, 245693, 473835, 594068, 652170, 591887, 435212, 52961, -261828]
8329b61828j39365m2088J07630J65830J11110N2524Q3245q929j10155j0973K03105
8318A50106K1175o2904J46292R1099M0918J35126J19650o2604N1882K3405J6947
8307F71092n7393o6499Q0846j6586p2967m6544k1633r4433L8076J28456K16528
8296G58943K01378l9780j35930j32903k50932l96381j60578J16104J14763Q3520
8286A58204J53295R6682J07007R9404J10247M9355j43406j86584N244K671k09172
8275B42947j05017K19952M32177O2890k08339j86591M1810J60069j04244k16289
8265C39365j14545Q0085K5765j14860l4048j4937R1353K07303K23016N5196r5358
8254F48335p4921P4441Q1250m5458P9583Q330l29326k06176Q9894N6197m1343
$$ y = [-261828, -401193, -443281, -335651, -169821, -58711, -6187, 77058, 68129, -42026, -52999, 150106, 171281, 108377, 254669, 345768, 386686, 521812, 641462, 578858, 630740, 654145, 671092, 613699, 547200, 628046, 611460, 538493, 491949, 470316, 375883, 413959, 542415, 758943, 960321, 920541, 784611, 651708, 400776, 4395, -156183, -40079, 74684, 158204, 311499, 408181, 515188, 614592, 724839, 774194, 630788, 444204, 449448, 452119, 242947, 137930, 357882, 790059, 852949, 644610, 458019, 499829, 659898, 555654, 339365, 224820, 304905, 330670, 215810, 181762, 166825, 258178, 465481, 688497, 743693, 648335, 573414, 647855, 729105, 683647, 763230, 771560, 442234, 236058, 325952, 382149, 340806]
8243C40806O0758J19846N765o7552j58929j05777J49471J05597j94332l38382
8233h2729j42048N4663J31226K10623J33141J54047m167k1973k0324N1894O7907
8222E32260K9719j46556q5027J43870O1317j3138K5517P7666N2108j6494p7052
8211E84190k0066K59957J97971j05619j10199k04190m5708J52497K6176j54164
8201E80845p1876p2852j68788j77859l6814K15603K59640J28118k59990j73063
8191B22964K0092R3936j29460j48830k8051K20197M27073K36389j2024p8718m833
8180H18735L2042j90387k79188k80302k0907J00666j6106K832R0035J74807Q7738
8169E19965l1025P8777O9352n0813N475J19629N1478m9298M2135N4328l5023j93014
$$ y = [340806, 401564, 521410, 527175, 459623, 300694, 194917, 344388, 449985, 255653, -82729, -224777, -170114, -38888, 171735, 304876, 458923, 454756, 432783, 412459, 464353, 532260, 561979, 415423, 330396, 474266, 535583, 522445, 547962, 625628, 677736, 661242, 584190, 564124, 824081, 1022052, 916433, 806234, 602044, 556336, 708833, 735009, 580845, 508969, 436117, 267329, 89470, 52656, 268259, 527899, 656017, 396027, 222964, 243056, 336992, 207532, 58702, 30651, 250848, 677921, 914310, 902286, 823568, 818735, 850777, 660390, 381202, 100900, 79993, 180659, 164553, 167385, 257420, 432227, 519965, 488940, 567717, 637069, 586256, 591731, 711360, 762838, 713540, 755675, 810003, 774980, 581966]
8157E81966j0147J70255K65j0608p2146j28598n7201m7786M0073K32112K34911
8146I33096o8095j6594j20609l26121j66363m7375J38118J69566k1694J67752
8136F41681J08236J12663P6561j0799m3079N2770o0726j60660o2923q515n3112
8125E92097J8832Q4434j49402q4404j0294P9471J55192R8300o6808M8367J00859
8114H66644K6868r0238m3113J49124J07187L7852K55421K17832K829J2011M444
8103A546861l65370k92769J02546J64215j06386j8348J01586N3050M6756J69735
8093A401876O0193j15870o0118K2109M9475O9740o1065m894P8758k47663l03150
8082H89391n420J57456R499n5937k96493l33832M6055J97814K81097K9747j80281
$$ y = [581966, 571819, 742074, 742339, 731731, 659585, 530987, 473786, 426000, 466073, 698185, 933096, 865001, 848407, 727798, 401677, 235314, 187939, 326057, 495623, 473929, 641681, 749917, 862580, 939141, 928342, 885263, 938033, 877307, 716647, 653724, 645209, 592097, 610929, 695363, 545961, 461557, 451263, 530734, 685926, 784226, 717418, 765785, 866644, 893512, 803274, 760161, 909285, 1016472, 1054324, 1309745, 1527577, 1530406, 1542417, 1546861, 1181491, 888722, 991268, 1155483, 1049097, 1030749, 1132335, 1185385, 1232141, 1401876, 1462069, 1346199, 1286081, 1308190, 1357665, 1427405, 1366340, 1361446, 1440204, 1192541, 889391, 883971, 1041427, 1050926, 994989, 698496, 364664, 410719, 608533, 889630, 919377, 739096]
8071G39096j55879j4509J96111L18544L33405N2706O909n9650n3055j16420o5938
8060A181320l2981j64700k0873J34577K42542J24720J69445O1466k24284o6939
8050A404293P8599N7624P9277J04133p956n7644J4791M2914Q266L9004j98909
8039A564392p2062K52096K84757L5106k43846j35212J56411J56214J09714q4720
8029B022850k6516Q0186P318q0925n2166q1950l501K08983J61028J44707K57846
8018B637860M01136J99883j0963j64437J7877L29520N33565N34454M14965M40630
8008E334490O35053O31031Q45864J171707J538527J809718K090303L109443M283011
7999B1449147N144969N484662N087999M059122K336268N09484j431299l259230
$$ y = [739096, 583217, 568708, 764819, 1083363, 1416768, 1469474, 1476383, 1416733, 1363678, 1247258, 1181320, 1148339, 983639, 962766, 1097343, 1339885, 1464605, 1634050, 1695516, 1471232, 1404293, 1482892, 1540516, 1619793, 1723926, 1715970, 1658326, 1673117, 1716031, 1724297, 1763301, 1564392, 1492330, 1744426, 2029183, 2064289, 1820443, 1685231, 1841642, 1997856, 2107570, 2022850, 1996334, 2076520, 2083838, 2002913, 1950747, 1868797, 1865296, 2074279, 2235307, 2380014, 2637860, 3038996, 3238879, 3227916, 3063479, 3081356, 3410876, 3944441, 4478895, 4893860, 5334490, 5969543, 6600574, 7446438, 8618145, 10156672, 11966390, 14056693, 17166136, 21449147, 26594116, 32078778, 37166777, 41225899, 43562167, 44071651, 42640352, 39381122]
7991C9381122m541359m848945m452652l862096l183474k532003j870607j422431
7983A2667555j085936p45657n19217n71417k04324J7264J30727L11775K26914
7974A0227684N1879K02149l1062n17096q31635q49969p00297l08168j08286n4046
7964G081153J54451N8331r8817o8459J54214K36818L30472O76915P14851N14139
7954I754068L77109P78422J412307J817738K129516K623592L424289M655532O119000
7945C3091573P978625J0319707J2789507J4951230J6286389J5871551J3095090
7938A24383672P915174J072495n910434j1349255j4285774j5107070j4041541
7931G2677267j1887695r668432p467853n762680m644776l651556k689627k120158
$$ y = [39381122, 34839763, 29990818, 25538166, 21676070, 18492596, 15960593, 14089986, 12667555, 11581619, 10835962, 10316745, 9745328, 9541004, 9558268, 9688995, 10000770, 10227684, 10279563, 10481712, 10450650, 9933554, 9101919, 8251950, 7551653, 7243485, 7135199, 7081153, 7235604, 7293935, 7195118, 7126659, 7280873, 7517691, 7848163, 8525078, 9239929, 9754068, 10131177, 10909599, 12321906, 14139644, 16269160, 18892752, 22317041, 26972573, 33091573, 41070198, 51389905, 64179412, 79130642, 95417031, 111288582, 124383672, 132298846, 133371341, 127460907, 116111652, 101825878, 86718808, 72677267, 60789572, 51121140, 43653287, 37890607, 33245831, 29594275, 26904648, 24784490]
7923B4784490j679572j030373l61108J168J24766L16010K96437k0727p32819j232679
7913B0465593j318387j294762j163063j200378r32181n28443l95431j9700K07711
7904A3820959J62403K00644J30016J80809O76003J131737J306845J642687K023534
7895B1275637K526487L173901M116549N616442P216251R184173J2044199J5875478
7887H1029117K0451285K5488663L0141939L2762203L1675386K5763039J5084985
7880B62396617J292013j2255433k2944466k9248469l0549800k8087168k3897915
7873A16705379j9388986j5291639j1699699r167340p281067n506866m401359l502446
7865D0465977k545071j437721o54606l07160j23394j43348n38637j247668j756367
$$ y = [24784490, 23104918, 22074545, 21713437, 21714605, 21839371, 22155381, 22451818, 22431091, 21698272, 20465593, 19147206, 17852444, 16689381, 15489003, 14556822, 14028379, 13632948, 13613248, 13820959, 13983362, 14184006, 14314022, 14494831, 15170834, 16302571, 17609416, 19252103, 21275637, 23802124, 26976025, 31092574, 36709016, 43925267, 53109440, 65153639, 81029117, 101480402, 126969065, 157111004, 189873207, 221548593, 247311632, 262396617, 263688630, 251433197, 228488731, 199240262, 168690462, 140603294, 116705379, 97316393, 82024754, 70325055, 61157715, 53876648, 48369782, 43968423, 40465977, 37920906, 36483185, 35828579, 35521419, 35398025, 35254677, 34716040, 33468372, 31712005]
7856C1712005k034709k258161k461633k126523j603296j092281o31884n35606
7848A8967912m04194l18046j84844K36652O51459R69744J205554J533930J816503
7839B4474670K111878K763969L771789M919888O378546Q341981J0968754J4355883
7831G8087358J8604532K3908457K9933298L5469764L8503955L7070041K9896722
7824B91474127J7226197R66217j5501783k8018392l4831562l6281191l3223733
7817A61809880k7977954k2389433j7534605j3857446j1009748q700384o979992
7810E3360318n625855m330440l321096k506031j691814j036987p00810p61680
7802C3385605j097025j439839j784529k000813j990162j864388j506721j241130
$$ y = [31712005, 29677296, 27419135, 24957502, 22830979, 21227683, 20135402, 19503518, 18967912, 18563718, 18245672, 18060828, 18297480, 18948939, 19918683, 21124237, 22658167, 24474670, 26586548, 29350517, 33122306, 38042194, 44420740, 52762721, 63731475, 78087358, 96691890, 120600347, 150533645, 186003409, 224507364, 261577405, 291474127, 308700324, 309666541, 294164758, 266146366, 231314804, 195033613, 161809880, 133831926, 111442493, 93907888, 80050442, 69040694, 60340310, 53360318, 47734463, 43404023, 40082927, 37576896, 35885082, 34848095, 34147285, 33385605, 32288580, 30848741, 29064212, 27063399, 25073237, 23208849, 21702128, 20460998]
7794B0460998r73182o82909l68450k01148k85108q4311K30415L60531O67753R40866
7784B0065455Q71457J244768K116414K670070L328132M294886N554007P071423
7776D7216612R138176J2237032J5973803K0328384K5244628L0028784L2618067
7769A92785486L1225803K4822302J3794237J39588j3478206k4007484k9719717
7762A95562009l0543431k8105822k3945154j9289486j5107652j1880456r615176
7755E7074832p547225o087029m941515l983362l205921k417066j741309j356392
7747B5795013j217252j241486j283771j299853j289137j224958j083232r82953
7739A6172371j037628r79621o49320n39957p37051m90631j25233l0814K0576R7026
$$ y = [20460998, 19487816, 18804907, 18436457, 18235309, 17950201, 17865890, 18096305, 18456836, 19124589, 20065455, 20936912, 22181680, 24298094, 26968164, 30296296, 34591182, 40145189, 47216612, 56354788, 68591820, 84565623, 104894007, 130138635, 160167419, 192785486, 224011289, 248833591, 262627828, 262767416, 249289210, 225281726, 195562009, 165018578, 136912756, 112967602, 93678116, 78570464, 66690008, 57074832, 49527607, 43440578, 38499063, 34515701, 31309780, 28892714, 27151405, 25795013, 24577761, 23336275, 22052504, 20752651, 19463514, 18238556, 17155324, 16172371, 15134743, 14155122, 13505802, 12965845, 12228794, 11738163, 11612930, 11582116, 11602692, 11699718]
7729A1699718J79355M21157O07104O78340P31786J178386J786056K163781K777235
7720B2222918L524898M531106O218563Q122737J0271035J2587062J5182462J6380662
7712I9041443J5205765J1836695O524153k42663p137130j2324774j5005667j5373229
7704H2524593j4014413j1985387r680912p552528n713018m712521l895131k954540
7696B2016143k533014k068143j667449j287321j242773j310418j011696p64532
7688A0130797o66263o92271o54460n46974l94398l45147l54416k98935j90181
7679E987752k49153k80980j80298k2162n0351j13970Q4360P4019K8804K07366
7669E485387L53591K56289L94245N15350O20570P10941J015197J635169K126417
$$ y = [11699718, 11879073, 12300230, 12907334, 13585674, 14317460, 15495846, 17281902, 19445683, 22222918, 25747816, 30278922, 36497485, 44620222, 54891257, 67478319, 82660781, 99041443, 114247208, 126083903, 132608056, 132365393, 125228263, 112903489, 97897822, 82524593, 68510180, 56524793, 46843881, 39291353, 33578335, 28865814, 24970683, 22016143, 19483129, 17414986, 15747537, 14460216, 13217443, 11907025, 10895329, 10130797, 9464534, 8772263, 8117803, 7570829, 7176431, 6831284, 6476868, 6177933, 5987752, 5738599, 5457619, 5277321, 5255159, 5204808, 5090838, 5175198, 5249217, 5278021, 5485387, 5838978, 6095267, 6489512, 7004862, 7625432, 8336373, 9351570, 10986739, 13113156]
7660A3113156K498636L191285L932794M765089N228767M722593L634367K174599
7652D3261286k3615k243238l725873m665644m995737m561550l715005l153709
7644A6176915k738757k213480j550128j210243r68139r06642q67036q41191m43995
7635D437304l31788l77499k35298l24931l43566j35200j01490p7191p0467j01831
7625B338043q8567j43515k01402k16866q7773N8658P8923M2795n2499k07091k46897
7614A273809r1322R7116J13332L7493N0805R1770J67617J2101n4242j51133k93533
7603A253813R790O2287J0773q0942j68650j70848O437J01163j50644j88093K6198
7592G11284Q6005n9920n1719J5397k1463M0673J20911K23157j4253l20392k19041
$$ y = [13113156, 15611792, 18803077, 22735871, 27500960, 32729727, 37452320, 41086687, 43261286, 43237671, 40994433, 37268560, 32602916, 27607179, 23045629, 19330624, 16176915, 13438158, 11224678, 9674550, 8464307, 7496168, 6589526, 5722490, 4881299, 4437304, 4105516, 3728017, 3492719, 3167788, 2824222, 2689022, 2587532, 2510341, 2439874, 2338043, 2249476, 2105961, 1904559, 1687693, 1599920, 1658578, 1737501, 1780296, 1727797, 1520706, 1273809, 1182487, 1279603, 1392935, 1430428, 1481233, 1573003, 1740620, 1752721, 1698479, 1547346, 1253813, 1263603, 1325890, 1336663, 1255721, 1087071, 916223, 922660, 1023823, 873179, 685086, 711284, 797289, 737369, 685650, 701047, 679584, 720257, 841168, 1064325, 1050072, 729680, 510639]
7581E10639j30323K6041K14471K00834J55890J35427R3295r0853j58649j74150
7571G82622j33677m108j67589r7490K8886j0219j06424J72437L28211j714j3819
7560G77116j04207p6332J32295J2982j59216j24429M917r5781k20153N934K07969
7549C61095O668k4720p9871j74480k5900O8104L10122J34644n8720j49230p4917
7538B92795J57842J94660p5907n6901J0299o2826k00284j32217J2977K25079J60201
7527E25718l0916P2671J39928p5789j34537l7336r2178l3700M7999J48182o4592
7516D65450k21981j07613M7887J92984J52037N9140N8235R5239Q8982K0351j5827
7505H34884j7287J3374k48577l54756j6188J91597K03213J81259m8345j08925
$$ y = [510639, 380316, 406357, 620828, 821662, 977552, 1112979, 1206274, 1115421, 956772, 782622, 648945, 644837, 477248, 379758, 408644, 398425, 292001, 464438, 792649, 790935, 777116, 672909, 596577, 728872, 741854, 582638, 458209, 463126, 367345, 147192, 153126, 361095, 367763, 343043, 263172, 88692, 62792, 130896, 441018, 575662, 516942, 367712, 292795, 450637, 645297, 569390, 512489, 522788, 459962, 259678, 127461, 140438, 365517, 525718, 494802, 567473, 707401, 631612, 497075, 459739, 367561, 333861, 381860, 530042, 465450, 243469, 135856, 183743, 376727, 528764, 587904, 646139, 741378, 830360, 850711, 834884, 817597, 830971, 582394, 227638, 211450, 403047, 606260, 787519, 739174, 630249]
7495F30249j1702P2270J43738q5844k08784q5472n1776j42620Q1983m7133q8241
7484B06668J30740m7817j10893J4656K25614J34060J8214j58569o1375J38892
7474D90190k5309k1503l6092J2651J61803P9537J04854Q8119m4821l15465l10285
7463A83679j93369n3484K37625K67142Q863k65898k80109r4167K65122J68727
7453B44131l3908J46494j12784j49681r7248l7708J50844J14681N6034J09198
7443C90053R2791j46358m5977l229j77310j44124l9816j36229k27079j02946J06455
7432d33769J95350L14323K2138k47480k3017q0718M7306J31761j52291r5342J2610
7421c09129K20899K59419J84459M4634j44241q3739J52587J64070J89857n7247
$$ y = [630249, 618547, 690817, 834555, 748711, 539927, 454455, 402679, 260059, 342042, 294909, 206668, 337408, 289591, 178698, 193354, 418968, 553028, 571242, 412673, 351298, 490190, 464881, 443378, 407286, 419937, 581740, 661277, 766131, 854250, 809429, 493964, 183679, -9690, -63174, 174451, 441593, 450456, 184558, -95551, -189718, 75404, 244131, 210223, 356717, 243933, 94252, -2996, -40704, 110140, 224821, 280855, 390053, 482844, 336486, 290509, 287280, 109970, -34154, -73970, -210199, -437278, -540224, -433769, -238419, 75904, 98042, -149438, -172455, -253173, -205867, -74106, -226397, -321739, -309129, -88230, 171189, 355648, 400282, 256041, 172302, 324889, 488959, 678816, 621569]
7411F21569k34736j08849j00798j33082m136j02786R4640K30717K35323J95841
7401F93703o9446k00715j8565O7654M4509P1581J01054j21194l66673l13625P4692
7390c7025L28295J13475r9895R4010R5264j24729j70950j85227j2981L9802o4811
7379b4772R599m0087o9564j9295K04463J26410j68789j59568j63071l3301O0736
7368b77239K4282J33169N035j31581M7522k105q4510J36696J50765k9858K3129
7357d695q378R994r7315k8904k536j06080j57997K2283N0497M5938K44132n363
7345c8424j29386L3725J85270K34793J07347q4520J8888O7217J31323R1545r9643
7334E18135p4766j34976j44358r8341L3715K00668K38422K8746k14317j79568
$$ y = [621569, 386833, 277984, 177186, 44104, 39968, -62818, 31822, 262539, 497862, 693703, 624257, 423542, 404977, 472631, 517140, 588721, 689775, 568581, 201908, -111717, -37025, 291270, 404745, 304850, 398860, 494124, 369395, 198445, 13218, 237, 40039, -24772, -15173, -55260, -124824, -144119, 60344, 186754, 17965, -141603, -304674, -337975, -277239, -252957, -119788, -114753, -246334, -198812, -200917, -285427, -148731, 2034, -27824, -4695, -13073, -3079, -100394, -129298, -131834, -237914, -395911, -373628, -323131, -277193, -33061, -38424, -167810, -134085, 51185, 285978, 393325, 308805, 327693, 394910, 526233, 617778, 518135, 443369, 308393, 164035, 65694, 99409, 300077, 538499, 567245, 352928, 173360]
7324A73360J03212P6346n7574p7185n6045J35733m641n2871J32088J5375l0262
7313C57536j56667p8539M7351P9380J83815j3556k26427j57456m7251m5110J08513
7302E1589L17229K43200m0460n1360J34291M2288j05239l2787j46916j90072m8157
7291A73606n4397j86151k18835k57159q2261J09228j06028j42887j60731J20397
7281h05218L09366J89987J3769P2640R3192P3381R3706M3850p8316m4777q7717
7270a26137j47989m6422J63298O8295R9147J74364J04800J6262L0134P6378m8108
7259C64022k27585j89275j43541m5443k1847J44963J29320O1888O9772J08464
7249B50738K31538J85845j72365k91306m9020l1768j6205J54629R4813N5910Q2465
$$ y = [173360, 276572, 352918, 295344, 218159, 162114, 297847, 293206, 240335, 372423, 387798, 357536, 200869, 122330, 169681, 249061, 432876, 419320, 192893, 35437, -11814, -56924, 51589, 368818, 612018, 571558, 520198, 654489, 696777, 591538, 558751, 411835, 221763, 173606, 119209, -66942, -285777, -542936, -625197, -515969, -621997, -764884, -925615, -805218, -495852, -305865, -292096, -219456, -126264, -52883, 40823, 84673, 6357, -38420, -126137, -274126, -320548, -157250, -88955, 10192, 184556, 289356, 305618, 335752, 412130, 364022, 136437, -52838, -196379, -241822, -263669, -118706, 10614, 72502, 142274, 250738, 482276, 668121, 495756, 204450, 155430, 123662, 107457, 262086, 356899, 412809, 495274]
7238D95274P5106L313J0111J28042J47102j876l46766m29967l63221n3027K26318
7227a09591J56082n8639K7643l3939L6054K14795O2403J21812P0361j30406o2119
7216B94456q9321r8080j7508J30020J49652N895l6253j21581j21972r127m4291
7205D1890o822J7248K968J84431R6716r6022j8559o4777j60746j24703O2141J58388
7193I2153j559J4761q115Q1258J40269r6565k06910m1530J11768J57756J86354
7182D29640n2533k99796j30164P3937K55119R4181p8541R600J82125j30269j65395
7171A87904k3672J35841K31270J28796m4680k11654j82960k06941j14679j25372
7161b26147J87765J75402K26895K51741j2731k06445k37436j87889j29279J52177
$$ y = [495274, 570380, 573693, 583804, 711846, 858948, 857072, 510306, 80339, -282882, -335909, -109591, 46491, -12148, 15495, -18444, 17610, 232405, 294808, 416620, 486981, 356575, 294456, 205135, 107055, 89547, 219567, 369219, 375114, 338861, 217280, 95308, 86181, 41890, 35068, 52316, 55284, 239715, 336431, 240409, 221850, 157073, -3673, -128376, -66235, 92153, 90594, 105355, 97240, 178498, 318767, 222202, 15292, -26238, 85530, 243286, 429640, 377107, 77311, -52853, 21084, 276203, 370384, 291843, 301443, 483568, 353299, 187904, 164232, 300073, 531343, 660139, 615459, 403805, 220845, 13904, -100775, -226147, -38382, 137020, 363915, 615656, 602925, 396480, 159044, -28845, -158124, -5947]
7151e947K97364k37489l3244L18414K8692k64492j82260p5989R8762K00239P5716
7140B19766O0249J32358q4524j72347k8874J59383J85558j72056k63079m0435
7130d001J06934J5359N970R0905M467J2942k561l3398j37003j80539L2822O7480
7118b0623q8564o691r5644Q6315Q7144N9573R8649J4517m0934j08272k22678j99756
7106d36964r0318j47602P179K69027K88778J83203J01243l1040j75619j16878
7096a48991R8393J72436J12663j1760r6012r0187K5736Q4893J04481l629l2247
7085B15776M1802N5623j07546j39720q2207j33691r3670O2263l0603j05090o935
7074c23998l5827j01933K3745K2451P024K19587J00789j15362j74160j28946J45683
$$ y = [-5947, 291417, 53928, 20684, 339098, 367790, 103298, -78962, -154951, -56189, 144050, 219766, 280015, 412373, 327849, 155502, 126628, 286011, 471569, 299513, 36434, -4001, 102933, 118292, 124262, 215167, 219634, 232576, 230015, 196617, 59614, -120925, -88103, -20623, -109187, -115878, -211522, -125207, -38063, 21510, 120159, 134676, 93742, -14530, -237208, -436964, -527282, -674884, -667705, -398678, -109900, 73303, 174546, 143506, -32113, -148991, -50598, 121838, 234501, 222741, 126729, 36542, 62278, 147171, 251652, 248023, 215776, 257578, 313201, 205655, 65935, -16272, -149963, -243633, -181370, -211973, -317063, -323998, -359825, -461758, -438013, -415562, -408538, -188951, -88162, -203524, -377684, -506630, -360947]
7063c60947K3777l328J71562K26009K011j21055j34722K8140j9424j41946M4897
7052b85026K38981J22778J06823Q56j15965n2310N8473K00315J16815k84596l73389
7041b66245r2869j1137J42862K02273Q9268O9147Q2514K13044L71931J23022k00824
7030G22986l40199k01179j89757p5699R6574P0067n1562j65893O6512J54040K3138
7019A09028j02382j76405p4487J5846J08965J7066l3377l9068j7655J33045j82011
7008b41435j54598K29158L34971L29234J24853k31348m84208j62577N8080J2368
6998a85502q1485n1662K17280K57457J14288N4400J3716o8481K1063Q5753r9490
6987B77337k75143j53332N7345K9314J18066J2769Q202Q0162k9711p1534J17247
$$ y = [-360947, -337170, -340498, -168936, 57073, 59084, -61971, -196693, -168553, -187977, -329923, -285026, -46045, 76733, 183556, 184412, 68447, 16137, 74610, 274925, 391740, 107144, -266245, -359114, -370251, -227389, -25116, 64152, 133299, 215813, 428857, 800788, 923810, 722986, 382787, 181608, -8149, -83848, 12726, 82793, 31231, -134662, -68150, 85890, 109028, 6646, -169759, -244246, -228400, -119435, -102369, -135746, -174814, -192469, -59424, -241435, -396033, -166875, 168096, 497330, 622183, 390835, -93373, -255950, -197870, -185502, -266987, -318649, -101369, 156088, 270376, 324776, 338492, 270011, 291074, 376827, 277337, 2194, -151138, -93793, -64479, 53587, 66356, 74558, 154720, 125009, 53475, 170722]
6976A70722J30586J24361J49978m0459j58978k58829k30147j27176M6579l0448
6966b23811R9576K35705K06199K20011J74709m346j78444l7907J95978O1705j88327
6955E61048l98072l25999j5967M0014J96156J71846q55J75989J74092J3938n6895
6944E35295o7883J05475r108j99883j71752j93910m4485J01076R3467K15692P0076
6933D34060k82686k16384M1994J33051k06959j79090J51152m23j0045L1947R2109
6922a1274K2646j12297j16108M5379L01256J43324j52917k17637K5632J41101
6912F9105O2248j79328k05214j39776j01614N3575K05515J92561N7767O160L6165
6901E7164J7342j03520Q8463J73410J34995j07027j25693J16204L7009N0754K3646
$$ y = [170722, 301308, 425669, 575647, 535188, 376210, 117381, -112766, -239942, -193363, -223811, -124235, 111470, 317669, 537680, 712389, 708043, 529599, 491692, 687670, 749375, 561048, 162976, -163023, -178990, -138976, 57180, 229026, 228171, 404160, 578252, 592190, 535295, 467412, 572887, 563779, 363896, 192144, -1766, -46251, 54825, 148292, 363984, 434060, 151374, -65010, -23016, 110035, -96924, -276014, -124862, -125285, -135330, -103383, -11274, 11372, -100925, -217033, -171654, 129602, 272926, 120009, -97628, -71996, 69105, 131353, -47975, -253189, -392965, -494579, -441004, -235489, -42928, 14839, 20999, 57164, 74506, -29014, 59449, 232859, 367854, 260827, 135134, 251338, 288347, 339101, 362747]
6890C62747k29024k31968j94659M4897K13259J67291P9493k7927J05786M2174
6880C32069n8954j74154j05144p6249j19843p0612J2381j2979J47213Q0999K5373
6869a9900P869M0859l142k31031j06333N8687P7558P1980P8280N7470M5247K9856
6857A07400j86555j8581J32944K01651J89957M3214j795q5720n3297q448K7740
6846C48510m9237o3982j27948j73265j50695r5890J0512J30933l7351j04565j18547
6835d31525J26278J39029K91463L06397j16110j71790L4317p1399j9629P6356
6825A63387P8924l8028j59415j74128K0891L3743O3385J03276J70621Q7253p8199
6814B71710N9891J24409p8487j33708k18220q5290n8221o8643K4305K2024N8870
$$ y = [362747, 133723, -98245, -292904, -248007, -34748, 132543, 212036, 184109, 289895, 332069, 273115, 98961, -6183, -82432, -202275, -272887, -260506, -273485, -126272, -45273, -19900, -12031, 28828, 25686, -205345, -311678, -252991, -175433, -103453, -25173, 32297, 77544, 107400, -79155, -97736, 35208, 236859, 426816, 470030, 468235, 382515, 329218, 320770, 348510, 299273, 235291, 107343, -65922, -216617, -312507, -301995, -171062, -208413, -312978, -431525, -305247, -166218, 125245, 431642, 315532, 143742, 178059, 106660, 87031, 163387, 242311, 204283, 44868, -129260, -108369, -74626, -11241, 92035, 262656, 349909, 271710, 331601, 456010, 377523, 243815, 25595, -59695, -117916, -186559, -162254, -140230, -81360]
6803h1360K02667K14499J01692O2311n3405j89740k33466P1501O891k78572l15138
6792d92120l08594j34752J65128l069N675K24812J30039R2160N3932l4535q4997
6781c86321P2446l9375L5321Q3971k292Q9729J1751j08889j12765K7048M1049
6770b88327R4559J7511J61963j44738l16210p3087m1209j26983J52740M26731
6760a37050J57294k17860k44463p8850O2201J11017K7120M3448O0897J46636O5576
6749d034j63412p4536P5568l0877K385J0121j50438n8086M3439O5870K7801J51583
6737a04616K24369J60795j36728k18328K4457j9290k20512J4222J01783o380J17373
6726f2855K07228N822j02792q3379r9755p9563M2063P3207J1850K4021j15513
$$ y = [-81360, 121307, 335806, 437498, 499809, 446404, 256664, 23198, 94699, 101590, -176982, -492120, -800714, -935466, -770338, -773407, -767732, -542920, -412881, -320721, -266789, -301324, -386321, -313875, -353250, -317929, -233958, -236250, -146521, -134770, -243659, -356424, -329376, -288327, -193768, -176257, -14294, -159032, -475242, -548329, -589538, -716521, -563781, -137050, 20244, -197616, -442079, -520929, -458728, -347711, -320591, -277143, -216246, -69610, -4034, -167446, -241982, -166414, -197291, -194906, -184785, -335223, -393309, -349870, -284000, -256199, -104616, 119753, 280548, 143820, -74508, -50051, -69341, -289853, -275631, -173848, -180228, -62855, 144373, 150195, 47403, -35976, -135731, -215294, -173231, -100024, -88174, -64153, -179666]
6715a79666j21062j04370M968J19041J23443K06041J56265R3049j93668k06555
6705a02514M1960Q8871K78781j0587j66893m5874J69025K0896j92904j38277j04685
6694a62201L285j4318j13889o4736J42914O7236O426n3714l1098j38601j64277
6683e22973n9610J13286P2197j12651L6489J00353P8888O3853Q0164N8786J25656
6672C4438K2552q5427l8718k5420j23373r7002N1377J63565J78244J6364j16198
6661a9598n3399J42408J10985l1571R3247m748m0404n429Q8453M9018p9998k08277
6649D0687m16078k27226r1635J63794J42083J58019K57319k5917n3564J8378j08027
6638a42167k68216p2116L9275L9185j2750O8036j6730k4106K29425J80623l3926
$$ y = [-179666, -300728, -405098, -400130, -281089, -157646, 48395, 204660, 297709, 104041, -102514, -60554, 28317, 307098, 296511, 129618, 83744, 252769, 273665, 80761, -57516, -162201, -158916, -173234, -287123, -351859, -208945, -141709, -135283, -188997, -220095, -358696, -522973, -582583, -469297, -397100, -509751, -473262, -372909, -294021, -230168, -150004, -91218, 34438, 56990, -28437, -67155, -92575, -215948, -312950, -261573, -98008, 80236, 96600, -19598, -72997, 69411, 180396, 148825, 242072, 237324, 196920, 191491, 279944, 328962, 248964, 40687, -375391, -602617, -694252, -530458, -388375, -230356, 26963, 1046, -52518, -34140, -142167, -410383, -482499, -443224, -404039, -416789, -348753, -365483, -389589, -160164, 20459, -13467]
6627a3467j93166k44625J35125J47614l7489Q1376R1859J20647N8838K11938M0296
6616C98946j51735k71620k90846L6337K54297J62624J18859k08204l02045j39630
6606c93017N6213K09187R8225j17846r7719J82073R8003k7812L12484O4135k47314
6595A36612j73363k30633k11257j4328J91604L20085K13453K03165J3409j11622
6585C37125r3455J2534n667j84818o2612J23792J02489N0002R747k4713j28830
6574A35594j43382j31557j37642J7950Q9577J37917J25903n9250j78179M7718
6564i5351J43682m6223n7531l191j46788N2642K27881J65136O1464k98716k57009
6553b54004j07401k9158K9066L2809J53206j46802m15274k48948P8666J84658
$$ y = [-13467, -206633, -451258, -316133, -168519, -206008, -124632, -32773, 87874, 146712, 358650, 398946, 247211, -24409, -315255, -278918, -24621, 138003, 256862, 48658, -253387, -393017, -336804, -127617, -29392, -147238, -244957, -62884, 35119, 7307, 319791, 383926, 136612, -36751, -267384, -478641, -492969, -301365, 18720, 232173, 435338, 448747, 337125, 243670, 256204, 250537, 65719, 3107, 126899, 229388, 279390, 289137, 264424, 135594, -7788, -139345, -276987, -259037, -169460, -31543, 94360, 35110, -143069, -95351, 48331, 2108, -55423, -58614, -205402, -152760, 75121, 240257, 301721, 3005, -254004, -361405, -390563, -361497, -328688, -175482, -322284, -737558, -986506, -907840, -723182]
6543g23182Q9202j23832j7555K26162J14936J17508R3062M5509J72439J54474
6533A48723q0973r8653j51578r9801J09536R7870M2971p4511Q307J11768j25502
6522a11843j90096N6335J31572J44423j11156k6153K20143J1447j71308p2356
6512a18992o4423j62547j0026J21437K745r2638P2971M8143r7868p3188k331J12269
6500b64448J86422J50428J33005K20255J47962Q8191K75636k4923k96618k33671
6490C82239k07431L3579K6125k88522j75293m791k1333K0311r241O1395J20037
6479f2925J41779j16240k85180j94415L911J14788J45103K59371R4491j33235
6469c2552m714j6520j23033j46151j18037k8832N3178J30481j5591M9080n8796
$$ y = [-723182, -633980, -757812, -775367, -549205, -434269, -316761, -223699, -178190, -5751, 148723, 67750, -30903, -182481, -282282, -172746, -74876, -31905, -106416, -98109, 13659, -111843, -301939, -245604, -114032, 30391, -80765, -106918, 113225, 124672, -46636, -118992, -183415, -345962, -355988, -234551, -231806, -324444, -251473, -203330, -301198, -374386, -376717, -264448, -78026, 72402, 205407, 425662, 573624, 661815, 937451, 912528, 615910, 382239, 174808, 208387, 234512, -54010, -229303, -234094, -255427, -235116, -244357, -182962, -62925, 78854, -37386, -322566, -516981, -513070, -398282, -253179, 6192, 100683, -32552, -37266, -53786, -176819, -322970, -441007, -469839, -416661, -286180, -301771, -252691, -311487]
6458c11487P7230J74099J06463J4087p9802l5563n5537j01410o698J97621L6491
6447A5494k3569K7082L4309q7854k0441m4664o4019Q9135K8914k70206k49188
6436e65007J6482R3946P6617O2534q7204O3278J50191J23963j815l7294O1747
6425d2562j80024k34053Q1381K66759J82119m6200o977J1362j55650j42731J7397
6414b49179K9460k0785j14744K7279J54104J41293J92354O1142k58387m42381
6404d79844k44552j0125Q3670K00595K67759K50046Q1002P2211J55526K3199p5672
6393C23815j04456k70551o7860J0432j20011p1131Q627l3020J35476K91177J40624
6382B43122j03860j03460q016M1052j4623p020j52677j26544o0428L5920J20425
$$ y = [-311487, -234257, -60158, 46305, 60392, -19410, -54973, -110510, -211920, -218618, -20997, 15494, -8075, 19007, 53316, -34538, -54979, -99643, -163662, -74527, -45613, -315819, -565007, -548525, -454579, -377962, -315428, -402632, -339354, -189163, -65200, -67015, -104309, -42562, -222586, -456639, -375258, -108499, 73620, 27420, 20443, 31805, -123845, -266576, -249179, -219719, -240504, -355248, -327969, -173865, -32572, 159782, 220924, -37463, -479844, -724396, -734521, -650851, -450256, -182497, 67549, 148551, 220762, 376288, 399487, 323815, 219359, -51192, -119052, -108620, -228631, -299762, -291135, -324155, -188679, 102498, 243122, 139262, 35802, 27786, 68838, 54215, 47195, -105482, -232026, -292454, -256534, -136109]
6371a36109p1730j28891L2658P7970J53030K25142K18689J40025M4594k40738
6361C14640l27535M5616j7425J04346J13645r6756k49787m2355J12600K4049p4984
6350i3946R3755J9390j45493J52233K35332n28j97723j66718N1753J57577k7411
6339G8221k9036p8326l08533j82345P4531J06972o0465N6384K25306L03932K78588
6328D65229m8896k56693j22522J70792K70878l8026k24599o1269J06180J21600
6318C82674l2736k65003N9678L47611K7601l71064k77046m8638j42233j40181
6308d59337P2609J58810r0245q2426J4436j21714K534P4697R9800J51135J26477
6297e3224o91R2399o597j3195R0711p344j30820l9981r8917m0299R0486J08013
$$ y = [-136109, -207839, -336730, -304072, -226102, -73072, 152070, 370759, 510784, 555378, 314640, -12895, 32721, 15296, 119642, 233287, 136531, -113256, -155611, -43011, -18962, -93946, -191, 19199, -126294, 25939, 261271, 260743, 63020, -103698, -51945, 105632, 78221, 49185, -29141, -337674, -520019, -445488, -338516, -398981, -342597, -117291, 186641, 465229, 416333, 159640, 37118, 207910, 478788, 440762, 216163, 154894, 261074, 382674, 349938, 84935, 144613, 492224, 519825, 148761, -128285, -176923, -319156, -459337, -386728, -227918, -318163, -400589, -386153, -507867, -505333, -430636, -330836, -179701, -53224, -53915, 38484, 31887, 18692, 109403, 102059, -28761, -68742, -167659, -207958, -117472, -9459]
6285i459J48821J63074l4603j59287J8929K06401J00287n3682r3569n1475R564
6274B45001o3173k2146n3275o1692J06739J21051K888j75761N2980K22978J37393
6263E12983J52578L6566k37893j80931J61148M8480k27955j01902n0350j54303
6253d1579j32110j81721j8731J89891J55706p1017j35564M9220J08778J97885
6243A20758K20088l9732k66403l04112j88438j09980J48410J95584J29660P2367
6233b1798p890Q2963o0123j18953P7773J87216Q4446P2657k5203k4856N8163M9903
6221C54298k8516M7743J65206N4764o3412j14845M2746r8880j98569n7207p1465
6210C1863l7783j36224j11418J02659K09648K14451M0984n3595m0999r8446r0562
$$ y = [-9459, 139362, 302436, 267833, 108546, 127475, 333876, 434163, 380481, 286912, 235437, 245001, 181828, 159682, 106407, 44715, 151454, 272505, 275393, 99632, 152612, 375590, 512983, 665561, 702127, 464234, 283303, 444451, 492931, 264976, 163074, 112724, -41579, -173689, -355410, -374141, -184250, -28544, -99561, -235125, -185905, -77127, 120758, 340846, 301114, 34711, -269401, -457839, -567819, -419409, -223825, -94165, -21798, -29688, 53275, -6848, -125801, -48028, 139188, 223634, 296291, 271088, 246232, 304395, 354298, 325782, 373525, 538731, 593495, 530083, 415238, 457984, 359104, 160535, 103328, 31863, -5920, -142144, -253562, -150903, 58745, 273196, 314180, 260585, 219586, 121140, 30578]
6199C0578J22104j35105j90165O3314L2091J16269J53192q3542j54365m5506M3776
6188d7359K50N8068N0525j8363p5585j3096L2838m2298j33727r8915K62055O2650
6176C7043j51086M1564J52498K27041j3779j73498k20610j54036K45911K56975
6166B48023J8012q081j15714R723P7598j08681n9645K23800K11871M2265r1077
6155D48094n9008J603k24455j33088M1637j25756j24391P6443K39757N4431j38661
6144E6606j96787l03408j65808Q2086J62754J89578J3680j08439O2968K00793
6134e977K7771M4656J66321J06951j4107j32557o3746j27977m9756o2487o7636
6123a78544K14479J95867K09652K28051p7358j28673j07748j20553q8642k3349
$$ y = [30578, 152682, 17577, -172588, -109274, -77183, 39086, 192278, 108736, -45629, -91135, -47359, -47109, 10959, 61484, 43121, -32464, -45560, -12722, -55020, -188747, -287662, -25607, 37043, -114043, -72479, 80019, 307060, 293281, 119783, -100827, -254863, -8952, 248023, 266035, 257954, 142240, 151963, 229561, 120880, 61235, 285035, 496906, 539171, 448094, 389086, 390689, 166234, 33146, 74783, -50973, -175364, -98921, 140836, 195267, 56606, -140181, -443589, -609397, -527311, -364557, -174979, -161299, -269738, -206770, -5977, 21794, 66450, 232771, 339722, 325615, 193058, 129312, 1335, -48421, -110908, -178544, 35935, 231802, 441454, 669505, 592147, 463474, 355726, 235173, 146531, 123182]
6113A23182R8346j30735n4372l6667k05780L303J88072O741L7120r770n2215M3162
6101A0387j84665j13479P1912j1744l6610J09793J67781K09891O6871m4547q5253
6090A60337j86134j81241p1694n6235k7794R1762J32413J10696O5880m0256L1307
6079B9041j82077k73523j17643R0288K95615K60570M1614k7589p935j88401M702
6068g5338m860r0470L3282J9998o2450O3353K46977Q3193M082j59225j30802n6293
6056a28553j56189m0132O9525J75844J44975N9169P3627m6594q432J67316R1329
6045D01885j48306j24110J49767K6435k7862q0328k23689j99974r4233J55059
6035a65356J60845l9156q1141N4516m2454j15087q8732N0242J81155N8163q9409
$$ y = [123182, 221528, 90793, 36421, -246, -206026, -202723, -14651, -7910, 29210, 19440, -32775, 10387, -174278, -287757, -215845, -227589, -264199, -154406, 13375, 223266, 290137, 245590, 160337, -25797, -207038, -278732, -334967, -362761, -270999, -138586, -27890, 37990, -2266, 29041, -153036, -426559, -544202, -453914, -158299, 102271, 143885, 116296, 108361, -80040, -75338, -80198, -170668, -137386, -117388, -179838, -116485, 130492, 213685, 217767, 58542, -72260, -128553, -284742, -324874, -255349, -79505, 65470, 124639, 198266, 151672, 143240, 310556, 401885, 253579, 129469, 279236, 305671, 277809, 197481, -26208, -226182, -320415, -165356, -4511, -43667, -124808, -70292, -112746, -227833, -316565, -266323, -85168, -27005, -116414]
6024a16414k01096j63260j7003N6235P5731J45937M2570m0918N122k6373Q106
6013b31363L4514l3771J34683K13212j16128j63984J04748K1373p5466m2007r8165
6002b52354n8059r2226n0150k1911j8476Q7905J46721J45390K0936J39706K39519
5991B87001R6622o0931j97590k41088r671J39747J38864J10726p1234j37806o0557
5980e917Q4175m225j15626N4771N2062j51139j92480J0542J70805J72908m0537
5969C5339j54901J53840J40699N0278R8402P4042j61456k3788J14515r2816j04712
5958A29442r8593j18516j09940q862J08159j4j36851j41007j3681o6146m0104
5947d96113q2079p948R2541j26910j7579J2872M526K52595M64440M48418K14140
$$ y = [-116414, -317510, -480770, -497773, -441538, -365807, -219870, -177300, -218218, -213096, -239469, -231363, -196849, -230620, -95937, 117275, 1147, -162837, -58089, -36716, -112182, -154189, -252354, -310413, -402639, -452789, -474700, -493176, -405271, -258550, -113160, -92224, 47482, 287001, 383623, 322692, 125102, -115986, -125657, 14090, 152954, 263680, 192446, 54640, -5917, 78258, 74033, -41593, 13178, 65240, -85899, -278379, -267837, -97032, 75876, 35339, -119562, 34278, 174977, 225255, 323657, 397699, 236243, 212455, 326970, 234154, 129442, 30849, -87667, -197607, -206469, -98310, -98324, -235175, -376182, -389863, -456009, -496113, -578192, -586140, -493599, -620509, -638088, -625216, -620690, -368095, 96345, 544763, 758903]
5936G58903J4572K4991j3855o3030k96555m05482q1330M6686l3607J03200K02774
5925B57267n9636j6523k0595j06387R4981M6131m6300J36781q7227j01797k11282
5914a14587j08688J43979L1321M6799k5456P256j08586k31133j8500J09409j1253
5903b79439j973J83905K7175O6868K00420k9451o5448l3015j56409o4631M2172
5892a09826m9465J67369J48754j27576j19971j28613j05658p2644l0364J14647
5882c13347J54486J71342P4998j67861j63228N6076J5946J71068J80815R8048
5872B78343J54061Q9557r9315j10243l4179J7832Q398o3582M2499q687r2725k85477
5860a03518j74060K005j8424J06320K4824r2461r8731m3415J705J49637J55102
$$ y = [758903, 773475, 798466, 784611, 721581, 425026, 19544, -61786, -15100, -48707, 54493, 257267, 197631, 181108, 160513, 54126, 149107, 195238, 148938, 285719, 198492, 96695, -114587, -223275, -79296, -47975, -1176, -26632, -19376, -127962, -359095, -377595, -268186, -279439, -281412, -97507, -70332, -3464, 196956, 167505, 102057, 69042, -87367, -151998, -109826, -159291, 8078, 156832, 29256, -90715, -219328, -324986, -397630, -427994, -313347, -158861, 12481, 87479, -80382, -243610, -187534, -171588, -520, 180295, 278343, 432404, 521961, 422646, 312403, 278224, 296056, 304454, 240872, 283371, 274684, 181959, -103518, -277578, -275573, -293997, -187677, -162853, -255314, -354045, -397460, -395755, -246118, -91016]
5849i1016J27647j7563j30715P4592J32827L1889J22269J05444j65459j64432
5839B5483q487K60588K37226n1340o394L6831p170j80694k72815k06418l5974
5828b09164r2656L2897J86279j45649k85925k773K70955L74960K45266p1502k61638
5817D1050q2690J06166N7796j00564L3727m2068j54697j897j41048j33134K03746
5806b13613R6747m4292j8677R2124J87620J57332k5454k26478q4192P8425P4849
5795G4391j6123j16767j10968p6173R9286J93492M5766j90756k40490k5856J58357
5784b05841J38576k0119r2228K1849J03704j28109q9071J11970J24624N8152m5175
5773b1668k47089p0658J22133O4591n3271Q548J22468k0527p9884n3839J19461
$$ y = [-91016, 36631, 19068, -111647, -37055, 95772, 127661, 249930, 355374, 189915, 25483, 16996, 277584, 514810, 463470, 457076, 493907, 486737, 306043, 33228, -173190, -209164, -301820, -268923, -82644, -228293, -514218, -516991, -246036, 128924, 374190, 302688, 41050, -41640, 64526, 122322, 21758, 55485, 13417, -141280, -143177, -284225, -417359, -213613, -116866, -161158, -179835, -87711, 99909, 257241, 231787, 5309, -78883, -458, 74391, 58268, -58499, -169467, -245640, -146354, 47138, 92904, -97852, -338342, -364198, -205841, -67265, -87384, -179612, -157763, -54059, -182168, -271239, -159269, -34645, 23507, -21668, -268757, -339415, -217282, -152691, -205962, -197414, -74946, -95473, -175357, -229196, -109735]
5762a09735M2289j43778j19294J6426K26834K29971J10591j45828k82386j16474
5752b91384J5966l7646l0477Q224O2851p4577n1393J6265j06116M6454J93441
5741b48392j03851k03713J62553K08462J05121P7376R5565j2718o8963m1089J6669
5730a2980R9959J55428j1213j50163j49186j24133J67160L45389J30797K3897
5720D74955o2908k73828l19165p1702j18332j55405L2762P0313P3684J04579M7389
5709a97658M3018r8054p5557N5741P7643l2627Q2853K38508J39909j73182j69031
5698a08437K01309Q8175Q8089K0956j59693j00396R6963J22208J05323n6780k04246
5687I3471k2573r0164k5636M9729m3790j33393j05004o0200j50325j6452j5506
$$ y = [-109735, -67446, -211224, -330518, -314092, -87258, 142713, 253304, 107476, -174910, -291384, -275418, -313064, -343541, -335317, -272466, -347043, -398436, -382171, -488287, -441833, -248392, -352243, -555956, -393403, -184941, -79820, -2444, 93121, 80403, 11440, -29649, -12980, 86979, 242407, 231194, 81031, -68155, -192288, -25128, 320261, 451058, 474955, 412047, 138219, -180946, -252648, -370980, -526385, -493623, -423310, -349626, -245047, -197658, -154640, -252694, -328251, -272510, -194867, -227494, -144641, 93867, 233776, 60594, -108437, 92872, 181047, 269136, 290092, 130399, 30003, 126966, 249174, 354497, 297717, 93471, 70898, -19266, -44902, 4827, -38963, -172356, -277360, -337560, -487885, -504337, -519843]
5676e19843P0469K30526K32287L4047J06250N2165n2388m9268j9731K01405J85500
5665D71419j08825l72030j41871P903J021Q9042o3897k3077O6924Q8452L775N6123
5653G4959J3118q0007j47084j08372m1326j587R3794J01494K8417L1289J87712
5642A52407J11446J23370J38313J11077j703j01998q5828j8226j76596k30862
5632B1400J93225J57800j56551r0201J5619K2251l7454k3671j48580j39378j58433
5621c43973n5519J5686M9965P3882l0578K8842n3308m6200j28215j76161j30024
5610g95603K9765K17438K71853K26743r7531l31253j2519K65123K17900m0198
5600d8282k87717j40289o9841r2895J09781K23277K02716J98178p3950j39534
$$ y = [-519843, -449374, -218848, 13439, 47486, 153736, 205901, 153513, 104245, 84514, 285919, 471419, 362594, -9436, -151307, -143404, -142383, -53341, -117238, -140315, -73391, 15061, 18836, 74959, 88077, 8070, -139014, -247386, -288712, -290299, -196505, -95011, -66594, -35305, 152407, 263853, 387223, 525536, 636613, 634910, 532912, 447084, 428858, 252262, 21400, 214625, 372425, 215874, 125673, 141292, 163543, 126089, 102418, -46162, -185540, -343973, -399492, -383806, -333841, -259959, -290537, -261695, -315003, -361203, -489418, -665579, -795603, -765838, -548400, -276547, -49804, -147335, -478588, -491107, -225984, -8084, -48282, -335999, -476288, -546129, -639024, -529243, -305966, -103250, 94928, 20978, -118556]
5590a18556j5732J2610j03835l1921J46560J27326l8458j79958M5573l119m8316
5579b07826j47879j77965l0433k1576L7719L8835J11077Q6898J8527J92207J46792
5568D6376P2353Q2242N6107j25414j80111p3793p8154j72748j24993k22577m5318
5557g66030K2868O2970L45553K14361L9829k10980j01121J58078J83967J27404
5547G6899J24586J19317j02874k01650j81099j66704j37854Q6267K95438K41792
5537A54118K831k32175l55028k33486Q0654M88721M03389J56092j15454k70553
5527G9109j83981j33877n7330K80384J94046j44326P6703M7461J1822l697j14521
5516E1793j43111l75254k34357J88318J72936m7396J69373L09621J25210j20955
$$ y = [-118556, -134288, -121678, -225513, -257434, -110874, 16452, -22006, -201964, -156391, -159510, -207826, -355705, -533670, -564103, -585679, -547960, -509125, -398048, -311150, -292623, -100416, 46376, 118729, 200971, 257078, 131664, -48447, -122240, -200394, -373142, -498135, -720712, -766030, -743162, -680192, -334639, -120278, -80449, -291429, -392550, -234472, -50505, 76899, 201485, 320802, 217928, 16278, -164821, -331525, -469379, -383112, -87674, 154118, 156949, -75226, -430254, -663740, -583086, -94365, 309024, 465116, 349662, 79109, -104872, -238749, -296079, -15695, 178351, 34025, 110728, 158189, 170011, 166314, 51793, -91318, -466572, -700929, -512611, -339675, -387071, -217698, 91923, 217133, 96178]
5506I6178k85684k58877K0886R2126N8888M7751J46938J07131o176p0541j5320
5495f6700j22439j88942P3918J13034L0012J517M0330L08359L78689R1838N8766
5484G18382q0604j65218m9014k15351l53779j37150K25649J99759O8416n0412
5474A60678p6965O6108J5160j27026n3538k1246r8978m4406J47492J64549l6313
5463I5515j68305q3389J47147J51327O2161l1535o7514J21636R6053j28610j0842
5452A83644L6407j39993k03638n9146J3067o5269L179K28597J9106j15385j65593
5441b65024O6891K32491j3778K6650K73332P6964j76335k5654K9553k516j76001
5430D6573j01967Q3536q5910N7068J85917J36026q0452k40852j19408O1037k2429
$$ y = [96178, -189506, -448383, -427497, -335371, -276483, -228732, -81794, 25337, 19161, -51380, -66700, -189139, -378081, -304163, -191129, -161117, -159600, -119270, 189089, 567778, 659616, 718382, 637778, 472560, 423546, 208195, -145584, -282734, -57085, 142674, 211090, 160678, 83713, 149821, 164981, 37955, -15583, -36829, -135807, -180213, -32721, 131828, 95515, -72790, -156179, -9032, 142295, 204456, 172921, 105407, 227043, 323096, 194486, 183644, 220051, 80058, -123580, -182726, -169659, -234928, -231749, -3152, 15954, -99431, -265024, -198133, 34358, 20580, 47230, 320562, 397526, 221191, 195537, 225090, 222574, 46573, -55394, 28142, -57768, -700, 185217, 321243, 240791, -61, -119469, -58432, -80861]
5419h0861Q7409k8437j56774q0862l3666J46658P7139k7347L8563K9441N1098
5408B2361n4639j36837K2833J59155M0636k02395o5123L6671k2140R6337k8004
5397a31145n6617j31162r7021r461j46541J17655L60898J44544j05054p7185O9098
5386f1991n9961j06245j1796P5338J76146n4738k2426L14982P9474j11338k07695
5375I750j52511p1959n4773O3548J26864K39017J39496k3087n6281M2593p482
5364B55175j03007J05785N7731j84449o6781N3938P023p9439L0277L2871j15780
5353f656l2254l6940k17218j01209J49144k5980j09755J6078P1288K39377K34286
5342A80161J67821O1861l8958p8435k88983k52941j05876N2091J04693J36079
$$ y = [-80861, 6548, -21889, -178663, -259525, -293191, -146533, -69394, -96741, -58178, -28737, 22361, -32278, -169115, -146282, 12873, 53509, -148886, -214009, -177338, -199478, -103141, -131145, -187762, -318924, -415945, -425406, -571947, -454292, -93394, 51150, -53904, -131089, -61991, -121952, -228197, -239993, -164655, 11491, -43247, -65673, 249309, 328783, 217445, 9750, -142761, -214720, -269493, -205945, -79081, 159936, 299432, 276345, 220064, 262657, 255175, 152168, 257953, 315684, 131235, 64454, 118392, 125415, 45976, 76253, 109124, -6656, -38910, -75850, -293068, -394277, -245133, -271113, -380868, -364790, -293502, -54125, 180161, 347982, 409843, 370885, 292450, 3467, -249474, -355350, -303259, -198566, -62487]
5332f2487J28505p1136k4418P6638j55092r3354K7553J14717J19333n6654r4522
5321i0917n1065l7851o7915j96891O9067K7109j59407K2812K26997J78912j94492
5310b73641j16167J08644J75165J42588n9681n7380N2730j28567j82150n6301
5300c94760r4631r921Q4919R2106J05884J24368K34422J44694m7375l0910K75180
5289D83976J57400M7097j54489l40531l21504J0935K95542K72835J37696o0877
5279E28080j57005l58415j98876N769J33266J70848P1616P5275K7168j62071j92102
5268e6447j64677O764K16313N4001j7352p125j85862p6081J9915J0221q315J7171
5256a91474p1880q9382J06939K61288K33815J66218l6390l52197k16262R419j32690
$$ y = [-62487, 66018, -5118, -29536, 47102, -107990, -201344, -173791, -59074, 60259, 3605, -90917, -141982, -179833, -247748, -444639, -375572, -348463, -507870, -485058, -258061, -79149, -273641, -389808, -281164, -105999, 36589, -23092, -80472, -27742, -156309, -338459, -394760, -489391, -499312, -414393, -322287, -216403, -92035, 142387, 287081, 239706, 208796, 483976, 641376, 688473, 533984, 193453, -128051, -117116, 178426, 451261, 588957, 528080, 371075, 12660, -186216, -180447, -47181, 123667, 195283, 270558, 297726, 135655, -56447, -221124, -214360, 1953, 55954, 38602, 31477, -154385, -230466, -210551, -200330, -208645, -191474, -263354, -352736, -245797, 15491, 249306, 415524, 379134, 26937, -189325, -179906, -312596]
5245c12596K9428K87679K64545K31837J50895l19329m19318k6990N2370R6827
5235C5348J5854r5844n9847M754j9471L8663Q6863p5742j84138J69264K08749
5224A24453P3102J36873j2542k9610J6302J24346K4515r1880O3445J49313J18735
5213F97052J11688J24961l66456k27785l1068k17711r5124j19784j63661j48421
5203d36309J67953K88620J56210J89204M2758r0870j73473k43895q1145K13659
5193C2712J98301L2141r2250o043L6447j81362k0462L92033K90369j39260k86917
5182B55709l9825k4234j98186j52534K7613R0784K4828o9794Q4045J33221O0417
5171A92044j0388k43921k07087K9603N5300J43789P6114j97433o6866M6364Q6847
$$ y = [-312596, -283168, 4511, 269056, 500893, 651788, 332459, -86859, -113849, -61479, 35348, 51202, -44642, -104489, -99735, -119206, -80543, 6320, -69422, -253560, -84296, 124453, 197555, 334428, 321886, 292276, 308578, 432924, 457439, 365559, 429004, 578317, 697052, 808740, 933701, 567245, 339460, 308392, 90681, -4443, -124227, -287888, -436309, -268356, 20264, 176474, 365678, 408436, 317566, 144093, -99802, -180947, 32712, 231013, 263154, 170904, 164861, 201308, 19946, -516, 391517, 681886, 542626, 255709, 215884, 191650, -6536, -159070, -131457, -40673, -15845, -85639, -1594, 131627, 192044, 181656, -62265, -269352, -239749, -184449, -40660, 35454, -161979, -228845, -182481, -95634]
5160i5634m5704j40008P005j57159p9491R3601J5149l9469N3165O9113J725p2873
5148c90580K53715K29424q3563k15843k15722k49545J35219L40533K08093O3141
5138G4872n9675j77838j03012j18922k26096j47024J19196L20821J19824P6714
5128a21140J75647q8812j52831o0698K6640J71090q0796k08016j0661R1063J4280
5117b44234J25128J35268J04898M3125l81876k50364r6789R3771K38168J3116
5107b19789j9229l694R2856J97124k3857j8582M591k02344k03l2064N1457J37996
5095c5738R9510K9621r7617l03965j16908K31694L17792K26594k3217k48059l60983
5084b81276K5883M8976K5998R9020p6438K13079J65910j65652q2386J34872N7438
$$ y = [-95634, -141338, -281346, -274341, -431500, -510991, -417390, -402241, -441710, -388545, -319432, -317707, -390580, -136865, 92559, 8996, -206847, -422569, -672114, -536895, -196362, 11731, 74872, 15197, -162641, -265653, -384575, -610671, -757695, -638499, -317678, -197854, -121140, 54507, -34305, -187136, -247834, -221194, -50104, -130900, -338916, -349577, -258514, -244234, -119106, 16162, 121060, 164185, -217691, -468055, -564844, -471073, -232905, -219789, -239018, -242712, -149856, 47268, 23411, 4829, 9420, -192924, -193127, -225191, -173734, -35738, 63772, 93393, -4224, -308189, -425097, -193403, 124389, 350983, 327766, 79707, -281276, -255393, -206417, -180419, -81399, -157837, 55242, 221152, 55500, -26886, 107986, 165424]
5073A65424N6526L50336K10356k90807k34480m3381r0984j21550j8444j08173
5063a25177p8599J64737n5535m25862k03076K37887K24888j8216o8542M9136K38378
5052e9981K3319j36284L685J7811Q2073J41242J05226j23682j40326j6731k04930
5041c08578q4509J14683P2102P9719J70682J00593p9105j50702k13246j09134
5031d07495J60504J81245j12047j78129o9357J62370K72426J40798R0992o4350
5021A76957j2378M8192P641j39205j39503N47j5799j58965j02026p0555j121K18344
5009a87871J66598J77279J84433M5565P3160k6317l4564L2339L8985j98494k94811
4998b3698j3673q5108j72424J08304K83599K13950M1878O776j54440m0784K46023
$$ y = [165424, 221950, 572286, 782642, 491835, 257355, 213974, 122990, 1440, -17004, -125177, -203776, -39039, -94574, -520436, -723512, -485625, -260737, -278953, -347495, -298359, -59981, -36662, -172946, -169261, -151450, -69377, 71865, 177091, 53409, -86917, -103648, -308578, -393087, -278404, -206302, -126583, 44099, 144692, 65587, -85115, -298361, -407495, -246991, -65746, -177793, -355922, -425279, -262909, 9517, 150315, 241307, 176957, 164579, 212771, 220412, 81207, -58296, -57749, -73548, -232513, -334539, -405094, -406215, -187871, -21273, 156006, 340439, 386004, 459164, 432847, 398283, 430622, 469607, 271113, -23698, -37371, -122479, -294903, -186599, 97000, 310950, 352828, 359604, 205164, 164380, 410403]
4987D10403L5406r4044j9592n3112j92879l18801j63729J53937J09284N252J52694
4976B4819J37889J0369J21537J05774j19884N1464K9719K0866j5500k68828k01736
4965a03511k7669j28102m8577J60912J41409M4103l9703m8664j54498j21617M6759
4954b79158J4866J6984M2861K04412K42123J30027J70193K80125M12689N66092
4944A801214R47004P87310N94570K71737l43369o07262n30441l69639k8298J42295
4934B665121p313k84958l60131l28162l41530j27228l3189l37134l63335j32266
4924C49875n4706k01076q2544L16368J41524k53572k57409M3313J78718J66098
4914C46589K63248N8896r2535k96224l34971N1519K70698K76548J65746j95682
$$ y = [410403, 445809, 351765, 332173, 279061, 86182, -232619, -396348, -242411, -133127, -127875, 24819, 162708, 173077, 294614, 400388, 280504, 331968, 361687, 382553, 367053, 98225, -103511, -131180, -259282, -307859, -146947, -5538, 38565, -1138, -49802, -204300, -325917, -279158, -264292, -247308, -204447, -35, 242088, 372115, 542308, 822433, 1235122, 1801214, 2748218, 3535528, 4130098, 4401835, 4058466, 3451204, 2920763, 2551124, 2522826, 2665121, 2657808, 2372850, 2012719, 1684557, 1343027, 1215799, 1182610, 845476, 482141, 349875, 295169, 94093, 11549, 327917, 469441, 215869, -41540, 1773, 180491, 346589, 609837, 668733, 576198, 279974, -54997, -3478, 267220, 543768, 709514, 513832]
4904E13832k08627m1966Q7489k4413j71960n4640p623K1731m4570m645k4254j34912
4892i4558m4421P9477P2118M4830n6789p4645j18620o2849J47268J50662j60338
4881a17865k03524j66084j02428O1688R4939K7945l6634J16425m2821j87671K41202
4870c14828L61364J44000j75164q6215K57210K25555p6835j74541J7821O7593
4860B45960j9294N2806r5951k43343M8028O2596p6161j1325j06269q3162j94554
4849d20669p1047J58907M1084j75606k71364j77987j19301R8616K79114J90508
4839d67745Q7577j4829J19343l2583o2735R5263l8164j77562k52741m7086J45560
4828f45702K04228M50498O8499j77150p4934o5524N6313J60934R4442R771J30318
$$ y = [513832, 305205, 263239, 350728, 326315, 154355, 99715, 92092, 113823, 69253, 64608, 40354, -94558, -138979, -59502, 12616, 57446, 657, -73988, -192608, -255457, -108189, 42473, -117865, -321389, -487473, -589901, -528213, -433274, -405329, -441963, -325538, -368359, -556030, -314828, 46536, 190536, 15372, -70843, 186367, 411922, 335087, 160546, 178367, 245960, 226666, 279472, 183521, -59822, -11794, 50802, -25359, -36684, -142953, -226115, -420669, -491716, -332809, -291725, -467331, -738695, -916682, -1035983, -937367, -658253, -467745, -380168, -394997, -275654, -308237, -370972, -275709, -313873, -491435, -744176, -791262, -645702, -441474, 9024, 77523, -99627, -174561, -240085, -183772, -22838, 71604, 81375, 211693]
4817B11693K9683k00508k56441p6611m9010j13063J3782O3386N5813J66915M1246
4806a13115l2551j43181k7854J07544K3140N8927O569j96342j21104K62048J35566
4795d0353j09606J8797R9034j07332j18351l5900n3074P7498n511L3067P0846
4784a70885K9181J4135L1661O1109o95k2898J69439J16498n8521j61110O3450
4773G1364K12867J32116q407m2775p8610l88631j016J63186j91505J39887L04024
4762C12500J41768j94842m69063k41570m2628m5252j10540L1412P1206K38063
4752c08946K09655J34235J32599L08r955j13238l73987k22569J21021Q5069P2412
4741b73396K1406K13156L29904J5551j09809r0274j62724q9415J85055J61432
$$ y = [211693, 241376, 40868, -215573, -292184, -341194, -454257, -440475, -377089, -321276, -154361, -113115, -145666, -288847, -316701, -209157, -186017, -127090, -120521, -316863, -437967, -175919, -40353, -149959, -131162, -32128, -139460, -257811, -293711, -346785, -269287, -274798, -241731, -170885, -141704, -127569, -95908, -34799, -35494, -58392, 111047, 227545, 169024, 7914, 71364, 284231, 416347, 407940, 365165, 286555, -102076, -103092, 60094, -131411, 8476, 312500, 454268, 259426, -209637, -451207, -493835, -539087, -649627, -618215, -547009, -308946, -99291, 34944, 167543, 167851, 157896, 44658, -329329, -551898, -430877, -345808, -273396, -251990, -38834, 291070, 306621, 196812, 106538, -56186, -145601, 39454, 200886]
4731B00886J74142P4947k85539k01032k96J04057J23201J27841k4925j23458o7544
4720A02280J62638K14996J75835O9826j93651l06171j31312J7549L6012r8840
$$ y = [200886, 375028, 449975, 164436, -36596, -36892, 67165, 190366, 318207, 293282, 169824, 102280, 264918, 479914, 655749, 725575, 531924, 225753, 94441, 111990, 148002, 49162]
$$ [...]
##END NTUPLES=NMR SPECTRUM
##END=
