##TITLE=C13_SA_21.213
 D2O, 21400 sc

 8.7.2020
##JCAMPDX= 6.0         $$ Bruker NMR JCAMP-DX V2.0
##DATA TYPE= NMR SPECTRUM
##DATA CLASS= NTUPLES
##ORIGIN= UXNMR, Bruker Analytische Messtechnik GmbH
##OWNER= root
$$ XWIN-NMR		Version 3.5
$$ Thu Jul  9 09:58:19 2020 Russian Standard Time (UT+4h)  she@DPX200
##.OBSERVE FREQUENCY= 50.327896
##.OBSERVE NUCLEUS= ^13C
##.ACQUISITION MODE= SIMULTANEOUS
##.ACQUISITION SCHEME= undefined
##.AVERAGES= 21401
##.DIGITISER RES= 17
##SPECTROMETER/DATA SYSTEM= spect
##.PULSE SEQUENCE= zgpg30
##.SOLVENT NAME= CDCl3
##.SHIFT REFERENCE= (INTERNAL, CDCl3, 0, 222.661)
##AUDIT TRAIL= $$ (NUMBER, WHEN, WHO, WHERE, WHAT)
$$ ##TITLE= Audit trail, XWIN-NMR		Version 3.5
$$ ##JCAMPDX= 5.01
$$ ##ORIGIN= Bruker BioSpin GmbH
$$ ##OWNER= she
$$ F:/spectra/data/she/nmr/c13/1/pdata/1/auditp.txt
$$ ##AUDIT TRAIL=  $$ (NUMBER, WHEN, WHO, WHERE, WHAT)
(   1,<2020-07-09 09:56:34.28 +0400>,<she>,<DPX200>,
      <created by zg, POWCHK disabled, PULCHK disabled
       terminated by command 'halt'
       configuration hash MD5:
       00 E9 B6 7A A2 85 ED C7 34 08 36 98 17 FE 4E 26
       data hash MD5: 32K
       A8 27 4A A5 2A 27 A6 69 E0 48 F0 65 96 BD 2E F0>)
(   2,<2020-07-09 09:56:38.48 +0400>,<she>,<DPX200>,
      <Start of raw data processing
       efp BC_mod = 2 LB = 1 FT_mod = 6 PKNL = 1 PHC0 = -236.5516 PHC1 = 29.36238 SI = 32K 
       data hash MD5: 32K
       6E 31 E6 87 8F F9 71 7F CA 49 02 57 49 EE D6 74>)
(   3,<2020-07-09 09:56:41.34 +0400>,<she>,<DPX200>,
      <abs ABSG = 5 
       data hash MD5: 32K
       41 47 36 9C 45 0E 49 81 2F DB 79 46 EF 72 5B 6B>)
(   4,<2020-07-09 09:57:08.81 +0400>,<she>,<DPX200>,
      <pk PHC0 = 2.119724 PHC1 = -3.8 
       data hash MD5: 32K
       F9 11 83 F7 9D 2B AF A3 9A EA 38 B6 3E 38 87 3F>)
(   5,<2020-07-09 09:57:13.15 +0400>,<she>,<DPX200>,
      <abs ABSG = 5 
       data hash MD5: 32K
       6B AC B2 28 08 6D EF 35 5D 45 C5 13 9D 85 A8 EB>)
$$ ##END=
$$ 
$$ hash MD5
$$ 51 B2 4B 11 38 2B 47 8E B6 43 67 59 30 2E F7 A2
##$RELAX= 
##$RELAX= 
##$RELAX= 
##$RELAX= 
##$RELAX= 
##$RELAX= 
##$RELAX= 
##$RELAX= 
$$ Bruker specific parameters
$$ --------------------------
##$DU= <F:/spectra>
##$EXPNO= 1
##$NAME= <c13>
##$PROCNO= 1
##$TYPE= <nmr>
##$USER= <she>
##$AMP= (0..31)
100 100 100 100 100 100 100 100 100 100 100 100 100 100 100 100 100 100 
100 100 100 100 100 100 100 100 100 100 100 100 100 100 
##$AQSEQ= 0
##$AQ_mod= 1
##$AUNM= <au_zg>
##$AUTOPOS= <>
##$BF1= 50.322709
##$BF2= 200.13
##$BF3= 50.322709
##$BF4= 500.13
##$BF5= 500.13
##$BF6= 500.13
##$BF7= 500.13
##$BF8= 500.13
##$BYTORDA= 1
##$CFDGTYP= 0
##$CFRGTYP= 5
##$CHEMSTR= <none>
##$CNST= (0..31)
1 1 145 1 1 1 1 1 1 1 1 1 1 1 1 1 1 1 1 1 1 1 1 1 1 1 1 1 1 1 1 1 
##$CPDPRG= <waltz16>
##$CPDPRG1= <>
##$CPDPRG2= <waltz16>
##$CPDPRG3= <>
##$CPDPRG4= <mlev>
##$CPDPRG5= <mlev>
##$CPDPRG6= <mlev>
##$CPDPRG7= <mlev>
##$CPDPRG8= <mlev>
##$CPDPRGB= <>
##$CPDPRGT= <>
##$D= (0..31)
$$ [...]
##$SUBNAM4= <"">
##$SUBNAM5= <"">
##$SUBNAM6= <"">
##$SUBNAM7= <"">
##$SUBNAM8= <"">
##$SUBNAM9= <"">
##$SW= 239.972175391363
##$SWIBOX= (0..15)
0 1 3 0 0 0 0 0 0 0 0 0 0 0 0 0 
##$SW_h= 12077.2946859903
##$TD= 32768
##$TD0= 1
##$TE= 0
##$TE2= 300
##$TE3= 300
##$TEG= 300
##$TL= (0..7)
120 120 120 120 120 120 120 120 
##$TP= (0..7)
150 150 150 150 150 150 150 150 
##$TP07= 0
##$TPNAME0= <>
##$TPNAME1= <>
##$TPNAME2= <>
##$TPNAME3= <>
##$TPNAME4= <>
##$TPNAME5= <>
##$TPNAME6= <>
##$TPNAME7= <>
##$TPOAL= (0..7)
0.5 0.5 0.5 0.5 0.5 0.5 0.5 0.5 
##$TPOFFS= (0..7)
0 0 0 0 0 0 0 0 
##$TUNHIN= 0
##$TUNHOUT= 0
##$TUNXOUT= 0
##$USERA1= <user>
##$USERA2= <user>
##$USERA3= <user>
##$USERA4= <user>
##$USERA5= <user>
##$V9= 5
##$VALIST= <valist>
##$VCLIST= <CCCCCCCCCCCCCCC>
##$VD= 0
##$VDLIST= <DDDDDDDDDDDDDDD>
##$VPLIST= <PPPPPPPPPPPPPPP>
##$VTLIST= <TTTTTTTTTTTTTTT>
##$WBST= 1024
##$WBSW= 4
##$XGAIN= (0..3)
0 0 0 0 
##$XL= 0
##$YL= 0
##$YMAX_a= 110517017
##$YMIN_a= -37678091
##$ZGOPTNS= <>
##$ZL1= 120
##$ZL2= 120
##$ZL3= 120
##$ZL4= 120
##$ABSF1= 222.6606
##$ABSF2= -17.33621
##$ABSG= 5
##$ABSL= 3
##$ALPHA= 0
##$AQORDER= 0
##$ASSFAC= 0
##$ASSFACI= 0
##$ASSFACX= 0
##$ASSWID= 0
##$AUNMP= <proc_1d>
##$AZFE= 0.1
##$AZFW= 0.5
##$BCFW= 0
##$BC_mod= 2
##$BYTORDP= 0
##$COROFFS= 0
##$CY= -3
##$DATMOD= 1
##$DC= 0
##$DFILT= <>
##$DTYPP= 0
##$F1P= 0
##$F2P= 0
##$FCOR= 0.5
##$FTSIZE= 32768
##$FT_mod= 6
##$GAMMA= 0
##$GB= 0
##$INTBC= 1
##$INTSCL= 4.134877e-10
##$ISEN= 128
##$LB= 1
##$LEV0= 0
##$LPBIN= 0
##$MAXI= 10000
##$MC2= 0
##$MEAN= 0
##$ME_mod= 0
##$MI= 0.1934396
##$NCOEF= 0
##$NC_proc= 1
##$NLEV= 6
##$NOISF1= 120.0001
##$NOISF2= 80.00006
##$NSP= 0
##$NTH_PI= 0
##$NZP= 0
##$OFFSET= 222.6606
##$PC= 1.4
##$PHC0= -234.4319
##$PHC1= 25.56238
##$PH_mod= 1
##$PKNL= yes
##$PPARMOD= 0
##$PSCAL= 0
##$PSIGN= 0
##$REVERSE= no
##$SF= 50.322729756361
##$SI= 32768
##$SIGF1= 140
##$SIGF2= 120
##$SINO= 11.81781
##$SIOLD= 32768
##$SREGLST= <13C.CDCl3>
##$SSB= 0
##$STSI= 32768
##$STSR= 0
##$SW_p= 12077.2946859903
##$SYMM= 0
##$S_DEV= 0
##$TDeff= 32768
##$TDoff= 0
##$TI= <>
##$TILT= no
##$TM1= 0
##$TM2= 0
##$TOPLEV= 0
##$USERP1= <user>
##$USERP2= <user>
##$USERP3= <user>
##$USERP4= <user>
##$USERP5= <user>
##$WDW= 1
##$XDIM= 32768
##$YMAX_p= 457579790
##$YMIN_p= -4656369
$$ End of Bruker specific parameters
$$ ---------------------------------
##NTUPLES= NMR SPECTRUM
##VAR_NAME=  FREQUENCY,     SPECTRUM/REAL,   SPECTRUM/IMAG
##SYMBOL=    X,             R,               I
##VAR_TYPE=  INDEPENDENT,   DEPENDENT,       DEPENDENT
##VAR_FORM=  AFFN,          ASDF,            ASDF
##VAR_DIM=   32768,         32768,           32768
##UNITS=     HZ,            ARBITRARY UNITS, ARBITRARY UNITS
##FACTOR=    0.368581032318806, 1,           1
##FIRST=     11204.8891385315, 0,            0
##LAST=      -872.405547458802, 0,           0
##MIN=       -872.405547458802, -4656369,    0
##MAX=       11204.8891385315, 457579790,    0
$$ Real data points
##PAGE= N=1
##DATA TABLE= (X++(R..R)), XYDATA
$$ [...]
25035 -1259145 -1681734 -812553 1099162 1750109 1478259 1678371 1298101 1320260 2654287
25026 2654287 3554080 2896797 1490154 -85919 -129696 823263 1195973 1152043 298533
25017 298533 -74459 -229313 -950803 -1701580 -1504299 -1070163 -709181 -370161 -97142 -475626
25007 -475626 -1010023 -811118 -400360 146500 -238966 -68536 191172 33328 560200 1360595
24997 1360595 1277764 597253 -278915 -714982 -414306 678889 1945440 2130966 1523092
24988 1523092 1635127 2183514 2178032 1585344 1138944 821565 381905 -387863 -743969 -688275
24978 -688275 -65133 1093441 1731250 1723188 1384158 399024 321112 621028 229613 -204919
24968 -204919 94622 590035 756855 -329297 -1428427 -1718451 -1157439 -295941 672563
24959 672563 719240 301654 549318 976059 826288 781958 834598 406466 491925 467234
24949 467234 -79192 -5320 -157704 -257505 -201185 -99078 152898 509300 864357 873547
24939 873547 665654 767227 796381 624450 762424 549509 -244967 -288748 -9655 215987
24929 215987 1145462 1240129 885010 1101750 1115800 857913 326860 -386650 -912389 -399799
24919 -399799 741279 1513144 2250393 2573546 2180583 1606694 1301610 1032030 34828
24910 34828 -1170133 -1562436 -1248246 -1011111 -1020581 -905819 -563428 -551763 -571807 -1283394
24900 -1283394 -2661511 -2799263 -2635145 -1750984 -586544 -573742 -1303025 -1946090 -2178135
24891 -2178135 -2094734 -1840252 -1594174 -879860 -464040 184038 1125174 1479554 840262 -390569
24881 -390569 -1842663 -2759007 -2466508 -1675758 -903863 -684834 -310114 315700 969369
24872 969369 861155 6040 -896111 -1714244 -1862838 -993008 -912178 -1063411 -1171735 -1494447
24862 -1494447 -1935190 -1612535 -599643 109878 376461 -36619 -163826 -316557 -449853
24853 -449853 -70521 -29841 253698 793628 1373871 945826 -125981 -1021773 -1103040 -604774
24843 -604774 562344 1843081 2200283 2130278 2624820 2901784 3280159 2575794 829669
24834 829669 -184908 -1252357 -870565 -200939 386633 880078 919683 268127 -115147
24825 -115147 99136 494203 1194775 1051855 1064110 1352661 1319055 888133 276320 76018
24815 76018 274662 205988 7542 -611055 -830294 -938583 -1479599 -2633576 -2638334 -2110198
24805 -2110198 -2038257 -1579666 -987845 -1007226 -1097748 -472242 -619652 -1090276 -81029 551577
24795 551577 247960 -406723 -731132 -665879 -1212770 -647928 456705 669306 154823 330014
24785 330014 966777 959919 483366 803456 1415723 1742656 1847122 1270373 603767 461251
24775 461251 827595 1511786 757480 -111884 -93516 88388 344561 388084 -480814 -944696
24765 -944696 -516995 -846611 -1262210 -901333 -1332697 -1595674 -965233 -223208 429379 790021
24755 790021 829632 764778 1813639 2005556 1377431 421087 -171055 628018 880504 561837
24745 561837 125974 -814570 -1076858 -240986 1153083 2311273 2417818 2251396 2103693
24736 2103693 1894497 2036483 2574358 2495570 2084005 2429629 2156651 1437239 458286 351189
24726 351189 492483 -43633 -487450 -1159117 -832366 -186586 -106746 -856220 -1612247 -1813533
24716 -1813533 -1385847 -1343566 -1150593 -396659 215614 831187 1523170 1955968 2382739 2932096
24706 2932096 3565646 3540839 3061934 2351074 1473021 680097 507081 246083 -1403969
24697 -1403969 -1710688 -1129904 -598016 -103748 672476 1411753 1007378 -400303 -879667
24688 -879667 -1147685 -925686 -664630 -577667 -668078 -831651 -1140485 -1454834 -870534 -842711
24678 -842711 -1553949 -1494730 -1272094 -1750914 -2075094 -1297846 -23530 673028 872918 844740
24668 844740 654266 619332 -130624 -535906 -480322 -122958 500175 537663 567284 705659
24658 705659 926288 1151485 -335479 -2219507 -2288823 -2236065 -2604350 -2922916 -2345580 -876411
24648 -876411 -329786 -362782 -282964 -457988 -591766 -384741 200693 355935 -19484 -402499
24638 -402499 -881894 -1350893 -1087769 -581218 -740882 -1129290 -999853 169790 850167
24629 850167 215946 -594418 -959982 -1849610 -1281137 150026 654598 724042 941072 1144782
24619 1144782 476758 -370133 -866149 -825452 198302 363189 73290 557697 817509
24610 817509 545230 295306 318436 -1002117 -2019488 -2550642 -2367324 -1001340 -284332
24601 -284332 560320 1368399 994155 473362 -132175 396670 1198507 963316 279174 -72425
24591 -72425 789581 1931413 1618777 930501 1522635 1837781 2078347 2349868 1671650 1164397
24581 1164397 1479328 1576362 1148860 1629949 2431977 2113265 1168799 349955 -145979 -1231974
24571 -1231974 -2158196 -1338114 -497470 -282823 134426 923302 1208803 1062343 1178366
24562 1178366 1063830 725962 893724 707979 1284796 2277551 2398816 1812551 1760965 2055949
24552 2055949 1826291 1196088 771409 -140374 -1374564 -1411210 -1053752 -603568 67201
24543 67201 431509 -115456 70251 -284099 -1074608 -1081889 -545720 208370 475440 -328851
24533 -328851 -1037754 -1263046 -1525694 -825346 -784418 -656109 883976 1547097 1025566 1140186
24523 1140186 1208603 1647373 1452276 696403 357592 -142832 -291221 -194664 297015 727528
24513 727528 785840 806259 575038 312423 201098 -215349 -817687 -487746 3215 261256
24503 261256 763348 1069254 1506813 1989151 1471403 1201941 1309188 1034635 147500 77814
24493 77814 -4561 158029 1003620 1460775 1281452 735474 117387 -325906 -885697 -1495308
24483 -1495308 -1576314 -881298 -604212 -785353 -565620 -493748 36224 284378 210865 727172
24473 727172 872962 218832 -88155 -470082 -1300294 -1132436 229173 858032 1412416
24464 1412416 1488631 1726341 1733891 956061 608817 1024056 1284281 1456863 1201414 258097
24454 258097 -429080 -794904 -859710 -436939 223034 -117325 -1024521 -1103272 -1102447 -1916955
24444 -1916955 -1387227 -536478 -518135 -854143 -1325188 -893753 318016 1037960 1877245
24435 1877245 2323488 2175157 1343096 1056528 1136359 783838 685491 -24773 -1419380 -1510189
24425 -1510189 -696614 59385 -51499 171956 1075666 1622954 1569610 1168393 799740 470530
24415 470530 128205 666342 2034132 2572738 1585465 -315784 -1516281 -1087209 -860494
24406 -860494 -1094992 -1473591 -1974957 -2052841 -1579227 -671800 -100156 139835 554260 732012
24396 732012 1124661 2564155 2801755 1560229 805852 660470 1850966 3048747 2741895
24387 2741895 2393660 1750904 500048 -521228 -592049 -451390 -285986 216604 535660
24378 535660 484303 760349 747842 1402596 1301840 103540 -1317408 -2079794 -1864515 -1952809
24368 -1952809 -2363503 -2026374 -1082603 -76326 109507 822725 2054207 2670692 2133240
24359 2133240 560343 -756428 -1269694 -1216642 -488702 -383415 -1440587 -779012 17524
24350 17524 -474754 -63252 -241551 -1486352 -2285385 -2117627 -830995 -702473 -659220 -892877
24340 -892877 -744453 346759 342564 -160938 -965533 -1287280 -1427780 -1492431 -1350533 -910608
24330 -910608 -639031 -1288171 -1492993 -725788 368132 906371 838128 502999 -83813 -605087
24320 -605087 -1241731 -2204591 -2420921 -1136949 -182904 -715169 -1697674 -1447973 -1258636
24311 -1258636 -758680 -643320 -993726 -923666 -949500 -540232 -104970 187579 -685983 -2224871
24301 -2224871 -2276861 -1601171 -1434212 -1636051 -2164849 -2868697 -2512365 -1395590 -216945
24292 -216945 712994 396640 -127644 441359 743725 812947 747594 568474 -460426 -1315324
24282 -1315324 -1420389 -1548897 -1496106 -609087 215697 104164 -386885 -1004153 -799506 -71127
24272 -71127 -279748 -1157602 -1246973 -420552 -318555 -620695 -292216 -137263 381443 372852
24262 372852 477337 -45035 -1605863 -2262458 -1935611 -1120056 -593106 -183877 296345
24253 296345 638905 990885 1120656 597541 791 96059 427759 553809 493185 330688
24243 330688 1076730 2108802 1675398 1300540 2371349 2912834 2113909 1535974 1994505
24234 1994505 1323916 298390 -99005 271545 608332 841827 1065339 468769 -1185273
24225 -1185273 -2121892 -2142789 -2074054 -1588375 -634575 -617739 -283569 1095367 2233558 2773452
24215 2773452 3032482 2190293 1242720 1095426 1092788 1396496 729335 258854 -35097 353770
24205 353770 995086 1221565 1106735 1663961 1728335 999720 760551 1093261 1193388 1514182
24195 1514182 1358566 1748349 2440844 2097683 1151961 463795 957439 1250766 1129162
24186 1129162 1481599 2062475 2651219 3394419 3821532 2822228 2087950 2425652 2080915
24177 2080915 1681714 1283940 1784810 2104653 2041391 1558844 1585012 1890900 2296049 3270771
24167 3270771 4205063 5557529 7406923 7928421 7394939 6670280 6513576 7745153 8379722
24158 8379722 9018936 10480046 12195172 15159092 20108899 26683975 35448735 46876467
24150 46876467 61767752 76904617 88236084 91550220 84583082 71704938 57403618
24143 57403618 44685539 34200896 25689530 20381399 16512758 13728808 11600659 9790335
24135 9790335 8301727 7155380 6394640 5469645 4936729 4545679 3709442 3203269 2771300
24126 2771300 2413084 2416543 2665101 2517058 2230614 1896048 1446235 705246 1007332 2143058
24116 2143058 2821651 2480364 1656185 1228813 807591 273572 535157 218588 -416431
24107 -416431 69159 1205107 1646438 1434205 812411 299724 -58087 133920 -6982
24098 -6982 436749 452597 -121338 -539256 -379016 1254912 2763956 2548083 853016 704294
24088 704294 827995 482077 295401 527114 1157985 1474400 1714941 1881774 2143376 1805607
24078 1805607 1158650 595860 233923 377222 198187 -239421 -518220 -502814 -1359951 -1924888
24068 -1924888 -1876149 -1260407 -469073 -428798 -880061 -705428 -49959 840269 1013959 983971
24058 983971 1276613 974476 485284 19102 289720 1091669 1660580 1497190 549627 -396681
24048 -396681 -676878 242803 1184006 1844353 1688552 463161 -754498 -1498078 -1596199
24039 -1596199 -1864992 -1745109 -887946 -425611 -651717 -1212647 -1300549 -770517 -427311 -281063
24029 -281063 -927246 -1225678 -1236749 -1678599 -1841602 -1885865 -1676100 -1196653 -1555573 -2303856
24019 -2303856 -2349280 -1677797 -491150 219483 -689055 -1203064 -445406 370603 1126973
24010 1126973 165774 -1261710 -1836296 -1326559 -425027 -44368 -202776 -849921 -1572263
24001 -1572263 -1563270 -1125616 -1371890 -2375514 -2028434 -854843 496108 1416177 1441837
23992 1441837 675325 -140700 -789521 -1211035 -1987877 -2968247 -3059081 -2144581 -1068380
23983 -1068380 -433507 -93953 343976 374150 -140224 -751255 -1139812 -1115661 -887114 -685218
23973 -685218 -219774 -291707 -508004 -607279 -130099 258177 47742 -71049 617356 1347939
23963 1347939 975339 917198 1247455 769851 -833222 -2044103 -3055165 -3327503 -1882284
23954 -1882284 -252069 257685 -101158 -465955 -620878 -897841 -1321576 -1976294 -1971595 -1773785
23944 -1773785 -1475960 -917457 -234014 -74048 -287087 -347124 -147392 -32465 81140 -31118
23934 -31118 -266884 -171737 -86421 120683 -102641 -122056 319791 629171 705943 1285845
23924 1285845 2585389 3156361 2441227 1565252 319328 -776489 -1202064 -516953 1052363
23915 1052363 1471095 818417 -213945 -711849 -644098 -169238 169207 347490 -201412
23906 -201412 -1152436 -1311892 -1063578 -1000574 -1027947 -1591576 -1303654 -219615 638966 318855
23896 318855 -664349 -1153773 -348513 568019 903332 626944 -27155 -73591 625431 448084
23886 448084 248303 -142329 -510531 -640378 -1261118 -1808937 -2041661 -1564029 -1053962 -498112
23876 -498112 -838354 -709001 -59897 -284550 -1014658 -580187 -237126 -1085159 -1711000 -1002705
23866 -1002705 134166 -81301 -953410 -1091783 -621049 -659054 -625064 -1326514 -971365 -441593
23856 -441593 391119 1476230 1937329 2209115 2335889 2018593 1753292 1591571 1298517
23847 1298517 1482861 1735597 2332696 1968830 1921539 2241220 2008575 1367335 931394 733712
23837 733712 173553 145317 1023264 936045 171409 -307752 -715638 -324774 196223 -308686
23827 -308686 -317400 799292 1999561 2905563 2249151 244294 -1139341 -1508306 -667769
23818 -667769 -98682 -572688 -971643 -1810957 -2074496 -1458720 -796450 -851690 -1286990 -1441329
23808 -1441329 -1737172 -1423889 -1572154 -1356019 -1103677 -1309651 -1115122 -786552 -1004417
23799 -1004417 -1188342 -655023 214432 388002 621326 764603 609688 652269 1068041 775820
23789 775820 82891 90956 -174368 -889565 -1427273 -1095038 -933709 -986999 -560300 -390586
23779 -390586 -762891 -1203842 -1340628 -1564344 -1009502 130806 972511 748268 221944
23770 221944 -125759 -204429 -1074563 -2240656 -3074022 -3407641 -2808307 -1857962 -1337101 -664836
23760 -664836 -595268 -1195776 -1948317 -2267085 -2288856 -1926255 -694658 -672641 -1030194 -666538
23750 -666538 272452 763489 732742 -4648 -952461 -1545712 -1836916 -957424 52134 794436
23740 794436 1824622 3399547 5443987 5938002 5595320 5878634 6232138 5591949 4415180
23731 4415180 3540337 2975095 2268321 1176866 410281 -432715 -472924 -625937 -911689
23722 -911689 -713817 -564665 76788 331325 424684 662198 1090996 610201 274989 224782
23712 224782 -122739 -517728 -648936 -44746 441654 -318109 -854335 -1185349 -1837302 -1822042
23702 -1822042 -1084097 -433292 138181 712496 1101982 1745129 2211775 2164796 1614988 1180697
23692 1180697 1753745 2530710 2217663 1035290 43358 -461669 365743 1674953 1619654
23683 1619654 985431 15240 -337134 8431 843467 640910 -648659 -220284 -3411
23674 -3411 -985403 -1388940 -743397 106262 769434 795725 -261521 -681364 265241 749324
23664 749324 461798 364045 601913 1146501 1497995 962993 -363623 -1166860 -875822 -482297
23654 -482297 -630577 -843627 -497294 600537 1479386 1412463 933691 742651 -113716 -991724
23644 -991724 -811619 -285512 663167 1273332 932440 270162 -383851 -616597 -791146 -790193
23634 -790193 -522523 112098 1194103 1731510 1966207 2415964 2280519 1818145 984308
23625 984308 447080 999119 783568 222635 655033 21226 -706444 -773826 -761707 -95613
23615 -95613 234941 -448228 -1614762 -1768717 -912906 346966 996900 819165 532293
23606 532293 205857 -192880 -485662 -100511 -277998 -1251563 -1256856 -1507409 -1360241 -1138690
23596 -1138690 -1638786 -1624533 -1454231 -1446078 -845094 291552 730594 105467 -1119330 -1878724
23586 -1878724 -1772296 -1149022 -773585 -631223 -84944 868532 612885 -118829 -447060
23577 -447060 -94801 172940 -422482 -766014 -705128 -211430 -626554 -1218913 -677355 481122
23567 481122 478371 60300 336169 226741 220820 585193 505080 492664 -13072 -477797 -459082
23556 -459082 226173 1116370 941941 1190992 1236257 882589 506884 238693 499651 356630
23546 356630 144230 445217 493388 716013 759060 -130398 -504814 -605268 -713112 -763129
23536 -763129 -952880 -1078328 -505006 323777 543531 282910 124309 305369 -69064 -555002
23526 -555002 -292885 -183453 -520097 -838117 -402061 305703 562861 326374 -490385 -779729
23516 -779729 -518262 285067 779197 670604 443250 -37929 -38821 -116995 -204379 -278099 147909
23505 147909 613346 1187400 1440941 1298672 1114970 912842 670750 698828 595224 -76317
23495 -76317 -109657 -303943 -690253 -750833 -922280 -1444124 -1362638 -626045 372764 466935
23485 466935 111240 386734 61527 197677 467513 1103008 1242968 671976 825148 1111228
23475 1111228 882023 951148 1501477 1024001 -125687 -582623 -1418174 -1890142 -1954050 -2399146
23465 -2399146 -2191649 -1727916 -1430130 -1045716 -750933 -356552 -111081 -644215 -898294
23456 -898294 -1311903 -2748326 -2955367 -1285628 174584 337307 -282877 -101479 668394
23447 668394 579415 -66275 -334068 -94581 516151 1323003 1946388 1946871 1752637 966554
23437 966554 245585 1030376 1342106 640484 382199 283986 29891 -598974 -938360 -674527
23427 -674527 -104999 -116066 735595 1590683 983203 -61978 -207041 -133595 271512 625308
23417 625308 42630 -505033 -59748 751632 673880 101469 558123 639753 -35347 -178057
23407 -178057 782264 1484852 1730483 1128159 -812228 -1521272 -517880 -240462 -558529
23398 -558529 -740089 -939505 -1380203 -777431 -159174 140667 281924 85465 460144 765085
23388 765085 876083 937636 1184073 1293204 773028 333969 918233 1353250 1146546 1377495
23378 1377495 1440997 868981 925747 1078550 330959 -343144 -344457 -66402 1321521 2729903
23368 2729903 2656392 2182401 1872666 705835 -491963 -1489557 -1865834 -1482069 -969911
23359 -969911 -386668 676582 1451684 1451154 831578 20734 -202892 -531923 -979100 -1189635
23349 -1189635 -1188398 -1766600 -2433706 -1879153 -797429 -102913 -145814 -764185 -808773 -153004
23339 -153004 750115 1913990 2065071 805032 -920269 -1512430 -447320 395953 -56675
23330 -56675 -1148871 -2062317 -2425614 -2202456 -1377242 -810444 -660980 159279 600924 133474
23320 133474 -145473 -368281 -11679 -42768 -57587 342161 105464 -157245 -582945 -758666
23310 -758666 -657554 65824 -229378 -1025454 -967848 167163 1226315 718465 280175
23301 280175 645908 848744 400466 258887 -162058 -1142725 -2436921 -2349619 -1202618
23292 -1202618 -751849 -738968 -719165 -938299 -798609 192916 535118 -196239 -947164 -1564591
23282 -1564591 -2194869 -2191496 -1563168 -565964 100280 432624 -114782 -1286195 -1898191 -2358923
23272 -2358923 -2810505 -2610292 -2172984 -738350 187550 -390402 -389204 -33392 -104919 183864
23262 183864 1233851 2012345 1474845 489993 433494 411476 -956530 -2459229 -2237738
23253 -2237738 -1444419 -978672 -718016 -1075458 -1446486 -729484 -244362 -223234 -321953 -577141
23243 -577141 -1207278 -1688798 -1548576 -265263 679450 1404145 1780475 1131760 -156291
23234 -156291 -1231255 -972101 -60608 40311 -979527 -1438790 -1547496 -1398028 -678866
23225 -678866 -583161 -801828 -1260710 -1924753 -2002325 -971693 -544776 -1403941 -2159367 -2478537
23215 -2478537 -1575957 199100 1111740 1265353 365150 -367540 -401696 -439559 -129071 -11932
23205 -11932 -457698 -17878 569994 296232 -324151 -1952433 -2906247 -2060127 -1212245 -1253790
23195 -1253790 -622076 -6848 52921 -105830 -267768 -884417 -1835298 -1981113 -1779075 -2427715
23185 -2427715 -2266434 -1286817 -298483 587864 761525 659406 485023 295003 4015
23176 4015 296086 423223 -83392 -196861 -43263 -261690 -1105585 -1659539 -1617656 -709630
23166 -709630 156549 19031 -980613 -1156666 -646675 -557375 -1148408 -1661101 -1622861 -786397
23156 -786397 111078 239664 -216655 -859376 -431168 -436560 -464090 -128253 -808596 -1080622
23146 -1080622 -478618 -202841 -438519 -309794 512603 880797 1644842 2411489 2640662
23137 2640662 2200769 1707127 903635 794811 1120255 821885 -104887 -782275 -1386576
23128 -1386576 -1050457 -291374 43719 -539863 -1473718 -1840135 -1448210 -594951 -141945
23119 -141945 365923 -657878 -1702228 -2165258 -2275350 -2314578 -3195193 -3955695 -3609872
23110 -3609872 -3236964 -3343478 -2359842 -1120533 194969 1254671 1280632 642135 542673
23101 542673 1096607 1601821 999744 640032 1181508 1256144 1674098 2229811 1796272 1564331
23091 1564331 1757895 803698 -351399 -1385715 -1482937 -1387877 -1407515 -650773 474128
23082 474128 1036970 1330513 658503 40752 -432770 -1012566 -687118 558147 993132
23073 993132 569861 116295 413499 1355883 2205270 1770769 1038430 497445 -113042 -95762
23063 -95762 377964 996130 1299872 1210776 1144847 1232334 1330637 1046411 441437 229709
23053 229709 -4981 -642653 -1197230 -1338544 -1513238 -1631791 -1352441 -1031443 -1134819 -1156869
23043 -1156869 -1600838 -1887050 -1644988 -1727867 -2302124 -1731064 -715305 -204949 309143
23034 309143 560024 956893 1400100 973847 -548494 -1334357 -1193051 -1268435 -1347155 -1162440
23024 -1162440 -1103670 -1244590 -1043852 -658088 -533445 -569251 -336550 -250742 -33509 250365
23014 250365 77634 646143 1255211 353988 -811331 -1682595 -1602535 -190910 838143
23005 838143 1066206 1426680 1892139 1724449 1329894 1513886 1615030 1631829 2053757 2905520
22995 2905520 3541123 2211706 634402 -136069 -235162 -79013 -173447 -1569517 -1977069
22986 -1977069 -1843452 -935405 676720 909218 173735 -134206 -193415 -85528 203972
22977 203972 193918 1415137 2854506 2901673 2233019 1179158 350818 343564 102665 -670566
22967 -670566 -1023006 -640716 -956933 -918292 -350653 -516011 -652852 -717611 -752743 -853088
22957 -853088 -999798 -1553070 -1523162 -1438089 -1266182 -822159 -413220 -136100 310688 1016921
22947 1016921 235481 -880335 -1331395 -1014357 144386 988256 506894 -748229 -1343706
22938 -1343706 -1387624 -1350952 -1212120 -1197693 -1500340 -1261678 -719817 -150031 74696 -735116
22928 -735116 -750179 252217 851455 -127256 -1544476 -1337015 -546252 -670857 -748293 -1476488
22918 -1476488 -2011627 -1506628 -799663 -689029 -341917 -168074 -426621 -1131186 -1876630
22909 -1876630 -2511224 -2394196 -1385486 -607000 -1487157 -2775165 -3390477 -2672444 -1877017
22900 -1877017 -1278805 -697155 266411 836981 402763 163794 46888 680719 970729
22891 970729 255886 -532188 -748619 -1020954 -817600 -43005 766310 1403507 1519056 841830
22881 841830 -133298 -78899 4501 -308097 -104600 332529 1013368 1777420 2385976 2372971
22871 2372971 1539395 867823 1413027 1806583 1510443 1488575 1725270 1597001 1213984 945476
22861 945476 708368 289400 -301112 -177409 392818 292864 -55931 -90223 80865 64702
22851 64702 -158018 -220413 -685422 -792735 -113192 291122 188262 -244765 -193577 302493
22841 302493 -234011 -979859 -978063 -426641 -115655 85662 340961 352873 333517 295374
22831 295374 -932733 -1863086 -1792389 -1323299 -747788 -573515 115448 379281 -85955 300973
22821 300973 797382 635796 389432 261540 479743 802706 419770 -447764 -1182161 -1343599
22811 -1343599 -927104 -116082 439683 1162065 1985728 2072483 1277304 -489233 -1359528
22802 -1359528 -1273796 -1049729 -427467 -406232 -973882 -1204149 -1368481 -1455695 -1439224 -1158841
22792 -1158841 -934953 -684507 -751933 -773398 -511685 -371584 143967 187277 229501 319780
22782 319780 -268715 -1451583 -2007596 -1825542 -1974718 -1891285 -853861 -651721 -631979 182447
22772 182447 454666 534530 494927 -426728 -1475716 -1276224 -610371 227903 240501 -651794
22762 -651794 -1064398 -1536586 -1648440 -1539831 -631917 209440 611781 809296 511677 597225
22752 597225 538041 951732 1140706 1336564 1525242 787650 1004096 1058956 1150669 1522565
22742 1522565 1292040 671001 95303 438765 448215 -45374 -4772 458706 395777 -323274
22732 -323274 123420 414068 -174499 -434558 -990301 -1133514 -962564 -972147 -1216786 -1954168
22722 -1954168 -2435730 -2305755 -1788433 -232028 1125464 1234890 780357 240950 -186597
22713 -186597 363101 1341748 1719944 1262948 240767 260260 1010143 591662 204747 203201
22703 203201 372898 -24849 70348 258826 10979 -460095 -529004 -244053 -500182 -1269760
22693 -1269760 -807523 -364615 267288 696187 722298 1176902 1526422 1117987 147576 -346312
22683 -346312 58631 594121 1362710 1649736 850770 20652 420209 739610 531208 911792
22673 911792 1348727 1878068 1846471 928632 -111467 646042 2066462 2613142 2114774
22664 2114774 839669 -155891 -654285 -349307 -808042 -268389 845127 1352832 1242104
22655 1242104 864780 421466 -35491 -810797 -977691 -922014 -935593 -876129 -687785 -699393
22645 -699393 -274923 316006 -400574 -533540 727924 1259305 1423916 1521761 847320 340552
22635 340552 117030 -431354 -999325 -1298418 -1413735 -703276 -116745 319015 -112479 -610584
22625 -610584 -511889 22402 -307298 -748924 -521715 -316769 -828606 -988277 -227120 583756
22615 583756 1042789 729860 523471 781599 234061 -591713 -1555993 -1848391 -1023960 85301
22605 85301 873137 1179943 661666 330837 375890 144087 -279428 -323448 -969950 -1324314
22595 -1324314 -1256746 -847948 -254413 -43738 254871 245298 103823 893698 1425064 831871
22585 831871 424026 742312 1070409 1983295 1845237 537298 -27903 -147575 -1184599
22576 -1184599 -1181213 50607 621626 1122578 1220831 838522 151579 -411970 -25310 -175858
22566 -175858 -1493229 -2108994 -1256861 -546582 -327707 -7573 -815 -700623 -1164027 -891736
22556 -891736 190399 628655 334686 385451 76250 -421993 -1544896 -3120445 -3733063
22547 -3733063 -2553000 -845731 -83863 7242 -301010 -1147852 -2347088 -2243469 -1349344
22538 -1349344 -1040318 -1145937 -1201985 -889913 -707748 -529150 30635 220772 -214798 -121287
22528 -121287 -485475 -1446940 -1289124 -553221 36886 1024507 1766636 1649968 767124 388780
22518 388780 -332315 -1328201 -1361383 -424423 178179 -394557 -1112680 -1502387 -1877177 -1319209
22508 -1319209 -821798 -1300419 -1805622 -2269576 -2223838 -1946979 -1539192 -866092 -639109 -688356
22498 -688356 -419143 518611 1584731 1212459 493247 -179411 -865457 -1664616 -2570725
22489 -2570725 -1598173 -249311 -670561 -1346312 -301819 961608 1680071 1165867 525579
22480 525579 550263 688875 648401 34744 266729 43484 -881694 -519782 660536 1336107
22470 1336107 1242145 1066767 41924 -350583 809175 1836108 1074181 -102883 -331523
22461 -331523 -894563 -1383930 -720139 193224 1048602 1377385 1246924 1956671 2908810 2998049
22451 2998049 1483953 228298 -447646 -746556 -736925 -350578 256521 518256 185037
22442 185037 -344185 -70685 508590 983230 1275802 1398124 1726759 1602907 2914318
22433 2914318 4204915 4821185 4894471 4186851 3180429 2482802 2969634 3256155 3644838
22424 3644838 4248130 3915789 3220021 2284114 1311119 444787 -69429 355813 872636
22415 872636 1250117 1487662 1501802 1269772 935124 604900 849515 600931 801566 940489
22405 940489 1042691 1570864 1811046 2666549 4033905 4664479 5125012 7104288 9171819
22396 9171819 10786174 12312649 13201620 12954467 11347501 9606532 8348699 7887689 8107544
22387 8107544 8088492 7510232 8083487 9715760 10961476 12420667 14176481 15249105 15611938
22378 15611938 15875077 16249508 16374165 17465929 19350066 21936252 26460225 31529657
22370 31529657 37068172 43214630 48967441 54897238 65134513 81921721 107038794 142848476
22362 142848476 184597955 215693674 220450061 201829341 179010918 164302280 157675286
22355 157675286 154268885 149463626 141464192 131420641 118590951 102617516 86374508
22348 86374508 71649327 59172892 48638272 40119272 33377831 28480171 24280796 20750563
22340 20750563 18925684 18214412 17339080 15409021 13741005 12541686 10543722 8762218
22332 8762218 8499736 8545742 8549841 8276218 7042379 5611582 4253076 2804451 2365691
22323 2365691 3460013 4888054 6147035 6898867 8393474 10191920 10416829 10225415 10389485
22314 10389485 9992866 8859501 8089215 7474599 7138603 6580377 5002075 3213165 2193464
22305 2193464 1873067 1499945 1428040 1000533 440376 881791 1234836 1418722 1644683 1833839
22295 1833839 1065262 29217 654830 1805659 2546726 2983912 4026183 4024991 3237451
22286 3237451 2943168 2430700 2154561 1942351 1527359 1932197 2494998 2683000 3171278
22277 3171278 3911434 5006493 5484488 4526222 3845865 3166660 2840421 3141579 4103000
22268 4103000 4331365 4349362 3980042 3930398 3613176 2215492 1213698 894771 746839
22259 746839 700731 791771 558558 369499 834850 1378229 1589616 1256062 830994 636391
22249 636391 514615 982516 1535652 1985943 2316726 1788853 1089292 930908 640814 -271411
22239 -271411 -313514 -467941 -783084 -359995 -301165 -963218 -1355033 -1272755 -2074023 -3261213
22229 -3261213 -2792205 -1024906 75510 625635 598819 268412 -848145 -1657348 -1545480
22220 -1545480 -1447378 -705863 -83821 -121996 105704 -135291 -609146 250869 1640352 2469553
22210 2469553 2341755 1185908 27047 -109939 -234837 -858857 -617493 -291235 -250385
22201 -250385 -551531 -644989 114478 1005170 1251666 1475560 2662315 2831088 1448382
22192 1448382 404680 135099 236453 -379922 -471287 -458817 -262625 55855 580712 1558834
22182 1558834 1737846 1581167 1585253 1936265 2415858 2979397 2725111 1636950 551412
22173 551412 424181 612159 829730 1345171 2133264 3443532 4166213 3986174 3063936
22164 3063936 2731503 2951930 2944112 1295552 -960765 -1016586 -519571 -437128 -954715 -2036137
22154 -2036137 -2633475 -2742215 -2412231 -2080618 -2188825 -2763812 -1943482 -509886 67881
22145 67881 638142 1256106 967345 972052 1388375 1785416 1073107 676985 547078 -61098
22135 -61098 34192 172017 256650 40841 814197 1357599 1505179 1755927 2181620 1762017
22125 1762017 1471299 2114124 2499662 2135529 1465174 1115985 458170 45944 400203
22116 400203 1043694 1084442 1288235 1386316 1094101 692844 1063595 1261979 343887 -443263
22106 -443263 -717136 -813511 -731883 -293875 751538 1229825 1299477 1380336 838883 116020
22096 116020 -49572 333252 471933 198248 210535 -112643 -535989 -57695 518430 681469
22086 681469 913043 1251067 1192458 484970 -485188 -1271224 -1593585 -1202832 -532959 -317911
22076 -317911 -603117 -1014366 -1007710 -844581 -1090271 -1163460 -1595992 -1968505 -2390970 -1713722
22066 -1713722 -530518 -369352 -237189 191467 623068 1476462 1356101 838427 -192304
22057 -192304 -742418 -447548 -310641 -467200 -811540 -1116911 -1263018 -1205386 -1639602 -1727538
22047 -1727538 -1537631 -1263299 -1125489 -1229781 -1103233 -262372 3098 79878 -356161 -1239238
22037 -1239238 -1993139 -2510373 -2566992 -1752331 -304935 300167 380822 381735 -263438 -1054143
22027 -1054143 -1489247 -740658 -628763 -817151 -680397 71268 720008 374840 81180
22018 81180 110984 471534 920182 934288 546577 204053 -501282 -1636440 -1407920 -1716695
22008 -1716695 -1635732 -495954 983979 2048263 1697814 1108401 52456 -1851613 -2637109
21999 -2637109 -2401130 -2168884 -1960578 -2615548 -1982152 -1208117 -782450 -264367 242224
21990 242224 846951 974779 705308 951651 887875 528711 -572247 -1019051 -103286 405606
21980 405606 921860 1074403 485913 -225911 -348753 355654 120959 -876528 -1650993 -1078528
21970 -1078528 -315842 49227 480899 143134 -441222 -718625 -1375577 -1698263 -1057557
21961 -1057557 -330591 -39984 323591 411730 28535 821458 1357123 1263425 1511220 1516824
21951 1516824 602161 141632 -126104 -631567 -496686 43741 379172 623046 478666
21942 478666 551248 482718 -703359 -1499930 -1445858 -1681343 -1794359 -1659928 -1798472 -1534431
21932 -1534431 -980047 -516343 -53723 -495365 -435371 202507 612532 1401421 1256497 875739
21922 875739 785980 432844 -43750 -447714 -597006 -1109740 -1105610 -798477 -94557 500119
21912 500119 196175 -246961 -695521 -1328542 -1294666 -513704 -66219 -3679 -574763 -1174269
21902 -1174269 -1174518 -874678 -575019 -175385 -322873 -358010 -47648 81682 -496071 -609784
21892 -609784 348344 552917 -52153 -17273 194386 -36760 143140 622619 676708 128686
21882 128686 -588473 -1697009 -2900770 -2946438 -2070108 -1674428 -1422630 -1412200 -1696869 -1120903
21872 -1120903 -286355 20085 349972 852253 759313 958764 994226 367363 -558683 -758597
21862 -758597 -983687 -1756944 -2755454 -2980565 -2891186 -2547514 -1829342 -1201997 -225962 29465
21852 29465 -548689 -1959279 -2487654 -990351 240926 440181 141459 -123019 -814735
21843 -814735 -1169463 -1190588 -912666 87913 1311725 2084113 2883276 2157929 1067046
21834 1067046 692569 502315 684320 1150740 1666848 891102 -381255 -457034 -35348
21825 -35348 226344 -532386 -1325252 -1017330 -477733 -266390 -70536 -271371 -956942 -746558
21815 -746558 -236377 -673992 -372900 127965 150519 -130644 -659755 341288 1114032 609987
21805 609987 693757 2006985 2981285 2554246 1827972 965322 385890 10875 -275974 -97592
21795 -97592 -349255 -1041679 -865533 456097 657876 -515913 -1531819 -1232279 -609154
21786 -609154 -105100 143669 -211627 -146067 560312 653343 -140732 -274918 6861 762769
21776 762769 573917 987985 701238 -211021 -407147 -253114 785639 1666220 1746368 1807058
21766 1807058 2244439 1551924 1685972 2183291 1996456 2599778 3743758 4030795 3743473
21757 3743473 2835262 2137867 1916264 1463748 596454 -520315 -920526 -365079 777860
21748 777860 1334748 936870 578685 -103861 -1005242 -821393 -761963 -368687 1044023 1047827
21738 1047827 -69488 -674799 -419824 -279263 1518134 2679775 2399640 2126200 1857672
21729 1857672 735042 -359896 -494564 -329816 -521652 -366480 233219 265156 153379
21720 153379 916951 1339211 610036 244954 558459 420348 64625 -349096 -147198 -395649
21710 -395649 90179 1047211 1672066 2390601 2432039 1855613 878654 -634385 -1898396
21701 -1898396 -2778390 -3013415 -2674884 -2243398 -1626695 -1037003 -601821 80115 155421 158052
21691 158052 486970 409314 379571 345774 -348682 61359 1194923 1531008 1740183 706199
21681 706199 -84936 755353 1679627 1889193 1644871 454531 -1023949 -1923396 -2395963
21672 -2395963 -2792801 -2886305 -3366103 -3889136 -4122753 -4261988 -3967083 -2917054 -1199418
21663 -1199418 9236 -15027 -399216 -745942 -1178721 -1744945 -1979287 -1441729 -502201
21654 -502201 -327835 -680916 -389616 787163 1389195 765256 -250139 -888258 -944108
21645 -944108 35585 1217952 1727973 1601888 1074675 710329 733724 1492748 2222231 1982446
21635 1982446 1666724 1219896 242210 -103702 862715 1976888 2769068 2430797 1143051
21626 1143051 -98995 -743475 -306937 279830 183772 -80800 -540230 -616693 -697817 -856691
21616 -856691 -895318 -469623 36779 176188 79391 444320 536927 -77622 -735980 -878198
21606 -878198 -283354 -393337 -475430 -449120 -34373 569369 543901 -243681 -362830 345379
21596 345379 559375 113099 -549687 -773631 -347107 281022 392299 -735474 -1589748
21587 -1589748 -2229602 -2490103 -3083515 -2863829 -1653834 -1016039 -819700 -44025 302512
21578 302512 870075 1120471 -243225 -891629 -1517526 -1926959 -1483807 -1774051 -2047859
21569 -2047859 -1130463 265027 776175 1564276 2547927 2510209 2428797 2970694 3120689 2420487
21559 2420487 1028581 755527 1611043 1666212 1353307 1385662 1921575 1992606 872766 -234364
21549 -234364 -498330 -604681 -513387 -794392 -814777 -1484486 -2057427 -2047734 -1549756 -217719
21539 -217719 496696 191207 561712 1186846 1626478 2643297 2870857 2792761 3435263 3583577
21529 3583577 3249303 3517530 3844613 4283580 4617457 4453298 3950392 2974520 2357183
21520 2357183 2195820 2555678 3215041 2251845 1424342 1202273 1111179 901330 567122 1073611
21510 1073611 1270707 1218512 1007781 720949 804206 551330 -190896 -246100 -174721 -249190
21500 -249190 -342662 58090 823265 1525089 1648069 939398 37337 11884 -217807 -462247
21490 -462247 -98526 343028 1242730 2551456 2962406 3222332 2764972 2527287 1919535
21481 1919535 572625 -221881 -1075126 -1758749 -2220070 -1804049 -579259 -727515 -935721
21472 -935721 -492924 -686553 -629935 67715 473404 717292 586863 721606 879828 -83873
21462 -83873 -464595 -292501 -757714 -491217 -58626 448344 411398 121116 10684 -60405
21452 -60405 166498 110717 -6242 -214549 -335682 -903672 -940712 -263345 772956 635470
21442 635470 164715 720318 787936 49228 -488089 -893167 -1498208 -2500513 -2875130 -2796065
21432 -2796065 -2453060 -1585399 -691938 -168588 -240877 -341111 -224034 -36058 142104 341894
21422 341894 -215362 145072 1047699 1418487 921308 351639 60519 -350105 -959993 -482948
21412 -482948 -946402 -2436072 -2458383 -1915480 -819226 87202 65479 -21590 -153841 -782570
21402 -782570 -1473690 -1729364 -1212588 -1386652 -2466909 -3456561 -3516832 -2802071 -2233686 -2203340
21392 -2203340 -3096933 -3843307 -3887502 -3153882 -1806713 -834899 -1209313 -1641590 -1720592 -1305059
21382 -1305059 -1549484 -1524214 -1022860 -1483547 -2362450 -2360856 -1819288 -1260933 -108350 590072
21372 590072 1147481 1103376 885156 665746 634360 602103 453823 459247 715243 1015584
21362 1015584 1588316 1263961 879745 249664 313738 317834 280265 152455 679555 538536
21352 538536 -126684 -358334 -1016171 -793266 -462972 -221086 217057 678340 801966 838882
21342 838882 750261 91252 -508959 -1340303 -1467533 -915931 -542126 -87379 -301732 -885522
21332 -885522 -918013 80816 892479 1059090 1467907 1540476 1092355 702906 -7751 -633542
21322 -633542 -1252859 -2193041 -2915355 -2880099 -2600092 -1937595 -935851 696804 2090880
21313 2090880 2358307 2076521 1409660 746251 491959 294010 67868 -389835 -561901
21304 -561901 -331626 -829349 -1735993 -1953949 -1478146 -1307486 -790536 -142171 457754 273094
21294 273094 -1254040 -1717394 -1464896 -1829089 -1808672 -1491242 -1300863 -1060727 -716025 -903789
21284 -903789 -1250456 -1220540 -1592377 -1563352 -1080802 -311439 370689 480484 -801517 -2207065
21274 -2207065 -2101651 -1243813 -578941 -610782 -1208852 -1310544 -1323816 -1312240 -1592139 -1956763
21264 -1956763 -2320623 -2607233 -2376551 -1957730 -1455862 -381311 273092 186643 1189186
21255 1189186 1985432 1210173 578836 360751 -262121 -199712 -176503 -242508 88827 -465026
21245 -465026 -1039820 -660530 -829297 -1172700 -1561044 -2029250 -2313996 -2453732 -2566608 -2010828
21235 -2010828 -602353 465474 752851 672039 1288860 1102950 -219632 -1523035 -1763653
21226 -1763653 -504352 637989 1370235 1087998 -74453 -1287907 -2136136 -2528267 -1940602
21217 -1940602 -1442638 -2082896 -2192392 -1230017 -977026 -1338729 -2572133 -3427715 -3008333
21208 -3008333 -2529311 -2414531 -2302801 -2233076 -1880025 -1767260 -2315537 -2172806 -857987
21199 -857987 -99571 42308 -107905 260108 536126 512645 345766 208926 368556 120253
21189 120253 -587207 -819680 -823925 -227305 -513676 -1404095 -2090228 -2141365 -1976268 -1443038
21179 -1443038 -265455 420111 392602 -724958 -1479387 -1135375 -907110 -1669420 -1590875
21170 -1590875 -161399 198432 198486 222101 144756 108482 -198772 -349863 -119546 323114
21160 323114 1419960 1822324 226378 -1186610 -1767020 -2427170 -1854664 -1123408 -752785
21151 -752785 -552484 -1031617 -1496205 -1377471 -1136782 -1511282 -1645883 -1361758 -537746 169202
21141 169202 892954 1154520 266415 -345099 182795 884701 455425 137187 -69049 56909
21131 56909 375025 49908 138461 -51250 450969 734349 512206 56078 -335981 107792
21121 107792 769591 571320 -542389 -1850318 -2028515 -1595072 -1403893 -1279121 -1242179
21112 -1242179 -622736 496589 -127898 -921312 -1532038 -1546620 -710919 -855573 -1704643
21103 -1704643 -1216464 183302 1832072 2659947 2993481 2728405 2006961 907721 166813
21094 166813 -85701 255516 709137 717101 685032 1023037 1542132 991591 -188596 -934672
21084 -934672 -699483 -477364 -965328 -1189549 -527999 77638 -505255 -532044 -583774 -622662
21074 -622662 -214439 307521 358352 310262 -50685 -506577 58071 5315 -644058 -478558
21064 -478558 -91599 -292907 -655268 -492760 -25576 -839248 -1400925 -1540542 -1669398 -1428581
21054 -1428581 -1123036 -1178952 -1535014 -1833154 -1932393 -1888172 -1300907 -415638 -180618 -1166414
21044 -1166414 -2171877 -2888955 -2907651 -2238860 -2228614 -1968844 -1754224 -1642779 -1777833 -2225949
21034 -2225949 -3258491 -4081230 -3590400 -2761601 -1310845 -336966 -733630 -1454537 -1778247
21025 -1778247 -1246417 -930778 -540657 695964 1284332 723031 182495 -211704 -281224
21016 -281224 -487245 -425529 -240334 -193701 294852 701010 255035 -37374 -137007 -294067
21006 -294067 760145 1738136 1567938 1315334 1159561 422564 -670392 -1097531 -100132
20997 -100132 363329 -253952 -929645 -924057 -258698 259068 578540 1055665 1413521 1247493
20987 1247493 890986 1590379 2847765 2827117 2018829 1161476 1047968 1975304 2786728
20978 2786728 2992633 2925704 2746036 2851161 2970199 2223683 946765 35798 285019
20969 285019 807491 935085 1007509 1091185 772053 377611 129809 -142858 259352 1051885
20959 1051885 1441209 555261 -302387 113046 996280 1265823 421381 131782 145004 -257293
20949 -257293 -828280 -251155 60441 30220 388673 810784 1247867 896164 276014 239855
20939 239855 -286 832287 1920084 2168997 2289184 2246208 3184369 3619417 2949650 2185093
20929 2185093 1032799 378830 1255902 1999215 2618988 3380861 3964925 4643360 6213928
20920 6213928 7592441 8961836 9747613 11084118 14539307 19313839 24503531 30900273
20912 30900273 37924253 48039613 64614439 88980964 123487898 162321663 187181576
20905 187181576 180924352 147553819 109264867 81003107 63164643 51613700 43347139
20898 43347139 38410741 36214303 33999864 30388426 25579931 20881514 17522143 13977741
20890 13977741 10703866 7916301 6224815 5204950 5247483 4723600 4359650 3953669 3362245
20881 3362245 3634495 3853967 3593674 3484782 3542334 2615071 1487400 1394702 1608054 2121814
20871 2121814 2266666 2203209 2366813 1603486 792835 686035 314289 -75910 472825 1399808
20861 1399808 1731551 1448401 1131012 1002970 1953575 2063827 1103283 1023397 1080523 1356953
20851 1356953 2032380 1209005 61081 155826 578732 516481 948283 1771508 2204098 2001638
20841 2001638 1465236 1779938 2296641 2257764 2402934 2096918 1471195 893295 247720 220124
20831 220124 -231658 -1002631 -354328 107477 -679829 -1089957 -1637105 -2272699 -2040495 -1070502
20821 -1070502 -503743 223019 1496126 2445376 2063141 1371240 727520 1503 518981
20812 518981 1266829 1594596 2044363 2376553 2272651 1526726 499076 -321195 -1093512
20803 -1093512 -862904 -307192 -267624 -256191 -61413 5708 696702 1349675 1055743 941881
20793 941881 932579 802462 1824119 2688438 2192041 1754003 1006903 90963 -149276 1037283
20783 1037283 1911206 2111002 2356617 3249676 3772550 2816438 1804589 1759023 2277376
20774 2277376 2454688 1458623 524646 909550 2076750 3250376 3609508 3473865 3235641
20765 3235641 3406897 3548299 4553594 6730365 9270101 11847884 11240579 9240181 7502696
20756 7502696 5635167 4346634 3444820 2990297 3202722 2488204 565348 -766015 -571738
20747 -571738 68404 621721 933799 822874 1069111 1295040 1115664 1819499 1676629 820397
20737 820397 1103988 604223 -395735 -584769 -303922 -534180 -1033078 -1175644 -859986 -333686
20727 -333686 498576 203972 -391410 -399971 -861548 -1657896 -2569812 -3155786 -2385725 -1448261
20717 -1448261 -1007351 -673912 -391777 -244344 -166415 -106186 155217 142264 -108700 273181
20707 273181 313819 417655 -35141 -938794 -1154026 -676616 -161789 579908 701502 1178937
20697 1178937 1839404 1692323 1492694 753433 70673 -307126 116527 211236 785041 1634924
20687 1634924 2032186 2767129 3105466 2367660 1427106 1175288 1009449 1091290 2034216 2950060
20677 2950060 2548321 2319160 1290917 174341 -108131 -500117 -349818 -435081 -11490
20668 -11490 781608 500665 -187796 -251933 -258211 -394239 -979155 -1486022 -2231509 -2970275
20658 -2970275 -2799074 -2434752 -1549144 -445853 82334 398707 587880 1407944 1976484
20649 1976484 2277783 1589038 744457 400589 675053 179109 -937202 -1419026 -759144
20640 -759144 173746 857427 1283718 994836 1014452 780197 95319 -156606 -384400 294867
20630 294867 923642 195555 -592205 -505024 -68007 556427 988423 1002248 846877 1047706
20620 1047706 991904 603373 -92055 -743104 272717 1165390 1361924 615237 7849
20611 7849 188816 1233997 1729399 1886079 1624941 550725 568253 1123026 1434133 1889436
20601 1889436 1983430 1073202 878387 1271245 1368796 991387 898398 1048010 1669767 2806413
20591 2806413 4890272 6639990 6282464 5164747 3399479 1867896 968113 175344 54074
20582 54074 -17669 -413187 -665242 -580794 -183066 -269219 -916037 -414907 494268 355501
20572 355501 234365 47849 234541 237626 -260307 -181174 142186 282529 571421 1209617
20562 1209617 1718007 1459084 836814 826919 888247 1574308 2082273 2525023 2609957 859911
20552 859911 -719945 -340820 529538 922077 1256278 1150687 675008 972965 1079128
20543 1079128 814166 1049351 1629026 2168485 2636800 1990131 1478277 1882776 2096327
20534 2096327 2411522 2046225 1650300 1999472 2743690 2632594 2793330 3147223 2246571
20525 2246571 748693 249748 352970 735827 1369884 1987642 2135304 2391758 2784100
20516 2784100 2900498 2818545 2210062 2259138 3179926 4469298 6146806 7577524 9638128
20507 9638128 11806449 11700657 10298057 9658817 10387570 12157371 14686704 19095923 26060794
20498 26060794 37133624 55736561 84105573 111589572 117327549 94941898 65943630
20491 65943630 45443189 32435962 25534950 21716935 18520998 16011999 14438298 13177269
20483 13177269 11487055 9733073 8752500 7629985 5386300 3823046 3349423 2819820
20475 2819820 2312853 2489963 2446180 1267278 -334820 -1003567 -1587511 -1768823 -1335652
20466 -1335652 -1076840 -907177 -576139 164953 892746 1213053 576008 480664 697807 87767
20456 87767 -1098111 -1939186 -2254389 -1824181 -1270380 -635750 -111999 767201 1627526 2004905
20446 2004905 1774735 1252215 917252 481740 555271 606088 -347320 -60511 1026989 1713147
20436 1713147 2071068 1606549 1271209 928292 813095 182054 -564054 -296092 -213524 316045
20426 316045 1445247 3063892 3619477 2904726 2565182 1655932 246154 -692216 -405770
20417 -405770 412692 -567644 -2067617 -2511035 -2546713 -2903766 -3086127 -2068464 -1225477
20408 -1225477 -1449768 -623629 564146 -261416 -1172297 -1118123 -741781 -627787 -645294 -731285
20398 -731285 -1089067 -1623722 -1839022 -1817008 -1868042 -1901580 -2057841 -2007995 -2097311 -2226765
20388 -2226765 -1920625 -1448123 -2102534 -3275774 -3204297 -2885977 -2820237 -2450283 -2271750 -2058118
20378 -2058118 -1049318 767795 1268951 465112 310875 167726 38276 -388110 -587683
20369 -587683 -123605 613928 905225 1721800 1990696 1217418 825113 1048060 857368 284025
20359 284025 -140735 -763893 -270114 804703 -23787 -1481735 -2341250 -2219702 -1493025
20350 -1493025 -1510143 -1274252 -288396 -68070 -414188 -606634 350284 945064 783638 1060040
20340 1060040 1271662 921918 30729 -88050 -14316 336225 514266 964721 1775071 1203609
20330 1203609 -353365 -1030232 -586354 -13117 676144 1123891 1206505 1454692 1623080
20321 1623080 574407 -1101727 -1798262 -2373692 -2029137 -633034 751297 1015104 373749
20312 373749 187130 889977 652955 511954 1403283 1728600 1038965 -74759 -432714
20303 -432714 -909307 -1929872 -1785318 -1118577 -1161618 -1719087 -2076341 -1743600 -297129
20294 -297129 841592 883990 935238 975196 913306 36269 -404598 -695475 -768940 -589844
20284 -589844 -1253810 -964109 464261 1696395 1345962 879126 640221 -99716 -370732
20275 -370732 28491 508160 1535260 1479557 1044797 859785 572923 1329018 2117411 1621820
20265 1621820 1271609 1234036 935905 759740 819316 586230 535597 733280 427708 -362617
20255 -362617 -158272 450788 452206 654259 467342 384526 -327141 -973313 -1392733 -1300641
20245 -1300641 -898367 -144794 379264 279222 -222357 249789 697310 -133900 -292651
20236 -292651 -179723 293352 730426 764060 431430 332672 314143 607329 502895 53664
20226 53664 61817 599102 1115863 1560377 2379890 2665461 2704623 2547808 2974558 3908812
20216 3908812 4122754 3779624 3174458 2435817 1623322 1165218 197751 -156153 302475
20207 302475 276890 520318 668023 -153358 -629143 288772 991405 847545 565963 59741
20197 59741 -613801 -634875 513238 993059 1363930 1485275 1578115 2216932 2453882 1326678
20187 1326678 618285 669339 955029 2021837 1714728 1489437 1548447 1540371 1327874 1075438
20177 1075438 1545052 2118056 2244656 1901566 1297223 586434 20681 690761 881449
20168 881449 958620 1399523 1642586 1657092 2144302 2748184 2189119 973596 1055328 2121310
20158 2121310 2816808 2357134 798218 -368117 -530283 -363797 290486 708451 1303346
20149 1303346 1776469 1004383 957552 1570853 1890247 1239354 -137707 -472757 248676
20140 248676 889921 1585854 2714969 3009820 2838127 2989718 3004265 2787146 4088114
20131 4088114 5868659 7797373 10242089 12332372 12177981 10219573 7568741 5307055
20123 5307055 4202397 3696810 3286076 3048240 1988671 1029669 1247402 1535009 1011441
20114 1011441 961667 1455779 1881178 2542554 3111469 2683358 2484395 2455428 1788411 1089569
20104 1089569 515467 150139 38863 390736 1200679 2204028 1679024 209598 -99031
20095 -99031 782393 1499856 1648644 1520780 1480167 1273896 1919344 2824698 2740267 2826328
20085 2826328 2714429 1912965 1215771 1178679 1573400 1684704 1658961 1374452 565585 352205
20075 352205 481204 578654 1215201 1219487 1530719 2044585 1910661 1575125 2267640 3049644
20065 3049644 2432741 1482980 739734 1037591 1880831 2393400 3005457 3305018 3072067
20056 3072067 3211742 3978595 5057401 6113133 6169373 5764921 6302247 7186811 8020904
20047 8020904 8471463 8445197 8557722 8667449 9111852 9420571 8965900 8860659 9440494 10966128
20037 10966128 12725463 15038168 17739173 20725617 24247914 28235849 34645971 43871588
20029 43871588 56331044 74252153 99563908 134822174 184821967 259094988 350674072
20022 350674072 411772046 396052745 315472468 232481431 177632924 145266069 121335054
20015 121335054 99010486 79626810 65193283 54646922 45693066 37696991 31344748
20008 31344748 26547742 23253527 21235612 20243586 19092636 17176099 16074841 14998608
20000 14998608 13647965 13092891 14076979 14679121 14431944 14443955 14430993 14317616 13425223
19991 13425223 12276898 11244369 10577052 11153178 13931681 18169791 22629039 28942904
19983 28942904 36783925 41003287 38093830 31496787 26006403 23318508 22351974 21851317
19975 21851317 22433770 25346975 29710428 36767629 46370405 58647511 76637767 104453061
19967 104453061 142232957 180959089 200780088 189495604 157420514 122916663 93873072
19960 93873072 71704646 56513268 45550438 37259664 31268679 27225261 24941399 24392450
19952 24392450 26061723 28736107 30817286 29633932 24926416 19652965 16273535 14736672
19944 14736672 13889361 13412608 12792389 12288915 12807902 13162128 12982287 12162674 11829663
19935 11829663 12033816 13420459 15382093 16850031 18195699 19761248 22760170 27288020
19927 27288020 32844958 39320842 47274818 57580793 71800978 92195146 121668455
19920 121668455 165320713 233073772 332129800 431336512 457579790 392308798 300020396
19913 300020396 225671440 176954426 148847409 133249516 120010600 99844604 77072428
19906 77072428 59892481 49244763 42148337 37264330 32024320 26776848 21786688 18165415
19898 18165415 16180098 14911412 13605354 12189002 11522980 11366242 12108067 11912100 11219631
19889 11219631 10947250 10274707 9805019 9281631 8273749 7953158 8171348 7411282 6991066
19880 6991066 7096642 6109977 4936385 4305044 4125712 3375310 2189450 1518101 752193
19871 752193 142611 -13456 -55147 834744 2167365 2342494 2137826 2031961 2596898 3199248
19861 3199248 3171599 3028549 2953015 3142949 4779210 5920676 4972118 3815058 3011677
19852 3011677 2483119 3448850 4189239 3683921 3259844 2915112 2541897 2090179 1518843
19843 1518843 1312763 1014569 264116 -323262 -427275 -678191 -1673355 -2183521 -2364482
19834 -2364482 -1881502 -1015784 -52173 117660 215314 1134298 1875723 2454224 2012010 2491224
19824 2491224 2727440 1682392 1538032 1884699 2407790 2602874 2942591 4278445 5542340
19815 5542340 5865836 5018709 3852938 3401261 2922176 1885982 913060 602898 809188
19806 809188 1168190 1367485 2073933 2762884 3070983 3219552 3148877 3237622 3168032 3316203
19796 3316203 2884694 2091566 1584930 1065519 518139 139382 -327073 -128249 230199
19787 230199 165298 -127590 -797862 -997714 -206034 370769 622770 658373 555396 536603
19777 536603 1147645 1185817 168327 -273316 32638 277669 159018 261568 526684 888777
19767 888777 1476490 1697621 647661 -300009 -362873 -111252 213096 631506 1589023 2086253
19757 2086253 2137481 1442273 1044272 1164041 1943394 3085612 4837210 7057040 10191807
19748 10191807 13661737 13322753 9889485 6765521 5332973 4434161 3735250 2758372 1888899
19739 1888899 1346192 1503819 2601119 5217368 7259081 7974017 8064645 7349016 6421900
19730 6421900 5647210 5020373 4094471 3333132 3154103 3310293 2723439 2130943 2252157
19721 2252157 1863066 1243938 330000 -710558 -1307749 -934606 -41571 156469 -6884
19712 -6884 32145 746610 2118721 2201845 559996 -706670 -908975 -168301 70558 719002
19702 719002 1629995 1222444 884039 664904 692606 182087 -481204 -534838 38347 250686
19692 250686 106708 -778701 -2364235 -3162173 -2629016 -716019 491148 754990 993012
19683 993012 204540 -809888 -412490 -61256 456623 518588 270770 260073 420078 144333
19673 144333 77052 1027637 1309189 1692738 2074167 2260659 1000310 -758137 -1363410
19664 -1363410 -910130 -172510 271481 416692 332364 199281 -364613 -236149 148906 582727
19654 582727 1076718 1156303 1177040 1802429 1674407 855685 1142934 1351446 1686025 1600543
19644 1600543 623111 -478459 -149915 78123 -307754 -1032548 -625047 715565 1412714
19635 1412714 1319926 1020743 651005 63684 852839 2903970 3548055 3151424 3111802 2279521
19625 2279521 1876484 2008851 2143878 2218615 3414857 5831625 8212361 11901906 14814498
19616 14814498 14861871 13216930 11172153 8492427 6380115 5507302 4948107 4985750 4708895
19607 4708895 3373739 2507287 2508174 1998764 1605320 1116535 490920 -10598 252844 948922
19597 948922 1432964 1297829 1515876 1556515 1837421 2153642 2313415 2470448 2199836 1881114
19587 1881114 2202642 2097892 1330410 1094382 1240098 1837412 1880339 1420189 779410 -8895
19577 -8895 609712 1680259 2742416 4334108 5900482 7432346 9302686 8284764 5199401
19568 5199401 3561213 2938084 3320012 3756172 2852698 2303816 2526777 2390683 2152451
19559 2152451 2504103 1996245 876947 155033 466744 836064 60252 11616 863821
19550 863821 1747000 1947797 1473590 1552173 1084701 534219 1209540 2123906 3045579 3218545
19540 3218545 2396838 2360653 2747224 3941666 5349421 6005675 7455968 11034715 15133956
19531 15133956 16978377 14726970 10432973 7425900 6699460 7540371 6894334 5984018 5300979
19522 5300979 4917731 5838457 7230904 8649808 10129302 11658480 12905455 14312355
19514 14312355 17388870 22617970 29124147 38482083 52279343 73045841 104909984 147792002
19506 147792002 185565150 192899124 163662778 121603233 88633111 66802228 51384420
19499 51384420 39113615 30491161 25087416 21913098 19537969 17898293 16246578 14217845
19491 14217845 12759646 12210441 10949971 9101667 7904742 7672351 8617368 9702737
19483 9702737 9667270 8707564 7325467 5955734 4085159 2732704 2102188 2276584 2294107
19474 2294107 1951181 1682067 1280876 1546742 1611379 1441543 1035907 -649172 -954851
19465 -954851 -687051 -738437 -868301 -1187858 -1283895 -709489 -77736 -84986 -1053481 -944348
19455 -944348 -289741 540291 1432389 1884143 1953236 814507 -145568 -751497 -995050 -1428271
19445 -1428271 -1340247 -816366 -216017 -5710 416307 497750 600309 930623 749295 824107
19435 824107 737169 683234 682356 1079030 1487818 539216 -828543 -1609224 -1214057 -500317
19425 -500317 -221029 470264 604827 -263664 -586590 77245 618136 353866 -330611 318685
19415 318685 1532630 2572545 3529712 4537614 4669846 3646299 2221719 981831 1600134
19406 1600134 2780537 3348333 3398281 3640997 3241337 1018880 -517774 -870307 -720665
19397 -720665 99832 858690 1710911 1778337 616852 -601260 -537794 -195809 -748968 -2036566
19387 -2036566 -3406443 -3704115 -2526557 -1702965 -1143336 -333789 220365 1052255 1776829
19378 1776829 1535411 1644610 2680550 3983908 4976705 6143121 7576089 10075434 12194788
19369 12194788 12330617 9721238 6257121 3443643 1979569 1993494 1776140 1478113 770579
19360 770579 490311 868072 459168 504245 952446 801228 -114439 -433969 -293937 -651207
19350 -651207 -430158 -239978 238485 312594 204421 588686 458890 -343743 -394238 -130872
19340 -130872 -190347 -420890 -982863 -1076865 -846435 -576547 -210757 -166092 304578 968144
19330 968144 1260999 1462587 1410913 1170014 618492 -129969 -584099 -865812 -1089964 -1036489
19320 -1036489 -744702 -839101 -1864054 -2436825 -2400116 -2183943 -2114250 -2986125 -3264289 -2610085
19310 -2610085 -2088032 -1310454 -1289496 -1586307 -979346 -200823 117465 -114336 178497 -130798
19300 -130798 -518790 155333 573789 693416 382168 -509897 -1243118 -1049867 15869
19291 15869 585360 375867 -417056 -1119253 -978766 -770631 -1124411 -1259554 -653958 540977
19281 540977 1962684 2653392 1913449 -185455 -1586643 -665831 395903 289772 58077
19272 58077 -627200 -833672 289433 1626476 1647462 917977 1389112 1961413 2197556 2103275
19262 2103275 1234772 256738 468909 679809 689147 1202499 1073612 654739 432638 853910
19252 853910 1347579 1275112 1092968 941360 38839 -1664741 -2289466 -3225392 -3521221 -2887666
19242 -2887666 -2083205 -1508076 -872880 -239160 105327 485729 789741 862073 566566 908804
19232 908804 1641652 1983082 2011674 1402806 322090 -574718 -706528 -153872 215523 28371
19222 28371 -31018 351528 851907 327945 -349387 46613 1030635 2207381 3069814 3349997
19212 3349997 2866158 1758003 725645 -671698 -1308045 -695228 -689860 -1431247 -1808295
19203 -1808295 -1207939 -894193 -1347368 -1119331 -580287 -130569 -76264 56245 394701 -260393
19193 -260393 -1077508 -1284106 -1025730 -617651 19294 -350010 -494187 -445535 -684029 -932080
19183 -932080 -1021536 -478922 -252228 -777632 -970847 -971320 -1420451 -1673384 -2240898 -3200765
19173 -3200765 -3588100 -3074150 -1699629 -551297 -254143 -1530199 -2821931 -2872148 -2630195
19164 -2630195 -1741039 -895867 -1194377 -1646648 -1598509 -1471842 -1107258 -1121181 -1082059 -976674
19154 -976674 -1985175 -2743551 -2708969 -2720622 -2725042 -2056734 -1396241 -1020023 113322 1198979
19144 1198979 876847 225632 -709333 -1407858 -1078331 -659644 -40129 568549 358384
19135 358384 155570 925801 1602303 1196107 712878 1139653 2168657 2357481 1745867
19126 1745867 852171 443170 -148464 -471908 149969 285440 26535 317217 555392
19117 555392 411464 189999 217472 364302 648567 525690 -37156 -309129 -203450 -738074
19107 -738074 -1091058 -1154324 -987072 -166550 620653 684199 158448 153342 781717 1762987
19097 1762987 1544763 831894 473108 416028 962589 1461982 1390937 761264 278345 113019
19087 113019 -67528 -823906 -1003500 123403 514764 565609 -224300 -1019638 -871430 -1497538
19077 -1497538 -2503862 -2587255 -2497900 -2218131 -1241733 -991461 -1078733 -580733 598055 656007
19067 656007 -1093383 -2910066 -2944467 -2284560 -2177019 -1950600 -1633089 -1304730 -1093016
19058 -1093016 -566522 -391796 -827210 -991277 -719304 -451719 321597 1024786 428286
19049 428286 449629 298857 -7652 485110 344137 75785 643513 1635968 1711340 1896193
19039 1896193 2553674 2681264 2775815 3197843 2607261 982181 373161 471497 262700 256774
19029 256774 -95133 -661989 -78447 894991 988380 1463165 1886445 1485033 1181445 1247049
19019 1247049 1539621 1343139 595693 -52353 143150 125564 -378337 -441402 -365278 -431282
19009 -431282 -644403 -560182 502087 1006395 907778 483258 -346391 -1623193 -2347587 -1660120
18999 -1660120 -498895 -63881 -787913 -1107836 -1628970 -2660212 -4293922 -4656369 -4133761
18990 -4133761 -4097762 -4058784 -3704626 -3070506 -2539573 -2460455 -2194459 -1707470 -1159402 -348173
18980 -348173 204646 -91776 -627397 -896140 -829729 -497007 -49656 435796 1272437 2586630
18970 2586630 2443998 1397670 1580126 1604459 724786 132842 805546 1175332 709908
18961 709908 73118 -526589 -876582 -362383 581956 1135957 1325616 1038970 521934 690005
18951 690005 875251 352756 -1093920 -2043338 -2038933 -1955136 -1001476 -459064 -847806 -751692
18941 -751692 -318466 -129317 -4274 446704 306856 324366 428469 -157575 -405336 -257491
18931 -257491 350250 353675 590912 699288 -546527 -1216497 -1195631 -1093132 -541234 -182401
18921 -182401 124954 -399223 -1395402 -1620379 -1938917 -2060389 -941803 286361 875187
18912 875187 1188383 1290591 958573 290742 186178 -114881 -443547 -328807 23288 754649
18902 754649 739761 494212 706642 -102409 -793745 -884050 -683167 -186405 108927 39840
18892 39840 -181236 -202306 -711462 -1181615 -1272439 -744921 -641872 -1349707 -1969343 -1492073
18882 -1492073 -585871 -237538 432032 1109265 656206 547124 1279972 1858864 1735385
18873 1735385 1335863 1016025 318925 -831520 -1061018 -501355 86407 1201892 1291519
18864 1291519 -324052 -656248 -244925 554596 1136158 1255602 1475429 1823796 2025325
18855 2025325 1993600 1084163 207772 -777429 -739805 73939 -43039 156450 235424 5893
18845 5893 -242543 71575 675344 1450586 2430515 2667704 2115684 1495918 910934 276795
18835 276795 -517453 -1417360 -1465728 -178522 347059 -150529 -88329 -316016 -853559 -850872
18825 -850872 -1523262 -2158972 -1073216 407798 612134 -70996 -233622 -262893 -166524 -272169
18815 -272169 138246 353167 -466141 -491863 -587328 -1016181 -1137291 -1360279 -1586779 -1665607
18805 -1665607 -1072113 -94305 -468695 -1346916 -1693958 -1335200 -699226 -568912 -620353 -390375
18795 -390375 -603798 -198239 379964 508402 -103308 -171531 -303444 -1140580 -1149878 -655158
18785 -655158 435435 1409383 1317946 558263 -303629 -649667 -862047 -1021307 -1103860 -676051
18775 -676051 -814301 -1249458 -984489 -571491 -466491 -518319 -226178 21539 855217 1137316
18765 1137316 523310 -421688 -1746373 -2297839 -2335836 -1485787 -395611 -159787 -597724
18756 -597724 -432250 -215744 -64186 -598370 -1677089 -1260742 -144028 -520568 -333668
18747 -333668 92365 -47385 -94098 -59731 -301198 -427856 -167831 288870 445604 -437528
18737 -437528 -1568336 -1607058 -356633 353839 258333 36096 -161496 133751 63077 149983
18727 149983 11064 -608794 -502958 -233643 631666 898500 -87489 -2143355 -3494731
18718 -3494731 -3384240 -2593363 -1882821 -1749694 -1328774 -649031 65020 -86733 -700697
18709 -700697 -829855 -1004298 -1067795 -1269847 -1737353 -2267042 -1476357 -631123 -566586 -645730
18699 -645730 -722756 -634987 -389826 -220353 -67108 137655 285895 367525 390358 -349306
18689 -349306 -551608 -138927 518137 263703 -771268 -1038666 -1169364 -1525806 -1655619
18680 -1655619 -787393 244889 116869 -812019 -1718184 -942594 -296270 144628 868467
18671 868467 634338 -386831 -992855 -1570431 -2045349 -1557863 -884057 -716932 164685
18662 164685 632663 1387672 2457925 2481916 1172840 -692740 -1524410 -1804514 -1707787
18653 -1707787 -1364767 -395309 634299 304829 -422895 -576588 -614613 -136495 -222613 -431536
18643 -431536 -754771 -802643 -1358962 -2020000 -2672548 -3234964 -2273890 -895154 -709846 -789508
18633 -789508 40110 652430 851781 664806 50419 830196 1930354 1860392 1547642 799529
18623 799529 -401183 -625237 -51585 131365 584019 362744 344333 428097 123413 -428592
18613 -428592 -651130 -623184 -696220 187288 787465 504469 -480841 -1254156 -1666092 -1234730
18603 -1234730 -576318 119987 -53663 -973477 -1660158 -1199631 -120465 -197945 -885070
18594 -885070 -1399699 -1111590 -828608 -1017994 -1615971 -2010192 -1400862 -897687 -1666179 -2841521
18584 -2841521 -2621230 -1347952 -878082 -956956 -776566 -834976 -1183080 -1033760 -1028778 -2026177
18574 -2026177 -2588675 -2232443 -1107239 -317940 -1011185 -2064396 -2258411 -1661557 -777765
18565 -777765 -904818 -1544232 -1931619 -862743 750612 848326 199424 -138881 -385646
18556 -385646 -512066 490024 1033644 561622 304725 -96604 -283655 -184378 -446629 -680709
18546 -680709 -1253816 -1290096 -790985 -1752035 -2384052 -2231506 -1985027 -805786 -503130 -1219435
18536 -1219435 -1584318 -922239 17827 645580 537251 -767946 -2152662 -2457741 -1875586
18527 -1875586 -1367983 -1546839 -1749033 -1634851 -1074037 -796532 -337700 566057 650755 -16734
18517 -16734 -41762 -190696 -651936 -442748 -806395 -1306331 -435417 847759 1024565 519279
18507 519279 347425 14152 -417979 53109 364875 119235 -76067 -443428 -193076 244696
18497 244696 15999 284794 7441 -592528 -744165 -586326 -427020 -503736 88230 1207596
18487 1207596 1302681 202774 291792 1475910 1834209 1796491 1837302 1858049 1686436 1340792
18477 1340792 1324306 1105984 107713 -425636 -1240189 -2167221 -1788849 -2571008 -2902852 -1835371
18467 -1835371 -982172 -91304 529998 259011 151519 855039 1116372 481725 186567
18458 186567 123238 -454947 -470910 278234 1497528 2406223 2383188 1258957 15346 -1109734
18448 -1109734 -1989049 -2434450 -2178680 -804877 -124280 -474296 -94386 316274 254411
18439 254411 459732 947844 512543 -280209 -1116263 -2282149 -1900134 -1187722 -1761298
18430 -1761298 -1593734 -1151400 -630753 -135990 -381169 -363083 56618 175267 -544491 -1655099
18420 -1655099 -1903296 -1531431 -1484880 -1846668 -1400962 -1071318 -1451549 -1015586 -2049
18411 -2049 188547 206731 -325334 -801599 -961214 -1250973 -1161653 -414812 408513 1259270
18401 1259270 1233107 24508 -68867 630558 1249179 1560109 1026018 -476089 -760616
18392 -760616 -352461 -92156 -284516 -559438 -1212040 -2438907 -2570026 -1934328 -725564
18383 -725564 427881 873852 607715 563476 853532 832831 1008065 824909 128007 108379
18373 108379 401849 -187116 -892086 -1257937 -613197 241025 715220 671026 157544 -152411
18363 -152411 244704 591234 736794 526851 1025269 1796794 1693185 1535282 1024159 208693
18353 208693 512047 1348048 2551428 2920615 998308 23308 -80758 81173 632816
18344 632816 534133 492369 222442 127477 435317 780638 1040275 714366 -105218 -650231
18334 -650231 -525963 124568 650842 613352 -129328 -731064 -1178425 -1584705 -2141940 -2535791
18324 -2535791 -2025376 -1319345 -1440457 -2232299 -3159042 -3077294 -2757019 -2389973 -1751770 -1114851
18314 -1114851 -1662057 -2782840 -2978595 -1789068 -833666 -753211 -703828 -1146482 -691539
18305 -691539 261542 1062672 1131460 1244694 1123670 1166638 1055903 -320036 -1549946 -1381145
18295 -1381145 -1358269 -1013439 -785793 -770211 -793217 -981830 -2009170 -3302673 -3341990 -2634545
18285 -2634545 -1913752 -1213937 -811021 66039 1016928 1365003 909477 185129 -705710
18276 -705710 -1586163 -2450364 -2324019 -1371059 -1015776 -1142580 -1294459 -834236 -227877 641215
18266 641215 1665596 2187336 2342277 1983140 812179 149226 -170180 -284705 107112
18257 107112 269721 -409985 -976132 -1090513 -568046 -632287 -294536 542394 820727 677354
18247 677354 1234574 1537099 1034800 723278 202438 -49599 464104 1178647 1253440 1255883
18237 1255883 2074044 3455992 3199915 1551363 493790 80683 -134990 598006 1735500
18228 1735500 2338047 2004317 257429 -520231 426927 1104295 1278288 568917 -440879
18219 -440879 -1770714 -2092699 -1117914 -927032 -1844375 -2165574 -1304841 -415863 -364469 -1062667
18209 -1062667 -636296 -381387 -1252957 -1530333 -1043386 -1137550 -1145144 -800306 -190395 509245
18199 509245 748785 406769 667480 1041930 1060086 1448950 1041888 396391 195143 270497
18189 270497 392718 202051 554375 -210006 -1545349 -1741764 -1919116 -1988799 -1649225 -578407
18179 -578407 -3333 475014 835549 1226668 1538042 1163165 429964 248531 209463 -349896
18169 -349896 -889737 -1034058 -127028 1232431 1620477 1366531 1649394 1667563 1019231 1135362
18159 1135362 1846175 1922008 2147297 2685806 2502278 2047998 1313286 794749 500180 -468740
18149 -468740 -686965 -279827 -138721 -300365 -819492 -1259206 -870721 301997 670749
18140 670749 -601208 -510146 211047 656001 794078 -78075 -1195805 -1424015 -841593
18131 -841593 -703031 -1053862 -893620 -345773 -253956 290799 379025 -184118 -489568 -1295276
18121 -1295276 -1306543 -463758 176203 242266 172978 -66026 -350751 -1572461 -3026207 -3230076
18111 -3230076 -2645979 -2085703 -1957761 -1474876 -912283 -958813 -1324939 -980884 -586657 -521288
18101 -521288 -30432 320319 258752 618786 647467 1311889 2449508 1964227 1299846 828379
18091 828379 63412 -624233 -959095 -1196163 -1143797 -329817 451826 172450 -563083 -760800
18081 -760800 -631440 -1113420 -981558 -312725 487825 558906 338369 251656 404699 1327685
18071 1327685 2028012 2315094 1644490 739784 494833 1152450 1518615 1597139 1350930 1613658
18061 1613658 2201954 2124043 1201981 592343 -421848 -1040936 -890683 -722629 -539246
18052 -539246 -764008 -1015142 -1690393 -2362062 -2447504 -2242379 -1912036 -1707301 -484428 527261
18042 527261 770350 607708 1229537 1673719 1114340 -53960 -214248 683390 911386
18033 911386 50386 -305546 661174 1008656 594900 487121 39381 -313695 -277711 282708
18023 282708 390035 -1043235 -1770005 -1285606 -535922 693300 517990 -840892 -1173318
18014 -1173318 -865261 -522496 -247457 169196 -119102 -943262 -1430159 -928783 401252
18005 401252 1249777 1283912 849520 516413 900950 1689066 1642779 778436 -240365 -314739
17995 -314739 585216 1536320 1571020 1130303 755430 140269 -516254 -1518255 -1522443 -392356
17985 -392356 151053 847688 1076474 665234 317417 -281458 -530848 -666591 -1078904 -1509242
17975 -1509242 -1709462 -2063705 -2292263 -2500786 -3117698 -3485234 -2965441 -2186089 -1542557
17966 -1542557 -925306 -485805 311159 792207 102906 -966251 -1690760 -1371490 -361613
17957 -361613 -406911 -1395892 -1300981 -885934 -1108669 -1354569 -884806 -889250 -200159 995819
17947 995819 1617875 1217302 535097 349757 109784 -596375 -1376525 -2621512 -3530015
17938 -3530015 -3564578 -3162945 -2017615 -1177856 -891181 -991702 -848057 252523 702034
17929 702034 680494 64636 -1003357 -1659839 -1676153 -1828016 -1922511 -1331460 -1388764 -1407799
17919 -1407799 -120227 957509 1305655 894757 131806 -383279 -284607 -257400 -720686
17910 -720686 -1401795 -1666685 -1392515 -1187970 -535906 -174730 787529 1868246 836701
17901 836701 -28151 79942 -683803 -1451445 -1043892 -876207 -879563 -1290119 -1127028 -997737
17891 -997737 -1433823 -1847933 -1334204 -810536 -992473 -1402760 -1334322 -1687206 -1236341 70817
17881 70817 221133 -392794 -521484 -573860 -860429 -1067648 -1100134 -470032 -200030 -194411
17871 -194411 -363330 -351373 475869 1774337 1371997 -101265 -474034 -639268 -1620013
17862 -1620013 -1374487 -337939 143007 202623 530359 441553 -519913 -743628 25738 601959
17852 601959 938910 249182 -940537 -1168202 -262718 227251 -317997 -762784 -368565
17843 -368565 41838 342599 618256 768105 961101 550545 65520 -446633 -1320451 -1034089
17833 -1034089 -66600 760883 723606 793622 1324550 2053266 1803240 916482 105902 -451884
17823 -451884 23274 947669 1415089 37157 -993638 -839077 176280 532656 -33503
17814 -33503 230116 1419113 1550203 803437 -449183 -1608241 -1718557 -1590463 -1343636
17805 -1343636 -867703 -449709 -1494741 -1928291 -1031601 -99352 115165 377840 794833
17796 794833 797113 481616 432684 223825 536899 801167 699495 928194 807726 -193074
17786 -193074 -1149495 -1112499 -868656 -383073 337102 806170 1192365 580641 -134744 -971070
17776 -971070 -1314496 -1604434 -1839386 -1879381 -1856011 -1725681 -1280939 -1182198 -1101584 -781928
17766 -781928 -792067 -539086 -668194 -971661 -275615 1212464 1564279 313862 -789545
17757 -789545 -1258181 -1162902 -1005657 -1058864 -1422219 -1756587 -1725954 -1429879 -971134 -364892
17747 -364892 -42706 -310502 -132354 -132478 -957611 -863362 -333674 -1070412 -2031854 -1834003
17737 -1834003 -524816 453771 769597 912311 693261 1487 -364817 -771308 -1960975
17728 -1960975 -2711675 -2695615 -2442083 -2205195 -2352994 -2116176 -2070928 -2045905 -2172415 -2739745
17718 -2739745 -2376587 -1148844 -512407 -870864 -1645263 -1542664 -1406113 -912127 -159841
17709 -159841 631420 991216 659776 13126 -13928 277837 238046 -223338 -313964 162977
17699 162977 11188 26677 397383 721585 180129 -72661 -247680 -282339 423142 1033508
17689 1033508 1217961 61903 -1439768 -1908932 -2129057 -2209765 -2131718 -2044628 -1831892 -1399546
17679 -1399546 -1037677 -616630 28158 -526976 -1066686 -1028310 -492590 505085 778858 776191
17669 776191 776556 289460 26775 243646 100683 43752 165243 222144 -228354 -1105481
17659 -1105481 -1614094 -1472755 -1028191 -990581 -666392 704369 1054650 110918 -322833
17650 -322833 -437939 -52687 81656 -211465 -728442 -827486 -910757 -1039066 -1120764 -1209511
17640 -1209511 -1081362 -1217520 -1125926 -603018 -253381 324515 1259031 2281513 2205195 2269937
17630 2269937 1817729 1060373 667768 594179 -200686 -498826 214471 159700 -651767 -1134867
17620 -1134867 -1703380 -2294216 -1366428 -412733 -298928 -397929 178343 239969 -161553 -69261
17610 -69261 -275587 -520385 -497846 -585604 -988823 -814332 -29228 898661 1175940 914968
17600 914968 -315696 -1719239 -2016851 -1677802 -793542 -639504 -1100859 -886279 -408107
17591 -408107 247378 1149535 1152308 600752 180472 375128 79979 -274086 -993985 -1006026
17581 -1006026 -925515 -1058090 -474902 -324909 201097 427764 395769 -76304 -632883 111536
17571 111536 1080996 1630652 1732431 1371346 941650 222030 -449380 -609855 -178909 255680
17561 255680 239369 -226159 -732452 57225 809967 529586 -770909 -1032971 -246977 514966
17551 514966 904193 1372844 1663715 1967631 1519552 626403 -29873 -167657 357404 681794
17541 681794 544304 269758 -180938 147403 1016158 1021836 294912 -564586 -990806 -1279797
17531 -1279797 -865058 -739332 -549147 -28488 595729 686043 830035 1312729 1783074 2051599
17521 2051599 1428863 845797 615220 -91961 -275483 -192555 -73617 337677 1002604 1620970
17511 1620970 1862505 1968969 1979451 1612437 1145208 1027891 1377334 1582952 1902476 2462701
17501 2462701 1678043 684541 334822 755385 1377696 1145054 642910 1483172 2071827
17492 2071827 2682990 3710308 3644871 2408929 1585775 1645315 1899743 1802684 1589450 1341305
17482 1341305 920245 939816 620688 846473 1395369 1019466 1001477 1676733 2471242 2279292
17472 2279292 743380 28896 620923 583277 242376 -443529 -826330 286499 447692
17463 447692 241674 601412 598580 93986 352877 919187 234067 -841450 -1089313 -1076021
17453 -1076021 -945150 -219845 414641 632858 320451 -25232 418008 1125540 1563563
17444 1563563 1494038 1083437 472776 182967 632853 1129451 690897 592553 1309771 1760855
17434 1760855 1710706 1387731 791622 -674752 -1611098 -1425660 -1208800 -1377978 -1277607
17425 -1277607 -1248190 -2050282 -3111152 -3462670 -3329340 -2575148 -1888081 -1471361 -599165
17416 -599165 -1084083 -1802523 -1824736 -1501113 -1320946 -1562822 -1736726 -2113977 -2356013 -2013604
17406 -2013604 -1826084 -1240718 -792578 -578407 272401 1113126 1588100 1133308 142225
17397 142225 -161868 107346 -33278 -999661 -1438751 -562484 225555 275912 -497677 -879127
17387 -879127 -221362 1123330 1677793 1574164 1444510 1088050 458813 -85004 -365284
17378 -365284 -766148 -777714 -706422 -417568 81507 12667 -878782 -2114884 -2373966 -2288962
17368 -2288962 -2074116 -1876465 -1375897 -1014558 -340208 -39320 -133123 -758157 -1661772 -2572421
17358 -2572421 -2640616 -2975815 -3420349 -2350470 -1452090 -596586 322976 701146 622048 626091
17348 626091 824588 888237 417570 -8483 -206768 249078 438695 -113046 -88642 -30457
17338 -30457 -34185 410911 1155378 1896949 1896304 2495008 2342441 1432021 1186861 1399883 1342734
17327 1342734 1103568 1206124 1316122 919341 639351 522759 874581 174731 -772567
17318 -772567 -594673 -141733 496140 1011688 1156074 644167 43406 -191252 -258623 43193
17308 43193 984141 993947 96258 -79632 16651 371805 649986 309015 -10063 -602314
17298 -602314 -488351 -223012 8692 462614 689202 -92201 -1428355 -2017293 -1947510 -1976437
17288 -1976437 -1744802 -1606479 -1726894 -1156206 241007 1188455 572374 -309311 -913753
17279 -913753 -1447966 -1494822 -1650847 -1090591 -1349652 -1821605 -1553025 -1100983 602840 1367821
17269 1367821 894942 41518 -444204 -67239 178708 -193206 -731661 -386507 170994
17260 170994 650769 469076 -720662 -851966 -680080 -1075282 -841929 -33429 104507
17251 104507 -126117 -100071 318659 29754 -504646 -530747 -601783 -786535 -116068 953482
17241 953482 1164487 237334 -1019242 -1509689 -1868063 -1901701 -1613868 -444085 871819
17232 871819 1329524 1409516 474653 -310154 112326 567894 802850 415725 67750 416068
17222 416068 210361 338830 423254 242324 -11006 -10332 1238093 1643049 1639613 1459917
17212 1459917 1724150 2064344 1730578 858735 -258993 -854399 -996547 -877675 -219541
17203 -219541 170468 -192247 -610087 -1126277 -1519623 -1888580 -1472078 -1179819 -1211065 -1205952
17193 -1205952 -1165849 -2109500 -2910154 -2659540 -2393332 -2119104 -1054447 482828 713224
17184 713224 172922 23019 402395 1039171 698059 673197 158568 -347104 -1045375 -1343033
17174 -1343033 -1486824 -2106735 -2087421 -1424621 -1239494 -848347 -323132 -126447 -718635 -1488797
17164 -1488797 -2119698 -1751619 -615165 237524 412645 18237 -243634 -541850 -999588
17155 -999588 -1967502 -2193388 -2129648 -2187564 -2042086 -1961260 -1813914 -872491 -294263 -183070
17145 -183070 -436062 -733937 -1026416 -1511821 -1126873 -751801 -695012 -896138 -865304 -598526
17135 -598526 -402731 -745299 -970874 -228311 520050 1595439 2280686 1342846 756137
17126 756137 800222 1098682 501867 -933793 -1230332 -702605 -129310 1093384 2531319
17117 2531319 3195817 2912841 1958185 2087659 2207388 1347481 754132 837441 423366 36070
17107 36070 -949113 -1728778 -1609602 -1667733 -2112866 -1500737 -200864 1086183 1633338 2079465
17097 2079465 2421845 1653620 1012966 247231 -555823 -1010628 -1218624 -1064666 -1587042
17088 -1587042 -1924679 -2146477 -2194663 -1937638 -2436314 -3170394 -2567788 -1392942 447463
17079 447463 1255919 1118483 189218 -506334 -314263 -8231 231318 -114861 -775070 -1302917
17069 -1302917 -1543214 -1018838 -674427 -729202 -1032780 -581834 591342 1033678 674868
17060 674868 310429 480039 230141 -205763 694300 1904431 1638797 519344 348998
17051 348998 620116 680894 325014 -35538 -17257 -685337 -1406501 -1768605 -1007418 -205384
17041 -205384 -2428 -188955 -496701 -166639 200181 -419735 -1062974 -645886 92616 177211
17031 177211 203102 675359 1567186 1587296 1067807 1260298 1703854 1273873 1185911 616623
17021 616623 -662649 -463652 319419 -88264 -751323 -341996 -462465 -682949 -784936
17012 -784936 -712013 -465428 -861237 -926186 -337541 -208525 -297232 434282 205124 -153141
17002 -153141 -7490 73302 -62273 -256976 -696391 -882960 -1046661 -413734 662131 663465
16992 663465 479251 -167079 -758775 -279232 165438 468218 648232 831710 759788 327519
16982 327519 194082 82314 -754588 -1209452 -904575 -1108397 -722570 -357156 -513044 437732
16972 437732 1964266 2088905 1324663 811704 836779 1662679 2482498 1613169 879049 877896
16962 877896 842031 395535 447965 1166113 1739902 2070936 1562460 320176 -210803 -88631
16952 -88631 -232541 -650813 -1167957 -429400 595618 972417 669100 130301 -1129218
16943 -1129218 -1500962 -727740 -754171 31706 1170877 2128768 2662380 2896216 3473644
16934 3473644 3413938 2554001 1798875 1225999 721368 167040 -800154 -985264 -870587 -1621759
16924 -1621759 -1292775 -769171 -1315529 -1959626 -2577467 -2155750 -901487 -123106 717087
16915 717087 1548225 2380742 2342140 1805148 1548014 1128141 200790 -174609 46107 319110
16905 319110 756980 1626215 2706250 2717382 1627684 947151 1128870 1190723 748351 984429
16895 984429 1023650 648618 405364 589479 877090 710073 -135430 -649543 -336727 -13215
16885 -13215 86974 -428437 -538307 -764732 -870835 -1065444 -1393119 -1383118 -1550409 -1316140
16875 -1316140 -1176259 -694570 722681 1533524 1764787 1345025 1045896 1099074 1402258
16866 1402258 2227033 2203605 2335090 2068223 1384370 295856 -633357 -447040 6445
16857 6445 -417934 -1488625 -2230731 -1724255 -854496 -267218 294207 421759 909282 1131255
16847 1131255 1234315 719629 599937 1062739 1185227 461018 373046 760195 1036295 1413005
16837 1413005 1926917 2063657 1512863 689461 199314 -55795 -754684 -601337 366207
16828 366207 164482 88446 908766 1877048 927390 -551975 -766022 -1526677 -2089382 -1916225
16818 -1916225 -1980955 -1414410 -1154199 -1349573 -1268639 -724392 264115 749794 1357108 1762902
16808 1762902 1075772 533100 -690569 -972786 -970140 -1299599 -1477444 -940003 -115164 -55125
16798 -55125 -307195 -498721 -364495 269383 556343 -99392 -1025870 -1653457 -1261421 -593599
16788 -593599 -919952 -1437134 -769563 -227926 -796955 -1128630 -1781759 -1756266 -1009645 -919688
16778 -919688 -414457 200738 -247595 -1302867 -1418703 -26601 1019105 843091 614539
16769 614539 -107614 -707700 -1297405 -1205342 -503433 135762 255383 265954 224806 88230
16759 88230 -18075 149670 109437 -143684 -649763 -825350 -880602 -1321494 -548149 461630
16749 461630 704477 341347 149998 740783 1153034 319266 -354516 -427086 -216424 -277714
16739 -277714 30290 640040 1336857 1932095 1863144 2447784 2721549 1667077 325396
16730 325396 -29477 68089 -84433 64825 632484 605542 967381 1828509 1775755 1134263
16720 1134263 997102 638648 -47779 -779021 -2100531 -2529818 -2142960 -1664584 -1052612
16711 -1052612 -1067559 -1734281 -1673485 -666952 -932523 -711562 12111 1116044 1637266
16702 1637266 1617406 1627749 1137364 654482 696594 747677 1010768 1595658 1717891 1299152
16692 1299152 499956 713332 511777 -96008 -103137 86508 -809017 -1554257 -1792160 -2041423
16682 -2041423 -712818 125474 -287161 -91621 -117693 88730 217330 210262 498711 -701135
16672 -701135 -2188200 -1963820 -1654947 -1638296 -1647360 -1959793 -2430151 -2882285 -3030762 -2534859
16662 -2534859 -1546050 -1818802 -1685152 -850215 -453963 -58971 -4680 293703 479921 219659
16652 219659 -442379 -459055 -140290 -528519 -91291 578824 803351 29643 -834644 -475721
16642 -475721 114418 661171 764356 418533 -735112 -1285755 -330453 -547127 -1963814
16633 -1963814 -2178655 -1210987 -499050 -178813 584253 635565 512972 348188 -754173
16624 -754173 -961543 -531728 129414 -172039 -1298029 -1488873 -820281 -170090 291626
16615 291626 589922 1113746 1373794 1067940 -377469 -1435797 -2092416 -2981274 -1972834
16606 -1972834 -1368240 -1016032 29451 161044 439080 771357 699347 125544 878848
16597 878848 1754830 1784708 1619313 1241678 755229 991796 865310 485229 -78670 -995562
16587 -995562 -1765906 -1468994 -1247527 -1501525 -1800911 -999306 -196221 363470 4345 -277966
16577 -277966 -419094 -1147742 -1324577 -1144196 -920705 -723942 18893 398048 212227 -680660
16567 -680660 -509278 -710186 -1358084 -1074299 -281621 -640359 -699259 -448847 -435052 84010
16557 84010 114827 -734670 -958183 -587512 -733489 -1360099 -1183437 -695251 -1470778 -1601778
16547 -1601778 -1068353 -867713 -522585 80464 55211 -558631 -1216790 -1229920 -315009 66913
16537 66913 -441977 -621361 5979 757260 992741 1770663 1850505 1256443 201213 -496848
16527 -496848 -24120 350589 474383 855503 1217577 1740359 1651880 862226 744586 665743
16517 665743 1295753 1823706 2249546 2751738 2315309 1469875 1036411 755685 1006972 1542855
16507 1542855 1437944 1033339 1028798 1063613 866195 525164 -509509 -1426860 -1210957 -648429
16497 -648429 -670464 -463791 99190 -291964 -1041444 -1561960 -840439 -108172 -1042324 -2101574
16487 -2101574 -2077986 -1730061 -1731809 -2013250 -1651472 -1288402 -782400 -476791 -289622 -201869
16477 -201869 -71966 523966 603200 449957 595418 990713 1428031 1272396 366891 -551961
16467 -551961 -317540 -15208 46519 12682 20391 301141 959994 892227 256227 -339629
16457 -339629 -325931 -311543 -720582 -657911 -550388 -477301 -14660 78369 -598554 -1014373
16447 -1014373 -720947 -522299 -892011 -1518877 -2223807 -2187833 -2162529 -2210243 -1913819 -993555
16437 -993555 -205901 -177714 197213 1100267 1268286 717296 -60297 -414481 -893595 -933740
16427 -933740 -370727 -234166 171887 584573 579412 -128239 -471501 497735 1676915 1882190
16417 1882190 1345068 -110585 -868038 -1671561 -1948090 -1513800 -1260703 -659717 -299641
16408 -299641 -315203 -6892 -207571 -153541 -443554 -1141363 -1307447 -810781 -253597 -144636
16398 -144636 124462 726003 1057902 811412 770590 1326820 1715711 1705812 2261166 3008989
16388 3008989 2561042 1543546 680912 326372 1650175 3099323 2938212 1922739 851153
16379 851153 -548159 -1307917 -1188208 -415075 -113981 -520905 59527 295200 534641
16370 534641 814673 -147655 -431163 797920 815700 69614 4236 142838 -254078 -1507294
16360 -1507294 -2158685 -2584003 -2771903 -1978113 -674227 1142346 1733909 578579 -130665
16351 -130665 544424 161383 -638600 -719772 18349 674542 377802 -42218 -182317 -622795
16341 -622795 -214589 879335 902797 295068 -1164664 -1980561 -1109636 -15427 23853
16332 23853 -81253 355282 660320 600430 972756 545661 150511 350852 -406256 -1081453
16322 -1081453 -969212 -1129382 -305915 806818 986786 508466 -81834 -247004 -354063
16313 -354063 -2973 237299 273161 -66655 -780437 -1518383 -1718701 -1091728 -545765 -494245
16303 -494245 -476236 -92273 54042 -250243 -515225 192899 775458 351720 41768 -317841
16293 -317841 -749692 -662043 -81641 590965 432857 130818 94390 -162968 -113852 214290
16283 214290 497581 186153 -786356 -1689921 -2526623 -1137695 382681 481874 -41167
16274 -41167 -506496 -793183 -284188 891211 1871710 2127911 2182511 1966667 1068104 409537
16264 409537 -129034 -410824 -337773 155362 307116 -77068 -548563 -1249366 -1494962 -1726649
16254 -1726649 -1749047 -1584074 -729186 -607399 -982229 -765863 -624712 -900461 -496667 -777478
16244 -777478 -795944 -802633 280193 682584 -516438 -1729575 -2462742 -2632696 -2182759 -714398
16234 -714398 589885 865412 750127 862771 1011978 627200 286615 472312 280667
16225 280667 -667078 -1514414 -1515235 -1436097 -980219 247336 930329 318906 -473491 -331223
16215 -331223 -439372 -434137 453202 1224235 1182415 1074396 1002184 582721 495639 878922
16205 878922 993754 376372 -162736 -165044 385920 -15587 -268378 165652 595937 418602
16195 418602 712612 1169222 1535783 2035411 2500506 2040678 1928102 2057826 2176680 2427621
16185 2427621 3247562 3931847 3416732 1910345 1123972 1470087 1227225 1039113 776976
16176 776976 -39025 -346820 -132685 -526904 -1298652 -1225435 -920710 -1052278 -1093683 -1067358
16166 -1067358 -1321552 -973743 -691010 -736913 -650694 -1146413 -879894 -96699 158274 -173056
16156 -173056 -167840 -521682 -1431192 -1930650 -1662122 -1325280 -446690 807499 801913 438554
16146 438554 596270 650121 -105810 -921108 -1170209 -1380880 -1333973 -1120637 -648391 66878
16136 66878 399082 229744 44360 92588 178301 -323176 -1027923 -1017284 -1047426 241042
16126 241042 1535542 1161479 657613 -166819 -828517 -473802 -133751 -397491 -399964 -434479
16116 -434479 -1079230 -1769872 -1989960 -1327182 -609210 -311521 -783539 -1630324 -1731996 -907019
16106 -907019 -148777 216678 654471 1359285 1180035 535931 -153913 -182395 94427 -440316
16096 -440316 -1191785 -1717459 -1802832 -1674796 -1791482 -1851202 -1380155 -1783916 -2281394 -1663877
16086 -1663877 -1022385 -649811 -826033 -998502 -629197 -110250 402015 470270 281027 510916
16076 510916 60662 -469026 -818803 -1754091 -1892904 -781832 9401 124674 -254699
16067 -254699 -980163 -1006731 -312763 452140 812026 1501635 1935673 1072640 305134 708104
16057 708104 1190554 757901 -41657 125926 1349186 1423326 1146104 1234188 175441 -1296111
16047 -1296111 -2056711 -2307440 -1349209 -744329 -350379 -479779 -1285132 -1890219 -1778399
16038 -1778399 -1711924 -1052074 -498504 -964518 -1283725 -1034917 -774845 -1063425 -1032039 -708284
16028 -708284 -122405 459215 1043675 541996 -575412 -1067188 -1285549 -1203514 -531188 -12510
16018 -12510 89207 -37742 -538759 -1072830 -703124 186123 1345186 2289910 2345214 1987558
16008 1987558 1241491 888105 1145076 1278250 648510 -355591 -881876 -1147365 -573535
15999 -573535 40369 42070 325227 1022535 1631934 2590344 2980176 2493655 2391259 2922867
15989 2922867 2510775 1689539 1525260 738485 587491 696239 396303 568160 988164
15980 988164 1454386 1454629 1049237 1030483 1550019 2680094 2414594 1610234 1904133 1940614
15970 1940614 1121306 555561 141665 -457083 -661103 -357247 -170516 -235200 215013 849082
15960 849082 1138623 822242 258261 -132906 -102064 508099 817120 -129051 -862222 -472199
15950 -472199 -221776 -173387 -345670 -946765 -1464824 -1024880 -475836 109985 -249294 -780983
15940 -780983 -75671 1231660 1033098 863265 1319856 1205224 1231292 1164838 985976 670272
15930 670272 -30999 -823707 -1105671 -751597 -820350 -404834 773355 1387341 1405003 715168
15920 715168 -155216 -393155 -117145 160521 363289 198032 52273 -546191 -1020202 -1265741
15910 -1265741 -927527 -771151 -646931 -155280 -486491 -731244 -27376 183522 208413 -186211
15900 -186211 -199585 398882 990105 655945 -25294 -648827 -1648658 -1921916 -1638798 -1548033
15890 -1548033 -856106 -1016347 -1343610 -404129 330194 458929 690317 1037267 1281324
15881 1281324 1127998 564843 -248098 -233279 -144382 -397117 125476 940397 1589744 1755465
15871 1755465 1275386 447909 29227 -130421 -226099 -322134 -115599 230563 926646 1926997
15861 1926997 2301030 2323222 2427565 2257508 874509 103937 738679 1129360 595916
15852 595916 -96021 -1322098 -1744566 -690896 -290446 -618914 -814709 -136928 736935
15843 736935 697495 495315 719974 1234933 1056729 685393 335135 110872 -641614 -854576
15833 -854576 -902245 -1150459 -53335 359811 332703 932868 1679806 1812126 1482764 946013
15823 946013 880347 820905 743752 937171 1392775 2273689 2292026 2213600 1632204 581460
15813 581460 -120103 -822850 -1127728 -1774042 -2562623 -2225320 -1765539 -1474532 -1312264 -1119623
15803 -1119623 -1262732 -1398346 -587682 440177 157047 -740209 -750326 -250529 421315
15794 421315 585679 765890 917415 322804 -245269 -388596 -310972 -208861 -378163 -223225
15784 -223225 -266653 -357691 -462835 -1377705 -1675367 -1144286 -813688 -316388 132512 1081786
15774 1081786 1553701 802740 1079993 1388720 642788 255167 -210128 -1585552 -2010988
15765 -2010988 -1523648 -1514087 -1370517 -1075438 -732886 -781074 -1395629 -1927959 -1700607 -1655484
15755 -1655484 -1914594 -1545655 -1072935 -723936 -524935 -267858 -298699 -152396 253591 289731
15745 289731 133587 -245932 395938 1261681 865517 897174 1316731 1289836 99052 -397058
15735 -397058 -126724 -3987 87306 728049 939863 456081 156752 -585622 -1355097 -1750462
15725 -1750462 -1466625 -813595 -432484 -568706 -482737 -912424 -829288 17265 446174 209878
15715 209878 121072 1009049 1671046 1834560 1320020 1025700 848433 49472 -506014 -1003785
15705 -1003785 -944348 -807111 -1341080 -1393936 -996969 -662138 -212836 212132 922800 1129962
15695 1129962 582551 -155343 -482628 -766011 -513003 -123113 354788 406914 561624 1107523
15685 1107523 1343104 1139434 361140 -233105 -300964 -371177 372364 891444 996841 415664
15675 415664 -702167 -1059856 -562303 58002 -107630 -343836 -933355 -1491676 -1360509
15666 -1360509 -1562081 -2315493 -2615132 -2396032 -2711335 -2421253 -1490174 -1051351 -875896
15657 -875896 -666658 -214942 -153099 534462 837664 391514 -498024 -970788 -723696 -602271
15647 -602271 -1195448 -2076283 -1652933 -375750 -194302 -895793 -2080319 -3427780 -2985965
15638 -2985965 -2690057 -2444731 -2022555 -2201841 -2841962 -2598488 -1218419 -178492 70030
15629 70030 -792925 -1613496 -1896057 -1868217 -1418821 -1034644 -1269836 -1620886 -1505084 -1473740
15619 -1473740 -791862 -576475 -668833 -611890 77696 455606 402437 630067 473354 688321
15609 688321 525589 443976 572527 631747 329029 236480 519233 973857 731554 257898
15599 257898 970896 1602136 1484538 584251 -157360 -593277 -1003194 -1347808 -520004 902113
15589 902113 1170254 875207 1750140 2464700 2427028 1890213 1269358 938077 1007076 524655
15579 524655 257526 463542 1175130 1527830 928669 560494 -54890 -71968 846143 1459284
15569 1459284 915448 782732 1235873 1853818 1847322 810714 281191 114658 99193 -273577
15559 -273577 -627276 -1077612 -1877600 -2199940 -1900135 -1161672 -586025 -447439 -465711 -477130
15549 -477130 -94823 760642 1197506 1321197 1385360 1024444 -136665 -409641 506207 1110425
15539 1110425 1032802 1141717 1471853 1762004 1805678 2209059 2270573 1715216 1262559 993781
15529 993781 134271 -448438 -243534 -139119 53018 144740 74771 -110662 -793492 -862158
15519 -862158 -140492 897974 723149 -329291 -1027283 -732349 -143118 775607 1341750
15510 1341750 1165207 924391 989570 904141 595519 -122367 -959140 -1170979 -1123289 -699804
15500 -699804 -5783 194601 491004 934235 538257 791671 1943018 1771549 1061750
15491 1061750 1019716 779277 507498 -348771 -1267878 -647203 -742413 -312330 877498 577331
15481 577331 -90989 -63932 327707 4836 -477455 -169033 226137 459235 958441 1852703
15471 1852703 2003519 1916487 1903341 1473600 996815 1290107 2237222 2390683 1798646 838069
15461 838069 372843 -442768 -1101503 -1036667 -839675 -386276 -702574 -1256059 -535093 -18180
15451 -18180 379733 699119 327330 337733 302315 154574 289185 -216711 -1070948 -1123215
15441 -1123215 -76775 611682 574189 572002 425153 200996 -259216 -659775 -303234 188918
15431 188918 514295 1578677 1991925 1398723 901436 712326 632506 229728 -839167
15422 -839167 -858727 -349811 -577671 -443850 47390 377095 440038 633287 1054454 1232253
15412 1232253 1355002 1320974 1182512 1331348 1622295 1261877 343070 -564144 -285475 826934
15402 826934 1580935 1543825 1151929 1243161 1104562 796936 784559 572731 521016 581038
15392 581038 456854 -13961 -731662 -1084994 -1054202 -180632 91662 134030 -326588 -769166
15382 -769166 -133214 1086508 1605471 1847971 1917629 2102740 1113958 -452616 -1389967
15373 -1389967 -1511839 -719781 464316 1021986 1583507 1666227 924285 -366557 -1205892
15364 -1205892 -1307339 -1389256 -480981 120160 256057 560450 1031625 1409559 1848690 2140882
15354 2140882 1172588 171670 -718432 -1260676 -989309 -620609 -708091 -235566 110888
15345 110888 962997 2252157 2149686 1426732 383037 -416502 -664280 -1044164 -1113993
15336 -1113993 -942122 -850650 -505707 -754462 -1246062 -1940312 -2052897 -1369478 -821414 86944
15326 86944 1065558 1505222 836208 29784 -528816 -998274 -744928 -322282 -488877 -818774
15316 -818774 123232 795404 1170005 1362146 859238 342893 517546 609365 1398318 2199885
15306 2199885 1346248 631786 275378 -661819 -591855 227549 1349020 1975493 1562041
15297 1562041 969781 629782 98692 -583700 -835218 -1282198 -1652013 -1473872 -668462
15288 -668462 224175 -111513 -1244246 -1428407 -60019 1037440 951165 930978 1087745
15279 1087745 1387308 1929137 1939359 1837141 1779899 1436199 1364163 667819 181691 197253
15269 197253 71338 -134188 -142911 83782 256967 275257 208079 246339 -256637 -1137494
15259 -1137494 -1470769 -1451119 -1643264 -2016863 -2250270 -1666937 -906809 25303 -5811 -515408
15249 -515408 215241 1129728 1597641 1742389 1597492 1431262 1411200 1415460 1125936 402746
15239 402746 -582779 -29137 277528 438265 1088405 1564793 2108788 2947702 2490489 1539987
15229 1539987 1417676 972108 803617 658882 206874 -186308 -636957 -1128809 -1424262
15220 -1424262 -1359284 -1168582 -841624 -688959 -75079 194007 -189010 92355 78725 7340
15210 7340 697785 1067889 567427 -30016 340752 810047 690381 985758 602529 -279214
15200 -279214 -1340792 -1390291 -565742 142196 188417 710152 374657 -238586 -410070 -187336
15190 -187336 -68840 -66031 253686 492432 -59351 -465971 -378527 -199205 -518910 -900354
15180 -900354 -136338 -642526 -1408652 -1469012 -1055339 -612379 -287193 -196545 -384472 -148439
15170 -148439 -780659 -1333758 -713579 383527 643867 -889832 -1817349 -1199296 336103
15161 336103 800003 526780 -144803 -1101086 -1005019 -150839 573677 323324 148294 -247317
15151 -247317 -514834 -300125 182239 821037 1037043 792721 645800 575175 -536042 -1436102
15141 -1436102 -1171598 -740962 -762822 -516635 519105 1338320 1507320 794617 185855
15132 185855 320179 1022769 1000244 894404 760223 725833 635037 147732 121751 514409
15122 514409 628160 270888 229045 -397068 -473492 144613 321227 165439 621334 757226
15112 757226 14338 -1026436 -1685527 -1187950 -366186 -364 -205362 -17997 478273
15103 478273 418915 40364 88396 711987 1056447 1062561 318437 -616174 -1817281 -3381653
15093 -3381653 -4203778 -4146267 -3293443 -2133352 -2002395 -1967600 -1419443 -1015942 -964678 -745522
15083 -745522 244681 1222853 1800786 1369858 223950 -341191 -563699 -867083 -1325057
15074 -1325057 -1443804 -1092329 -229269 661442 873982 403865 -405243 -805925 -348614
15065 -348614 379293 521133 991187 1443951 1212492 931207 115488 -409809 -1209509 -1969448
15055 -1969448 -1764651 -1360284 -1070638 -475220 -344542 245888 1066026 1269427 736540
15046 736540 603657 1379746 1542373 775371 -213076 -845650 -1281885 -1119059 -930648 -1395895
15036 -1395895 -1166886 -372606 146061 250080 -134740 -95055 -13902 -507939 -1028464 -1128699
15026 -1128699 -671468 -527978 -626971 -1204825 -1578286 -1202548 -1314556 -1679973 -2271057 -2954998
15016 -2954998 -3230184 -2671688 -1732604 -651321 368192 836887 1240606 1363003 1023533
15007 1023533 429182 700095 451249 -439225 -167849 359173 465111 -64682 83965
14998 83965 1087560 1402673 342898 -312877 -402359 -836386 -1179766 -2010320 -2644156 -2618325
14988 -2618325 -1745266 -1471924 -1616456 -1475110 -1321670 -1416847 -1754991 -1921659 -2386924 -2442177
14978 -2442177 -1846284 -1399797 -1739595 -1160724 31713 92513 -223540 -805047 -394835
$$ [...]
##END NTUPLES=NMR SPECTRUM
##END=
