##TITLE=C13_SA_15.184
 CDCl3, 22200 sc

 28.1.2020
##JCAMPDX= 6.0         $$ Bruker NMR JCAMP-DX V2.0
##DATA TYPE= NMR SPECTRUM
##DATA CLASS= NTUPLES
##ORIGIN= UXNMR, Bruker Analytische Messtechnik GmbH
##OWNER= root
$$ XWIN-NMR		Version 3.5
$$ Wed Jan 29 13:45:07 2020 Russian Standard Time (UT+4h)  she@DPX200
##.OBSERVE FREQUENCY= 50.327896
##.OBSERVE NUCLEUS= ^13C
##.ACQUISITION MODE= SIMULTANEOUS
##.ACQUISITION SCHEME= undefined
##.AVERAGES= 22200
##.DIGITISER RES= 17
##SPECTROMETER/DATA SYSTEM= spect
##.PULSE SEQUENCE= zgpg30
##.SOLVENT NAME= CDCl3
##.SHIFT REFERENCE= (INTERNAL, CDCl3, 0, 222.624)
##AUDIT TRAIL= $$ (NUMBER, WHEN, WHO, WHERE, WHAT)
$$ ##TITLE= Audit trail, XWIN-NMR		Version 3.5
$$ ##JCAMPDX= 5.01
$$ ##ORIGIN= Bruker BioSpin GmbH
$$ ##OWNER= she
$$ F:/spectra/data/she/nmr/c13/1/pdata/1/auditp.txt
$$ ##AUDIT TRAIL=  $$ (NUMBER, WHEN, WHO, WHERE, WHAT)
(   1,<2020-01-29 13:43:35.85 +0400>,<she>,<DPX200>,
      <created by zg, POWCHK disabled, PULCHK disabled
       terminated by command 'halt'
       configuration hash MD5:
       00 E9 B6 7A A2 85 ED C7 34 08 36 98 17 FE 4E 26
       data hash MD5: 32K
       4A FB F4 66 87 60 A1 A2 6E B1 57 A5 D6 64 22 AF>)
(   2,<2020-01-29 13:43:39.37 +0400>,<she>,<DPX200>,
      <Start of raw data processing
       efp BC_mod = 2 LB = 1 FT_mod = 6 PKNL = 1 PHC0 = -232.7068 PHC1 = 27.80638 SI = 32K 
       data hash MD5: 32K
       FE F6 ED 38 DD 36 B8 E8 F5 1D C0 21 4F 4A 89 6D>)
(   3,<2020-01-29 13:43:42.00 +0400>,<she>,<DPX200>,
      <abs ABSG = 5 
       data hash MD5: 32K
       9A FF 94 0C B8 E2 B3 4A F3 E9 2D 5A 16 01 A3 76>)
(   4,<2020-01-29 13:44:08.28 +0400>,<she>,<DPX200>,
      <pk PHC0 = 1.431228 PHC1 = 10.6 
       data hash MD5: 32K
       7E 8D 47 F5 25 9B 0B 80 68 A1 AA C8 CD 7F 89 25>)
(   5,<2020-01-29 13:44:11.84 +0400>,<she>,<DPX200>,
      <abs ABSG = 5 
       data hash MD5: 32K
       93 2B 4A 9B 7B 8C 23 28 84 12 7C 7B 22 55 43 D3>)
$$ ##END=
$$ 
$$ hash MD5
$$ B7 0C 75 6F AC 33 65 08 B5 69 61 22 52 BB B4 C7
##$RELAX= 
##$RELAX= 
##$RELAX= 
##$RELAX= 
##$RELAX= 
##$RELAX= 
##$RELAX= 
##$RELAX= 
$$ Bruker specific parameters
$$ --------------------------
##$DU= <F:/spectra>
##$EXPNO= 1
##$NAME= <c13>
##$PROCNO= 1
##$TYPE= <nmr>
##$USER= <she>
##$AMP= (0..31)
100 100 100 100 100 100 100 100 100 100 100 100 100 100 100 100 100 100 
100 100 100 100 100 100 100 100 100 100 100 100 100 100 
##$AQSEQ= 0
##$AQ_mod= 1
##$AUNM= <au_zg>
##$AUTOPOS= <>
##$BF1= 50.322709
##$BF2= 200.13
##$BF3= 50.322709
##$BF4= 500.13
##$BF5= 500.13
##$BF6= 500.13
##$BF7= 500.13
##$BF8= 500.13
##$BYTORDA= 1
##$CFDGTYP= 0
##$CFRGTYP= 5
##$CHEMSTR= <none>
##$CNST= (0..31)
1 1 145 1 1 1 1 1 1 1 1 1 1 1 1 1 1 1 1 1 1 1 1 1 1 1 1 1 1 1 1 1 
##$CPDPRG= <waltz16>
##$CPDPRG1= <>
##$CPDPRG2= <waltz16>
##$CPDPRG3= <>
##$CPDPRG4= <mlev>
##$CPDPRG5= <mlev>
##$CPDPRG6= <mlev>
##$CPDPRG7= <mlev>
##$CPDPRG8= <mlev>
##$CPDPRGB= <>
##$CPDPRGT= <>
##$D= (0..31)
$$ [...]
##$SUBNAM4= <"">
##$SUBNAM5= <"">
##$SUBNAM6= <"">
##$SUBNAM7= <"">
##$SUBNAM8= <"">
##$SUBNAM9= <"">
##$SW= 239.972175391363
##$SWIBOX= (0..15)
0 1 3 0 0 0 0 0 0 0 0 0 0 0 0 0 
##$SW_h= 12077.2946859903
##$TD= 32768
##$TD0= 1
##$TE= 0
##$TE2= 300
##$TE3= 300
##$TEG= 300
##$TL= (0..7)
120 120 120 120 120 120 120 120 
##$TP= (0..7)
150 150 150 150 150 150 150 150 
##$TP07= 0
##$TPNAME0= <>
##$TPNAME1= <>
##$TPNAME2= <>
##$TPNAME3= <>
##$TPNAME4= <>
##$TPNAME5= <>
##$TPNAME6= <>
##$TPNAME7= <>
##$TPOAL= (0..7)
0.5 0.5 0.5 0.5 0.5 0.5 0.5 0.5 
##$TPOFFS= (0..7)
0 0 0 0 0 0 0 0 
##$TUNHIN= 0
##$TUNHOUT= 0
##$TUNXOUT= 0
##$USERA1= <user>
##$USERA2= <user>
##$USERA3= <user>
##$USERA4= <user>
##$USERA5= <user>
##$V9= 5
##$VALIST= <valist>
##$VCLIST= <CCCCCCCCCCCCCCC>
##$VD= 0
##$VDLIST= <DDDDDDDDDDDDDDD>
##$VPLIST= <PPPPPPPPPPPPPPP>
##$VTLIST= <TTTTTTTTTTTTTTT>
##$WBST= 1024
##$WBSW= 4
##$XGAIN= (0..3)
0 0 0 0 
##$XL= 0
##$YL= 0
##$YMAX_a= 122615577
##$YMIN_a= -37546889
##$ZGOPTNS= <>
##$ZL1= 120
##$ZL2= 120
##$ZL3= 120
##$ZL4= 120
##$ABSF1= 222.624
##$ABSF2= -17.3728
##$ABSG= 5
##$ABSL= 3
##$ALPHA= 0
##$AQORDER= 0
##$ASSFAC= 0
##$ASSFACI= 0
##$ASSFACX= 0
##$ASSWID= 0
##$AUNMP= <proc_1d>
##$AZFE= 0.1
##$AZFW= 0.5
##$BCFW= 0
##$BC_mod= 2
##$BYTORDP= 0
##$COROFFS= 0
##$CY= -3
##$DATMOD= 1
##$DC= 0
##$DFILT= <>
##$DTYPP= 0
##$F1P= 0
##$F2P= 0
##$FCOR= 0.5
##$FTSIZE= 32768
##$FT_mod= 6
##$GAMMA= 0
##$GB= 0
##$INTBC= 1
##$INTSCL= 4.134877e-10
##$ISEN= 128
##$LB= 1
##$LEV0= 0
##$LPBIN= 0
##$MAXI= 10000
##$MC2= 0
##$MEAN= 0
##$ME_mod= 0
##$MI= 0.1934396
##$NCOEF= 0
##$NC_proc= 3
##$NLEV= 6
##$NOISF1= 120.0001
##$NOISF2= 80.00006
##$NSP= 0
##$NTH_PI= 0
##$NZP= 0
##$OFFSET= 222.624
##$PC= 1.4
##$PHC0= -231.2756
##$PHC1= 38.40638
##$PH_mod= 1
##$PKNL= yes
##$PPARMOD= 0
##$PSCAL= 0
##$PSIGN= 0
##$REVERSE= no
##$SF= 50.3227315989248
##$SI= 32768
##$SIGF1= 140
##$SIGF2= 120
##$SINO= 11.81781
##$SIOLD= 32768
##$SREGLST= <13C.CDCl3>
##$SSB= 0
##$STSI= 32768
##$STSR= 0
##$SW_p= 12077.2946859903
##$SYMM= 0
##$S_DEV= 0
##$TDeff= 32768
##$TDoff= 0
##$TI= <>
##$TILT= no
##$TM1= 0
##$TM2= 0
##$TOPLEV= 0
##$USERP1= <user>
##$USERP2= <user>
##$USERP3= <user>
##$USERP4= <user>
##$USERP5= <user>
##$WDW= 1
##$XDIM= 32768
##$YMAX_p= 357158919
##$YMIN_p= -1133521
$$ End of Bruker specific parameters
$$ ---------------------------------
##NTUPLES= NMR SPECTRUM
##VAR_NAME=  FREQUENCY,     SPECTRUM/REAL,   SPECTRUM/IMAG
##SYMBOL=    X,             R,               I
##VAR_TYPE=  INDEPENDENT,   DEPENDENT,       DEPENDENT
##VAR_FORM=  AFFN,          ASDF,            ASDF
##VAR_DIM=   32768,         32768,           32768
##UNITS=     HZ,            ARBITRARY UNITS, ARBITRARY UNITS
##FACTOR=    0.368581032318806, 1,           1
##FIRST=     11203.0474431902, 0,            0
##LAST=      -874.247242800138, 0,           0
##MIN=       -874.247242800138, -1133521,    0
##MAX=       11203.0474431902, 357158919,    0
$$ Real data points
##PAGE= N=1
##DATA TABLE= (X++(R..R)), XYDATA
$$ [...]
$$ plain form
10912 16321 22020 200807 403219 536675 572100 577847 597667 536871 425587 243496 141437
10901 141437 42921 -142434 -236797 -419265 -695617 -777672 -794108 -633949 -339961 -271470
10891 -271470 -256517 -71626 -47108 -89470 98938 271480 411700 283043 145236 95468
10881 95468 186891 567353 532377 300743 186430 53037 -114724 -206836 -202706 -280141 -195653
10870 -195653 13904 -47836 -40219 15023 3843 -15409 107754 117955 -125549 -300172 -176610
10859 -176610 125506 333689 525656 631320 361731 11288 11053 122126 151363 -71355
10849 -71355 -176116 -157319 10241 169226 -13840 -294394 -450661 -517846 -588997 -363517
10839 -363517 -31879 180133 85384 -1325 -88462 -82589 168456 338847 292435 99342 -89410
$$ packed form
10912A6321N699J78787K02412J33456L5425N747J9820o0796j11284j82091j02059
10901A41437r8516j85355r4363j82468k76352q2055j6436J60159K93988O8491
10891b71470J4953J84891K4518m2362J88408J72542J40220j28657j37807m9768
10881I5468R1423L80462l4976k31634j14313j33393j67761r2112M130p7435Q4488
10870a95653K09557o1740P617N5242j1180j9252J23163J0201k43504j74623J23562
10859a76610L02116K08183J91967J05664k69589l50443k35J11073K9237k22718
10849g1355j04761J8797J67560J58985j83066k80554j56267o7185p1151K25480
10839c63517L31638K12012r4749q6709q7137N873K51045J70391m6412j93093j88752
$$ plain form
10828 -89410 -185703 -242239 -347507 -504804 -398777 -217185 -199733 -203053 -321027 -558520 -618500
10817 -618500 -490456 -579678 -525564 -217756 -130068 -340945 -348385 -248582 -46187 24216 -87243
10806 -87243 -202924 -66561 59109 113438 124579 140147 144403 515543 919142 862529 650282
10795 650282 589204 606986 642941 658479 548622 546147 515850 523272 406471 288080 88680
10784 88680 144264 260572 247521 33598 -126228 -153831 -201455 -206284 -206129 -460850 -518797
10773 -518797 -366351 -251851 -110090 -63295 -267387 -224966 -8469 68214 -99735 -279406
10763 -279406 -209950 -90091 -150175 -397052 -581821 -618816 -591675 -637277 -598823 -513148 -469747
10752 -469747 -492495 -427373 -274226 -282518 -149183 153736 184126 29798 -118699 -121465 -80847
$$ packed form
10828h9410r6293n6536j05268j57297J06027J81592J7452l320j17974k37493n9980
10817f18500J28044q9222N4114L07808Q7688k10877p440R9803K02395P0403j11459
10806h7243j15681J36363J25670N4329J1141J5568M256L71140M03599n6613k12247
10795F50282o1078J7782L5955J5538j09857k475l0297P422j16801j18391j99400
10784H8680N5584J16308j3051k13923j59826k7603m7624m829J55k54721n7947
10773e18797J52446J14500J41761M6795k04092M2421K16497P6683j67949j79671
10763b79406O9456J19859o0084k46877j84769l6995K7141m5602L8454Q5675M3401
10752d69747k2748O5122J53147q292J33335L02919L0390j54328j48497k766M0618
$$ plain form
10741 -80847 -119090 -43952 70609 169858 97237 75632 102363 -16193 -238924 -352002 -2903
10730 -2903 285882 356928 310813 137600 -100555 -179507 -349131 -276931 -1428 145139 157676
10719 157676 -67372 -314534 -470322 -591675 -662128 -606866 -421055 -305301 -437657 -379514
10709 -379514 -185846 -214458 -280910 -14259 472235 641235 343491 135464 87069 41268
10699 41268 57862 -237898 -328148 -361593 -378257 -133971 26853 -101385 -362611 -502950
10689 -502950 -470085 -277626 -125866 -207265 -265844 -169733 -53113 55848 38235 -33362 -102015
10678 -102015 -201954 -193916 -80679 50605 253726 259159 103813 -106696 -170592 -57515 62752
10667 62752 257112 258581 -96980 -390448 -296861 -38147 170409 364628 708516 956835
$$ packed form
10741h0847l8243P5138J14561R9249p2621k1605K6731j18556k22731j13078L49099
10730b903K88785P1046m6115j73213k38155p8952j69624P2200K75503J46567J2537
10719A57676k25048k47162j55788j21353p0453N5262J85811J15754j32356N8143
10709c79514J93668k8612o6452K66651M86494J69000k97744k08027m8395m5801
10699D1268J6594k95760r0250l3445j6664K44286J60824j28238k61226j40339
10689e02950L2865J92459J51760q1399n8579R6111J16620J08961j7613p1597o8653
10678a02015r9939Q038J13237J31284K03121N433j55346k10509o3896J13077J20267
10667F2752J94360J469l55561k93468R3587K58714K08556J94219L43888K48319
$$ plain form
10657 956835 872027 840848 858231 641848 638172 848199 808639 660902 483257 254810 149484
10646 149484 102169 101178 216655 322493 332802 177804 -98844 -241609 -250806 -193977 -333385
10635 -333385 -373013 -235845 -160526 34264 97201 138869 -34055 -7726 379128 719050
10625 719050 720047 563945 350274 58895 -114359 -12333 103688 -56104 -214108 -235212
10615 -235212 -115263 -71161 -37314 -198872 -223869 -97766 5140 -26047 -192726 -383176
10605 -383176 -423608 -131875 52833 89421 31049 -86645 -173304 -77058 98272 133502 133063
10594 133063 323377 457515 419918 278682 247035 337458 295045 275823 228624 170141 175757
10583 175757 98830 -42476 -58858 152923 414088 416818 375869 266527 116952 31221 -83166
$$ packed form
10657I56835q4808l1179J7383k16383l676K10027l9560j47737j77645k28447j05326
10646A49484m7315r91J15477J05838J0309j54998k76648j42765r197N6829j39408
10635c33385l9628J37168P5319J94790O2937M1668j72924K6329L86854L39922
10625G19050R97j56102k13671k91379j73254J02026J16021j59792j58004k1104
10615b35212J19949M4102L3847j61558k4997J26103J02906l1187j66679j90450
10605c83176m0432K91733J84708L6588n8372j17694q6659R6246J75330L5230m39
10594A33063J90314J34138l7597j41236l1647R0423m2413j9222m7199n8483N616
10583A75757p6927j41306j6382K11781K61165K730m0949j09342j49575q5731j14387
$$ plain form
10572 -83166 -291071 -358871 -238838 -4784 111047 77248 -57534 -101781 15563 -33212
10562 -33212 -55785 -33921 23738 -250410 -419585 -482704 -397883 -176789 -143303 -118646 107165
10551 107165 432860 473711 445936 484830 458518 339655 376835 381108 160859 -84819 -157723
10540 -157723 -89541 -21529 -91234 -87754 -166611 -362751 -502770 -681569 -538272 -341456 -288871
10529 -288871 -245753 -33510 199034 215226 191182 200308 139568 69289 -76632 -272543 -311043
10518 -311043 -368370 -249519 122185 56524 -159476 -158416 -144613 -134393 -95558 -373879 -699704
10507 -699704 -640109 -251241 78438 117001 -85789 -320225 -432318 -534733 -613077 -582689
10497 -582689 -448967 -250278 -96598 48210 107200 142222 126633 3456 -225419 -263429
$$ packed form
10572h3166k07905o7800J20033K34054J15831l3799j34782m4247J17344m8775
10562c3212k2573K1864N7659k74148j69175o3119Q4821K21094L3486K4657K25811
10551A07165L25695M0851k7775L8894k6312j18863L7180M273k20249k45678p2904
10540a57723O8182O8012o9705L480p8857j96140j40019j78799J43297J96816N2585
10529b88871M3118K12243K32544J6192k4044R126o0740p0279j45921j95911l8500
10518c11043n7327J18851L71704o5661k16000J060J3803J0220L8835k78321l25825
10507f99704N9595L88868L29679L8563k02790k34436j12093j02415p8344L0388
10497e82689J33722J98689J53680J44808N8990L5022j5589j23177k28875l8010
$$ plain form
10487 -263429 -93194 175490 195919 -19893 -201617 -344364 -357471 -237505 -78882 -72522
10477 -72522 -5284 16974 -23034 -163850 -219057 -162955 -2690 -67612 -262469 -341151 -245648
10466 -245648 -233411 -534168 -564187 -219309 82885 57927 -55122 80679 221219 294817
10456 294817 196118 76794 207444 340700 346910 280819 128094 52012 293591 343626 303665
10445 303665 230006 82104 -101096 -230123 -241038 -152661 -256248 -470762 -507914 -602657
10435 -602657 -626056 -718011 -741180 -606101 -510507 -388958 -233972 -237907 -218536 -244547 -207470
10424 -207470 -221590 -417891 -617001 -491660 -349252 -310491 -77502 122655 -16560 -101882
10414 -101882 -65258 -2578 20816 41501 157146 235787 158531 89720 -157524 -383040 -374310
$$ packed form
10487b63429J70235K68684K0429k15812j81724j42747j3107J19966J58623O360
10477g2522O7238K2258m0008j40816n5207N6102J60265o4922j94857p8682R5503
10466b45648J2237l00757l0019L44878L02194k4958j13049J35801J40540P3598
10456B94817r8699j19324J30650J33256O210o6091j52725p6082K41579N0035l9961
10445C03665p3659j47902j83200j29027j0915Q8377j03587k14514l7152r4743
10435f02657k3399r1955k3169J35079R5594J21549J54986l935J9371k6011L7077
10424b07470j4120j96301j99110J25341J42408L8761K32989K00157j39215q5322
10414a01882L6624O2680K3394K0685J15645P8641p7256o8811k47244k25516Q730
$$ plain form
10403 -374310 -317261 -398926 -515310 -602626 -506946 -298793 -167964 -116743 -99044 -115650 95160
10392 95160 136399 126610 118381 62734 157663 136988 -29223 -194824 -266302 -296360 -309951 -306887
10380 -306887 -288324 -218802 -233027 -251402 -351052 -461858 -361956 -228496 -180529 -225097 -122264
10369 -122264 -7246 -74680 -78914 133624 234079 87199 94784 230175 326415 185870 -29300
10358 -29300 -167722 -86094 29082 -71767 -33501 -73907 -235247 -319027 -493750 -604020
10348 -604020 -636682 -615284 -532249 -406751 -425304 -519060 -436582 -220780 -106669 -245273 -268818
10337 -268818 -171213 -96427 -101839 -178021 -451692 -492947 -237884 1253 -58628 -125824 -234207
10326 -234207 -362072 -395309 -409297 -423716 -396018 -362384 -113601 94679 -7266 -120410
$$ packed form
10403c74310N7049q1665j16384q7316R5680K08153J30829N1221J7699j6606K10810
10392I5160M1239r789q229n5647R4929k0675j66211j65601p1478l0058j3591L064
10380c06887J8563O9522j4225j8375r9650j10806R9902J33460M7967m4568J02833
10369a22264J15018o7434m234K12538J00455j46880P585J35391R6240j40545k15170
10358b9300j38422Q1628J15176j00849L8266m0406j61340q3780j74723j10270
10348f04020l2662K1398Q3035J25498j8553r3756Q2478K15802J14111j38604k3545
10337b68818R7605P4786n412p6182k73671m1255K55063K39137n9881o7196j08383
10326b34207j27865l3237j3988j4419K7698L3634K48783K08280j01945j13144
$$ plain form
10316 -120410 63624 238185 146611 181492 230997 101477 51238 46846 62416 77193 -36128
10305 -36128 -7645 262762 497431 510028 473052 444817 431551 322376 141928 155150 51560
10294 51560 -175493 -317901 -226659 -80785 114922 181375 119748 87217 134738 190776 224086
10283 224086 190757 -28953 -33699 205576 283145 65600 42581 144546 161810 172422 160620
10272 160620 281639 249439 135759 137799 59905 -171572 -354197 -490781 -618517 -577809
10262 -577809 -369512 -164609 -121119 38657 309212 418504 505088 472664 451227 275860
10252 275860 262113 290405 61643 -284410 -466052 -346003 -180584 58284 173388 133010
10242 133010 101847 -95342 -306611 -403835 -254621 -74567 58683 123841 20485 40120
$$ packed form
10316a20410J84034J74561r1574L4881M9505j29520n0239m392J5570J4777j13321
10305c6128K8483K70407K34669J2597l6976k8235j3266j09175j80448J3222j03590
10294E1560k27053j42408R1242J45874J95707O6453o1627l2531M7521N6038L3310
10283B24086l3329k19710m746K39275P7569k17545k3019J01965J7264J0612j1802
10272A60620J21019l2200j13680K040p7894k31477j82625j36584j27736M0708
10262e77809K08297K04903M3490J59776K70555J09292Q6584l2424k1437j75367
10252B75860j3747K8292k28762l46053j81642J20049J65419K38868J15104m0378
10242A33010l1163j97189k11269r7224J49214J80054J33250O5158j03356J9635
$$ plain form
10232 40120 125271 2468 -152363 -120984 -261180 -609201 -659646 -351252 -22619 119231
10222 119231 39110 -200099 -279390 -223830 -3540 230428 394372 420268 485235 460333 388530
10211 388530 225174 -161507 -502124 -534972 -379873 -242881 -91901 -69424 -182216 -327166
10201 -327166 -395687 -315507 -220143 -129504 -114547 -118537 -58061 -195668 -340850 -389232 -446728
10190 -446728 -354432 -407903 -693107 -802419 -569496 57296 277408 123326 -81088 -126051
10180 -126051 -48183 26343 69514 72572 79923 160455 288473 402553 433539 261972 74061
10169 74061 152579 277470 80807 -152511 -100731 -5714 149647 559599 679274 437384
10159 437384 242609 19117 -130927 -150358 -70261 73243 188267 226908 213698 210807 210160
$$ packed form
10232D0120Q5151j22803j54831L1379j40196l48021n0445L08394L28633J41850
10222A19231q0121k39209p9291N5560K20290K33968J63944K5896O4967k4902p1803
10211C88530j63356l86681l40617l2848J55099J36992J50980K2477j12792j44950
10201c27166o8521Q0180R5364R0639J4957l990O0476j37607j45182m8382n7496
10190d46728R2296n3471k85204j09312K32923O26792K20112j54082k04414m4963
10180a26051P7868P4526M3171L058P351Q0532J28018J14080L0986j71567j87911
10169G4061P8518J24891j96663k33318N1780R5017J55361M09952J19675k41890
10159D37384j94775k23492j50044j9431Q0097J43504J15024L8641j3210k891o47
$$ plain form
10148 210160 125174 101184 294319 440689 358547 20231 -232027 -404488 -457651 -280927
10138 -280927 -239645 -181055 -16797 256440 369909 435344 403311 489932 683299 888978
10128 888978 833137 576543 323965 255363 199377 190143 259386 284700 137913 67267 91353
10117 91353 282149 217543 -199299 -438040 -261058 -143727 -63655 8643 -26079 109726
10107 109726 150961 27769 70907 146576 22870 -248948 -368117 -142602 -51117 -130242
10097 -130242 -72480 -19881 -46105 -156779 -396431 -363877 -342342 -327568 -195822 -93954 155460
10086 155460 549038 541340 289432 126542 160735 92232 69279 125523 25477 -85098 -265954
10075 -265954 -300867 -184896 -162199 -39689 210049 225668 84744 97876 92124 266683 328817
$$ packed form
10148B10160q4986k3990J93135J46370q2142l38316k52258j72461n3163J76724
10138b80927M1282N8590J64258K73237J13469O5435l2033Q6621J93367K05679
10128H88978n5841k56594k52578o8602n5986r234O9243K5314j46787p0646K4086
10117I1353J90796o4606m16842k38741J76982J17331Q0072P2298l4722J35805
10107A09726M1235j23192M3138P5669j23706k71818j19169K25515R1485p9125
10097a30242N7762N2599k6224j10674k39652L2554K1535J4774J31746J01868K49414
10086A55460L93578p698k51908j62890L4193o8503k2953N6244j00046j10575j80856
10075b65954l4913J15971K2697J22510K49738J5619j40924J3132n752J74559O2134
$$ plain form
10064 328817 197040 224859 341744 347552 388669 227427 51811 -82 88833 105186 165632
10053 165632 300111 347137 339559 317310 316333 33858 -222740 -208965 82640 417949 615378
10042 615378 580801 410286 157085 21181 31103 53587 165770 490615 440722 190897
10032 190897 207647 138421 -21516 24180 -9402 -126136 -64010 52398 253059 399348
10022 399348 341225 220311 174163 185660 236986 449518 461469 237710 74135 -63450
10012 -63450 -158845 -235256 -119081 53410 166167 236073 219965 233368 150243 -32334 -195784
10001 -195784 -334253 -324676 -350563 -434762 -369993 -10910 326995 305939 247715 305580 266977
9990 266977 206061 41685 -84340 -123203 -160501 -231491 -427534 -457027 -388303 -287990 -203927
$$ packed form
10064C28817j31777K7819J16885N808M1117j61242j75616n1893Q8915J6353O0446
10053A65632J34479M7026p578k2249r77k82475k56598J3775K91605L35309J97429
10042F15378l4577j70515k53201j35904R922K2484J12183L24845m9893k49825
10032A90897J6750o9226j59937M5696l3582j16734O2126J16408K00661J46289
10022C99348n8123j20914m6148J1497N1326K12532J1951k23759j63575j37585
10012f3450r5395p6411J16175J72491J12757O9906j6108J3403q3125j82577j63450
10001a95784j38469R577k5887q4199O4769L59083L37905k1056n8224N7865l8603
9990B66977o0916j64376j26025l8863l7298p0990j96043k9493O8724J00313Q4063
$$ plain form
9979 -203927 -149365 -16693 164133 165597 -44745 -125044 -136023 -209813 -323413 -468647 -462586
9968 -462586 -63429 318481 272636 74437 -41980 -90809 -152202 -171886 -174365 -132923 -51987
9957 -51987 141438 63615 -242125 -434811 -562746 -616541 -523072 -564328 -837777 -705085 -261373
9946 -261373 187753 357409 144401 74425 97170 116868 215724 292994 534504 507684 213751
9935 213751 56012 116211 157251 -12920 -257990 -389873 -207058 -2137 -70557 -64896 173943
9924 173943 287637 194468 243105 402652 331105 182499 88845 112703 99667 207323 198746
9913 198746 -193599 -349128 -278144 -106576 -79034 -99097 -79191 -116030 -191660 -142483 -140172
9902 -140172 -291545 -369561 -328498 -288653 -112101 148705 260603 104023 -158529 -204603
$$ packed form
9979b03927N4562J32672J80826J464k10342q0299j0979p3790j13600j45234O061
9968d62586L99157L81910m5845j98199j16417m8829o1393j9684k479M1442Q0936
9957e1987J93425p7823l05740j92686j27935n3795R3469m1256k73449J32692M43712
9946b61373M49126J69656k13008o9976K2745J9698R8856P7270K41510k6820k93933
9935B13751j57739O0199M1040j70171k45070j31883J82815K04921o8420N661K38839
9924A73943J13694r3169M8637J59547p1547j48606r3654K3858j3036J07656q577
9913A98746l92345j55529P0984J71568K7542k0063J9906l6839p5630M9177K311
9902a40172j51373p8016M1063L9845J76552K60806J11898j56580k62552m6074
$$ plain form
9892 -204603 -141680 -89485 35619 -10770 -93026 139396 82823 -172190 -512865 -471462 -102193
9881 -102193 107246 108299 45798 1322 -52831 -101429 -227867 -322134 -528278 -573384 -435052
9870 -435052 -300544 -45325 216236 135450 -197420 -509261 -692716 -740265 -595928 -454121
9860 -454121 -497692 -465823 -393162 -360177 -466625 -597457 -692383 -817368 -652072 -401305 -114748
9849 -114748 173089 258572 420232 483799 462621 457895 326231 297828 323813 363173 254681
9838 254681 47499 51183 163264 456237 506170 253427 -66219 -436425 -495895 -331619
9828 -331619 -230805 -301153 -195755 -125660 -104510 38063 14818 56348 333795 429480 284892
9817 284892 348806 512563 569037 658367 614878 523882 416333 261162 -72766 -308945 -124979
$$ packed form
9892b04603O2923N2195J25104m6389q2256K32422n6573k55013l40675M1403L69269
9881a02193K09439J053o2501m4476n4153m8598j26438r4267k06144m5106J38332
9870d35052J34508K55219K61561q0786l32870l11841j83455m7549J44337J41807
9860d54121m3571L1869P2661L2985j06448j30832r4926j24985J65296K50767K86557
9849a14748K87837Q5483J61660O3567k1178m726j31664k8403K5985L9360j08492
9838B54681k07182L684J12081K92973M9933k52743l19646l70206n9470J64276
9828c31619J00814p0348J05398P0095K1150J42573k3245M1530K77447R5685j44588
9817B84892O3914J63757N6474Q9330m3489r0996j07549j55171l33928k36179J83966
$$ plain form
9806 -124979 -16540 -23031 -59457 -13652 -147950 -283125 -219848 -225442 -224597 -89043 41316
9795 41316 75205 31114 105973 271511 270072 287737 201324 25731 -49448 86653 134969
9784 134969 47248 155858 317507 388401 203859 -34002 -296476 -585663 -674156 -428022
9774 -428022 -91678 511 16155 90517 110587 204528 122612 -114622 -300522 -385531 -308139
9763 -308139 -190852 -193316 -197358 -70328 -135227 -336279 -309712 -408845 -576149 -445380 -214330
9752 -214330 -63135 -65834 -161857 -229735 -344045 -493980 -384555 -173054 -27107 -9784 178503
9741 178503 411757 334223 303959 303915 287283 373181 230660 200673 270712 156414 72146 24334
9729 24334 210584 149699 130836 357739 354193 228800 195175 13113 -207675 -211286 -17005
$$ packed form
9806a24979J08439o491l6426M5805j34298j35175O3277n594Q45J35554J30359
9795D1316L3889m4091P4859J65538j439J7665q6413j75593p5179J36101M8316
9784A34969q7721J08610J61649P0894j84542k37861k62474k89187q8493K46134
9774d28022L36344R2189J5644P4362K0070R3941q1916k37234j85900q5009P7392
9763c08139J17287k464m042J27030o4899k01052K6567r9133j67304J30769K31050
9752b14330J51195k699r6023o7878j14310j49935J09425K11501J45947J7323J88287
9741A78503K33254p7534l0264m4j6632Q5898j42521k9987P0039j14298q4268m7812
9729B4334J86250o0885j8863K26903l546j25393l3625j82062k20788l611J94281
$$ plain form
9718 -17005 257364 545007 609067 292376 131130 74520 -56304 -273100 -318878 -230823 -26798
9707 -26798 144395 92559 2242 -143629 -163639 -84115 13737 175336 282821 73296 -159464
9696 -159464 -257355 -272599 -183575 -45176 -47829 -130083 -118027 -141919 -205965 -256909 -299115 -371406
9684 -371406 -467023 -468353 -524908 -673232 -632021 -514233 -430303 -114970 59322 31226 8824
9673 8824 6973 49892 302815 303923 -75893 -99751 181478 373179 273466 108981 -28390
9662 -28390 -213744 -348086 -367672 -400821 -440457 -523766 -460557 -228630 -115766 -209067 -316250
9651 -316250 -196950 115799 163848 -2368 -224462 -132297 81332 55082 -62120 -114155
9641 -114155 -342404 -488012 -310205 -277835 -331578 -380246 -566798 -455239 -357775 -360804 -256433
$$ packed form
9718a7005K74369K87643O4060l16691j61246n6610j30824k16796m5778Q8055K04025
9707b6798J71193n1836r0317j45871k0010P9524R7852J61599J07485k09525k32760
9696a59464r7891j5244Q9024J38399k653q2254J2056k3892o4046n0944m2206p2291
9684c71406r5617j330n6555j48324M1211J17788Q3930L15333J74292k8096k2402
9673H824j851M2919K52923J108l79816k3858K81229J91701r9713j64485j37371
9662b8390j85354j34342j9586l3149l9636q3309O3209K31927J12864r3301j07183
9651c16250J19300L12749M8049j66216k22094R2165K13629k6250j17202n2035
9641a14155k28249j45608J77807L2370n3743m8668j86552J11559R7464l029J04371
$$ plain form
9630 -256433 -62605 141145 51914 -154728 -367246 -446157 -250926 28137 134428 120061
9620 120061 -31674 -454272 -693404 -619467 -401154 -128873 97749 220047 369715 515891
9610 515891 647678 687704 582188 334966 64562 -8802 -175663 -304138 -289899 -258989
9600 -258989 -239229 -260961 -378007 -410757 -440504 -563799 -545296 -603747 -631176 -480763 -338033
9589 -338033 -108267 80678 9686 -217233 -393380 -350607 -274157 -209897 -104981 -182363 -450738
9578 -450738 -685317 -745260 -802154 -707077 -758553 -791434 -551990 -206150 114860 55910 8396
9567 8396 117615 57888 -52764 -154599 -414348 -537255 -444249 -320090 -160104 -15876
9557 -15876 -20233 -121625 -117084 -181025 -227700 -285530 -451798 -610316 -731932 -612767 -384583
$$ packed form
9630b56433J93828K03750q9231k06642k12518p8911J95231K79063J06291j4367
9620A20061j51735m22598k39132P3937K18313K72281K26622J22298J49668J46176
9610E15891J31787M0026j05516k47222k70404p3364j66861j28475J4239L0910
9600b58989J9760k1732j17046l2750k9747j23295J8503n8451k7429J50413J42730
9589c38033K29766J88945p0992k26919j76147M2773P6450O4260J04916p7382k68375
9578d50738k34579n9943n6894R5077n1476l2881K39444L45840L21010n8950m7514
9567H396J09219n9727j10652j01835k59749j22907R3006J24159J59986J44228
9557a5876m357j01392M541o3941m6675n7830j66268j58518j21616J19165K28184
$$ plain form
9546 -384583 -198490 -206159 -298385 -349357 -446257 -620964 -533531 -198005 -88072 -30303 108819
9535 108819 71945 -199560 -334014 -287701 -22777 246101 441679 400015 196247 222282
9525 222282 295332 288275 322237 248943 -2273 -142895 10033 162151 179631 81225 -12451
9514 -12451 73944 253132 273504 201538 37751 -182763 -242386 -113869 3555 -41614 44652
9503 44652 88395 -6573 -73814 63299 225657 297191 299638 214066 289881 357046 256163
9492 256163 237984 339268 230119 26193 122848 329062 235290 129795 90121 10653 -119861
9481 -119861 -106710 -121758 -84748 80585 88422 48654 62138 -146479 -533427 -668301 -671957
9470 -671957 -444974 -110155 147923 193914 138259 129305 73635 20399 -26246 -24694 208569
$$ packed form
9546c84583J86093p669r2226n0972r6900j74707Q7433L35526J09933N7769J39122
9535A08819l6874k71505j34454M6313K64924K68878J95578m1664k03768K6035
9525B22282P3050p057L3962p3294k51216j40622J52928J52118J7480r8406r3676
9514a2451Q6395J79188K0372p1966j63787k20514n9623J28517J17424m5169Q6266
9503D4652M3743r4968o7241J37113J62358P1534K447q5572P5815O7165j00883
9492B56163j8179J01284j09149k03926R6655K06214r3772j05495l9674p9468j30514
9481a19861J3151j5048L7010J65333P837l9768J3484k08617l86948j34874l656
9470f71957K26983L34819K58078M5991n5655q954n5670n3236m6645J552K33263
$$ plain form
9459 208569 352942 261065 301824 266420 61052 -91906 -268872 -429501 -397512 -352977 -388147
9448 -388147 -376181 -228201 -51447 201375 254737 28056 -94094 -57961 -84122 -192494
9438 -192494 -101390 3134 -32292 52542 329291 526455 456621 246481 -16464 -78671 -62394
9427 -62394 -230708 -489236 -493726 -301491 -285366 -245244 -16020 190909 389605 470493 361396
9416 361396 248690 248944 224388 -104984 -267142 -349339 -436244 -423331 -443145 -389081 -144003
9405 -144003 34561 54095 123730 104425 182171 146717 -187367 -532611 -592147 -521750 -399632
9394 -399632 -430495 -680322 -585422 -295741 -199477 -365504 -687190 -851946 -902561 -676924
9384 -676924 -330563 -133315 -9436 -109765 -270766 -168390 15747 183403 348324 276942
$$ packed form
9459B08569J44373r1877M0759l5404k05368j52958j76966j60629L1989M4535l5170
9448c88147J1966J47980J76754K52822N3362k26681j22150L6133k6161j08372
9438a92494R1104J04524l5426Q4834K76749J97164o9834k10140k62945o2207J6277
9427f2394j68314k58528m490J92235J6125M0122K29224K06929J98696Q0888j09097
9416C61396j12706K54k4556l29372j62158q2197q6905J2913j9814N4064K45078
9405a44003J78564J9534O9635j9305P7746l5454l34084l45244n9536P0397J22118
9394c99632l0863k49827R4900K89681R6264j66027l21686j64756n0615K25637
9384f76924L46361J97248J23879j00329j61001J02376J84137J67656J64921p1382
$$ plain form
9374 276942 31421 -93423 -206584 -212762 -177289 -197039 -114851 -65258 109447 294958 391048
9363 391048 496989 513706 354244 110954 -20845 -68212 -104409 -104618 -134342 -100846 -267836
9352 -267836 -425571 -425555 -444449 -511498 -428945 -371836 -379853 -298999 -314237 -401749 -444190 -471899
9340 -471899 -476019 -586305 -696804 -539091 -576622 -708677 -645270 -717502 -750798 -628254 -677323
9329 -677323 -656931 -449716 -364098 -339205 -314250 -274279 -238236 -49647 120842 86884 144641
9318 144641 -10290 -404207 -607123 -586040 -340986 -238850 -486262 -668614 -564802 -475517
9308 -475517 -142047 35772 29851 -110587 -416150 -354564 -146096 152784 379952 396988
9298 396988 239345 -101112 -300316 -370401 -284463 -95567 -43796 -145521 -262449 -306525
$$ packed form
9374B76942k45521j24844j13161o178L5473j9750Q2188M9593J74705J85511R6090
9363C91048J05941J6717j59462k43290j31799m7367l6197k09k9724L3496j66990
9352b67836j57735J6j8894o7049Q2553N7109q017Q0854j5238q7512m2441k7709
9340d71899m120j10286j10499J57713l7531j32055O3407p2232l3296J22544m9069
9329f77323K0392K07215Q5618K4893K4955L9971L6043J88589J70489l3958N7757
9318A44641j54931l93917k02916K1083K45054J02136k47412j82352J03812Q9285
9308d75517L33470J77819n921j40438l05563O1586K08468K98880K27168J7036
9298C96988j57643l40457j99204p0085Q5938J88896N1771j01725j16928m4076
$$ plain form
9288 -306525 -351726 -338812 -389356 -399648 -170760 -89515 -225707 -158849 -80730 16398 133749
9277 133749 69447 -125301 -156892 11808 105235 -164663 -319763 -262496 -246666 -293631 -233694
9266 -233694 -50717 -40633 -220321 -287828 -150028 -153964 -170769 -162390 -94205 -210735 -261144
9255 -261144 -102675 -59201 -42352 -141786 -313446 -321816 -149420 -163544 -157754 145075 415685
9244 415685 330861 132458 -75924 -109744 68429 247822 452820 472097 286478 161474
9234 161474 54236 -26014 -32270 -67397 -174284 -387578 -609811 -616451 -423742 -219881 -4516
9223 -4516 80900 91902 -48263 -102375 20935 96614 -53306 -255763 -172444 -74461 113637
9212 113637 353444 558035 666828 597296 308870 36377 -89091 -95047 36490 111220
$$ packed form
9288c06525m5201J2914n0544j0292K28888Q1245j36192O6858P8119R7128J17351
9277A33749o4302j94748l1591J68700R3427k69898j55100N7267J5830m6965N9937
9266b33694J82977J0084j79688o7507J37800l936j6805Q379O8185j16530n0409
9255b61144J58469M3474J6849r9434j71660q370J72396j4124N790L02829K70610
9244D15685q4824j98403k08382l3820J78173J79393K04998J9277j85619j25004
9234A61474j07238q0250o256l5127j06887k13294k22233o640J92709K03861K15365
9223d516Q5416J1002j40165n4112J23310P5679j49920k02457Q3319R7983J88098
9212A13637K39807K04591J08793o9532k88426k72493j25468n956J31537P4730
$$ plain form
9202 111220 274920 278260 -11402 -225676 -124427 55354 163789 46921 31339 186312
9192 186312 340660 434002 489621 623643 679398 603797 590227 634289 498225 264064 168588
9181 168588 182224 225563 282304 160980 129461 -32971 -300471 -502864 -671428 -559858
9171 -559858 -390419 -357223 -89857 70794 -32679 -251909 -363393 -279349 -81946 -53823
9161 -53823 -44164 -92673 -147115 21341 284323 583239 758258 651804 522705 427741 349556
9150 349556 200950 -66793 -350186 -436159 -419248 -242076 -25770 97609 141990 148851 155420
9139 155420 97299 -81567 -202080 -185558 -276084 -296365 -257957 -159974 -163770 -448973 -591162
9128 -591162 -387313 -207884 -119433 -13511 35990 -109560 -140757 -27204 114825 33795
$$ packed form
9202A11220J63700L340k89662k14274J01249J79781J08435j16868j5582J54973
9192A86312J54348R3342N5619J34022N5755p5601j3570M4062j36064k34161r5476
9181A68588J3636M3339N6741j21324l1519j62432k67500k02393j68564J11570
9171e59858J69439L3196K67366J60651j03473k19230j11484Q4044J97403K8123
9161e3823R659m8509n4442J68456K62982K98916J75019j06454j29099r4964p8185
9150C49556j48606k67743k83393q5973J6911J77172K16306J23379M4381O861O569
9139A55420n8121j78866j20513J6522r0526k0281L8408R7983l796k85203j42189
9128e91162K03849J79429Q8451J05922M9501j45550l1197J13553J42029q1030
$$ plain form
9118 33795 -83365 -185552 -419581 -663338 -636466 -428239 -360236 -582479 -707845 -518305
9108 -518305 -367649 -335156 -258412 -141276 137412 378812 289043 85393 -110878 -208111
9098 -208111 -128233 -133354 -145140 -112564 -211263 -291795 -337920 -376988 -332720 -126677 -154700 -193157
9086 -193157 77612 182041 275537 128711 -90993 -158605 -164640 15073 52114 141755 326158
9075 326158 353092 389362 424097 442143 539608 609519 498225 309237 192073 162108 189903
9064 189903 253318 153175 -124607 -274963 -71766 164217 296189 192462 29284 -76241
9054 -76241 -7449 186878 243752 151524 31367 -222435 -300129 -98260 177240 250425 309183
9043 309183 462153 543869 523659 373597 111949 -137646 -336171 -295209 -9259 320106
$$ packed form
9118C3795j17160j02187k34029k43757K6872K08227O8003k22243j25366J89540
9108e18305J50656L2493P6744J17136K78688K41400q9769k03650j96271r7233
9098b08111P9878n121j1786L2576r8699q0532m6125l9068M4268K06043k8023l8457
9086a93157K70769J04429R3496j46826k19704o7612o035J79713L7041Q9641J84403
9075C26158K6934L6270L4735J8046R7465O9911j11294j88988j17164k9965K7795
9064A89903O3415j00143k77782j50356K03197K35983J31972j03727j63178j05525
9054g6241O8792J94327N6874r2228j20157k53802p7694K01869K75500P3185N8758
9043C09183J52970Q1716k0210j50062k61648k49595j98525M0962K85950L29365
$$ plain form
9033 320106 535991 629791 681836 584969 560844 411755 82596 -77102 204768 526221
9023 526221 421176 160595 -75423 -248291 -483034 -425767 -219696 -114886 39570 30611
9013 30611 -3842 102039 121117 13201 -88221 -216658 -337381 -373008 -479849 -545365 -445674
9002 -445674 -334456 -227124 -249477 -326110 -221348 -146851 -59039 121601 10672 -192596
8992 -192596 -348216 -493771 -568162 -408289 -296127 -195343 -83278 1159 -31606 -249032
8982 -249032 -253830 -195721 -159501 82084 89458 -112373 -339874 -366924 -273471 -239679 -208004
8971 -208004 -298666 -286568 -235092 -381087 -612311 -473553 -18861 187069 276314 378264
8961 378264 132873 -283011 -377933 -198968 -9044 115396 122217 155516 294306 251294 128146
$$ packed form
9033C20106K15885R3800N2045r6867k4125j49089l29159j59698K81870L21453
9023E26221j05045k60581k36018j72868k34743N7267K06071J04810J54456q959
9013C0611l4453J05881J9078j07916j01422j28437j20723l5627j06841o5516R9691
9002d45674J11218J07332k2353p6633J04762P4497Q7812J80640j10929k03268
8992a92596j55620j45555p4391J59873J12162J00784J12065Q4437l2765k17426
8982b49032m798N8109L6220K41585P374k01831k27501k7050R3453L3792L1675
8971b08004r0662J2098N1476j45995k31224J38758M54692K05930Q9245J01950
8961C78264k45391m15884r4922J78965J89924J24440O821L3299J38790m3012j23148
$$ plain form
8950 128146 -22512 -98393 -124478 5661 76897 98641 54454 105960 315458 377491 120375
8939 120375 74423 134298 59846 154994 481895 603825 454772 226175 -7951 -209124
8929 -209124 -294653 -204800 -196330 -301311 -364640 -357852 -92290 8135 -28289 169276 424233
8918 424233 586126 531679 250989 -189779 -394420 -340470 -222525 -31440 101387 -71170
8908 -71170 -340479 -343177 16826 291895 228229 187210 183315 84799 114060 426636 658700
8897 658700 590586 293250 -12253 -177954 -406697 -404334 -297616 -284645 -222355 -21959 251774
8886 251774 380278 172807 123591 325603 309908 188251 177713 116406 22382 -73939 -118878
8875 -118878 -187735 -312942 -287325 -14926 118518 203304 170318 94016 173972 261576 267743
$$ packed form
8950A28146j50658p5881k6085J30139P1236K1744m4187N1506K09498O2033k57116
8939A20375m5952N9875p4452R5148L26901J21930j49053k28597k34126k01173
8929b09124q5529Q9853Q470j04981o3329O788K65562J00425l6424J97565K54957
8918D24233J61893n4447k80690m40768k04641N3950J17945J91085J32827j72557
8908g1170k69309k698L60003K75069o3666m1019l895r8516K9261L12576K32064
8897F58700o8114k97336l05503j65701k28743K363J06718J2971O2290K00396K73733
8886B51774J28504k07471m9216K02012j5695j21657j0538o1307r4024r6321m4939
8875a18878o8857j25207K5617K72399J33444Q4786l2986p6302P9956Q7604O167
$$ plain form
8864 267743 143310 93124 5783 -46439 -44510 -189017 -244297 -195893 -33136 -53869 -139874
8853 -139874 -109596 -175796 -19680 8491 -232359 -267262 -130866 -344050 -706004 -792149 -553106
8842 -553106 -253781 -116016 -51147 34885 129618 162082 11336 -276590 -370241 -307074 -245354
8831 -245354 -143861 -174921 -162532 -10362 91594 104515 9008 -161318 -173254 -111042 -59683
8820 -59683 13222 201720 287700 151860 -57226 -66117 91855 171486 44744 -196975 -360953
8809 -360953 -401686 -199208 21451 -6444 -208025 -255408 -137945 -49139 -80317 -69472 -8978
8798 -8978 -11298 105829 106014 -76251 59279 208469 273487 400521 468076 385805 401647 310986
8786 310986 24417 -86468 -58632 -72177 -4575 38499 88459 226999 328196 153443 -125177
$$ packed form
8864B67743j24433n0186q7341n2222J929j44507n5280M8404J62757k0733q6005
8853a39874L0278o6200J56116K8171k40850l4903J36396k13184l61954q6145K39043
8842e53106K99325J37765O4869Q6032R4733L2464j50746k87926r3651O3167O1720
8831b45354J01493l1060J2389J52170J01956J2921r5507j70326j1936O2212N1359
8820e9683P2905J88498Q5980j35840k09086q891J57972P9631j26742k41719j63978
8809c60953m0733K02478K20659k7895k01581m7383J17463Q8806l1178J0845O0494
8798h978k320J17127J85j82265J35530J49190O5018J27034O7555q2271J5842r0661
8786C10986k86569j10885K7836j3545O7602M3074M9960J38540J01197j74753k78620
$$ plain form
8775 -125177 -217428 -169865 -150811 -286449 -498171 -534815 -512847 -635165 -702024 -672830 -398201
8764 -398201 -132272 -144303 -73000 152535 323350 307945 312323 426949 437957 257984 -3558
8753 -3558 -106205 -239518 -334177 -280661 -104865 61619 295390 483705 547845 505958 325507
8742 325507 32675 71043 135857 86826 -10422 -151315 -204475 -115522 44001 223533 302207
8731 302207 144516 -701 -31909 236635 333694 135644 -65115 -217609 -408709 -301333
8721 -301333 56615 175756 224868 280730 447994 682692 726807 649771 399333 82290
8711 82290 -28589 120984 116327 -17944 -61203 -145989 -326601 -286857 -333310 -422234 -195402
8700 -195402 148434 272589 198515 176969 126085 -33517 -102611 -48330 -23265 -121286 -337985
$$ packed form
8775a25177r2251M7563J9054j35638k11722l6644K1968j22318o6859K9194K74629
8764c98201K65929j2031P1303K25535J70815j5405M378J14626J1008j79973k61542
8753c558j02647j33313r4659N3516J75796J66484K33771J88315O4140m1887j80451
8742C25507k92832L8368O4814m9031r7248j40893n3160Q8953J59523J79532P8674
8731C02207j57691j45217l1208K68544R7059j98050k00759j52494j91100J07376
8721c01333L57948J19141M9112N5862J67264K34698M4115p7036k50438l17043
8711H2290j10879J49573m657j34271m3259q4786j80612L9744m6453q8924K26832
8700a95402L43836J24155p4074k1546n0884j59602o9094N4281K5065r8021k16699
$$ plain form
8689 -337985 -324506 -85528 -105327 -14173 370607 474344 373690 186437 72408 -5225
8679 -5225 -96345 -116365 11913 97209 -37424 -298281 -418383 -397996 -381748 -265186 -160950
8668 -160950 -180581 -137863 -126746 -228457 -502764 -667736 -746233 -786751 -685301 -479033 -313969
8657 -313969 -293938 -330802 -404704 -390827 -329926 -218882 -96105 6251 71580 128476 90056
8646 90056 82120 49954 148901 226818 347940 517818 450890 577660 635225 444471 316164
8635 316164 133523 -156756 -251790 -69442 173250 162224 104692 100956 288112 563861 529470
8624 529470 361253 206047 148004 132028 103388 -76186 -160173 -188264 -108074 -46808 -152830
8613 -152830 -225395 -57919 -82506 -304500 -381785 -199818 143404 331246 252623 108382
$$ packed form
8689c37985J3479K38978j9799R1154L84780J03737j00654j87253j14029p7633
8679e225r1120k0020J28278Q5296j34633k60857j20102K0387J6248J16562J04236
8668a60950j9631M2718J1117j01711k74307j64972p8497m0518J01450K06268J65064
8657c13969K0031l6864p3902J3877O0901J11044J22777J02356O5329N6896l8420
8646I0056p936l2166R8947P7917J21122J69878o6928J26770N7565j90754j28307
8635C16164j82641k90279r5034J82348K42692j1026n7532l736J87156K75749l4391
8624E29470j68217j55206n8043j5976k8640j79574q3987k8091Q0190O1266j06022
8613a52830p2565J67476k4587k21994p7285J81967L43222J87842p8623j44241
$$ plain form
8603 108382 164250 186024 57949 121109 191893 121034 29462 -74700 -78599 -21687 147704
8592 147704 275100 178910 -141464 -243422 -170078 -233067 -265347 -453518 -492083 -238199 -123635
8581 -123635 -115111 -141955 -274428 -283061 -18805 246839 427006 420151 253756 397219 459681
8570 459681 367681 233531 37232 57665 110795 13779 -28130 92536 212786 193090 242748
8559 242748 163178 77400 74888 -8211 36805 227560 305347 459298 702880 794583 696254
8548 696254 410223 466778 605294 634505 450377 195522 243083 557344 763664 691680
8538 691680 455111 289155 259794 103205 -107273 -28125 34451 119221 73600 -38167 124613
8527 124613 446160 676216 580575 401247 272860 300150 475067 641113 556161 274908
$$ packed form
8603A08382N5868K1774j28075O3160P0784p0859r1572j04162l899N6912J69391
8592A47704J27396r6190l20374j01958P3344o2989l2280j88171l8565K53884J14564
8581a23635Q524k6844j32473q633K64256K65644J80167o855j66395J43463O2462
8570D59681r2000j34150j96299K0433N3130r7016m1909J20666J20250j9696M9658
8559B42748p9570q5778k512q3099M5016J90755P7787J53951K43582R1703r8329
8548F96254k86031N6555J38516K9211j84128k54855M7561L14261K06320p1984
8538F91680k36569j65956k9361j56589k10478P9148O2576Q4770m5621j11767J62780
8527A24613L21547K30056r5641j79328j28387K7290J74917J66046q4952k81253
$$ plain form
8517 274908 152958 84509 -94459 -157892 -38739 89403 118537 184157 255883 159600 -94993
8506 -94993 -367163 -426039 -343620 -137893 279288 612132 661176 485593 338971 369187 256381
8495 256381 -26476 -125052 14255 119741 329854 433512 483339 556806 613622 504826
8485 504826 294279 31396 -216402 -312428 -293620 -102218 42503 72380 61581 8704 112909
8474 112909 130605 -9763 -83874 -45691 146862 247085 255639 326579 521775 668703 730515
8463 730515 587781 191885 -61892 -246893 -260873 -131677 -5010 42750 72744 89530
8453 89530 202580 339414 150536 -98611 -168947 -59987 336858 526677 263755 85867
8443 85867 -13990 -157561 -143339 12411 -72112 -193507 34492 287650 221585 57352 -116369
$$ packed form
8517B74908j21950o8449j78968o3433J19153J28142K9134O5620P1726r6283k54593
8506i4993k72170n8876Q2419K05727M17181L32844M9044j75583j46622L0216j12806
8495B56381k82857r8576J39307J05486K10113J03658M9827P3467N6816j08796
8485E04826k10547k62883k47798r6026J8808J91402J44721K9877j0799n2877J04205
8474A12909J7696j40368p4111L8183J92553J00223Q554P0940J95196J46928O1812
8463G30515j42734l95896k53777j85001j3980J29196J26667M7760K9994J6786
8453H9530J13050J36834j88878k49147p0336J08960L96845J89819k62922j77888
8443H5867r9857j43571J4222J55750q4523j21395K27999K53158o6065j64233j73721
$$ plain form
8432 -116369 -234254 -129634 159352 443695 461686 479174 555493 445854 273796 367601
8422 367601 491055 475158 462698 342308 356551 526044 542751 387726 222800 327021
8412 327021 595876 700902 592401 483485 462959 551533 602642 622273 755168 724007 582013
8401 582013 490202 459916 540451 612624 409005 273311 97785 -8480 136194 311458
8391 311458 309908 238703 309836 410424 433918 593108 837840 853460 714687 537938 386756
8380 386756 357417 464556 612501 740053 890267 894099 812781 867517 953638 897868 822962
8369 822962 841586 986561 928588 776082 773196 739163 385156 306952 575727 719547 751369
8358 751369 698897 770300 886771 822965 681680 435341 393871 485586 620017 752351 846174
$$ packed form
8432a16369j17885J04620K88986K84343J7991J7488P6319j09639j72058R3805
8422C67601J23454j5897j2460j20390J4243J69493J6707j55025j64926J04221
8412C27021K68855J05026j08501j08916k0526Q8574N1109J9631J32895l1161j41994
8401E82013r1811l0286Q0535P2173k03619j35694j75526j06265J44674J75264
8391C11458j550p1205P1133J00588K3494J59190K44732J5620j38773j76749j51182
8380C86756k9339J07139J47945J27552J50214L832q1318N4736Q6121n5770p4906
8369H22962J8624J44975n7973j52506k886l4033l54007p8204K68775J43820L1822
8358G51369n2472P1403J16471o3806j41285k46339m1470R1715J34431J32334R3823
$$ plain form
8347 846174 900082 815432 749944 684249 599202 560214 429741 359512 603019 738278 603936
8336 603936 563590 718048 769258 664703 778282 714987 392861 323524 417224 481156 385474
8325 385474 499740 839557 1119439 1191713 1115745 1005080 696721 557705 897683 1057006
8315 1057006 970900 841591 825783 793127 849284 959858 1042610 1072552 1131548 1021970 981958
8304 981958 1094195 1211271 1158406 883798 624153 501346 599553 926301 1079204 891203
8294 891203 598388 443038 453335 528107 883385 1156297 1179677 1164343 1124835 1288118 1588911
8283 1588911 1684574 1498199 1372529 1231265 970687 847036 835369 969419 1068666 878351
8273 878351 735278 724847 804926 893621 838563 571206 518622 713104 932223 909197 842555
$$ packed form
8347H46174N3908q4650o5488o5695q5047l8988j30473p0229K43507J35259j34342
8336F03936m0346J54458N1210j04555J13579o3295l22126o9337R3700O3932r5682
8325C85474J14266L39817K79882P2274p5968j10665l08359j39016L39978J59323
8315A057006q6106j29309j5808l2656N6157J10574Q2752K9942N8996j09578m0012
8304I81958J12237J17076n2865k74608k59645j22807R8207L26748J52903j88001
8294H91203k92815j55350J0297P4772L55278K72912K3380j5334l9508J63283L00793
8283A588911R5663j86375j25670j41264k60578j23651j1667J34050R9247j90315
8273H78351j43073j0431Q0079Q8695n5058k67357n2584J94482K19119k3026o6642
$$ plain form
8262 842555 812114 708832 605064 690234 760101 591923 502460 636447 624029 494283 584613
8251 584613 679389 617875 728881 1031370 1047963 660574 364199 319778 346512 367654 385460
8240 385460 580668 946596 1169161 1234449 1372244 1457803 1358124 1102885 747067 588843
8230 588843 805072 1021817 1225268 1376862 1431491 1408007 1234940 1020575 1081319 1029295
8220 1029295 990524 1124043 1221891 1209788 1005573 970122 1137588 1212828 1167968 1107766 1409739
8209 1409739 1561255 1519565 1506646 1333775 1141470 1057133 1106505 1181034 1303105 1494096
8199 1494096 1491525 1301571 1205722 1203160 1249202 1277289 1241759 1334893 1371022 1176499 914051
8188 914051 834695 1060632 1075139 942192 979312 1134722 1214093 1216369 1285052 1259481 1270850
$$ packed form
8262H42555l0441j03282j03768Q5170O9867j68178q9463J33987j2418j29746R0330
8251E84613R4776o1514J11006L02489J6593l87389k96375m4421K6734K1142J7806
8240C85460J95208L65928K22565O5288J37795Q5559r9679k55239l55818j58224
8230E88843K16229K16745K03451J51594N4629k3484j73067k14365O0744n2024
8220A029295l8771J33519R7848j2103k04215l5451J67466P5240m4860o0202L01973
8209A409739J51516m1690j2919j72871j92305q4337M9372P4529J22071J90991
8199A494096k571j89954r5849k562M6042K8087l5530R3134L6129j94523k62448
8188I14051p9356K25937J4507j32947L7120J55410P9371K276O8683k5571J1369
$$ plain form
8177 1270850 1403953 1615710 1768728 1754546 1515368 1161888 870608 880036 965277 889718
8167 889718 921701 1148292 1354800 1484208 1567670 1788734 1813577 1689564 1542845 1430516
8157 1430516 1351656 1186468 1185059 1432668 1701460 1734097 1580165 1275038 1144374 1381927
8147 1381927 1398144 1357823 1381278 1482569 1754619 1954783 1951983 1823997 1671976 1452475
8137 1452475 1270785 1202881 1174869 1145985 1281705 1356823 1340136 1401311 1454157 1434578 1295445
8126 1295445 1333148 1466705 1455632 1322457 1357574 1461015 1506653 1422321 1343421 1476954 1671224
8115 1671224 1454764 1258958 1257055 1305808 1479580 1382957 1181643 1223388 1403889 1340154 1216447
8104 1216447 1308106 1377828 1413479 1405273 1354603 1335872 1326948 1342626 1396683 1396505 1493310 1357972
$$ packed form
8177A270850J33103K11757J53018j4182k39178l53480k91280R428Q5241p5559
8167H89718L1983K26591K06508J29408Q3462K21064K4843j24013j46719j12329
8157A430516p8860j65188j409K47609K68792L2637j53932l05127j30664K37553
8147A381927J6217m0321K3455J01291K72050K00164k800j27986j52021k19501
8137A452475j81690o7904k8012k8884J35720P5118j6687O1175N2846j9579j39133
8126A295445L7703J33557j1073j33175L5117J03441M5638q4332p8900J33533J94270
8115A671224k16460j95806j903M8753J73772r6623k01314M1745J80501o3735j23707
8104A216447R1659O9722L5651q206n0670j8731q924J5678N4057j78R6805j35338
$$ plain form
8092 1357972 1137624 1295055 1503827 1556606 1741200 2080014 2112431 1946849 1895636 2055636
8082 2055636 2195432 2208008 2027075 1855578 1657115 1458440 1574449 1681345 1822021 2049494
8072 2049494 2080690 1955356 1962763 2088090 2103032 2039136 1849073 1787666 1860653 1948975 1962887
8061 1962887 1881179 2085958 2308995 2359505 2283848 2052415 2116373 2181231 2191397 2294601 2352125
8050 2352125 2351147 2279704 2043260 2002709 2130577 2207314 2226128 2238067 2213890 2375841 2651366
8039 2651366 2641673 2384937 2300454 2469781 2564754 2289526 2084496 2308300 2729939 3004392
8029 3004392 3188265 3371992 3576430 3731598 3564794 3256566 3199079 3231726 3268866 3406843
8019 3406843 3560420 3684355 3821551 3841840 3911838 4084713 4213709 4361219 4590905 4916843
$$ packed form
8092A357972k20348J57431K08772N2779J84594L38814L2417j65582n1213J60000
8082B055636J39796J2576j80933j71497j98463j98675J16009J06896J40676K27473
8072B049494L1196j25334P407J25327J4942o3896j90063o1407P2987Q8322J3912
8061A962887q1708K04779K23037N0510p5657k31433O3958O4858J0166J03204N7524
8050B352125r78p1443k36444m0551J27868P6737J8814J1939k4177J61951K75525
8039B651366r693k56736q4483J69327R4973k75228k05030K23804M21639K74453
8029C004392J83873J83727K04438J55168j66804l08228n7487L2647L7140J37977
8019C406843J53577J23935J37196K0289O9998J72875J28996J47510K29686L25938
$$ plain form
8009 4916843 5259375 5601744 5938939 6175228 6504649 7078979 7873929 8883878 10035195
8000 10035195 11420999 13103230 15262778 18122682 21647785 25947925 31355151 37302068
7992 37302068 43050512 47864552 50803636 51448206 49991488 46732524 42203451 37290526
7984 37290526 32453461 28124194 24484703 21425089 19037588 17212111 15934597 15047651
7976 15047651 14401735 13881314 13450303 13172953 13181266 13372727 13593305 13686878 13655042 13551745
7966 13551745 13181825 12695546 12119050 11571702 11156641 10992325 10994415 10993583 10874901 10881314 11180933
7955 11180933 11453394 11693069 12054028 12639210 13303389 14300133 15530603 16761256 18373611
7946 18373611 20367219 22806694 25808912 29493554 33969379 40304896 49183300 60518256
$$ packed form
8009D916843L42532L42369L37195K36289L29421N74330P94950J009949J151317
8000A0035195J385804J682231K159548K859904L525103M300140N407226N946917
7992C7302068N748444M814040K939084O44570j456718l258964m529073m912925
7984C7290526m837065m329267l639491l059614k387501j825477j277514q86946
7976A5047651o45916n20421m31011k77350Q313J91461K20578R3573l1836j03297
7966A3551745l69920m86279n76496n47348m15061j64316K090q32j18682O413K99619
7955A1180933K72461K39675L60959N85182O64179R96744J230470J230653J612355
7946A8373611J993608K439475L002218L684642M475825O335517Q878404J1334956
$$ plain form
7938 60518256 74476448 90826279 108947607 126958386 142211263 152013825 154573216
7931 154573216 149737489 138862069 124089280 107837031 92117142 78325055 66850155
7924 66850155 57793296 50695534 45042006 40804628 37296510 34225036 31867249 30294134
7916 30294134 29342086 28691287 28445863 28582990 28640788 28444550 27968604 27102333 25825433
7907 25825433 24482397 23157185 21906628 21246967 20905493 20506356 20262020 20237689 20428623
7898 20428623 20797978 21403414 22347936 23626972 24874849 26257559 28060783 30535548 33515322
7889 33515322 37112299 41699538 47605246 55386365 65513267 78757199 96097299 118374319
7881 118374319 146223595 179083852 215052362 250476913 280258660 299468150 304311626
$$ packed form
7938F0518256J3958192J6349831J8121328J8010779J5252877R802562K559391
7931A54573216m835727j0875420j4772789j6252249j5719889j3792087j1474900
7924F6850155r056859p097762n653528m237378l508118l071474k357787j573115
7916C0294134r52048o50799k45424J37127N7798j96238m75946q66271j276900
7907B5825433j343036j325212j250557o59661l41474l99137k44336k4331J90934
7898B0428623L69355O05436R44522J279036J247877J382710J803224K474765K979774
7889C3515322L596977M587239N905708P781119J0126902J3243932J7340100K2277020
7881A18374319K7849276L2860257L5968510L5424551K9781747J9209490M843476
$$ plain form
7874 304311626 294043259 271396955 241217117 208639704 177488800 150012514 127287511
7867 127287511 108969101 94152033 82333299 73202516 66154526 60521425 55875625 52000172
7859 52000172 49188267 47564009 46567443 45721593 45047864 44253635 42897199 40914689 38381630
7850 38381630 35767340 33272120 31107799 29511788 28437326 27696110 27040431 26570918 26437181
7841 26437181 26759317 27242948 27718593 28488485 29772929 31716773 33951477 36761670 40182244
7832 40182244 44425964 49837160 56750683 65692589 77406432 92895234 113134742 139184007
7824 139184007 171785782 210546163 253137114 295205353 330256956 352178601 357158919
7817 357158919 344565689 317454136 281233815 241877135 204443450 171818473 144864728
$$ packed form
7874C04311626j0268367k2646304l0179838l2577413l1150904k7476286k2725003
7867A27287511j8318410j4817068j1818734r130783p047990n633101m645800l875453
7859E2000172k811905j624258r96566q45850o73729p94229j356436j982510k533059
7850C8381630k614290k495220k164321j596011j074462p41216o55679m69513j33737
7841B6437181L22136M83631M75645P69892J284444J943844K234704K810193L420574
7832D0182244M243720N411196O913523Q941906J1713843J5488802K0239508K6049265
7824A39184007L2601775L8760381M2590951M2068239L5051603K1921645M980318
7817C57158919j2593230k7111553l6220321l9356680l7433685l2624977k6953745
$$ plain form
7810 144864728 123286750 106149021 92443338 81682280 72938345 65605107 59521804
7803 59521804 54570818 50708303 47841843 45579094 43709634 42089888 40546725 38771203
7795 38771203 36815496 34907700 32649402 30362723 28592572 27052562 25856888 25214983
7787 25214983 24912182 24803784 24535855 24630973 24951604 25246245 26005521 27328343 28895215
7778 28895215 30589260 32707210 35628602 39375579 44056525 49957789 57663193 67942543
7770 67942543 81256345 98529745 120933947 148516329 180993514 216675570 251565290
7763 251565290 280450759 298522468 302390257 291514491 268304870 237442520 204146427
7756 204146427 172126880 144076541 120939339 102448567 87810139 76204216 66626077
$$ packed form
7810A44864728k1577978j7137729j3705683j0761058q743935p333238o083303
7803E9521804m950986l862515k866460k262749j869460j619746j543163j775522
7795C8771203j955707j907796k258298k286679j770151j540010j195674o41905
7787B5214983l02801j08398k67929R5118L20631K94641P59276J322822J566872
7778B8895215J694045K117950K921392L746977M680946N901264P705404J0279350
7770F7942543J3313802J7273400K2404202K7582382L2477185L5682056L4889720
7763B51565290K8885469J8071709L867789j0875766k3209621l0862350l3296093
7756B04146427l2019547k8050339k3137202j8490772j4638428j1605923r578139
$$ plain form
7749 66626077 58742533 52647851 47741897 43396573 39702801 36639941 34147201 31979016
7741 31979016 30037291 28216774 26412985 24670082 22910131 21439289 20068564 18888797
7733 18888797 18060415 17341378 16721628 16165861 15756534 15525401 15359969 15434706 15630044 16002440
7723 16002440 16440138 17081260 18101470 19255134 20351439 21863779 24113676 26990512
7715 26990512 30857815 35993023 42556770 51099790 62076498 75786098 91984990 109673881
7707 109673881 126918721 141045623 149900128 151826421 146299076 134346516 118556755
7700 118556755 101773771 85752534 71594771 59816405 50465413 43191192 37387990
7693 37387990 32614451 28740866 25603028 22659922 20027593 17915546 16144849 14765925
$$ packed form
7749F6626077p883544o094682m905954m345324l693772l062860k492740k168185
7741C1979016j941725j820517j803789j742903j759951j470842j370725j179767
7733A8888797q28382p19037o19750n55767m09327k31133j65432P4737J95338L72396
7723A6002440M37698O41122J020210J153664J096305J512340K249897K876836
7715B6990512L867303N135208O563747Q543020J0976708J3709600J6198892J7688891
7707A09673881J7244840J4126902Q854505J926293n527345j1952560j5789761
7700A18556755j6782984j6021237j4157763j1778366r350992p274221n803202
7693C7387990m773539l873585l137838k943106k632329k112047j770697j378924
$$ plain form
7685 14765925 13662281 12368506 11255051 10548529 9872571 9134209 8483914 8079530 7623794
7676 7623794 7208201 6958510 6681230 6539595 6580805 6596649 6404066 6197978 6065133 6145208
7666 6145208 6279278 6405956 6680051 7224630 7636659 7928144 8366528 9052870 10386195
7657 10386195 12484763 15025620 18078473 21733414 26176933 31383550 36717935 41895893
7649 41895893 46183829 48737235 49185940 47275633 43562936 38833315 33574406 28532478
7641 28532478 24035611 20233404 17068332 14507363 12459408 10654637 9148270 7934439
7633 7934439 7082869 6363172 5778823 5368883 5053243 4659443 4013748 3412775 3132333 2938622
7623 2938622 2635622 2250912 1958609 1730135 1649966 1693781 1677114 1605816 1629194 1544278 1288154
$$ packed form
7685A4765925j103644j293775j113455p06522o75958p38362o50295m04384m55736
7676G623794m15593k49691k77280j41635M1210J5844j92583k06088j32845Q0075
7666F145208J34070J26678K74095N44579M12029K91485M38384O86342J333325
7657A0386195K098568K540857L052853L654941M443519N206617N334385N177958
7649D1895893M287936K553406M48705j910307l712697m729621n258909n041928
7641B8532478m496867l802207l165072k560969k047955j804771j506367j213831
7633G934439q51570p19697n84349m09940l15640l93800o45695o00973k80442j93711
7623B938622l03000l84710k92303k28474q0169M3815j6667p1298K3378q4916k56124
$$ plain form
7612 1288154 994154 793545 766315 797055 640910 349574 514305 886078 1028008 985050
7602 985050 932636 867677 822101 782606 874476 1080177 1080031 1019850 892171 681615 727653
7591 727653 937114 951084 927230 897907 799193 647986 576605 816321 858785 779784 715587
7580 715587 674597 681342 767597 661137 574190 465300 342688 363928 406872 424681 485442
7569 485442 400444 263141 308278 251883 408369 770533 857192 716882 488858 461592 433921
7558 433921 167753 -35356 -2895 18613 -46897 77791 201373 289438 430107 592229
7548 592229 788865 895609 812174 371175 104317 110430 330130 528391 658408 604792
7538 604792 531149 574013 579233 504932 451358 406288 359195 196748 115087 97806 54535 229800
$$ packed form
7612A288154k94000k00609k7230L0740j56145k91336J64731L71773J41930m2958
7602I85050n2414o4959m5576l9495R1870K05701j46o0181j27679k10556M6038
7591G27653K09461J3970k3854k9323r8714j51207p1381K39716M2464p9001o4197
7580G15587m0990O745Q6255j06460q6947j08890j22612K1240M2944J7809O0761
7569D85442q4998j37303M5137n6395J56486L62164Q6659j40310k28024k7266k7671
7558D33921k66168k03109L2461K1508o5510J24688J23582Q8065J40669J62122
7548E92229J96636J06744q3435m40999k66858O113K19700J98261J30017n3616
7538F04792p3643M2864N220p4301n3574m5070m7093j62447q1661j7281m3271J75265
$$ plain form
7526 229800 257806 246751 425245 621481 825276 785364 700324 471276 198643 8645
7516 8645 -35299 56534 242170 460222 366317 150856 -27567 -130104 -226355 -97970 -34852
7505 -34852 -311754 -641188 -680401 -661835 -598645 -504240 -371016 -316361 -214110 49613 330812
7494 330812 457011 301783 -6910 -212678 -198744 -196644 -2073 395589 481191 303789
7484 303789 190498 203784 248195 502912 578297 352792 193432 275398 234246 161828 236407
7473 236407 459019 546206 456338 426536 330121 93464 -104324 -113886 -109998 -38072 -42516 -226680
7461 -226680 -288577 -181236 20382 349280 477923 506469 583719 597168 358760 191761
7451 191761 137826 11090 -97424 -150062 -167907 -159161 121857 289131 194817 130274 187275
$$ packed form
7526B29800K8006j1055J78494J96236K03795l9912q5040k29048k72633j89998
7516H645m3944R1833J85636K18052r3905k15461j78423j02537r6251J28385O3118
7505c4852k76902l29434l9213J8566O3190R4405J33224N4655J02251K63723K81199
7494C30812J26199j55228l08693k05768J3934K100J94571L97662Q5602j77402
7484C03789j13291J3286M4411K54717P5385k25505j59360Q1966m1152p2418P4579
7473B36407K22612Q7187q9868k9802r6415k36657j97788r562L888P1926m444j84164
7461b26680o1897J07341K01618L28898J28643K8546P7250J3449k38408j66999
7451A91761n3935j26736j08514n2638j7845Q746K81018J67274r4314o4543N7001
$$ plain form
7440 187275 255691 236645 313846 377802 290237 96889 -79942 -138208 -128675 29933 218831
7429 218831 346944 380193 464428 544851 408049 293434 126215 -77096 -23125 96567
7419 96567 242083 241806 217412 92888 -94143 -80146 -54651 24925 23357 43751 33067 305867
7407 305867 506083 504500 431060 187849 203419 382855 418053 381101 378250 358448 68427
7396 68427 -80302 -9250 -75429 92773 382361 474276 404572 402059 442479 479573 393792
7385 393792 160246 -144856 -325634 -381520 -363678 -174501 -172083 -290078 -299743 -342791 -284499
7374 -284499 -356716 -534742 -450832 -394022 -359336 -446090 -387291 -170647 -132984 -122325 -40275
7363 -40275 322704 550059 438313 36602 -278464 -396349 -457931 -360376 -263212 -198485 -32470
$$ packed form
7440A87275O8416j9046P7201O3956q7565j93348j76831n8266R533J58608J88898
7429B18831J28113L3249Q4235Q0423j36802j14615j67219k03311N3971J19692
7419I6567J45516k77k4394j24524j87031J3997K5495P9576j568K0394j0684K72800
7407C05867K00216j583p3440k43211J5570J79436L5198l6952k851j9802k90021
7396F8427j48729P1052o6179J68202K89588R1915o9704k513M0420L7094q5781
7385C93792k33546l05102j80778n5886J7842J89177K418j17995r665m3048N8292
7374b84499p2217j78026Q3910N6810L4686q6754N8799K16644L7663J0659Q2050
7363d0275L62979K27355j11746m01711l15066j17885o1582R7555R7164O4727J66015
$$ plain form
7352 -32470 63540 89311 -44868 -198489 -153763 -200015 -322676 -325505 -167941 65675 105521
7341 105521 29755 18010 -25345 -200876 -74406 87266 -4716 -39768 82812 257900 302790
7330 302790 452037 682264 697343 689292 546154 201969 -48435 -83359 78711 234731
7320 234731 177207 74092 110357 147110 17732 -67311 -115814 -71461 104512 212367 107202
7309 107202 -117605 -313265 -339165 -250526 -212861 -80474 37629 -36531 -285700 -572054
7299 -572054 -592233 -599900 -519685 -178538 10453 -42822 -146248 -259401 -142835 -105608 -331053
7288 -331053 -233953 34633 85993 20929 159021 574008 674403 555877 381591 180019
7278 180019 -66209 -154315 -173061 -284705 -395330 -486662 -355375 -9926 224840 214105
$$ packed form
7352c2470R6010K5771j34179j53621M4726m6252j22661k829J57564K33616L9846
7341A05521p5766j1745m3355j75531J26470J61672r1982l5052J22580J75088M4890
7330C02790J49247K30227J5079q051j43138l44185k50404l4924J62070J56020
7320B34731n7524j03115L6265L6753j29378q5043m8503M4353J75973J07855j05165
7309A07202k24807j95660k5900Q8639L7665J32387J18103p4160k49169k86354
7299e72054k0179p667Q0215L41147J88991n3275j03426j13153J16566L7227k25445
7288c31053R7100K68586N1360o5064J38092M14987J00395j18526j74286k01572
7278A80019k46228q8106j8746j11644j10625r1332J31287L45449K34766j0735
$$ plain form
7268 214105 333654 469433 486841 307784 9239 -152300 -183341 -342766 -282582 -29876
7258 -29876 289253 449736 264413 114418 170377 95991 -129124 -165182 -170953 27030 94597
7247 94597 40365 223588 221218 206461 250150 278245 443207 557830 628531 573381 479137
7236 479137 351533 264845 269652 233017 116580 165416 331691 546004 710712 756402 622734
7225 622734 469112 350395 11491 -323804 -354280 -328963 -351608 -279604 -99070 135780
7215 135780 95988 -82302 -75237 97529 11805 -73574 -4883 182510 247641 257003 324371
7204 324371 354681 330230 165145 8693 -78505 -187223 -277275 -249605 -200344 -70654 154949
7193 154949 87558 -43590 56213 68243 59454 178599 398307 531740 543948 604174 670760
$$ packed form
7268B14105J19549J35779J7408j79057k98545j61539l1041j59425O0184K52706
7258b9876L19129J60483j85323j49995N5959p4386k25115l6058n771J97983O7567
7247I4597n4232J83223k370j4757M3689K8095J64962J14623P0701n5150r4244
7236D79137j27604q6688M807l6635j16437M8836J66275K14313J64708M5690j33668
7225F22734j53622j18717l38904l35295l0476K5317k2645P2004J80534K34850
7215A35780l9792j78290P065J72766q5724q5379O8691J87393O5131R362O7368
7204C24371L0310k4451j65085j56452q7198j08718r0052K7670M9261J29690K25603
7193A54949o7391j31148R9803J2030q789J19145K19708J33433J2208O0226O6586
$$ plain form
7182 670760 759266 900662 1047497 920869 693764 553355 407460 282985 133611 -55867
7172 -55867 -76383 103004 165534 63271 47587 -14684 -70022 -131920 -184083 -173457 110003
7161 110003 302159 318170 309055 333154 381540 327669 233906 310992 246745 43258 -50123
7150 -50123 -185184 -107629 101720 220381 102392 63230 145658 184306 249204 -27754 -271383
7139 -271383 -243592 -162055 21964 156191 85894 -20837 -55614 -98939 -207034 -94037 48235
7128 48235 -36214 -101312 51715 78344 -5815 -294248 -348659 -113156 146225 282084 405767
7117 405767 304456 82023 -117707 -83795 158369 287349 173919 -107692 -198030 -189220
7107 -189220 -54080 -84778 -312277 -284544 -82505 15913 180629 218441 247157 358704 386710
$$ packed form
7182F70760Q8506J41396J46835j26628k27105j40409j45895j24475j49374j89478
7172e5867k0516J79387O2530j02263j5684o2271n5338o1898n2163J0626K83460
7161A10003J92156J6011r115K4099M8386n3871r3763P7086o4247k03487r3381
7150e0123j35061P7555K09349J18661j17989l9162Q2428L8648O4898k76958k43629
7139b71383K7791Q1537J84019J34227p0297j06731l4777m3325j08095J12997J42272
7128D8235q4449o5098J53027K6629q4159k88433n4411K35503K59381J35859J23683
7117D05767j01311k22433j99730L3912K42164J28980j13430k81611r0338Q810
7107a89220J35140l0698k27499K7733K02039R8418J64716L7812K8716J11547K8006
$$ plain form
7096 386710 36789 -351883 -544177 -542239 -284721 -192832 -198369 -154514 136894 220570 107248
7085 107248 253875 384283 303876 225502 163389 -59245 -182921 -189058 15296 227797 228634
7074 228634 143793 235821 297942 474031 531654 533188 542692 370692 53582 -271476 -414880
7063 -414880 -450575 -260578 -142872 1964 328122 265667 100443 35866 -9828 59098 138955
7052 138955 141160 95226 17160 -37522 111852 312784 338473 323473 432225 392732 295456
7041 295456 205628 193748 121493 62595 26323 -21479 -2601 -161550 -365287 -403552 -227663
7030 -227663 -40984 90721 -43853 -435981 -684288 -813349 -770161 -733890 -697795 -576956
7020 -576956 -544833 -368411 -70223 141596 402546 635658 617216 448393 259805 37685
$$ packed form
7096C86710l49921l88672j92294J938K57518R1889n537M3855K91408Q3676j13322
7085A07248J46627J30408q0407p8374o2113k22634j23676o137K04354K12501Q37
7074B28634q4841R2028O2121J76089N7623J534R504j72000l17110l25058j43404
7063d14880l5695J89997J17706J44836L26158o2455j65224o4577m5694O8926P9857
7052A38955K205m5934p8066n4682J49374K00932K5689j5000J08752l9493r7276
7041B95456q9828j1880p2255n8898l6272m7802J8878j58949k03737l8265J75889
7030b27663J86679J31705j34574l92128k48307j29061M3188L6271L6095J20839
7020e76956L2123J76422K98188K11819K60950K33112j8442j68823j88588k22120
$$ plain form
7010 37685 -86630 -171558 -141941 -36043 6087 -78362 -228259 -381265 -400873 -354620 -304211
6999 -304211 -73659 300798 532648 559374 558706 522466 387899 190368 230279 356191 293158
6988 293158 185677 50992 -55310 122584 390973 569909 514556 324926 249342 130050
6978 130050 -105962 -227338 -86634 218140 480304 596645 484546 461669 335458 184067
6968 184067 96226 -116929 -386224 -529913 -552892 -448263 -355274 -172863 -191811 -213961 -123836
6957 -123836 -69745 96375 188941 140080 910 16395 98985 18925 -132241 -268910 -179034
6946 -179034 -58789 20417 90654 30447 -32998 -125721 -140552 -40129 -8095 121150 252482
6935 252482 208342 -20441 -258554 -544666 -611424 -350084 -284802 -276493 -151313 -46899 -83847
$$ packed form
7010C7685j24315q4928K9617J05898M2130q4449j49897j53006j9608M6253N0409
6999c04211K30552L74457K31850K6726o68l6240j34567j97531L9911J25912o3033
6988B93158j07481j34685j06302J77894K68389J78936n5353j89630p5584j19292
6978A30050k36012j21376J40704L04774K62164J16341j12099k2877j26211j51391
6968A84067q7841k13155k69295j43689k2979J04629R2989J82411j8948k2150R0125
6957a23836N4091J66120R2566m8861j39170J5485Q2590q0060j51166j36669Q9876
6946a79034J20245P9206P0237o0207o3445r2723j4831J00423L2034J29245J31332
6935B52482m4140k28783k38113k86112o6758K61340O5282Q309J25180J04414l6948
$$ plain form
6924 -83847 -153031 -161675 25630 207447 283931 371192 392720 465258 420890 160681 -34842
6913 -34842 -180128 -145311 183270 427295 272454 -9197 -16174 197121 172169 -251185 -536540
6902 -536540 -436721 -226477 -58863 -74281 -449462 -550895 -289732 -44905 -18327 -32550
6892 -32550 36592 -23578 -140018 -83723 -19334 72325 366067 581484 613428 435686 200704
6881 200704 160275 311963 288816 214386 256806 -17382 -149098 -137240 -73501 2266 -24476
6870 -24476 20235 160921 551757 840870 797691 619063 569593 683844 634030 452555 378607
6859 378607 331978 347973 254933 -65 -59583 -50633 84306 352025 461778 617612 456250
6848 456250 78407 -202625 -307408 -204998 -195511 -108288 14362 55928 237953 167379 -112566
$$ packed form
6924h3847o9184q644J87305J81817P6484Q7261K1528P2538m4368k60209j95523
6913c4842j45286L4817L28581K44025j54841k81651o977K13295k4952m23354k85355
6902e36540R9819K10244J67614j5418l75181j01433K61163K44827K6578j4223
6892c2550O9142o0170j16440N6295O4389R1659K93742K15417L1944j77742k34982
6881B00704m0429J51688k3147p4430M2420k74188j31716J1858O3739P5767k6742
6870b4476M4711J40686L90836K89113m3179j78628m9470J14251m9814j81475p3948
6859C78607m6629J5995r3040k54998n9518Q950J34939K67719J09753J55834j61362
6848D56250l77843k81032j04783J02410R487Q7223J22650M1566J82025p0574k79945
$$ plain form
6837 -112566 -133471 -121019 -100816 -64441 12934 90926 161699 255569 300833 307173 425763 412467
6825 412467 147936 -90955 -69152 159707 373518 517952 516954 323496 245248 290407 224274
6814 224274 171254 295364 416956 338971 212805 193483 189438 188845 313067 526556 540813
6803 540813 195573 -201680 -479090 -430009 -268326 -51493 25528 68506 316477 361800
6793 361800 199175 154825 284442 353529 280831 185786 105523 161506 358129 469293 471845
6782 471845 337099 372587 445898 137425 -119577 -47748 61115 -19248 -32896 7190 123798
6771 123798 252176 141270 245907 399315 458232 642080 402821 127090 -62685 -241802
6761 -241802 -313828 -354216 -213591 -27860 -178309 -377129 -242785 -20531 3418 -246379
$$ packed form
6837a12566k0905J2452K0203L6375P7375P7992P0773R3870M5264O340J18590j3296
6825D12467k64531k38891K1803K28859K13811J44434r98j93458p8248M5159o6133
6814B24274n3020J24110J21592p7985j26166j9322m045n93J24222K13489J4257
6803E40813l45240l97253k77410M9081J61683K16833P7021M2978K47971M5323
6793C61800j62625m4350J29617O9087p2698r5045q0263N5983J96623J11164K552
6782D71845j34746L5488P3311l08473k57002P1829J08863q0363j3648M0086J16608
6771A23798J28378j10906J04637J53408N8917J83848k39259k75731j89775j79117
6761b41802p2026m0388J40625J85731j50449j98820J34344K22254K3949k49797
$$ plain form
6751 -246379 -380351 -78537 337971 457527 302149 134527 9747 103895 295624 230096
6741 230096 96908 101179 72340 -135490 -120949 -70830 37092 66840 109748 274100 300013
6730 300013 179966 10556 -22888 151096 133524 -83534 79670 302571 244772 19439
6720 19439 -86427 43500 274775 397683 378028 318536 112727 -39768 -44902 -132159 -262354
6709 -262354 -182142 119439 339911 445304 563695 677365 596128 355362 44949 -99564
6699 -99564 -9995 65677 -86138 -93056 153949 507877 412087 82126 75267 208488 528940
6688 528940 779271 820574 664807 369305 204748 81484 -255626 -717170 -683565 -364552
6678 -364552 -158381 -51250 101906 112787 163125 200897 142745 139130 228094 204759 14097
$$ packed form
6751b46379j33972L01814M16508J19556j55378j67622j24780R4148J91729o5528
6741B30096j33188M271k8839k07830J4541N0119J07922K9748M2908J64352K5913
6730C00013j20047j69410l3444J73984j7572k17058J63204K22901n7799k25333
6720A9439j05866J29927K31275J22908j9655n9492k05809j52495n134q7257j30195
6709b62354Q0212L01581K20472J05393J18391J13670q1237k40766l10413j44513
6699i9564Q9569P5672j51815o918K47005L53928r5790l29961o859J33221L20452
6688E28940K50331M1303j55767k95502j64557j23264l37110m61544L3605L19013
6678c64552K06171J07131J53156J0881N0338L7772n8152l615Q8964k3335j90662
$$ plain form
6667 14097 -258878 -210805 83117 202987 218956 326679 295071 51796 -233077 -197201 147776
6656 147776 277019 132571 -99615 -174642 95162 330547 237626 55609 113985 169545
6646 169545 128317 130391 188024 248899 327872 455282 575591 646400 669597 660465 605346 648397
6634 648397 669107 588361 557196 514718 292022 196342 80377 -3347 94069 337918 567726
6623 567726 553923 468204 640101 636184 327067 175919 195444 256809 264404 172247 -60787
6612 -60787 -227805 -128263 -34921 -180919 -256546 -384266 -444351 -430258 -429642 -230387 55678
6601 55678 169945 34565 -274628 -400294 -544901 -504950 -114465 355176 684487 624686
6591 624686 379245 355817 379031 205995 157750 110206 58863 87431 158227 288068 529992
$$ packed form
6667A4097k72975M8073K93922J19870J5969J07723l1608k43275k84873L5876L44977
6656A47776J29243j44448k32186p5027K69804K35385r2921j82017N8376N5560
6646A69545m1228K074N7633O0875P8973J27410J20309P0809K3197r132n5119M3051
6634F48397K0710q0746l1165m2478k22696r5680j15965q3724R7416K43849K29808
6623E67726j3803q5719J71897l917l09117j51148J9525O1365P595r2157k33034
6612f0787j67018R9542R3342j45998p5627j27720o0085J4093O16J99255K86065
6601E5678J14267j35380l09193j25666j44607L9951L90485M69641L29311n9801
6591F24686k45441k3428K3214j73036m8245m7544n1343K8568P0796J29841K41924
$$ plain form
6580 529992 689501 492431 196962 12488 -204493 -196847 -126367 -187109 -319393 -288189 -404091
6569 -404091 -506028 -630870 -619799 -508856 -353725 -226248 -230146 -245283 -144970 1614
6559 1614 96958 48031 -114672 -74850 137077 248578 44793 -109562 43978 170393 212087
6548 212087 124296 -134349 -277944 -413102 -408774 -316877 -367199 -502746 -609857 -652378 -741719
6537 -741719 -585394 -220681 -53669 -7262 110498 -31423 -13836 43668 -97143 -158838
6527 -158838 3457 54453 -130690 -364631 -324769 -133641 -78156 -89222 -73003 -169760 -193880
6516 -193880 63221 223989 102132 -112867 -138665 42302 73580 34449 -102999 -110616 63400
6505 63400 105606 45789 -42914 -71149 -110996 -216165 -275794 -163600 -18130 129824 87164
$$ packed form
6580E29992J59509j97070k95469j84474k16981P646P0480o0742j32284L1204j15902
6569d04091j01937j24842J1071J10943J55131J27477l898j5137J00313J46584
6559A614R5344m8927j62703L9822K11927J11501k03785j54355J53540J26415M1694
6548B12087q7791k58645j43595j35158M328R1897n0322j35547j07111m2521q9341
6537g41719J56325L64713J67012M6407J17760j41921J7587N7504j40811o1695
6527a58838J62295N0996j85143k33941L9862J91128N5485j1066J6219r6757k4120
6516a93880K57101J60768j21857k14999k5798J80967L1278l9131j37448p617J74016
6505F3400M2206n9817q8703k8235l9847j05169n9629J12194J45470J47954m2660
$$ plain form
6494 87164 -54266 -185296 -142971 87972 249617 270681 209798 350279 331799 377920 434758
6483 434758 350559 249165 130106 35051 -18576 -41948 -257832 -304880 -257981 -223785 -119271
6472 -119271 -273 -2030 -167481 -186306 -69755 -172462 -266818 -291581 -301808 -138504 -61147
6461 -61147 -284727 -442071 -549331 -447471 -197580 -94353 -191177 -424076 -633748 -666502
6451 -666502 -555713 -503384 -447849 -234138 -68947 -138054 -314787 -408520 -619027 -670620 -492599
6440 -492599 -237315 78947 117258 170549 191820 254440 117174 -119597 -195433 28481 356569
6429 356569 451811 393971 228419 226686 341747 362110 353574 249365 -10052 -120619 -179835
6418 -179835 -93606 17696 -102868 -104537 17056 -36652 -137052 -242074 -159180 -79330 -23029
$$ packed form
6494H7164j41430j31030M2325K30943J61645K1064o0883J40481j8480M6121N6838
6483D34758q4199j01394j19059r5055n3627k3372k15884m7048M6899L4196J04514
6472a19271J18998j757j65451j8825J16551j02707r4356k4763j0227J63304P7357
6461f1147k23580j57344j07260J01860K49891J03227r6824k32899k09672l2754
6451f66502J10789N2329N5535K13711J65191o9107j76733r3733k10507n1593J78021
6440d92599K55284L16262L8311N3291K1271O2620j37266k36771p5836K23914L28088
6429C56569R5242n7840j65552j733J15061K0363q536j04209k59417j10567n9216
6418a79835Q6229J11302j20564j669J21593n3708j00400j05022Q2894P9850N6301
$$ plain form
6407 -23029 -42126 -119722 43844 209027 122320 156977 157391 134841 1120 -276523 -341903
6396 -341903 -194250 -46212 67889 255163 192189 134852 244974 314626 414251 532401
6386 532401 581036 735175 769668 534421 210230 87243 -20159 -59173 125264 208131
6376 208131 109181 109690 59867 -53085 79582 261199 288729 122533 127166 304414 367741
6365 367741 376622 297968 158042 100539 33887 43910 7527 -143573 -321557 -306704 -279701
6354 -279701 -181185 -141613 -6143 110986 185178 184694 117853 155308 179832 284506 297607
6343 297607 258002 180421 108420 187965 317075 372184 301722 302239 221424 36996 -1230 -120033
6331 -120033 -319775 -331222 -81936 180088 243455 20635 -181153 -23596 46769 37334 175654
$$ packed form
6407b3029j9097p7596J63566J65183q6707L4657M14k2550j33721k77643o5380
6396c41903J47653J48038J14101J87274o2974n7337J10122O9652R9625J18150
6386E32401M8635J54139L4493k35247l24191j22987j07402l9014J84437Q2867
6376B08131r8950N09m9823j12952J32667J81617K7530j66196M633J77248O3327
6365C67741Q881p8654j39926n7503o6652J0023l6383j51100j77984J4853K7003
6354b79701R8516L9572J35470J17129P4192m84o6841L7455K4524J04674J3101
6343B97607l9605p7581p2001P9545J29110N5109p0462N17q0815j84428l8226j18803
6331a20033j99742j1447K49286K62024O3367k22820k01788J57557P0365r435J38320
$$ plain form
6320 175654 152244 152527 228552 307149 295236 150559 229417 523410 731194 682321 487038
6309 487038 246313 64734 -6208 -168619 -149597 19220 103119 82245 70034 99127 197568
6298 197568 238683 275012 190397 36581 -59629 -42481 138141 416864 265755 6934 -39339
6287 -39339 -144898 -145675 -205378 -290417 -203528 -170760 -46333 172655 192879 252111 367941
6276 367941 410390 408584 389120 469576 367658 141858 196895 313734 376506 308243 370757
6265 370757 300997 153850 262621 373786 440629 482209 259785 49691 7620 -150500
6255 -150500 -352069 -516857 -469811 -241403 -8929 125377 211527 119240 -140126 -336350
6245 -336350 -295901 -201248 -228315 -231853 -237988 -250137 -282675 -385040 -392651 -308098 -365393 -407947
$$ packed form
6320A75654k3410K83P6025P8597j1913j44677P8858K93993K07784m8873j95283
6309D87038k40725j81579p0942j62411J9022J68817Q3899k0874j2211K9093R8441
6298A97568M1115L6329q4615j53816r6210J7148J80622K78723j51109k58821m6273
6287c9339j05559p77n9703q5039Q6889L2768J24427K18988K0224N9232J15830
6276C67941M2449j806j9464Q0456j01918k25800N5037J16839O2772o8263O2514
6265C70757o9760j47147J08771J11165O6843M1580k22424k10094m2071j58120
6255a50500k01569j64788M7046K28408K32474J34306Q6150r2287k59366j96224
6245c36350M0449R4653k7067l538o135j2149l2538j02365p611Q4553n7295m2554
$$ plain form
6233 -407947 -438630 -523650 -293512 -163984 -206851 -149448 -78760 160798 190711 150252 -6286
6222 -6286 -254991 -544057 -710886 -704678 -557860 -245015 -128048 -108758 81706 149045 198020
6211 198020 359774 359272 174717 -42358 -129696 -89208 41113 147379 135290 67125 189194
6200 189194 405613 354976 99510 -196345 -532392 -538647 -378687 -207090 205036 495405
6190 495405 495379 392790 262395 286856 253253 99886 67459 181726 266872 231484 -75693
6179 -75693 -417943 -508569 -333479 -92159 108843 267821 362727 370409 279257 299980 474659
6168 474659 492073 335863 311373 361375 345316 77158 -64317 17034 86120 116707 77637
6157 77637 -39839 -42854 61586 34390 -8645 -135193 -152070 -51317 -116113 -273695 -285555
$$ packed form
6233d07947l0683q5020K30138J29528m2867N7403P0688K39558K9913m0459j56538
6222f286k48705k89066j66829O208J46818L12845J16967J9290J90464O7339M8975
6211A98020J61754n02j84555k17075q7338M0488J30321J06266j2089o8165J22069
6200A89194K16419n0637k55466k95855l36047o255J59960J71597M12126K90369
6190D95405k6j02589j30395K4461l3603j53367l2427J14267Q5146l5388l07177
6179g5693l42250r0626J75090K41320K01002J58978R4906P682r1152K0723J74679
6168D74659J7414j56210k4490N0002j6059k68158j41475Q1351O9086L0587l9070
6157G7637j17476l015J04440k7196m3035j26548j6877J00753o4796j57582j1860
$$ plain form
6146 -285555 -71281 159509 334854 524378 478588 136981 138807 523002 643584 580002
6136 580002 591427 523481 212457 -54735 -59433 84995 176667 113431 40174 -61247 48377
6125 48377 152977 -27765 -156996 -199638 -253577 -399352 -462000 -408970 -264459 -105035 -49152
6114 -49152 -106298 -209737 -130721 -61930 -212209 -135248 -38110 -134580 -168084 -34998 -2215
6103 -2215 -77090 -125017 -114449 -45445 34880 264037 696806 876786 664975 171915 -126739
6092 -126739 134873 419685 534694 404373 269999 126330 5658 25157 105535 197621
6082 197621 279876 302742 246035 157182 40896 9616 158194 47831 -109358 124234 160976
6071 160976 242595 264081 -15382 -216279 -137862 74405 189478 33289 -225497 -196127
$$ packed form
6146b85555K14274K30790J75345J89524m5790l41607J826L84195J20582o3582
6136E80002J1425o7946l11024k67192m698J44428R1672o3236p3257j01421J09624
6125D8377J04600j80742j29231m2642n3939j45775o2648N3030J44511J59424N5883
6114d9152n7146j03439P9016O8791j50279P6961R7138r6470l3504J33086L2783
6103b215p4875m7927J0568O9004Q0325K29157M32769J79980k11811m93060k98654
6092a26739K61612K84812J15009j30321j34374j43669j20672J9499Q0378R2086
6082A97621Q2255K2866n6707q8853j16286l1280J48578j10363j57189K33592L6742
6071A60976Q1619K1486k79463k00897P8417K12267J15073j56189k58786K9370
$$ plain form
6061 -196127 -125546 -203308 -182428 -74850 -17431 -234562 -575151 -438424 28227 234666
6051 234666 190451 247770 305043 358532 420898 490968 341587 226250 193837 406969 523846
6040 523846 337422 196728 119494 83668 -81725 -123695 -83121 -53239 -134963 -244915 -321663
6029 -321663 -413695 -567886 -662808 -423711 -37527 201787 204008 75259 34396 39537 124999
6018 124999 307625 340067 265117 258865 224886 91786 78614 -149335 -278546 -58452 36051
6007 36051 20260 148099 193038 35495 9760 88096 191766 310416 370582 554406 662851
5996 662851 468652 269420 -54304 -191553 -261860 -525066 -694062 -446233 -130265 -50594
5986 -50594 -61185 -136712 3291 314252 505373 212957 117739 250110 343082 421593 374651
$$ packed form
6061a96127P0581p7762K0880J07578N7419k17131l40589J36727M66651K06439
6051B34666m4215N7319N7273N3489O2366P0070j49381j15337l2413K13132J16877
6040E23846j86424j40694p7234l5826j65393m1970M0574K9882q1724j09952p6748
6029c21663r2032j54191r4922K39097L86184K39314K221j28749m0863N141Q5462
6018A24999J82626L2442p4950o252l3979j33100j3172k27949j29211K20094R4503
6007C6051j5791J27839M4939j57543k5735P8336J03670J18650O0166J83824J08445
5996F62851j94199j99232l23724j37249p0307k63206j68996K47829L15968P9671
5986e0594j0591p5527J40003L10961J91121k92416r5218J32371R2972P8511m6942
$$ plain form
5975 374651 261826 188014 141039 166128 246063 498441 572824 419847 346982 270022 290973
5964 290973 148620 -80286 -128452 -78216 -209457 -354663 -331316 -203297 -184382 -174119 -60907
5953 -60907 164964 233400 257100 254207 155417 250889 244332 125725 17098 -46862 -238223
5942 -238223 -521759 -633851 -513000 -351641 -181797 -110307 -258619 -363778 -339048 -150332
5932 -150332 14493 -173400 -446831 -357733 -250564 -120145 159591 125310 21720 162111
5922 162111 364929 368541 344714 441373 430336 322420 308582 270963 221444 157798 -25144
5911 -25144 -79580 -79413 -130844 -155229 -186719 -116123 -68497 -148721 -27507 149381 129066 92096
5899 92096 43297 5967 -79117 -135690 -314550 -530709 -609959 -520641 -345868 -458799 -627652
$$ packed form
5975C74651j12825p3812m6975K5089P9935K52378P4383j52977p2865p6960K0951
5964B90973j42353k28906m8166N0236j31241j45206K3347J28019J8915J0263J13212
5953f0907K25871O8436K3700k893r8790R5472o557j18607j08627o3960j91361
5942b38223k83536j12092J20851J61359J69844P1490j48312j05159K4730J88716
5932a50332J64825j87893k73431Q9098J07169J30419K79736l4281j03590J40391
5922A62111K02818L612k3827R6659j1037j07916j3838l7619m9519o3646j82942
5911b5144n4436J67n1431k4385l1490P0596M7626q0224J21214J76888k0315l6970
5899I2096m8799l7330q5084n6573j78860k16159p9250Q9318J74773j12931j68853
$$ plain form
5888 -627652 -688064 -671891 -420812 -202933 -175888 -403190 -454529 -271944 -235202 -185736 -26742
5877 -26742 242475 280883 156021 76426 47327 -158373 -320084 -363910 -152938 190418 439036
5866 439036 374797 233837 255215 176420 53163 128354 193411 -24637 -374352 -464864 -318692
5855 -318692 -159742 88246 291538 277217 58752 -6879 19678 -217013 -477886 -559440
5845 -559440 -370125 -329431 -400810 -354693 -317763 -233787 -159357 -231181 -338835 -484802 -632514
5834 -632514 -498086 -463271 -489696 -577177 -645265 -695852 -638351 -510913 -532205 -479874 -358980
5823 -358980 -235185 -358458 -605394 -553216 -183736 5759 16326 -134587 -301735 -262196
5813 -262196 -193940 -153214 -84234 12408 25387 67054 -28678 -158078 -128869 -142229 -156038
$$ packed form
5888f27652o0412J6173K51079K17879K7045k27302n1339J82585L6742M9466J58994
5877b6742K69217L8408j24862p9595k9099k05700j61711m3826K10972L43356K48618
5866D39036o4239j40960K1378p8795j23257P5191O5057k18048l49715r0512J46172
5855c18692J58950K47988K03292j4321k18465o5631K6557k36691k60873q1554
5845e59440J89315M0694p1379M6117L6930Q3976P4430p1824j07654j45967j47712
5834f32514J34428L4815k6425q7481o8088n0587N7501J27438k1292N2331J20894
5823c58980J23795j23273k46936N2178L69480J89495J0567j50913j67148L9539
5813b62196O8256M0726O8980R6642J2979M1667r5732j29400K9209j3360j3809
$$ plain form
5802 -156038 -178872 -234006 -265557 -291196 -207326 -57680 -97517 -68742 68857 -10615 -247670
5791 -247670 -351626 -181372 31568 127627 367716 669112 697262 505504 290999 260700
5781 260700 209003 -46707 -187196 -175899 -87933 -52322 -48771 32795 69612 -59972 -342102
5770 -342102 -479605 -360673 -241798 -181436 -67450 56023 34847 84730 339038 593555
5760 593555 805209 927092 812703 673239 471703 104049 -71025 -89343 -49179 26853
5750 26853 -97446 -136247 -153986 -285891 -363811 -379928 -116106 190470 304234 454821 409273
5739 409273 228044 154775 97445 180129 226871 281182 220031 -30075 -122027 -65941 -15495
5728 -15495 -145916 -198325 -44248 38478 217881 325158 179816 -174322 -227918 -129097 -164819
$$ packed form
5802a56038k2834n5134l1551k5639Q3870J49646l9837K8775J37599p9472k37055
5791b47670j03956J70254K12940R6059K40089L01396K8150j91758k14505l0299
5781B60700n1697k55710j40489J1297Q7966L5611L551Q1566L6817j29584k82130
5770c42102j37503J18932J18875O0362J13986J23473k1176M9883K54308K54517
5760E93555K11654J21883j14389j39464k01536l67654j75074j8318M0164P6032
5750B6853j24299l8801j7739j31905p7920j6117K63822L06576J13764J50587m5548
5739D09273j81229p3269n7330Q2684M6742N4311o1151k50106r1952N6086N0446
5728a5495j30421n2409J54077Q2726J79403J07277j45342l54138n3596R8821l5722
$$ plain form
5717 -164819 -479091 -559256 -534440 -691000 -602591 -149346 130178 265828 555142 430454
5707 430454 -17495 -245672 -313857 -296947 -66759 33880 29118 -101746 -53739 123215 105219
5696 105219 -6125 -156597 -430997 -503920 -439972 -221027 -89825 -162133 -238204 -213778 -220094
5685 -220094 -236208 -280317 -192982 -19776 -19572 108851 85640 66535 210334 336290 195670
5674 195670 -217289 -512227 -491901 -318099 -304260 -281387 -363473 -388516 -266196 -193084 16498
5663 16498 277553 345341 213605 235376 322275 466045 523011 549506 333699 129835 391420
5652 391420 669528 578321 176206 -140276 -172703 -63896 206730 330014 375291 428100
5642 428100 492497 682254 571589 331319 174331 13860 -101459 -251331 -246096 -183658
$$ packed form
5717a64819l14272q0165K4816j56560Q8409M53245K79524J35650K89314j24688
5707D30454m47949k28177o8185J6910K30188J00639m762j30864M8007J76954j7996
5696A05219j11344j50472k74400p2923O3948K18945J31202p2308p6071K4426o316
5685b20094j6114m4109Q7335J73206K04J28423k3211j9105J43799J25956j40620
5674A95670m12959k94938K0326J73802J3839K2873q2086k5043J22320P3112K09582
5663A6498K61055O7788j31736K1771Q6899J43770N6966K6495k15807k03864K61585
5652C91420K78108r1207m02115l16482l2427J08807K70626J23284M5277N2809
5642D28100O4397J89757j10665k40270j56988j60471j15319j49872N235O2438
$$ plain form
5632 -183658 -209820 -123595 19500 139607 136767 -130243 -230461 -128725 -186223 -215981 -66377
5621 -66377 -105270 -276889 -141852 65573 -12162 -114455 -100996 67599 97523 -2232 41482
5610 41482 20556 -7657 -40267 -12381 -17110 -128676 33163 88519 -133827 -300212 -199773
5599 -199773 20900 2617 -95377 -191687 -252732 -135522 102733 261535 385406 383868 413468
5588 413468 266226 94063 125040 -23232 -240333 -390754 -510784 -532412 -444147 -497207
5578 -497207 -458890 -312137 -288800 -109928 139719 217142 64468 -250708 -443140 -387602
5568 -387602 -181089 181271 581105 594043 286646 104759 -81648 -212464 -252578 -353558
5558 -353558 -329735 -170325 69865 475999 794724 635822 173737 5232 -71391 -138998
$$ packed form
5632a83658k6162Q6225J43095J20107k840k67010j00218J01736n7498k9758J49604
5621f6377l8893j71619J35037K07425p7735j02293J3459J68595K9924r9755M3714
5610D1482k0926k8213l2610K7886m729j11566J61839N5356k22346j66385J00439
5599a99773K20673j8283r7994r6310o1045J17210K38255J58802J23871j538K9600
5588D13468j47242j72163L0977j48272k17101j50421j20030k1628Q8265n3060
5578d97207L8317J46753K3337J78872K49647P7423j52674l15176j92432N5538
5568c87602K06513L62360L99834J2938l07397j81887j86407j30816m0114j00980
5558c53558K3823J59410K40190M06134L18725j58902m62085j68505p6623o7607
$$ plain form
5548 -138998 -10356 24198 -93424 -231871 -207336 -109709 -113700 -81048 185337 138430 -42454
5537 -42454 -76098 -115686 -127007 -165118 -188043 -145438 -91389 -113545 -82978 -44519 6573 -177345
5525 -177345 -191005 -29881 -91818 -177827 -119128 -67676 -83657 -184759 -349887 -490471 -507062
5514 -507062 -300592 -83544 60477 52925 -36466 -95259 32969 55177 -60162 -29540 180929
5503 180929 414287 240242 -91862 -22986 258230 472508 438497 207992 175223 70923
5493 70923 -78913 -41339 -51462 -79186 -158187 -214756 -289179 -423597 -245293 14992 9749
5482 9749 -37183 13983 -33878 -159698 -250514 -170945 58051 35069 -274757 -471354 -530058
5471 -530058 -452317 -337701 -209737 -18441 -85371 -197611 -273642 -498768 -359537 -34754
$$ packed form
5548a38998J28642L4554j17622j38447K4535R7627l991L2652K66385m6907j80884
5537d2454l3644l9588j1321l8111k2925M2605N4049k2156L0567L8459N1092j83918
5525a77345j3660J61124o1937q6009N8699N1452j5981j01102j65128j40584j6591
5514e07062K06470K17048J44021p552q9391n8793J28228K2208j15339L0622K10469
5503A80929K33358j74045l32104O8876K81216K14278l4011k30505l2769j04300
5493G0923j49836L7574j0123k7724p9001n6569p4423j34418J78304K60285n243
5482I749m6932N1166m7861j25820r0816P9569K28996k2982l09826j96597n8704
5471e30058P7741J14616J27964J91296o6930j12240p6031k25126J39231L24783
$$ plain form
5461 -34754 142043 239351 185265 134111 135122 -39715 -126740 114223 361959 456662 491321
5450 491321 400395 241909 151406 244853 246863 229074 169178 99488 36897 -23806 -11978 7633
5438 7633 -67578 -217839 -249768 -253149 -273186 -226057 -438722 -491163 -203578 -17029 66296
5427 66296 199771 403641 716527 635387 373777 335250 225571 -62302 -169413 -66418
5417 -66418 -54807 -162906 -309084 -248881 5198 257771 170878 112237 302336 299696 304472
5406 304472 293195 331893 467372 410027 487757 580528 579051 423593 304837 134105 -83354
5395 -83354 -210064 -280099 -253755 -57649 9959 -156188 -239240 57032 154023 75789 -12229
5384 -12229 -98493 -126538 -223316 -424406 -687537 -491779 20709 218616 258292 398200 607252
$$ packed form
5461c4754J76797R7308n4086n1154J011j74837q7025K40963K47736R4703L4659
5450D91321r0926j58486r0503R3447K010j7789n9896o9690o2591o0703J1828J9611
5438G633p5211j50261l1929l381k0037M7129k12665n2441K87585J86549Q3325
5427F6296J33475K03870L12886q1140k61610l8527j09679k87873j07111J02995
5417f6418J1611j08099j46178O0203K54079K52573q6893n8641J90099k640M776
5406C04472j1277L8698J35479n7345P7730R2771j477j55458j18756j70732k17459
5395h3354j26710p0035K6344J96106O7608j66147q3052K96272R6991p8234q8018
5384a2229q6264k8045r6778k01090k63131J95758N12488J97907L9676J39908K09052
$$ plain form
5373 607252 725628 722082 499509 164402 -210565 -298006 -345433 -395456 -451496 -594178 -533072
5362 -533072 -321694 -190681 -197691 -99316 116471 231889 116253 -181331 -419829 -470841
5352 -470841 -284578 -207392 -258095 -164989 -73817 25828 -28501 -32600 82925 -157 -228984
5341 -228984 -164833 131630 277342 226038 227511 88865 -28412 -102104 -94317 94568 55497
5330 55497 -42753 -208696 -549258 -877124 -1034704 -894300 -667301 -592474 -530753 -566765 -572244
5319 -572244 -335121 -231775 -195086 -117977 -23074 107596 292387 448615 518141 554021 412978
5308 412978 354765 242694 -45608 -150048 -33015 -22821 -247401 -457328 -447271 -140114
5298 -140114 90083 116150 104888 37860 -90571 -118057 -28966 -31231 -336227 -537929 -372626
$$ packed form
5373F07252J18376l546k22573l35107l74967q7441m7427n0023n6040j42682O1106
5362e33072K11378J31013p010R8375K15787J15418j15636k97584k38498n1012
5352d70841J86263P7186n0703R3106R1172R9645n4329m099J15525q3082k28827
5341b28984O4151K96463J45712n1304J473j38646j17277p3692P787J88885l9071
5330E5497r8250j65943l40562l27866j57580J40404K26999P4827O1721l6012n479
5319e72244K37123J03346L6689P7109R4903J30670J84791J56228O9526L5880j41043
5308D12978n8213j12071k88302j04440J17033J0194k24580k09927J0057L07157
5298a40114K30197K6067j1262o7028j28431k7486Q9091k265l04996k01702J65303
$$ plain form
5287 -372626 -246652 -295550 -430335 -541741 -522787 -254645 -124835 52963 84681 -129314
5277 -129314 -501112 -779156 -721711 -393357 -245529 -347412 -493298 -514846 -362006 -286591
5267 -286591 -338617 -312365 -205305 -206294 -165550 -50857 24906 59662 110088 -12590 -232931
5256 -232931 -110261 65288 -2591 -211187 -485669 -456869 -221718 -68111 75545 269524
5246 269524 408527 406846 317019 241888 103100 240361 267409 94248 -26419 -123864 -307219
5235 -307219 -404415 -621603 -826212 -745997 -636320 -567703 -455604 -200260 -94223 -90948 -44361
5224 -44361 33777 29773 -3723 121211 340348 384394 275754 50550 -146891 -205568 -304674
5213 -304674 -231718 -20428 14033 33302 235571 294044 177404 108445 75175 -8009 -115908
$$ packed form
5287c72626J25974m8898j34785j11406J8954K68142J29810J77798L1718k13995
5277a29314l71798k78044N7445L28354J47828j01883j45886k1548J52840P5415
5267b86591n2026K6252J07060r89M0744J14693P5763L4756N0426j22678k20341
5256b32931J22670J75549o7879k08596k74482K8800K35151J53607J43656J93979
5246B69524J39003j681q9827p5131j38788J37261K7048j73161j20667r7445j83355
5235c07219r7196k17188k04609Q0215J09677O8617J12099K55344J06037L275M6587
5224d4361P8138m004l3496J24934K19137M4046j08640k25204j97441n8677r9106
5213c04674P2956K11290L4461J9269K02269N8473j16640o8959l3270q3184j07899
$$ plain form
5202 -115908 -57693 201630 389157 264274 94877 -13240 -260883 -97290 237155 238539
5192 238539 61463 228860 520973 451345 245521 90085 69658 37911 44633 175175 317986
5181 317986 269701 228502 394148 462722 327909 149044 130081 261113 407668 498410 419830
5170 419830 319333 173907 -81937 -254374 -365632 -349194 -273327 -339626 -472601 -516587
5160 -516587 -304239 -44911 93480 69279 -90001 -76389 2575 -3937 -183074 -415097 -312910
5149 -312910 -338115 -295092 -32181 -78427 -131303 -14228 172107 191133 117292 121549 216154
5138 216154 141174 185125 445655 825220 1025224 936372 691884 389700 304433 333415 381743
5127 381743 272973 254032 313112 347383 397946 265211 23012 -230620 -336073 -273656 -154132
$$ packed form
5202a15908N8215K59323J87527j24883j69397j08117k47643J63593L34445J384
5192B38539j77076J67397K92113o9628k05824j55436k0427l1747O722J30542J42811
5181C17986m8285m1199J65646O8574j34813j78865j8963J31032J46555R0742p8580
5170D19830j00497j45426k55844j72437j11258J6438P5867o6299j32975m3986
5160e16587K12348K59328J38391k4201j59280J3612P8964o512j79137k32023J02187
5149c12910k5205M3023K62911m6246n2876J17075J86335J9026p3841M257R4605
5138B16154p4980M3951K60530L79565K00004q8852k44488l02184q5267K8982M8328
5127C81743j08770j8941N9080L4271N0563j32735k42199k53632j05453O2417J19524
$$ plain form
5116 -154132 -66610 29331 184874 227087 247694 321346 383225 389182 148561 -41706 -57489
5105 -57489 -126851 -231684 -366988 -435889 -439853 -431162 -282407 -16815 247985 371259 440868
5094 440868 379984 266867 274165 230459 256292 362277 310401 271589 340957 451141 460341
5083 460341 456882 301499 223515 299315 387533 494238 520690 339616 291719 315631 142408
5072 142408 104468 181784 308104 161649 -237206 -503061 -430247 -296595 -176822 -150519
5062 -150519 -4701 352066 521965 388702 246375 294238 298966 146850 1380 61702
5052 61702 -42630 -121347 -148217 -35669 98685 220185 451063 551007 507452 371069 209714
5041 209714 65412 2091 -143461 -244659 -194506 -115846 -52362 -149164 -231527 -193423 -98726
$$ packed form
5116a54132Q7522R5941J55543M2213K0607P3652O1879N957k40621j90267j5783
5105e7489o9362j04833j35304o8901l964Q691J48755K65592K64800J23274O9609
5094D40868o0884j13117P298m3706K5833J05985n1876l8812O9368J10184R200
5083D60341l459j55383p7984P5800Q8218J06705K6452j81074m7897K3912j73223
5072A42408l7940P7316J26320j46455l98855k65855P2814J33652J19773K6303
5062a50519J45818L56767J69899j33263j42327M7863M728j52116j45470O0322
5052F1702j04332p8717k6870J12548J34354J21500K30878R9944m3555j36383j61355
5041B09714j44302o3321j45552j01198N0153P8660O3484r6802q2363L8104R4697
$$ plain form
5030 -98726 44242 -45822 -174220 -209329 -16663 231671 437104 496464 287943 67137
5020 67137 96991 79620 143647 201990 -13027 -7737 214180 328397 350022 323342 360318
5009 360318 397221 151695 -6254 34733 156426 -30352 -338839 -521980 -457095 -201833
4999 -201833 -169163 -220639 -193248 -312189 -604584 -605311 -366067 -212475 -105966 -109875 -33820
4988 -33820 57216 33440 -16727 -120719 -126372 -75416 19497 126758 202674 85751 -82405
4977 -82405 -122431 -111313 61522 285365 309317 331682 351517 301879 141346 41163 41285
4966 41285 96689 51157 -38992 -181941 -347023 -598164 -749080 -591560 -154304 94597
4956 94597 367853 592639 641663 616660 645147 585599 290858 95259 256952 139335 -72378
$$ packed form
5030i8726J42968r0064j28398l5109J92666K48334K05433N9360k08521k20806
5020F7137K9854j7371O4027N8343k15017N290K21917J14217K1625k6680L6976
5009C60318L6903k45526j57949M0987J21693j86778l08487j83141O4885K55262
4999b01833L2670n1476K7391j18941k92395p27K39244J53592J06509l909P6055
4988c3820R1036k3776n0167j03992n653N0956R4913J07261P5916j16923j68156
4977h2405m0026J1118J72835K23843K3952K2365J9835m9638j60533j00183J22
4966D1285N5404m5532r0149j42949j65082k51141j50916J57520M37256K48901
4956I4597K73256K24786M9024k5003K8487n9548k94741j95599J61693j17617k11713
$$ plain form
4945 -72378 -217703 -203569 -40128 130475 173978 83175 44957 235910 505759 452209 215162
4934 215162 116373 7120 -183865 -206520 -256163 -313535 -27093 216105 68513 78522 280890
4923 280890 411253 417881 429374 229460 -195674 -492742 -473430 -304511 -219404 -246847 -484000
4912 -484000 -515897 -358859 -250374 -107818 15744 175099 95645 -302485 -616509 -644014
4902 -644014 -452869 -359552 -489361 -471554 -289207 -95803 14324 112192 124397 -6294
4892 -6294 -101707 -153649 -141332 -88154 48336 258353 200790 98576 173875 383972 455944
4881 455944 293367 198607 180408 215302 58547 -273345 -321493 -177059 118489 319300
4871 319300 395154 365093 152648 -15527 -193514 -280914 -144158 -24338 6898 -122476
$$ packed form
4945g2378j45325J4134J63441J70603M3503r0803l8218J90953K69849n3550k37047
4934B15162r8789j09253j90985k2655m9643n7372K86442K43198j47592J0009K02368
4923B80890J30363O628J1493j99914m25134k97068J9312J68919Q5107k7443k37153
4912d84000l1897J57038J08485J42556J23562J59355p9454l98130l14024k7505
4902f44014J91145R3317j29809J7807J82347J93404J10127R7868J2205j30691
4892f294r5413n1942J2317N3178J36490K10017n7563j02214P5299K10097P1972
4881D55944j62577r4760j8199L4894j56755l31892m8148J44434K95548K00811
4871C19300P5854l0061k12445j68175j77987q7400J36756J19820L1236j29374
$$ plain form
4861 -122476 -340238 -476508 -445384 -459793 -387207 -284991 -236861 -172506 95759 379416 422166
4850 422166 372042 315671 270303 186048 137310 203381 265503 232440 265322 237611 124553
4839 124553 137361 397944 482229 418011 362260 246594 188240 48569 -204881 -298899 -120194
4828 -120194 19036 151470 266659 170608 -88112 -48432 155875 248094 452323 678297
4818 678297 717820 673074 520286 258413 40003 -9273 29266 130279 308419 384895 180900
4807 180900 -40414 -78093 61313 115289 200457 335619 346876 452557 504491 391384 243559
4796 243559 188397 212706 29126 -10225 305218 537746 594295 476708 171661 91519 166480
4785 166480 33641 -145711 -58323 126925 211420 112000 -235182 -332009 -110687 -40095 -83029
$$ packed form
4861a22476k17762j36270L1124j4409P2586J02216M8130O4355K68265K83657M2750
4850D22166n0124n6371m5368q4255m8738O6071O2122l3063L2882k7711j13058
4839A24553J2808K60583Q4285o4218n5751j15666n8354j39671k53450r4018J78705
4828a20194J39230J32434J15189r6051k58720L9680K04307R2219K04229K25974
4818F78297L9523m4746j52788k61873k18410m9276L8539J01013J78140P6476k03995
4807A80900k21314l7679J39406N3976Q5168J35162J1257J05681N1934j13107j47825
4796B43559n5162K4309j83580l9351L15443K32528N6549j17587l05047q0142P4961
4785A66480j32839j79352Q7388J85248Q4495r9420l47182r6827K21322P0592m2934
$$ plain form
4774 -83029 -70005 -164368 -220587 -76710 29852 -17491 -184934 -297584 -240834 -113379 29917
4763 29917 10472 -234086 -336867 -315306 -230159 -129580 -165547 -175607 -272061 -503826 -555281
4752 -555281 -574696 -674338 -658939 -896581 -1133521 -891332 -564170 -306050 -32001 86369
4742 86369 20864 -141553 -251917 -171242 77399 68794 -30929 4119 -47044 -281995 -504317
4731 -504317 -616358 -538276 -396327 -93066 321697 229536 101856 124145 -58943 -38185
4721 -38185 278788 374486 442763 508768 523956 521134 537614 291383 -110853 -339562 -523800
4710 -523800 -751965 -790836 -553290 -343246 -346610 -523071 -465533 -190073 98328 310029
$$ packed form
4774h3029J3024r4363n6219J43877J06562m7343j67443j12650N6750J27455J43296
4763B9917j9445k44558j02781K1561Q5147J00579l5967j0060r6454k31765n1455
4752e55281j9415r9642J5399k37642k36940K42189L27162K58120K74049J18370
4742H6369o5505j62417j10364Q0675K48641q605r9723L5048n1163k34951k22322
4731e04317j12041P8082J41949L03261M14763r2161j27680K2289j83088K0758
4721c8185L16973R5698O8277O6005J5188k822J6480k46231m02236k28709j84238
4710e23800k28165l8871K37546K10044l364j76461N7538K75460K88401K11701
$$ [...]
##END NTUPLES=NMR SPECTRUM
##END=
