##TITLE=C13_SA_14.183
 CDCl3, 24150 sc

 27.1.2020
##JCAMPDX= 6.0         $$ Bruker NMR JCAMP-DX V2.0
##DATA TYPE= NMR SPECTRUM
##DATA CLASS= NTUPLES
##ORIGIN= UXNMR, Bruker Analytische Messtechnik GmbH
##OWNER= root
$$ XWIN-NMR		Version 3.5
$$ Tue Jan 28 13:55:32 2020 Russian Standard Time (UT+4h)  she@DPX200
##.OBSERVE FREQUENCY= 50.327896
##.OBSERVE NUCLEUS= ^13C
##.ACQUISITION MODE= SIMULTANEOUS
##.ACQUISITION SCHEME= undefined
##.AVERAGES= 20350
##.DIGITISER RES= 17
##SPECTROMETER/DATA SYSTEM= spect
##.PULSE SEQUENCE= zgpg30
##.SOLVENT NAME= CDCl3
##.SHIFT REFERENCE= (INTERNAL, CDCl3, 0, 222.624)
##AUDIT TRAIL= $$ (NUMBER, WHEN, WHO, WHERE, WHAT)
$$ ##TITLE= Audit trail, XWIN-NMR		Version 3.5
$$ ##JCAMPDX= 5.01
$$ ##ORIGIN= Bruker BioSpin GmbH
$$ ##OWNER= she
$$ F:/spectra/data/she/nmr/c13/1/pdata/1/auditp.txt
$$ ##AUDIT TRAIL=  $$ (NUMBER, WHEN, WHO, WHERE, WHAT)
(   1,<2020-01-28 11:07:18.35 +0400>,<she>,<DPX200>,
      <created by zg, POWCHK disabled, PULCHK disabled
       terminated by command 'halt'
       configuration hash MD5:
       00 E9 B6 7A A2 85 ED C7 34 08 36 98 17 FE 4E 26
       data hash MD5: 32K
       58 49 78 F2 F5 9F 35 ED E0 AD E5 03 7A 68 DE 2C>)
(   2,<2020-01-28 13:53:42.92 +0400>,<she>,<DPX200>,
      <Start of raw data processing
       efp BC_mod = 2 LB = 1 FT_mod = 6 PKNL = 1 PHC0 = -227.1762 PHC1 = 36.60638 SI = 32K 
       data hash MD5: 32K
       68 BA FE 15 07 E1 EF E1 29 50 C6 D3 04 64 9C E7>)
(   3,<2020-01-28 13:53:45.14 +0400>,<she>,<DPX200>,
      <abs ABSG = 5 
       data hash MD5: 32K
       30 D5 42 38 DB AF C5 19 E0 62 08 18 8C B2 36 CE>)
(   4,<2020-01-28 13:54:06.28 +0400>,<she>,<DPX200>,
      <pk PHC0 = 8.945142 PHC1 = -8.799999 
       data hash MD5: 32K
       01 83 B5 76 C8 1C 41 B2 9C D0 0F EB 56 CE BC B9>)
(   5,<2020-01-28 13:54:09.89 +0400>,<she>,<DPX200>,
      <abs ABSG = 5 
       data hash MD5: 32K
       BA 7C DE 99 B5 46 03 20 5F 50 D1 18 62 47 C2 EC>)
$$ ##END=
$$ 
$$ hash MD5
$$ 1C 17 2C A0 C0 97 B5 D5 C5 34 4F A4 C1 48 AA 37
##$RELAX= 
##$RELAX= 
##$RELAX= 
##$RELAX= 
##$RELAX= 
##$RELAX= 
##$RELAX= 
##$RELAX= 
$$ Bruker specific parameters
$$ --------------------------
##$DU= <F:/spectra>
##$EXPNO= 1
##$NAME= <c13>
##$PROCNO= 1
##$TYPE= <nmr>
##$USER= <she>
##$AMP= (0..31)
100 100 100 100 100 100 100 100 100 100 100 100 100 100 100 100 100 100 
100 100 100 100 100 100 100 100 100 100 100 100 100 100 
##$AQSEQ= 0
##$AQ_mod= 1
##$AUNM= <au_zg>
##$AUTOPOS= <>
##$BF1= 50.322709
##$BF2= 200.13
##$BF3= 50.322709
##$BF4= 500.13
##$BF5= 500.13
##$BF6= 500.13
##$BF7= 500.13
##$BF8= 500.13
##$BYTORDA= 1
##$CFDGTYP= 0
##$CFRGTYP= 5
##$CHEMSTR= <none>
##$CNST= (0..31)
1 1 145 1 1 1 1 1 1 1 1 1 1 1 1 1 1 1 1 1 1 1 1 1 1 1 1 1 1 1 1 1 
##$CPDPRG= <waltz16>
##$CPDPRG1= <>
##$CPDPRG2= <waltz16>
##$CPDPRG3= <>
##$CPDPRG4= <mlev>
##$CPDPRG5= <mlev>
##$CPDPRG6= <mlev>
##$CPDPRG7= <mlev>
##$CPDPRG8= <mlev>
##$CPDPRGB= <>
##$CPDPRGT= <>
##$D= (0..31)
$$ [...]
##$SUBNAM4= <"">
##$SUBNAM5= <"">
##$SUBNAM6= <"">
##$SUBNAM7= <"">
##$SUBNAM8= <"">
##$SUBNAM9= <"">
##$SW= 239.972175391363
##$SWIBOX= (0..15)
0 1 3 0 0 0 0 0 0 0 0 0 0 0 0 0 
##$SW_h= 12077.2946859903
##$TD= 32768
##$TD0= 1
##$TE= 0
##$TE2= 300
##$TE3= 300
##$TEG= 300
##$TL= (0..7)
120 120 120 120 120 120 120 120 
##$TP= (0..7)
150 150 150 150 150 150 150 150 
##$TP07= 0
##$TPNAME0= <>
##$TPNAME1= <>
##$TPNAME2= <>
##$TPNAME3= <>
##$TPNAME4= <>
##$TPNAME5= <>
##$TPNAME6= <>
##$TPNAME7= <>
##$TPOAL= (0..7)
0.5 0.5 0.5 0.5 0.5 0.5 0.5 0.5 
##$TPOFFS= (0..7)
0 0 0 0 0 0 0 0 
##$TUNHIN= 0
##$TUNHOUT= 0
##$TUNXOUT= 0
##$USERA1= <user>
##$USERA2= <user>
##$USERA3= <user>
##$USERA4= <user>
##$USERA5= <user>
##$V9= 5
##$VALIST= <valist>
##$VCLIST= <CCCCCCCCCCCCCCC>
##$VD= 0
##$VDLIST= <DDDDDDDDDDDDDDD>
##$VPLIST= <PPPPPPPPPPPPPPP>
##$VTLIST= <TTTTTTTTTTTTTTT>
##$WBST= 1024
##$WBSW= 4
##$XGAIN= (0..3)
0 0 0 0 
##$XL= 0
##$YL= 0
##$YMAX_a= 34466132
##$YMIN_a= -140588108
##$ZGOPTNS= <>
##$ZL1= 120
##$ZL2= 120
##$ZL3= 120
##$ZL4= 120
##$ABSF1= 222.624
##$ABSF2= -17.3728
##$ABSG= 5
##$ABSL= 3
##$ALPHA= 0
##$AQORDER= 0
##$ASSFAC= 0
##$ASSFACI= 0
##$ASSFACX= 0
##$ASSWID= 0
##$AUNMP= <proc_1d>
##$AZFE= 0.1
##$AZFW= 0.5
##$BCFW= 0
##$BC_mod= 2
##$BYTORDP= 0
##$COROFFS= 0
##$CY= -3
##$DATMOD= 1
##$DC= 0
##$DFILT= <>
##$DTYPP= 0
##$F1P= 0
##$F2P= 0
##$FCOR= 0.5
##$FTSIZE= 32768
##$FT_mod= 6
##$GAMMA= 0
##$GB= 0
##$INTBC= 1
##$INTSCL= 4.134877e-10
##$ISEN= 128
##$LB= 1
##$LEV0= 0
##$LPBIN= 0
##$MAXI= 10000
##$MC2= 0
##$MEAN= 0
##$ME_mod= 0
##$MI= 0.1934396
##$NCOEF= 0
##$NC_proc= 3
##$NLEV= 6
##$NOISF1= 120.0001
##$NOISF2= 80.00006
##$NSP= 0
##$NTH_PI= 0
##$NZP= 0
##$OFFSET= 222.624
##$PC= 1.4
##$PHC0= -218.231
##$PHC1= 27.80638
##$PH_mod= 1
##$PKNL= yes
##$PPARMOD= 0
##$PSCAL= 0
##$PSIGN= 0
##$REVERSE= no
##$SF= 50.3227315989248
##$SI= 32768
##$SIGF1= 140
##$SIGF2= 120
##$SINO= 11.81781
##$SIOLD= 32768
##$SREGLST= <13C.CDCl3>
##$SSB= 0
##$STSI= 32768
##$STSR= 0
##$SW_p= 12077.2946859903
##$SYMM= 0
##$S_DEV= 0
##$TDeff= 32768
##$TDoff= 0
##$TI= <>
##$TILT= no
##$TM1= 0
##$TM2= 0
##$TOPLEV= 0
##$USERP1= <user>
##$USERP2= <user>
##$USERP3= <user>
##$USERP4= <user>
##$USERP5= <user>
##$WDW= 1
##$XDIM= 32768
##$YMAX_p= 286494416
##$YMIN_p= -1165148
$$ End of Bruker specific parameters
$$ ---------------------------------
##NTUPLES= NMR SPECTRUM
##VAR_NAME=  FREQUENCY,     SPECTRUM/REAL,   SPECTRUM/IMAG
##SYMBOL=    X,             R,               I
##VAR_TYPE=  INDEPENDENT,   DEPENDENT,       DEPENDENT
##VAR_FORM=  AFFN,          ASDF,            ASDF
##VAR_DIM=   32768,         32768,           32768
##UNITS=     HZ,            ARBITRARY UNITS, ARBITRARY UNITS
##FACTOR=    0.368581032318806, 1,           1
##FIRST=     11203.0474431902, 0,            0
##LAST=      -874.247242800138, 0,           0
##MIN=       -874.247242800138, -1165148,    0
##MAX=       11203.0474431902, 286494416,    0
$$ Real data points
##PAGE= N=1
##DATA TABLE= (X++(R..R)), XYDATA
$$ [...]
25464 169423 274498 294284 63345 -197269 -252689 -188592 -342724 -448843 -373248 -322945
25454 -322945 -214693 -99327 -53380 -1419 46265 107383 187660 215279 225694 330113 367999
25443 367999 199603 55564 84877 249304 296365 209156 86833 -57143 -298533 -187317
25433 -187317 6176 -77524 -200312 -158300 -73771 -80194 2765 107187 255891 350800 377887
25422 377887 372154 335866 175557 145171 94411 158314 174525 -646 -162444 -292074 -258794
25411 -258794 -268568 -176100 -64770 49527 -12517 -147901 -184858 -134955 -133068 -208487 -317953
25400 -317953 -419850 -316410 -302476 -344675 -360885 -462510 -443045 -359543 -130079 -65206 -188671
25389 -188671 -170606 19571 180893 172069 118170 94651 107851 269528 375492 348269 264528
25378 264528 219744 157127 100710 205617 269728 308563 178309 90128 247681 407233 212071
25367 212071 13431 -94127 -272768 -385149 -417715 -359769 -248681 -112005 257178 514729
25357 514729 467904 229378 168881 186723 15685 -173975 -136297 33358 36709 -96672 -132193
25346 -132193 -89445 -80184 -258800 -398087 -266254 101409 393474 309411 -79173 -287017
25336 -287017 -254850 -254353 -262472 -163075 -29508 114132 112924 67736 227150 334790 223280
25325 223280 163083 400160 574350 431726 190394 47857 73857 106736 1372 -213730
25315 -213730 -362386 -242239 -206741 -134064 179405 215659 -70177 -372284 -271469 -51912
25305 -51912 -34403 44065 -77332 -255171 -418711 -513400 -520406 -699572 -699504 -474879 -199363
25294 -199363 35217 292108 353681 358296 519201 559288 428135 306098 154645 182829
25284 182829 305681 282646 374001 617492 634681 493226 451961 410744 155802 -85414
25274 -85414 -177713 -75449 39715 102095 -62504 -186168 -82872 10864 125020 347769
25264 347769 493519 684880 942685 1032239 663524 249704 243697 396973 237952 50867
25254 50867 -59032 -128451 -126448 -134563 -160923 -61241 71738 196436 318892 293523 123161
25243 123161 -82138 -76036 -24765 -65791 -33986 -71574 -61498 -10456 57075 41969 10544
25232 10544 -133306 -228322 -285926 -396190 -357549 -263617 -212012 -62952 -79602 77455 412841
25221 412841 449175 166100 -79039 -196010 -176474 -49726 90011 165968 225681 183765
25211 183765 -65303 -248803 -109334 248999 482369 529593 659946 608545 407659 220567
25201 220567 315817 435156 384672 242494 223759 195069 147122 321255 402720 307873 378819
25190 378819 472982 649446 937386 951195 708704 558655 497006 487364 355774 250638
25180 250638 161197 185463 328496 389465 336279 283908 374516 424929 399025 280347 170822
25169 170822 144191 159670 61798 63173 172993 301586 382588 647252 1120323 1546414 1706841
25158 1706841 1690859 1579996 1663901 1972957 2400169 2910457 3615180 4844402 6558178
25149 6558178 8786718 11850139 16858291 25572441 39476070 49331201 40271444 25950386
25141 25950386 17377854 12451842 9497090 7408077 5886757 4646956 3796946 3029476
25133 3029476 2438620 2131055 1833271 1522637 1471886 1279568 1184583 1181926 1080286 886496
25123 886496 811778 720455 473701 248977 229272 290366 279118 328370 550548 659446 704604
25112 704604 458540 49782 -37933 108995 222706 280171 365538 538393 669945 745927
25102 745927 764539 734042 525135 354528 297608 169948 12220 -199337 -155366 16351
25092 16351 -8023 -58011 23980 188455 353961 312160 -18571 -367437 -551237 -628486 -688386
25081 -688386 -543711 -266370 -127323 -148350 -242084 -424555 -381517 -176044 -102407 -69265
25071 -69265 25349 84433 222445 393603 350357 293149 263944 202351 269583 223967 156471
25060 156471 104892 17821 -138723 -166905 -228867 -134049 20854 -6817 -54790 -128314 -123239
25049 -123239 1271 169899 132257 -55003 -280067 -356614 -187074 198104 426398 325675
25039 325675 58082 -157147 -184400 -58138 99718 196293 290667 291121 199627 -181484 -367557
25028 -367557 -84999 118656 34838 -209694 -235702 -134867 -114448 -40060 11805 123600
25018 123600 145042 55065 -29736 -27911 -93006 -280121 -483270 -555243 -442784 -382350 -434030
25007 -434030 -441589 -469643 -341096 -131516 -16448 -79199 -158170 -428365 -536430 -516548 -466584
24996 -466584 -334051 -119442 87165 289836 495025 483356 282833 111445 -56190 -335259
24986 -335259 -407466 -241459 -54969 45739 -16109 -120804 -78388 58831 122543 214672
24976 214672 325165 193915 -6162 -147319 -4427 190822 98826 -19714 -56279 -140602
24966 -140602 -258899 -227647 -93954 35483 69168 88594 154210 114261 -20714 -264453
24956 -264453 -537575 -699117 -588988 -306646 -144428 -236068 -256993 -15835 245796 267180
24946 267180 14297 -84106 -48926 21888 121803 124660 -101277 -365224 -557349 -573305 -341344
24935 -341344 131431 262938 155203 172701 274742 451105 695940 608508 310913 -34704
24925 -34704 -199331 -295482 -277586 -206363 -243433 -79073 108948 281914 266858 289470 336939
24914 336939 218418 77681 335161 579996 458859 261567 150639 238140 293743 199401
24904 199401 94431 21958 -78756 6283 48623 -17199 1149 45449 262144 400893 339989
24893 339989 203433 128252 82033 -180955 -399615 -365105 -308686 -182954 51032 -48404
24883 -48404 -212428 -27719 160421 230708 195793 286154 397814 390346 297447 178145 119137
24872 119137 178619 386548 521229 595359 666482 576110 255140 -188318 -265290 -138330
24862 -138330 -77295 -814 217289 457079 395026 240670 194018 271083 381780 523213
24852 523213 558926 542026 385685 209038 104390 123413 162482 278030 340029 367092 269619
24841 269619 133843 126471 80687 65609 211924 291134 320203 202105 336053 608072 785880
24830 785880 444792 205956 197988 366605 567808 781171 887791 1011768 1197234 1460730
24820 1460730 1609049 1941683 2382641 3223511 4255553 5661065 7333290 9922352 13767473
24811 13767473 20501027 31808752 45690010 45276449 31061078 20096694 13623336 10003535
24803 10003535 7684006 6122711 4660360 3652903 2853651 2350896 2066460 1890496 1532037
24794 1532037 1327068 1095481 1051779 1015950 982183 1020118 1110611 907384 691757 632530
24784 632530 673788 684324 683089 622062 518650 375051 300196 171508 141539 48751 -49320
24773 -49320 -55868 44253 8686 -48596 -25271 71033 67129 11434 175250 182148 -25498 -207772
24761 -207772 -225539 -137689 -62793 78949 223127 509695 615332 361305 147812 46113
24751 46113 15262 -89671 -65102 217244 286548 157003 159763 275869 355694 319352 220829
24740 220829 -19936 -264578 -275208 -383607 -420896 -432696 -290645 -165177 -89491 -107765
24730 -107765 13069 265486 253714 294981 377835 445112 540798 323195 164046 -33709
24720 -33709 -315033 -300501 -86181 -55721 -127897 -218644 -136243 167328 406131 401608 90396
24709 90396 -174858 -277994 -118607 184554 290171 309224 524222 574690 596982 506761
24699 506761 413617 537657 594282 579304 416822 261238 369568 648367 564380 305288
24689 305288 241639 161379 99920 19545 -192587 -387630 -403792 -244846 -110617 -207493 -254489
24678 -254489 -90722 -79085 -213337 -279569 -393525 -444811 -264623 -85320 74937 216303
24668 216303 236944 149486 70422 -44316 -339632 -578099 -581558 -380498 -180451 -131478 -114055
24657 -114055 -188351 -96831 -106771 -163888 -174503 -297425 -388441 -324400 -183666 -311065 -419282
24646 -419282 -333580 -317997 -247798 15672 199367 253359 216841 24211 -258609 -479147
24636 -479147 -504584 -365366 -181364 -30492 84141 34844 -23298 -155 -132238 -170244
24626 -170244 -57043 -51313 -20672 49312 -74363 -211110 -126825 -168477 -241475 -257271 -196996
24615 -196996 -197618 -173521 -58631 -184687 -420220 -475803 -502062 -381162 -284565 -286008 -366381
24604 -366381 -406101 -255117 -312400 -376448 -290877 -101345 -31037 65536 114574 94580 -63696
24593 -63696 -329302 -526753 -700665 -887627 -732093 -343194 -153628 -12703 -54831 -160527
24583 -160527 -242690 -343711 -350931 -220041 -183945 -66730 105917 208317 -19148 -320956
24573 -320956 -427010 -470965 -436900 -306184 -246696 -289306 -270345 -162822 -147061 -224321 -285301
24562 -285301 -366325 -316429 -222150 -34208 49656 -52512 -188656 -306226 -166476 74453
24552 74453 219329 236510 226008 394446 428419 288149 197241 160197 88134 -92723 -305621
24541 -305621 -378818 -313212 -406907 -527304 -581956 -627193 -573607 -346100 -122713 -49136 58125
24530 58125 102887 242865 296258 329373 423463 473424 385954 264490 177117 38754 16094
24519 16094 -607 -107028 -171287 -98815 107239 38582 -57651 -52646 -7491 -111103 -82447
24508 -82447 -33768 -212827 -387203 -408708 -450437 -530335 -456518 -193137 -16011 -48006 -127033
24497 -127033 -296138 -448627 -408008 -480014 -576679 -469333 -315743 -50749 17388 -114702
24487 -114702 -123690 -158880 -168051 -162212 -148612 -59709 -89908 -125262 -192185 -240178 -211823 -43155
24475 -43155 100875 -97101 -395330 -522694 -435117 -214678 55636 45265 -67019 61035
24465 61035 113796 -76192 -90320 -160458 -227812 -132923 -124782 -24815 126985 311952 453369
24454 453369 611487 654817 534226 247519 -150767 -425932 -514883 -437544 -302364 -280023
24444 -280023 -404998 -433712 -240372 -18178 119312 246670 216899 350445 612040 680694
24434 680694 518302 379775 295661 161803 1285 -138846 -349601 -401707 -295702 -101231
24424 -101231 68468 137321 225573 294350 283196 59537 2137 -47405 -122068 -204955 -316239
24413 -316239 -164500 -65444 -32892 69410 272595 357718 436850 441759 265562 131923 116141
24402 116141 94719 31240 -157655 -206647 56131 242375 231844 62758 -131801 -23887
24392 -23887 232497 222069 142549 173526 289296 292928 181383 198372 233738 233174 192239 31258
24380 31258 -253405 -365444 -227323 110909 454904 503358 366869 247791 48441 -87296
24370 -87296 -83233 41031 96756 -78862 -87737 64638 75058 -50465 -135178 -6088 33287
24359 33287 -10743 11017 -159934 -423796 -561572 -473102 -232079 42976 231526 56892
24349 56892 -205916 -273112 -282022 -214210 -14323 101437 -6346 -131037 -87903 183082 425791
24338 425791 474917 500207 426041 322684 371315 450561 336274 101803 -124227 -78260 76849
24327 76849 -37553 -234410 -282174 -180504 -109334 -187186 -204086 -58304 101062 76172 -204049
24316 -204049 -257612 -59833 -47404 -18216 19584 9238 -86813 -184947 -207671 -455957 -460577
24305 -460577 -362495 -244248 -45150 149993 293713 298077 204402 198418 380521 574739 647770
24294 647770 639841 346989 102911 38756 -121587 -269314 -373783 -306234 -136029 73342
24284 73342 107505 -150694 -372924 -501721 -668711 -543739 -271510 -51432 -50817 -241319
24274 -241319 -316260 -212303 167293 366039 228633 -137459 -153942 -98964 -232023 -266925
24264 -266925 22532 178417 227373 169955 -2054 -78813 -248420 -460989 -544480 -619246
24254 -619246 -545917 -544344 -484324 -217488 -54389 131499 166133 103201 15905 -146348 -293790
24243 -293790 -364639 -160855 -51220 -62264 38647 128888 124999 201083 299344 203144 138155
24232 138155 86844 -29968 -137325 -240587 -284268 -190543 -147670 -310831 -341604 -53645
24222 -53645 180425 363609 383645 40676 -223077 -149006 -21462 44789 121560 161269 198586
24211 198586 208731 199132 225391 177413 92643 -120847 -251501 -98784 -68667 -220733 -351800
24200 -351800 -392011 -389794 -445578 -416527 -321112 -345451 -373457 -318722 -345692 -386086 -368572 -371425
24188 -371425 -206858 -3985 -76576 -226754 -298907 -207723 4446 154043 200545 313031
24178 313031 379818 244303 -98194 -314699 -373758 -417042 -514482 -625989 -482890 -305126
24168 -305126 -195059 -166819 -39745 102811 131315 271794 395189 263110 81193 152289
24158 152289 224744 143174 -20491 -71671 -49919 120934 207090 232712 352797 109717 -146357
24147 -146357 -367918 -618521 -618656 -573982 -673062 -665611 -471574 -226407 88273 349966 270272
24136 270272 203011 138799 -125325 -354057 -458205 -497479 -455135 -229281 -42248 -79117
24126 -79117 -155447 -33595 138280 3490 -265379 -292401 -316306 -446910 -457265 -496789 -507789
24115 -507789 -420113 -371426 -269086 -132972 -169939 -138732 -308620 -274028 -130080 73492
24105 73492 159845 15240 -102331 -180066 -325845 -168560 -19331 -205511 -313458 -315993
24095 -315993 -220094 -60319 140182 352234 379346 239670 216554 129474 486 -109616
24085 -109616 -116986 76855 141350 4270 -125880 -206327 -344518 -529504 -680139 -707739
24075 -707739 -442470 -316704 -430592 -462055 -205263 -38259 52228 182058 150216 222023
24065 222023 172418 -29 -37091 67458 154508 202157 290692 143548 -101741 -221395
24055 -221395 -212784 -226462 -194132 -243413 -294074 -299508 -294149 -382949 -399811 -416744 -386241 -386285 -53418
24042 -53418 190557 106881 24177 -105838 -80044 -59782 -176457 -133505 44711 70851 -166481
24031 -166481 -294914 -166166 -79508 -171880 -202621 -269868 -213535 -119561 -124430 -64538 -42152
24020 -42152 51007 105514 -2893 -238678 -378036 -281939 -293858 -466002 -315087 -128855
24010 -128855 -141173 -236203 -207359 -202707 -29613 159546 44838 -12339 -18532 -73951 -111781
23999 -111781 -151321 -224990 -268844 -227523 -146740 -181410 -307742 -316785 -440987 -497172 -407311
23988 -407311 -189467 77055 116652 110571 -35266 -154713 -165466 -116375 51381 145956 39316
23977 39316 -193874 -125784 10113 -2571 -42465 -283161 -358592 -388565 -374411 -219652 -66756
23966 -66756 -12423 -78572 -138373 -103533 64681 255698 150507 -8823 -75512 64049 218820
23955 218820 377499 388273 258044 194979 148988 71242 56015 -39924 -31238 27158 -43227
23944 -43227 -219297 -129303 167979 431209 621428 481868 371761 381901 152342 27371
23934 27371 -36964 -237860 -404310 -317542 -33330 -172481 -493450 -550206 -527302 -335697
23924 -335697 -147309 -37098 87190 49052 -216034 -332209 -225895 -190096 -198955 -126859
23914 -126859 54804 100456 48057 1719 39559 -13704 -156642 -325015 -527137 -416920
23904 -416920 -85660 253480 372857 188810 55457 193407 291962 342775 527334 643226
23894 643226 600862 416591 247819 216980 180554 156177 198370 298054 183324 -104769 -186572
23883 -186572 -275532 -315206 -429441 -382839 -388657 -437863 -460520 -367300 -96566 -6304 -80646
23872 -80646 -132998 -370203 -591973 -637841 -583242 -517088 -381947 -220924 -218013 -357306 -451675
23861 -451675 -447608 -372033 -186939 -11746 125862 232223 219731 -43125 -210292 -90145
23851 -90145 -96872 -135769 -48446 -6435 -81585 -50291 30496 -68372 -164618 -250485 -125394 60992
23839 60992 140128 231321 162859 -41575 -219094 -122384 66023 -19729 -281347 -301578 -246768
23828 -246768 -288638 -356126 -371099 -355123 -420080 -516155 -520406 -360393 -262355 -278091 -255581
23817 -255581 -321130 -223784 -216903 -306053 -137399 52902 217912 97673 -120711 -279894
23807 -279894 -367865 -407775 -323435 -155699 -129626 -243377 -380989 -511829 -393226 113948
23797 113948 599817 721326 657190 663800 697737 608620 529096 610930 454254 177608 117707
23786 117707 197990 151565 91154 71664 155317 361256 416009 280691 22189 -35101 1673
23775 1673 -90105 -35583 66998 46648 -54033 -78601 -123750 -181094 -285769 -423744 -428096
23764 -428096 -298220 -47570 356711 697343 661992 463683 434170 312496 201562 256439
23754 256439 324750 330297 328313 176841 21579 82999 167588 23513 -31865 34679 45006
23743 45006 -72228 -97685 63660 74868 -21875 -142274 -53551 12824 1627 -120133 -330529
23732 -330529 -301266 -269569 -480461 -728826 -793160 -772654 -672977 -685630 -634512 -409200 -158301
23721 -158301 -25272 205183 587947 678333 463212 298105 295329 213895 14236 -171619
23711 -171619 -314480 -308791 -260880 -434516 -501188 -406094 -143655 98860 173410 217403 287411
23700 287411 313074 227724 99374 176467 350405 305676 104523 -73699 -134163 -11912
23690 -11912 64160 94966 116586 120993 -69908 -260571 -205030 -118611 -64347 -67209 -102026 -100601
23678 -100601 -113407 -253795 -472931 -448407 -347279 -76965 183280 225074 145558 104072
23668 104072 38644 82393 -26244 -197650 -211594 -249575 -263245 -279194 -205380 -190660 -126459
23657 -126459 -8652 -115593 -391704 -556034 -461392 -299724 -220105 -242240 -245100 -196120 -134526
23646 -134526 -136887 -285894 -370626 -455644 -524243 -422424 -374330 -345405 -201181 -366 181320
23635 181320 92958 86077 174399 198297 209986 292114 449389 550931 654834 579786 239648
23624 239648 -31544 -237546 -371070 -567711 -597136 -496204 -344259 -152593 -11213 150484
23614 150484 236274 68456 -110292 -230650 -266033 4313 -21084 -374380 -425719 -188065
23604 -188065 -23167 40835 -63625 -231982 -117786 -68561 -118294 -176689 -249139 -268171 -185861
23593 -185861 -105887 -9980 44489 -30292 -49239 16140 21113 -21856 41586 244241 413343
23582 413343 467668 317415 61800 -4901 148149 246657 215628 350328 357274 184103 -21023
23571 -21023 -241867 -311189 -180227 -98165 33834 186138 401583 571280 438111 62024
23561 62024 -223282 -342456 -375933 -375187 -409479 -245692 43429 171092 125591 -141873 -568874
23550 -568874 -630844 -499890 -446036 -388799 -244910 -81403 -107737 -188102 -173369 -267667 -452223
23539 -452223 -644875 -714663 -621997 -744614 -915525 -767811 -436719 -274257 -198321 -136074
23529 -136074 -250559 -278015 -156427 -64233 14191 49436 -100310 -335038 -284759 -173663
23519 -173663 -60176 -3068 -47921 -134101 -185054 -126446 -217078 -397950 -451875 -476698 -344591
23508 -344591 9168 224492 354919 319105 347035 306067 50582 -132819 -119842 91975
23498 91975 95243 -40599 -309038 -564669 -604802 -552677 -344154 -342518 -450385 -496482 -607122
23487 -607122 -600185 -475533 -506954 -580697 -431364 -327383 -270054 -350451 -382316 -298643 -74553
23476 -74553 218568 414286 403877 253910 200253 108892 -1811 33900 38090 -100411 -114143
23465 -114143 -140041 -263579 -210860 147825 502052 607210 505904 250183 9368 37108
23455 37108 196606 199366 155037 123487 125711 289050 302562 62033 -200876 -212248 -106915
23444 -106915 -24484 110809 188553 297665 297389 79231 -96054 -158977 -295796 -478290 -458996
23433 -458996 -199656 -65293 -61478 -58622 -224409 -322576 -84890 -20470 -77026 -61290 47184
23422 47184 -129867 -308646 -221525 -317326 -466936 -387101 -85931 151148 124766 73904 -47544
23411 -47544 -316244 -371011 -280962 -56235 98875 168288 176971 187994 111080 -15038 -50336
23400 -50336 -48103 97289 284294 291728 79127 -201918 -256766 -267930 -307516 -105787 139125
23389 139125 230166 279390 244313 53299 76612 151514 135373 -110252 -261846 -294158 -241352
23378 -241352 -234323 -198058 -136859 69491 170846 24937 -104336 -105245 -98268 -95549 34502
23367 34502 76790 -52459 -172022 65837 236752 122620 36531 -43441 -123884 -199565 -204641
23356 -204641 20971 155233 72447 -42792 -57423 126402 291201 303793 312065 227376 40905
23345 40905 178605 347757 328193 99871 -95549 69690 349354 188153 -168021 -346803
23335 -346803 -396729 -466938 -653260 -802683 -960526 -1037734 -913545 -701345 -719111 -636243
23325 -636243 -393670 -93659 102858 -58881 -216785 -90071 62241 29305 -96722 -66249
23315 -66249 118912 166556 194106 191189 143032 159288 234238 321179 211150 2090 -162361
23304 -162361 -146536 -135419 -102402 -83417 -40097 45769 156373 188895 221224 157878 48602
23293 48602 -106040 -107201 -119595 -170799 -106565 -145704 -429341 -857355 -918027 -495629 -212597
23282 -212597 -172368 -142506 -49668 -136614 -195673 -125882 -69484 27687 39072 -71606 -102790
23271 -102790 -27614 122527 224619 217477 260467 141908 -80927 -153623 -89446 -22193 138628
23260 138628 310757 255139 139379 6110 -20331 108242 123874 -74366 -287571 -262104
23250 -262104 -190498 -126107 -49717 -264202 -333158 -257571 -313640 -231300 -69868 -200911 -392645
23239 -392645 -395258 -401102 -424455 -355808 -254100 -66046 301504 523243 446195 267095 374230
23228 374230 628229 554270 142043 -95377 -57411 -17261 -224305 -388062 -403349 -305032
23218 -305032 -96015 195284 308509 335172 343187 350074 384030 379942 449473 422448 440525
23207 440525 357469 135870 -82447 -170794 -218049 -115190 -52341 96643 300966 308205 189029
23196 189029 12342 -146933 -119028 51634 284618 349862 200642 -71008 -111163 -98388
23186 -98388 -205588 -199883 159284 555376 462542 252505 143870 225068 285765 30025 -211537
23175 -211537 -366830 -561618 -621486 -319727 9067 132276 140741 -108067 -356974 -242031
23165 -242031 -151984 -257994 -237979 -75146 -2118 -97406 -104470 11767 69906 145727 52240
23154 52240 -183995 -213291 -157216 -125826 -39650 121642 179786 289138 306236 299209 285105
23143 285105 246467 227370 133683 -55377 24872 133829 181393 191685 99213 51184 79808
23132 79808 71969 213742 266630 218889 157257 102992 103428 -25759 28574 99696 -23952 -28018
23120 -28018 72876 231825 452658 532225 457603 242415 67126 65260 43840 -107154 -200875
23109 -200875 -268171 -383001 -395112 -299756 -405061 -596135 -746775 -811812 -694109 -713272
23099 -713272 -564105 -339802 -459303 -646445 -766755 -707528 -348861 20914 117445 184351
23089 184351 294935 344889 343932 486528 701702 888197 790557 468846 266180 252868 286788
23078 286788 200116 211881 287881 146484 -100915 -153627 -221467 -371156 -515609 -618260
23068 -618260 -721215 -492146 -117313 53529 -26002 -244369 -378664 -434626 -412419 -376092
23058 -376092 -407046 -486804 -489077 -361219 -217363 -10179 24494 -30757 112446 216187 75140
23047 75140 28223 306419 527430 373882 139332 -190725 -219309 -34305 195712 426971
23037 426971 387593 232704 116628 21228 73869 344766 510293 477608 364588 306663
23027 306663 156644 -139847 -367668 -395027 -286539 -85051 -33031 -74907 -126320 -142995
23017 -142995 -73073 50304 -100071 -213031 -201617 -113158 -65118 -119934 -19268 140151
23007 140151 120917 -131543 -313429 -257596 -167077 -30421 46364 -17382 13208 -33124 -76246
22996 -76246 -69566 -224625 -281545 -105983 80671 142956 130800 41311 -12832 138666 235759
22985 235759 94333 50807 169363 196605 169966 243622 498108 526428 461618 346110 299221
22974 299221 258711 263306 281144 183307 42800 -218996 -469682 -528089 -541360 -586582 -663915
22963 -663915 -636917 -462460 -421831 -509062 -358070 -20250 236620 147056 43498 66447
22953 66447 76829 147888 192038 135671 126645 290764 348505 410550 363817 82230 -52864
22942 -52864 -10740 161886 315246 247083 -33217 -108678 -138041 -86360 -4621 -31452 4233
22931 4233 -39467 -185665 -314701 -453186 -591508 -492094 -344288 -350234 -404589 -350211 -193735
22920 -193735 -161916 -254420 -223329 -217495 -213896 -101110 -42 109177 100611 -49554 -74280
22909 -74280 -189059 -220417 -60222 109109 58773 -151442 -202417 -196591 -129248 70323 170780
22898 170780 202926 296363 271972 8177 9405 222358 199532 84875 91212 65091 -186224
22887 -186224 -227078 -77445 -175932 -449984 -581785 -426913 -482738 -642896 -708451 -504017
22877 -504017 -406927 -512476 -421991 -176777 -38810 33041 59384 -95179 -142502 63795
22867 63795 251219 290476 67993 -313219 -325899 -191198 -217476 -125816 -91107 -320740 -420456
22856 -420456 -385516 -389151 -271610 -194147 -61254 -76858 -231110 -212511 -147683 -172971 -221610
22845 -221610 -177078 -240998 -349436 -373247 -558060 -679958 -563708 -265942 42341 165919
22835 165919 292739 271633 228087 79947 -71033 -20848 70735 23892 53724 95847 55160
22824 55160 35431 83407 22977 -29410 93386 206550 178345 97207 -9170 -14943 100521
22813 100521 32160 -48964 36514 -98576 -78562 168632 348317 263160 51922 -19254 159890
22802 159890 343487 248010 133235 22422 -56760 -220518 -322397 -341952 -259986 -194932
22792 -194932 -193623 -116503 -23367 -37629 -171986 -274256 -459494 -622703 -523016 -481423 -367691
22781 -367691 -175327 -72761 -72334 -179105 -335512 -492467 -383734 -140211 -54305 -327840
22771 -327840 -648017 -869541 -834506 -571118 -453537 -426832 -589297 -550541 -422051 -287414
22761 -287414 -168772 -96212 -241937 -362855 -506151 -431086 -293393 -362272 -339721 -335959 -260196
22750 -260196 -201339 -259408 -201273 -117117 -34575 -76031 -182128 -38955 119857 10105 44214
22739 44214 88959 135813 133844 -20743 -8526 184709 318048 288461 123472 -21980 -16265
22728 -16265 149225 170966 6975 -80744 -154145 -205386 -168618 -264949 -524292 -548344 -373859
22717 -373859 -71611 253766 333986 310746 147599 -25459 -236008 -409281 -522681 -488601
22707 -488601 -460305 -552429 -531055 -298461 46010 158589 160635 85581 -114923 -295440 -342566
22696 -342566 -327600 -271042 -100433 -32288 -9854 31890 -23797 40548 186741 285376 156739
22685 156739 -59168 -362427 -485112 -506979 -485414 -530199 -493254 -353565 -277263 -81208
22675 -81208 84613 87883 -101479 -346878 -645900 -970517 -1104940 -962568 -744794 -463793
22665 -463793 -141348 -46130 -144505 -204690 -278445 -309406 -397460 -601564 -705633 -762897 -651785
22654 -651785 -421300 -285791 -381398 -533857 -498014 -337957 -128578 50850 -42417 -141130
22644 -141130 -256067 -500987 -623278 -712593 -564582 -526855 -529917 -254469 -51866 139714
22634 139714 69585 -85881 -153473 -119737 -138043 -266697 -316631 -332160 -351550 -459188 -566521
22623 -566521 -692279 -563631 -188076 -40803 -141667 -359813 -439174 -290034 -96692 92250
22613 92250 183205 103518 -48624 -135002 -100539 -21974 55236 15734 -69788 -106884 -4432
22602 -4432 274760 406177 417237 349271 291292 258103 208338 72797 48185 91173 -27675
22591 -27675 -20912 75652 84518 180610 211540 232937 351655 241981 -16992 -294303 -258439
22580 -258439 -73656 39186 120803 134937 -181900 -308376 -106315 211227 254415 124955
22570 124955 92654 45178 -14425 -30588 -89824 -290983 -504653 -510584 -205658 104493 148917
22559 148917 231340 241344 102856 -93580 -294642 -488222 -546779 -299362 88956 229060
22549 229060 155604 85861 66385 89551 70907 28495 -63011 -231825 -306475 -366361 -383861
22538 -383861 -387200 -388540 -313474 -340598 -512387 -466722 -320297 -339073 -300505 -151597 -248124
22527 -248124 -456676 -344637 -245088 -290304 -314865 -285207 -119486 -232033 -474592 -518407
22517 -518407 -466254 -299736 -110244 99705 300481 445433 393966 402581 429704 343305 84543
22506 84543 -56998 -14590 153298 199476 203949 280933 233763 8974 -207594 -218440 -88539
22495 -88539 -30224 126425 108284 -130200 -160867 -95924 -7951 -112802 -249944 -134016 58051
22484 58051 -32826 -278355 -450866 -431003 -377445 -215317 -9187 -58708 -80633 -188206 -320143
22473 -320143 -180286 -71383 -208043 -316777 -315892 -299861 -320517 -306594 -153624 84385 334281
22462 334281 429617 422634 124554 -130037 -200246 -188045 19758 119247 65104 145491 282472
22451 282472 374038 364400 248273 151464 30995 -2495 -110875 -270305 -326177 -254302 -93201
22440 -93201 103124 315321 318790 279775 149542 60679 28825 -83398 -154872 8877 -77808
22429 -77808 -293250 -70891 232328 179642 -21466 -37579 -47128 -88618 -313726 -366685 -358275
22418 -358275 -455236 -455651 -349369 -269817 -281167 -183694 -98828 -30483 215127 261871 -5073
22407 -5073 -239349 -201874 137263 456051 601123 535259 446320 352526 389109 432963 422122
22396 422122 490524 394092 158893 90353 126586 29320 -12885 21534 -42545 -216806 -325828
22385 -325828 -259275 -193381 -79697 97635 -59158 -490583 -718312 -646562 -376927 -214487
22375 -214487 -230631 -196506 -12340 245733 381693 323254 220735 235173 166342 107604 168303
22364 168303 18798 -286296 -561957 -713273 -578306 -267257 -72618 4638 80437 228247
22354 228247 312782 318122 284292 57673 -32439 86851 216252 131160 29483 90155 318332
22343 318332 317655 237623 111009 -742 -97411 -10652 99203 76793 48575 116968 110503
22332 110503 -10427 -58052 58565 339114 509362 207956 -14910 28359 47524 54758
22322 54758 -97500 -155094 -77097 -38769 109084 258502 230486 65915 -69834 -197698
22312 -197698 -127769 25581 130572 327233 332764 316727 421619 257043 109607 5027
22302 5027 -31861 -104401 -66918 92010 32573 87520 256466 254575 85007 -38097 26161
22291 26161 57464 20743 11964 117926 77895 -43426 -130314 -142138 16604 100580 44233
22280 44233 73156 290826 456118 564375 531360 378203 63870 -129538 33491 34350 -76079
22269 -76079 -10802 150995 327987 318146 196369 90851 17593 65971 102907 108260 83807
22258 83807 257795 351404 185721 -40267 -224328 -425495 -560528 -424559 -82050 297613
22248 297613 540187 547587 494634 604725 500916 447674 380459 310365 414457 374866 -11398
22237 -11398 -272532 -192628 -57358 -60167 144362 445192 494022 279848 155061 214857 -775
22226 -775 -108969 59903 66275 46537 148694 103879 -64840 -56747 -192958 -340642 -274483
22215 -274483 -77808 293184 428421 380645 320378 178612 155792 83141 130494 338579
22205 338579 445418 437127 343444 228194 315740 455286 449561 249285 81140 169828 116215
22194 116215 -231984 -400372 -297536 -172693 -325510 -402648 -382650 -486967 -321522 -88184
22184 -88184 59586 198594 134097 115201 169139 192136 165087 95657 16183 -189238 -203963
22173 -203963 -99736 -153087 -264134 -164895 -56323 -232878 -369387 -294792 -194890 -178756
22163 -178756 -147061 -223329 -328627 -264109 -153945 -186379 -68150 150992 162058 107681 73109
22152 73109 63666 -177994 -444106 -638900 -727029 -696710 -612506 -445343 -234536 -68350 21059
22141 21059 -72105 -183380 -139868 -26101 41128 138604 73539 -5803 100172 74062 -34707
22130 -34707 -34076 -34009 71062 169843 239278 134215 -107512 -73793 -100112 -121862 -194454 -306352
22118 -306352 -302371 -309081 -423691 -449344 -401234 -338586 -345216 -394695 -402903 -222171 -29740 19932
22106 19932 -39326 -182500 -152207 35192 136693 84799 207714 358714 486609 481691 331929
22095 331929 188592 111764 38467 -70246 -112147 -36487 83676 139912 203541 182866 163471
22084 163471 42184 -295459 -456671 -362844 -289663 -130004 64455 202502 126438 -84176
22074 -84176 -313623 -376528 -421659 -419604 -308396 18787 348366 344792 101393 -62042 -239976
22063 -239976 -322216 -230165 -289180 -380555 -394150 -185776 52517 181718 250670 187547 -59903
22052 -59903 -295025 -229171 -111468 -126660 -73221 89237 215283 281282 258041 140714 -161871
22041 -161871 -301958 -267847 -167525 -11143 168729 261103 294532 253794 244384 269616 191748
22030 191748 161234 -59116 -455244 -704268 -671674 -544731 -314394 -41633 377213 454597
22020 454597 67478 -2596 129292 148319 535102 519938 324547 250306 62233 -131116
22010 -131116 -358745 -438824 -360982 116582 415734 284254 144794 220019 117191 -85262
22000 -85262 -112165 -175028 -261820 -325392 -425376 -443174 -350696 -147972 147369 108112 3261
21989 3261 90763 105542 51060 -2576 -111729 -190099 -114952 -83239 1412 -53696 -40738 -123013
21977 -123013 -122006 32150 45756 -82137 -101822 -18279 -97928 -209368 -211457 -197422 -318226
21966 -318226 -310399 -128757 40736 33173 -78063 -247015 -306833 -288283 -246216 40126 269090
21955 269090 409912 568861 447199 147387 79677 19271 -142744 -175833 6220 291944
21945 291944 383806 402399 451069 323777 166505 -24833 -283692 -371133 -229560 -247956
21935 -247956 -295082 -139684 -14856 21792 -49654 -26025 139352 239982 238986 175516 135446
21924 135446 50694 -107111 -188758 -27354 77059 169188 231345 127828 52016 95661 62298
21913 62298 -77302 -71536 42657 90581 102344 198033 95430 188516 281531 235179 140048
21902 140048 197634 144927 -142050 -227153 -218352 -456802 -607130 -568416 -387034 -301631 -233993
21891 -233993 -146737 -8574 26100 4746 -104614 -167260 -227447 -259421 -52059 178305 436936
21880 436936 497624 210696 -140169 -366854 -359845 -194869 -40356 55098 34502 -184904
21870 -184904 -367044 -469093 -558729 -505591 -331918 -160338 -34468 149849 245032 217557
21860 217557 85839 -164354 -237435 -130878 13732 161853 490621 706134 538388 268680
21850 268680 144080 -17078 -148586 -181201 -227697 -188011 -6559 49666 21309 -25861 -102608
21839 -102608 -127611 -295968 -310924 -178794 8015 118731 126328 115547 136366 145828 99696
21828 99696 89743 54163 27186 56358 153242 141019 17327 47474 99555 -124071 -215049
21817 -215049 -105158 -127465 -65162 -50567 -27760 -19243 -154623 -346495 -490576 -501596 -314863
21806 -314863 -191304 -206664 -232336 -27175 123831 157267 240552 329126 420830 285620 -19081
21795 -19081 -243598 -328853 -322857 -215986 5873 201012 214500 169168 -22572 -267857 -230219
21784 -230219 -76963 -130576 -204837 -93644 -57827 -52979 123986 249108 278648 430007 414621
21773 414621 299634 273263 253648 135102 122474 105220 -91164 -427084 -475464 -344783
21763 -344783 -332833 -230054 -15427 -26449 -57338 32161 86873 -7820 -281539 -526863 -599400
21752 -599400 -742444 -897976 -735160 -485597 -377431 -488877 -442602 -300625 -76329 108311
21742 108311 -8361 -252411 -376614 -366812 -331312 -273592 -128398 -138137 -322659 -431291 -315567
21731 -315567 -147581 -106376 -37149 28989 -4202 -41079 -56879 13022 62717 -92847 -191528
21720 -191528 -50319 -53838 69177 252585 351775 248477 151000 1060 -231360 -298784
21710 -298784 -140392 20974 133413 229655 132734 -61583 -251043 -333061 -264803 -237362
21700 -237362 -278192 -399620 -511148 -484207 -387130 -328659 -259038 -165479 -196711 -93663 102146
21689 102146 225276 60226 -147839 -254356 -218903 -236507 -373909 -355511 -155488 25615
21679 25615 37838 26139 -14621 -19991 -59167 -159090 -103368 -161363 -338289 -495033 -619502
21668 -619502 -577548 -635270 -728279 -687635 -606867 -495356 -341480 -277700 -214512 -58057 175206
21657 175206 100618 -121581 -87838 48079 180165 272481 343645 284458 164539 42483
21647 42483 -122537 -236543 -158873 -168962 -331447 -530460 -506678 -304509 -222376 -44460
21637 -44460 117894 25774 -208529 -361377 -454446 -673526 -837607 -859816 -850466 -699541 -421997
21626 -421997 -115805 -163516 -146044 -10514 -52547 -14415 110648 247359 193580 -99814
21616 -99814 -296165 -307322 -181639 -165294 -279475 -307789 -285905 -235126 -172865 -158472 -319395
21605 -319395 -396053 -388552 -440509 -388641 -136764 103035 226683 321824 148094 -208061 -304121
21594 -304121 -30160 189752 235531 313264 183121 45256 104234 15992 -240448 -329029
21584 -329029 -127265 -33955 -39480 32702 -68441 -30626 -129611 -300758 -351113 -399966 -318379
21573 -318379 -295363 -316024 -257076 -142029 78061 201264 381709 428705 275327 -92082
21563 -92082 -316813 -205585 -172861 -114502 1209 73379 -69036 -223301 -365807 -485571
21553 -485571 -396604 -280767 -196751 1857 67797 -11182 -30310 14251 -40170 -32396 70856
21542 70856 -30020 -219465 -414699 -532727 -489612 -180988 149689 264157 150012 32714
21532 32714 -168833 -408794 -374372 -240076 -119199 70822 139164 -73667 -195985 -201042
21522 -201042 -189795 -218663 -203850 -74061 65530 187186 279057 397626 375405 390330 426144
21511 426144 290549 170566 173466 273477 301516 229892 121456 80418 -10735 -166452 -314050
21500 -314050 -268270 -244691 -257884 -182425 -180468 -111997 -261026 -429682 -623739 -888651 -950793
21489 -950793 -879022 -755057 -705718 -663016 -373348 -214560 -297469 -493995 -550972 -535696 -320792
21478 -320792 97589 462913 433330 369229 416704 523948 507515 315890 71124 -21822
21468 -21822 104611 230329 359195 388191 376096 303371 297613 263235 44553 -33975 64131
21457 64131 151624 167244 111568 31979 -87475 -262691 -306383 -311952 -194295 182419 388118
21446 388118 190975 -125494 -407701 -547476 -578016 -357647 -161160 -80437 -65641 -87753
21436 -87753 -57508 30426 60295 5600 -73641 -162858 -194043 -358225 -468022 -391180 -353557
21425 -353557 -300904 -259822 -261470 -188766 -210138 -149080 -197608 -258255 -142809 -36113 17730
21414 17730 182933 291601 274538 144530 76208 122537 208766 229554 19243 -219003 -421139
21403 -421139 -480960 -517094 -462601 -518052 -479244 -223833 -210808 -247026 -142658 -233753 -218097
21392 -218097 -64362 56232 70532 -61893 -106508 -39285 -53752 -86663 -139464 -150911 41932
21381 41932 144998 213456 113675 70385 54574 -28706 41845 174317 426173 495485 338941
21370 338941 216310 79578 22006 -2048 -34660 -205247 -144077 17259 -24784 -102763 -16126
21359 -16126 162871 214785 -17744 -181727 -58900 62110 195868 344122 444137 446818
21349 446818 409852 433970 483167 293569 63869 -5945 -43388 -17056 65614 -2742 -91628
21338 -91628 91461 197535 106948 83205 230871 269806 205320 173475 249747 287881 143607
21327 143607 -22669 19777 4071 -5709 -30854 -58349 -162851 -84635 117936 241932 107445
21316 107445 102274 481149 615058 514661 412350 368901 345512 170276 142876 26495
21306 26495 -19205 50930 20722 29221 -53421 -119745 -31244 80813 59365 -92589 -277457
21295 -277457 -335085 -274256 -158549 -13790 52534 47429 -51598 -164783 -48131 172518 260410
21284 260410 152413 -6433 -29359 206418 429375 359151 109656 -259833 -477922 -409905
21274 -409905 -229275 -117642 -12377 15958 -83458 -196878 -89886 -66106 -62795 -127399 -21840
21263 -21840 214743 160660 20413 -171887 -40524 1859 -47630 9996 -127957 -107958 82515
21252 82515 95261 -56014 60302 246071 422279 547116 379271 31106 -310509 -442693
21242 -442693 -407606 -552414 -797943 -812810 -523178 -245834 -42868 -65330 -222977 -405975
21232 -405975 -372591 -148010 -53258 -136070 -368815 -559278 -678961 -701963 -533604 -486656
21222 -486656 -466942 -185939 124580 249886 343259 378001 319554 172293 -102812 -207607
21212 -207607 -218203 -264309 -252250 -140469 -113249 -81624 -196306 -238342 -267058 -280211 -52811
21201 -52811 59054 48749 105071 44715 -144603 -267959 -135618 -41051 106969 185851 34464
21190 34464 -83872 -139838 -220517 -172141 -164312 -209119 -258418 -451916 -563222 -502070 -454370
21179 -454370 -474595 -418576 -202766 23414 91686 293174 421428 274948 124362 -34945
21169 -34945 -207628 -406974 -409565 -274553 -26676 91770 100838 116771 90869 206433 358466
21158 358466 392536 333918 391733 476213 382725 125114 153507 235191 141098 144125 302153
21147 302153 376302 404455 485764 433157 376169 200585 -46623 -204435 -330816 -510675
21137 -510675 -335678 4372 151366 63440 -27472 -48175 45872 47104 -24350 49308 143806
21126 143806 185537 -14360 -239291 -197635 66609 194405 203208 14126 54822 175058
21116 175058 97843 -29397 103271 62823 -67559 -164859 -154673 -92848 -18615 41002 -11479
21105 -11479 -139484 -42431 61015 223185 389231 390769 328218 390850 469021 434141 464481
21094 464481 666815 888998 1124976 1320220 1538763 1640368 1886632 2268714 2785882 3245346
21084 3245346 4139917 5626958 7787735 10109861 13378081 18190560 25981119 38240359
21076 38240359 54696010 59472374 44614126 29846927 21127201 15813450 12101782 9535025
21068 9535025 7592349 6079913 4914917 3892051 3198335 2963598 2750125 2453512 2068613
21059 2068613 1769413 1567984 1520747 1465323 1206937 910245 786021 899880 1004938 986038
21049 986038 1044088 1051724 997729 1056273 973858 780083 591033 508319 385448 268016 250457
21038 250457 249323 359411 419120 273984 51125 -56013 -34330 -46270 -210745 -354931
21028 -354931 -244006 96847 215722 323570 422826 234688 -15827 -156999 -201740 -294823
21018 -294823 -251209 -238090 -316495 -442055 -308886 -77912 -16202 139870 316414 460461
21008 460461 377909 256010 77229 -51288 69352 126074 239317 279487 58339 -131848
20998 -131848 -45725 159779 347067 355651 97270 -89981 -91459 -76087 -115227 -13096 216293
20987 216293 410503 367702 261400 367841 310222 14311 -69201 26842 -83398 -185189
20977 -185189 -136890 -19884 122291 152359 247468 418509 275229 -38752 -304301 -232876
20967 -232876 -115367 57015 271859 310176 153858 223339 272209 399723 537287 645095
20957 645095 726682 448855 171329 245343 453759 515985 494447 75783 -209799 -244019
20947 -244019 -346491 -231385 77904 177917 -2441 -33264 -38897 690 75178 234485
20937 234485 284973 118467 116005 257510 345668 264635 107088 -139934 -93603 106433 273148
20926 273148 316238 411233 660202 682425 492647 212725 34581 -27776 100843 154942
20916 154942 131606 63689 -154879 -257911 -127028 19167 -36894 -191321 -148147 -50369
20906 -50369 -20939 -163975 -370498 -456039 -156637 132949 179537 144346 30868 -83568
20896 -83568 28447 72899 157472 426673 568268 566459 409014 125635 10140 134112
20886 134112 216500 325922 484658 385359 380576 500614 321153 -74410 -378048 -349953
20876 -349953 -200389 -132622 -219439 -324683 -133090 246331 415099 448892 393799 338624
20866 338624 384268 317989 183322 -34126 -127109 -39630 123390 -1325 -110438 -24620
20856 -24620 69997 -87818 -284454 -160520 12173 121698 281153 254118 192288 218447
20846 218447 358176 407280 288897 65574 52193 68229 203097 14025 -208685 -143004
20836 -143004 -110298 -284917 -197445 69060 -25308 -126089 -51482 139662 265569 257285 251093
20825 251093 276511 297706 243969 141366 106499 199393 268342 270035 115237 -70413 -39140
20814 -39140 -22814 58532 32117 -225351 -297548 -177166 -164985 -178388 -175648 -133761 -67985
20803 -67985 -267789 -538065 -570392 -285088 -27414 60496 311048 394095 171387 60113
20793 60113 65016 162154 197241 132443 134558 66961 -49565 -280473 -457952 -377472 -342267
20782 -342267 -118111 150115 -90151 -445110 -486134 -353384 -198332 -73982 -99343 -144455
20772 -144455 -31755 111803 154720 30544 -138693 -218080 -251553 -84721 -70331 -238275
20762 -238275 -190474 -35607 101353 242107 184483 57224 -53826 -184579 -128256 -120827
20752 -120827 -177988 -163692 -62603 -46351 -186419 -260377 -155767 170128 299497 227504
20742 227504 112496 -9496 2805 1145 -59902 -166591 -251842 -289417 -220455 -41682 30660
20731 30660 103146 74909 118752 273546 475386 398562 316458 258176 298367 641784 836678
20720 836678 697412 579034 537348 475927 529070 634610 565937 412519 235531 184423
20710 184423 327031 427508 383855 382937 342837 368013 574355 809065 893396 776336 519376
20699 519376 453221 476401 515906 669449 680462 509238 388374 248235 219936 162739 96729
20688 96729 13230 131845 265974 383751 694029 723431 493666 277611 89465 110162
20678 110162 204705 193238 233970 508541 621530 585964 410026 412263 508946 409575 291864
20667 291864 402126 502915 603839 725791 808552 653824 688368 722817 744444 793914
20657 793914 879418 763209 707372 807498 939869 966883 1391155 1578640 1750915 2041594
20647 2041594 2616626 3408379 4550945 5791087 7792728 10243252 13933593 19622562
20639 19622562 29331068 44363748 63065883 63676376 44196101 28698914 19630348 14755855
20631 14755855 11606142 9487066 7581382 6267558 5178288 4420646 3621849 3078367
20623 3078367 2586980 2303784 2209112 2203921 2008809 1750888 1244308 848260 657088 571983
20613 571983 535968 662605 755697 708322 603509 566646 450699 180549 38665 -68473
20603 -68473 -267706 -183231 69910 275584 179106 -19562 -169032 -203866 -98172 -62776
20593 -62776 -76133 -175515 -354935 -267644 -191670 -141535 -199612 -254482 -295780 -268793 -293238
20582 -293238 -356786 -491328 -509348 -294866 -171839 -131437 -117808 -12527 142344 221948
20572 221948 371567 469260 302394 168666 198173 387086 736634 1046988 1401414 1398845
20562 1398845 1116308 772682 278252 -36260 9917 152370 153240 143664 337882 447463
20552 447463 366982 200929 106957 49866 -6308 40081 42914 -159132 -298901 -190101 -127387
20541 -127387 -189700 -306216 -331472 -82948 98990 121668 176085 116178 44951 167634 329208
20530 329208 277180 82522 -127840 -130064 -89410 -79320 -150171 -284698 -207813 -25858 177889
20519 177889 161839 64797 134451 288762 356964 246603 101142 85863 129392 189315 277545
20508 277545 209772 117776 16861 15437 33343 69190 146795 152606 324921 442405 342551
20497 342551 348514 383386 378670 401959 429119 431207 587055 626679 390678 136461 227143
20486 227143 545253 843847 940510 1038221 1229371 1327106 1236242 1121603 930705 786193
20476 786193 617640 535537 602829 551492 341364 484781 625059 484765 377551 276363
20466 276363 177556 96667 91925 68095 163049 222342 123861 133238 221461 309502 306890 174930
20454 174930 159692 331340 346032 445991 353816 335288 446510 607498 745541 781072 761054
20443 761054 716828 585609 666331 815305 710742 485296 365165 363315 396770 169368
20433 169368 22610 117556 425752 620353 494900 494133 576803 524621 556747 555973 434899
20422 434899 351617 439467 459253 441864 420744 511534 653388 812093 668396 595911 745806
20411 745806 1089330 1360174 1426206 1647591 2035084 2435631 2829514 3325612 4169848 5041551
20401 5041551 6364535 8101111 10379914 13649880 18457543 25500852 36244699 51349497
20393 51349497 65310711 62734895 46418066 32279255 23273126 17601481 13610365 10620245
20385 10620245 8551475 7392337 6393618 5396639 4396111 3575319 3057807 2753959 2312545
20376 2312545 2103269 2071670 1948272 1798155 1652115 1475403 1372952 1350898 1044537 566218
20366 566218 426520 478899 680811 810859 861331 956095 984004 889952 714887 433231
20356 433231 276834 247214 319682 433339 403415 363906 361773 429164 434051 353948 405518
20345 405518 473773 541001 614151 495954 349820 329128 399782 248779 65989 90149 117508
20334 117508 137360 162620 141660 132002 185894 182435 169754 167495 134435 29153 22029 199792
20322 199792 320156 222144 171973 92307 189348 206731 56577 -96090 -201125 -103028 74739
20311 74739 172141 311440 575235 900994 857819 619190 450498 389898 424383 421824 420486
20300 420486 398435 328941 402951 685196 705918 490636 321824 205365 93442 1628
20290 1628 79915 272713 266911 35005 -120944 -37846 19106 107708 186449 128105 165209
20279 165209 241284 241057 232476 301589 474373 554390 585729 522301 434491 441697 411004 412516
20267 412516 460485 580586 615642 509857 295177 157228 113280 -30481 -198354 -127317
20257 -127317 40740 233466 398839 593338 621443 633556 648027 695442 529902 -9090
20247 -9090 -389754 -470113 -338597 -65282 173902 321912 358835 299856 251372 190842 301219
20236 301219 483298 521732 605442 509583 130453 -217326 -410920 -351382 -131506 195698
20226 195698 481056 476585 417717 446066 516486 434112 271749 34565 46393 176966 259842
20215 259842 309479 426064 252068 263070 499183 681261 835176 921999 890857 914742
20205 914742 808939 670433 751236 791465 633107 415925 139988 11879 99819 256637
20195 256637 364459 282240 130952 48019 -32503 -933 62983 86990 98518 248034 407635
20184 407635 449659 512231 614151 622562 611102 726886 717530 388691 207048 350659 502863
20173 502863 644943 566872 419180 411010 284841 258274 415527 449654 280295 279986 298542
20162 298542 248571 -53163 -179475 -40221 71260 64625 105167 200766 172541 130191 107862
20151 107862 155471 324611 274649 397014 461801 316764 180652 30752 54677 85380
20141 85380 -144184 -297631 -198978 91873 119036 51852 -142778 -275368 -295044 -128621
20131 -128621 -148499 -271943 -376795 -275502 -131296 -106615 -61087 -32425 114511 92849
20121 92849 -34757 -1832 50813 124786 98226 143577 262099 318565 223783 182355 201454
20110 201454 148336 140734 261106 454723 476876 409009 212043 29963 192208 445538
20100 445538 453261 292441 103986 106980 234952 223154 446908 388498 344486 353339 473694
20089 473694 506410 517305 399854 379815 507921 461729 396487 516942 453337 293909 153317
20078 153317 125222 277603 255922 112000 -53291 -3181 235345 418622 644543 767377
20068 767377 541744 228812 155547 309139 398670 430095 523420 380265 184291 248203
20058 248203 333331 192482 68653 134778 -23912 -138035 145598 303446 345206 609431
20048 609431 732947 743772 861361 777163 498773 360098 375810 588150 746880 890982
20038 890982 1071903 1070754 872181 669095 638518 677004 718364 737722 585614 420631 338905
20027 338905 260672 140237 337097 615598 665707 783480 879160 955332 1033342 1128419 1312719
20016 1312719 1152304 1016734 1090934 1058298 1013318 1023635 1047839 1184861 1350504 1586662
20006 1586662 1603831 1492972 1461075 1632453 2008217 2260818 2388396 2549573 2641194 2656461
19996 2656461 2673062 2930643 3301527 3589784 4351418 5978549 6684889 7344522 8034032
19987 8034032 8414572 8876655 9673125 10493033 11653747 13252878 15644583 18923030 23812336
19978 23812336 30729997 40317710 53499201 73140586 104410935 154443627 224992263
19971 224992263 275154743 239047767 165332710 112203707 79225526 59915921 47609177
19964 47609177 39722601 34247226 30883713 28383536 26871874 26290932 27133798 29865167
19956 29865167 35405933 44321501 56279656 63159529 56315798 43788034 34763755 29005480
19948 29005480 25342366 22953172 21092718 19554655 18562539 17832920 17248578 17115500 17376583
19939 17376583 17515092 17606356 18210871 19709774 22469301 26557327 32520555 41041917 53566404
19930 53566404 72308223 99832310 134909836 160273650 155505046 140602553 138782619
19923 138782619 157545320 201147307 263711469 286494416 227735156 156306434 109117514
19916 109117514 79846214 60592013 47471580 38315962 31763158 26663665 22664793
19909 22664793 19279733 16592751 14466764 13000575 11581940 10127642 8761275 7866927
19901 7866927 7065447 6365846 5447888 4716433 4379968 4205496 3740706 3352191 2962506
19892 2962506 2664780 2431689 2362488 2267855 2268579 2267315 2203875 1979673 1797442 1676519 1629397
19881 1629397 1777312 1806841 1651919 1596533 1495407 1413811 1278262 1270780 1319922 1271277 1067933
19870 1067933 916308 734745 682892 814140 1011327 1262776 1647489 1940993 1914230 1542358
19860 1542358 1317056 1235807 1244232 1152809 955964 568245 555695 538299 437172 566339
19850 566339 667312 536480 304370 207958 218193 187816 210575 468849 708952 836245
19840 836245 832017 859670 904883 832122 807821 649319 502144 516273 810265 1084876 890354
19829 890354 562058 260090 -41002 -254011 -161472 52189 -8725 -202065 -453407 -466406
19819 -466406 -248403 -44258 105365 29306 -67973 40899 102725 213075 344267 124978
19809 124978 -191345 -387103 -511214 -565998 -485847 -269199 -25821 168166 176952 70207
19799 70207 32691 112360 209161 193117 154856 63663 -92336 -209838 -197890 -54621 -65310
19788 -65310 -162285 -154170 -35799 68410 279616 484133 409245 376121 443473 496367 528321
19777 528321 564574 499428 263001 -32560 -238377 -123238 123711 157821 67107 -74009
19767 -74009 -161495 -174343 -94580 -1624 59889 -22440 -47290 -28281 113096 202384 261606
19756 261606 283566 279208 312814 374199 341534 108262 -309782 -487458 -578133 -625020 -575216
19745 -575216 -370387 -368880 -371328 -56480 270991 303632 169457 22256 -55603 -103360 -121350
19734 -121350 -155131 -172445 -116499 -154051 -185442 -237212 -104625 21243 65735 127806 -37270
19723 -37270 -110619 -188675 -139886 -40148 25084 -67640 -105674 -74869 213704 544243 456677
19712 456677 287971 97852 -21952 23496 187038 89278 -95098 -177848 -234170 -325117
19702 -325117 -493410 -524580 -424700 -182206 -150222 -155961 -61503 -226483 -553970 -581391 -286395
19691 -286395 39301 22666 -122200 -154316 -219149 -120486 108215 84612 -9847 -30472 -5392
19680 -5392 -387 16494 24710 -106119 -82352 141207 202988 101742 -92870 -61478 66457
19669 66457 143130 91490 -48670 -254305 -327339 -181601 -119241 -216016 -420437 -867957 -999809
19658 -999809 -777260 -723272 -652717 -350348 -196320 -102227 21317 -20594 -227495 -231502 -129020
19647 -129020 -191979 -175607 -178552 -231255 -117510 -148683 -48992 33712 -129038 -225292 -233969
19636 -233969 -269426 -280582 -331698 -289909 -83654 172675 35794 -18112 -14138 69762 -61978
19625 -61978 -186876 -15505 49068 -220065 -338967 -60324 123280 64645 21893 20588 200051
19614 200051 374705 525507 538039 300304 -8428 -140153 -153301 12774 165019 193000
19604 193000 195507 87876 -57859 -58774 -31714 85681 175464 240785 272327 218515 184426
19593 184426 183309 87128 37239 205730 270637 138089 191563 309221 295190 287383 232005
19582 232005 221754 247673 181955 95581 -72897 -41402 128265 117449 40615 -2538 -75649
19571 -75649 -46247 -193753 -386953 -274189 7019 380151 814620 911467 631470 391354
19561 391354 84595 -56228 19129 85489 78713 68556 17227 5895 2618 44636 -81513
19550 -81513 58423 262245 349483 386004 300343 200262 40680 116186 169073 318903 640179
19539 640179 798088 711671 518084 327214 203557 -7836 -160950 12822 421682 708985
19529 708985 692603 631928 654407 607249 527092 399501 381145 294893 328147 447754 613991
19518 613991 518491 638187 796893 957198 1123219 1122552 998830 781008 963280 1349556
19508 1349556 1636123 1544489 1412459 1492271 1676904 2029344 2518288 2903369 2898136 3176497
19498 3176497 3808831 4525709 5536355 6840237 8325037 10144145 12778821 16402435
19490 16402435 21417828 28497030 38326361 52395408 73764541 101830059 121939949
19483 121939949 112955182 85233366 60776010 44025742 33126573 25609726 20209112
19476 20209112 16155834 13187946 10950011 9226022 7912033 7008650 6143522 5265665
19468 5265665 4513512 3774387 3032294 2585479 2468474 2396655 2133842 1971184 1540936 1180052
19458 1180052 993295 841993 768640 887365 1039751 1068470 1024934 1008806 1032858 951025
19448 951025 650845 428535 448872 528460 700432 1012493 1112311 843338 437447 188414
19438 188414 16636 -108002 -172211 -86261 15246 15860 18050 297126 476926 356053 323610
19427 323610 517454 702665 838893 760476 890493 1104677 1166595 985664 830980 875226
19417 875226 999744 1385644 1796653 2044791 2455628 3061639 4129605 5579317 7674116
19408 7674116 10477487 14811433 21418697 30748647 35364072 27464602 18019969 12534743
19400 12534743 9204162 7075737 5671487 4618175 3945364 3407779 2836336 2353903 2000920
19391 2000920 1639646 1427190 1412087 1307959 1094869 869207 673461 707129 737091 497448
19381 497448 283650 216636 133913 135128 188146 191900 277291 428499 325562 197674 79931
19370 79931 31186 40244 -6765 51573 79214 32373 -54414 837 127176 99087 -35395
19359 -35395 -3984 76915 -13702 -109703 -35656 22968 -87755 -192622 -277002 -266254 -307799
19348 -307799 -190879 -123629 -114759 -29902 -149620 -237816 -103872 -156093 -306723 -253593 20279
19337 20279 202797 28051 -231927 -207663 50557 233042 420787 474910 385461 323799
19327 323799 426851 572488 542621 605509 594305 465906 229910 132788 360014 493279
19317 493279 229241 96165 183020 380373 374642 359460 295004 96553 -99521 -276804
19307 -276804 -206214 -115663 -70549 -30594 -235796 -466481 -522486 -462226 -223090 -185032 -243080
19296 -243080 -308849 -321111 -152273 50315 43224 -53410 49376 300183 320033 101972 63035
19285 63035 16782 -160121 -256429 -372233 -466677 -368894 -433342 -681044 -682190 -484219 -350150
19274 -350150 -304705 -116453 17584 -35063 -209355 -163531 33461 137213 187856 114528
19264 114528 -119437 -231846 -271696 -455806 -667618 -530540 -264433 -221637 -467135 -666039
19254 -666039 -705719 -739008 -706010 -553873 -262562 -221883 -245597 -225625 -290677 -205898 -92542
19243 -92542 -8493 110135 74968 -127635 -380786 -581892 -503694 -333519 -259791 -217322 -153702
19232 -153702 7297 91730 144256 134029 39936 -20373 -135120 -203611 -96396 -55005 -94948
19221 -94948 -199384 -358271 -466134 -445529 -295774 -302539 -421983 -494692 -326870 -167193
19211 -167193 -118890 -327659 -513722 -616933 -663997 -622545 -420624 -239469 -185120 -349421
19201 -349421 -297217 -91867 -42268 -114076 -281507 -364370 -261991 -210690 -223888 -156105 -221480
19190 -221480 -236140 -96428 11703 -83010 -128722 -92072 101799 410968 405714 203122 164841
19179 164841 91323 -119298 -190583 -65195 47612 91512 240050 252928 157247 228532 226701
19168 226701 188941 149240 -54344 -240106 -104172 14581 5708 -113713 -131983 70807
19158 70807 -101284 -239101 -338002 -523221 -553220 -464873 -173551 26960 133269 270215
19148 270215 179869 -39142 -307013 -451132 -369390 -174882 21938 243323 268540 338863
19138 338863 385410 231922 145028 332087 355692 214071 11567 -3930 104894 271665
19128 271665 397996 493923 438341 314093 307898 304696 246775 227356 188024 183813 147632 -146610
19116 -146610 -350650 -258586 8562 331185 416463 322945 368998 387600 381542 412349 330013
19105 330013 315884 302489 209484 66932 18629 147207 208032 175915 233719 263119 278563
19094 278563 220127 320093 291836 92724 78299 174024 203135 332309 580151 832990 966471
19083 966471 1091771 1074652 994143 904254 974608 1131390 1269362 1389906 1529370 1552068
19073 1552068 1788722 2447649 3234275 4163576 5424763 6928273 9020274 11911695 16277828
19064 16277828 22740309 29625311 29841260 22679907 15930746 11534814 8822693 7210725
19056 7210725 6024750 4995945 4143451 3370401 2725210 2316748 2042901 1823370 1511725
19047 1511725 1067517 765177 635305 519332 292285 93009 109053 85996 -64049 -91337
19037 -91337 -78438 -67575 -93632 198479 579425 715864 569109 319584 226843 265696 326698
19026 326698 413031 373473 277735 266178 266165 118134 99190 108636 72777 138972 305078 290097
19014 290097 43753 -49225 -43114 66387 169782 221852 398499 359159 134375 -57207
19004 -57207 -141896 -90077 105635 242886 267986 118368 -114694 -239797 -441237 -812836
18994 -812836 -893602 -661669 -445621 -359423 -203679 -38265 108757 178883 316988 520035
18984 520035 430139 332013 349526 231376 -40568 -322897 -503012 -624384 -720518 -753148
18974 -753148 -606907 -458699 -326730 -84992 225163 311496 264092 346505 405093 273964
18964 273964 77030 121915 142602 181954 187954 152210 37424 -151512 -422931 -575766 -572759
18953 -572759 -414240 -433082 -454339 -382221 -200687 -71797 -51897 65444 175124 205095
18943 205095 119621 41221 82018 185881 305570 416102 436957 458294 254087 93142
18933 93142 122597 147890 218964 59409 -168040 -289659 -182387 -78826 -27052 -36649 -12772
18922 -12772 85050 -12808 -142787 -140132 -55559 -19059 -109840 -224902 -395124 -436468 -354417
18911 -354417 -308460 -345224 -419038 -255517 11696 133105 134024 61594 132227 354284 395282
18900 395282 280933 174093 46946 54195 178588 259694 299064 172468 50864 -160950
18890 -160950 -376736 -466893 -379120 -250241 -26564 139057 331144 221037 26129 121570
18880 121570 270469 372637 419891 506880 524341 521281 548247 428949 388401 357706 323121
18869 323121 381216 549397 395045 126790 -109164 -346077 -441585 -388832 -369718 -334832
18859 -334832 -377343 -348756 -363403 -343555 -377403 -370559 -233202 -57199 138342 62399 -113778
18848 -113778 62508 216246 134913 198414 313735 213204 62305 -99404 -206853 -253734
18838 -253734 -225379 15108 118561 -10886 -76255 -103797 -71595 -119 156086 232820 253715
18827 253715 289875 285649 115242 -201746 -417868 -470014 -409588 -413830 -457472 -440608 -358396
18816 -358396 -281556 -462899 -731723 -802322 -530884 -391128 -524007 -566464 -453381 -293129
18806 -293129 -284683 -325159 -357402 -326624 -342230 -252349 -128044 -48449 -23810 -74076 -10784
18795 -10784 27244 -26757 -159933 -113639 -58369 136716 269176 159204 7016 -176808
18785 -176808 -313873 -321670 -220701 -278184 -216596 -145334 -115367 -150267 -183247 -149138 -128947
18774 -128947 -259150 -380315 -297588 -220262 -327494 -390674 -388602 -462656 -415466 -380516 -355954
18763 -355954 -216695 -134281 -174857 -339495 -433468 -496082 -705745 -871560 -613896 -331677
18753 -331677 -223431 -115125 75848 247997 126687 76539 218352 305767 129800 -10096
18743 -10096 -60660 -268138 -505904 -537943 -429198 -339561 -228091 -202029 -302942 -227234 101573
18732 101573 386451 357010 160285 17917 90028 26714 116351 258628 111121 6233
18722 6233 -22353 -52402 31149 105172 -52563 -168289 -38722 137973 99971 -39815 -121034
18711 -121034 28603 247574 146367 -130258 -287212 -321458 -170779 50227 209844 256324
18701 256324 285588 215861 88861 -22879 -209607 -285331 -360382 -359607 -219294 -3894 290538
18690 290538 484622 439734 207455 173244 212302 352994 314265 262465 4294 -13676 135333
18679 135333 36406 -93091 -96849 76775 371047 457069 303534 135496 98665 42494 2842
18668 2842 104069 127578 65785 95327 19190 -158451 -270850 -347173 -224630 71945 -40519
18657 -40519 -161192 -213284 -133538 10865 12898 -71365 -100446 -154030 -294361 -356963 -231181
18646 -231181 -202173 -111853 124965 184715 132014 74255 108816 40227 113518 120387 29332
18635 29332 14648 -12243 124793 -5043 -285755 -290261 -258877 -320727 -443123 -590585 -589961
18624 -589961 -432959 -237276 -261071 -486300 -594409 -561854 -335849 -159511 108346 240229
18614 240229 171432 268265 368359 187636 -44541 -118756 -154556 -108624 -127640 -69464 -51488
18603 -51488 2074 -136798 -286319 -334273 -287931 -228182 -283675 -166913 36415 170517 199009
18592 199009 132361 128438 228497 58995 -195307 -484085 -639223 -625253 -665580 -581435 -253945
18581 -253945 -129316 -109549 -26299 -176590 -422707 -600507 -594776 -512986 -422936 -202598 32162
18570 32162 186569 366948 396651 219894 300109 456829 460797 495765 544790 678883 598232
18559 598232 176237 -281541 -371578 -48431 192786 243655 244048 187656 109839 210993 334837
18548 334837 262456 123765 -53700 -52314 -54072 -100088 -991 -45311 8521 -75124 -207555
18537 -207555 -169138 -9495 154403 245348 148095 -73087 -205113 -157505 -42155 80588
18527 80588 237047 247212 161083 167013 316644 394839 193783 -56427 -160810 8171 257165
18516 257165 197097 -85428 -290223 -278010 -206593 -236997 -293520 -405379 -434347 -311568 -331223
18505 -331223 -444712 -441186 -421779 -479348 -385424 -280568 -265336 -244481 -34471 119412 123632
18494 123632 -6221 19387 226891 191253 9638 -40066 -111027 -406391 -574122 -565400 -581408
18483 -581408 -717692 -679901 -660786 -646992 -495181 -350805 -285593 -171383 -28609 -73849
18473 -73849 -148010 -187077 4322 294294 368751 398574 237418 165089 215918 79500 -94426
18462 -94426 -262040 -423783 -471578 -356437 -217673 -139795 -170497 -225264 -252203 16412 174272
18451 174272 169905 165403 85719 76235 194530 289421 401907 613131 663621 560459 420557
18440 420557 296895 144969 5019 -163638 -468137 -679408 -713138 -697703 -614243 -697227
18430 -697227 -923589 -854177 -766046 -801745 -644731 -655933 -787881 -863095 -746416 -666455 -484599
18419 -484599 -187237 -30973 -4417 -42420 -132211 -330236 -387315 -261898 -81359 -88543 -171671
18408 -171671 -170798 3035 228157 125140 -2829 14510 79115 129541 11121 -175100 -233735
18397 -233735 -107788 -228343 -460674 -555277 -552111 -472013 -477003 -584762 -452189 -183032 7524
18386 7524 113640 111703 134205 219192 254277 201407 5522 -51171 131879 197049 238635
18375 238635 327903 297262 315447 504883 438681 207027 22482 -143357 -341961 -379946
18365 -379946 -353521 -242594 -87414 -19102 154825 317829 125607 -71166 -95776 -87150
18355 -87150 -33089 122397 263143 159732 113580 241904 94578 76570 145908 160285 113289
18344 113289 249277 398362 295276 265445 279894 268714 598378 842902 851281 784532 636128
18333 636128 540301 372977 280131 113803 94924 286102 358266 340757 222623 -19384
18323 -19384 -78205 163998 160188 10178 -30561 -85179 -176191 -275404 -118143 159203 391749
18312 391749 596778 732078 506483 144152 -83743 -275040 -260905 -104267 205768 530363
18302 530363 838592 998827 728700 474889 328811 380231 487787 579837 648973 650702
18292 650702 497108 552986 968215 1151723 1292358 1420428 1309531 1083957 793520 504838
18282 504838 374765 423130 464845 439904 558688 573016 488415 462906 408777 277665 203119
18271 203119 360299 484230 391010 296117 276009 354912 518132 667298 880911 773153
18261 773153 620855 522549 389468 314921 478442 676662 752692 587455 373881 464601
18251 464601 573663 591188 663178 804386 986578 1186528 1396582 1501691 1494858 1477788
18241 1477788 1599826 1715581 1748581 1785758 1971922 2221673 2753875 3192331 3356132 3617463
18231 3617463 3763288 4163766 5052655 5918836 7035138 8706061 11294734 14648905 19025900
18222 19025900 25079203 33907113 46632176 65899437 92499799 118183021 119565678
18215 119565678 94375165 67161951 47849734 35293032 26925055 21195407 17033374
18208 17033374 14012648 11515025 9543896 8161203 7171798 6115874 5097123 4429477
18200 4429477 4093167 3662647 3344128 3056530 2730434 2469504 2509063 2480820 2261693 1907478
18190 1907478 1383186 1089907 887870 579928 578306 786374 1000837 1008042 840428 755323
18180 755323 702649 430519 154454 102196 -24569 -9795 136084 204956 243236 165774 -4119
18169 -4119 -129 52492 49527 85967 94750 101174 19673 -136137 -179266 -79792 153296 396901
18157 396901 399196 331160 275035 287613 369145 206400 12208 -30798 6445 -54059 -73431
18146 -73431 -14462 34166 116164 262566 251226 60216 137347 380510 481884 448136 267876
18135 267876 165732 168048 309410 406112 431008 399602 299714 188707 27068 -113799 -114990
18124 -114990 -121081 47549 255121 453534 664995 821517 758100 605167 456726 323939
18114 323939 227975 167594 143467 142255 186115 158830 160705 145408 150745 127603 114509 313028
18102 313028 548971 514406 449029 345187 483539 567088 407615 286416 243090 248110 292974
18091 292974 321819 359140 457153 721090 773263 593181 395834 248534 349874 340443 187353
18080 187353 111718 39273 33916 142158 196508 276256 322817 399044 669798 675503 450798
18069 450798 370757 385851 453410 362681 253402 265015 214305 210759 343031 466697 387289
18058 387289 106532 -57677 -49278 -25265 -68415 167804 384568 556693 730993 700806
18048 700806 497191 296274 137215 114339 225854 353059 445256 526918 469118 337059
18038 337059 215713 190689 218267 210615 100122 135894 316592 713662 1150903 1325925
18028 1325925 1107449 833812 600363 385433 261509 396337 520946 489457 490455 665504
18018 665504 852990 1045558 1161712 1263917 1201892 1161248 998506 792641 773134 872325
18008 872325 914852 775216 502763 426319 497531 594895 589037 484911 361059 332371 173346
17997 173346 -26550 -80505 119977 491447 779701 736057 631743 733961 914786 829845
17987 829845 577623 517825 605921 634176 661577 528471 423522 536288 605597 748329
17977 748329 851467 988286 1186293 1275869 1393333 1339385 1035497 751990 749778 1097985
17967 1097985 1457565 1512289 1484758 1475375 1481364 1647679 1825528 2000457 2288504 2566994
17957 2566994 3054399 3871399 4864273 5887709 7361684 8985386 10843402 13392288 16981008
17948 16981008 22046634 29590390 40515879 56510649 80212588 109881960 126347039
17941 126347039 109708508 79533842 55884035 40122272 30143088 23563195 19195694
17934 19195694 15999971 13285649 11009525 9191047 7600403 6511798 5814973 5299835
17926 5299835 4545759 3846049 3407432 3224774 3055410 2800354 2370333 1998095 1746631
17917 1746631 1358015 910411 549451 384820 599421 748575 768075 822887 823165 638990
17907 638990 634310 672069 547210 322438 275259 341184 232310 22232 134981 344484
17897 344484 237208 149711 170465 303660 474387 421661 301417 194796 283790 367323
17887 367323 464169 433394 363781 386413 518396 495313 283584 95384 63438 198231 491892
17876 491892 686565 626144 508125 359443 190747 219563 444204 555444 705976 862754
17866 862754 818383 953752 1134380 1138433 1062991 982856 844782 850677 942196 731805 447086
17855 447086 212123 79432 56752 72789 137660 380778 654320 753363 690513 763049 991793
17844 991793 1139000 875084 608279 536245 414365 369043 298044 293092 266172 120267 143238
17833 143238 276855 416885 455764 386256 236277 25431 -106679 22022 80200 -62941
17823 -62941 -165924 -47082 19739 -253648 -467093 -301512 65285 406309 522383 596872
17813 596872 714224 789407 532225 298712 345682 278811 110507 121190 328224 200373
17803 200373 -306853 -638571 -726942 -540513 -200190 84639 64844 -44454 -63220 66007
17793 66007 -7710 -138005 -151308 -103702 29530 92829 142810 211012 261092 139576 -87097
17782 -87097 -98044 -3607 42338 231671 314299 69802 -65932 209102 348642 307437 317391
17771 317391 264288 259184 168580 31894 -111078 -172569 -48407 268383 479471 737718
17761 737718 707116 321624 101181 -14505 36755 141825 281331 446152 347754 235154
17751 235154 308624 379257 233370 -42879 -178191 -13482 218550 335749 507617 744070
17741 744070 804529 801251 1121214 1397006 1281967 933019 526852 466246 656403 707943
17731 707943 554200 445485 312200 281257 316302 361442 630851 819683 735092 759496
17721 759496 805936 579445 288276 163187 238940 427257 841143 1004431 667775 418676
17711 418676 373840 190717 239049 502091 619010 467303 268097 165603 265261 453443
17701 453443 616765 571250 490788 447279 460301 660621 875174 905362 754573 611752
17691 611752 758540 782656 839341 955394 817230 738201 676816 851042 1022664 1099136
17681 1099136 1163118 1252708 1419079 1557261 1518137 1785888 2093372 2481676 2973840 3323525
17671 3323525 3604543 4004033 4552867 5139078 6035544 7318505 8899943 11142558 14460848
17662 14460848 19074298 25125887 33205983 44241184 60666525 84359774 110863328
17655 110863328 119983349 100737100 73685150 53597267 40224226 30694428 23799235
17648 23799235 18781369 15043269 12350923 10513359 9263871 8061538 6745730 5729924
17640 5729924 4925148 4192843 3600785 2957174 2430294 2195836 2020036 1770162 1576263
17631 1576263 1566172 1550977 1558919 1559664 1525396 1303382 1081807 871257 589250 250414 104840
17620 104840 -11805 95042 392204 600021 577097 405340 462994 553979 613889 545696
17610 545696 471723 439700 283466 317886 379661 160686 -94028 -141035 58417 223131
17600 223131 96290 -112077 -227880 -113207 -4208 133863 187693 60745 202037 578480
17590 578480 784971 727431 535303 302155 310552 581407 685920 679944 595640 545454 406619
17579 406619 368546 404488 535613 731583 970298 1363996 1679563 1968092 2682154 3467117
17569 3467117 4699046 6353989 8517514 11369706 16288393 23991352 33238320 33572450
17561 33572450 23776515 15885237 11107601 8152440 6090918 4738436 3868251 3240550
17553 3240550 2666214 2174671 1684580 1444451 1342302 1205466 976828 972108 757535 544943
17543 544943 446868 379674 90909 166885 235926 335101 364468 297650 245506 195590 121511
17532 121511 83210 249086 511126 497239 391962 301856 214364 36454 -121895 -132308
17522 -132308 -91229 -112614 -174746 -323652 -455034 -371181 -160139 -69790 -145889 -312478 -470889
17511 -470889 -336189 -176388 50957 287327 198727 11458 -9887 140013 257638 313817
17501 313817 220091 53401 29275 -32147 -118532 -96658 -157560 -210012 -352190 -369408 -291558
17490 -291558 -230038 -277346 -356386 -329372 16332 297606 240562 53035 -267843 -526189
17480 -526189 -433470 -281103 -317684 -158289 -109072 -133622 -128365 -94325 -57477 -137523 -18051
17469 -18051 184151 258436 284598 424987 612520 658008 516491 352705 228695 163773
17459 163773 124452 96763 137134 253247 247163 168155 246388 198480 138938 225724 149864
17448 149864 170903 205475 105682 -31539 -27964 47577 138199 228542 77699 81873 134127
17437 134127 128561 87805 216999 378713 282864 20049 -154306 -168959 -96110 -43767 52661
17426 52661 278228 409872 410853 292196 195080 41987 -173004 -252045 -392138 -423405 -365490
17415 -365490 -45680 438658 498586 218691 -48536 -35391 29544 -176118 -239300 -159779
17405 -159779 -37586 58583 142125 85781 -147392 -361434 -335288 -239554 -7949 56372 -174013
17394 -174013 -213128 -146416 -157515 -346008 -663636 -713338 -575901 -314761 -240541 -324485 -437746
17383 -437746 -515420 -503139 -373900 -223148 -26142 241752 153457 -268316 -479064 -436279
17373 -436279 -401675 -514998 -510607 -385499 -278498 -208316 -211159 -251735 -190756 24929 256786
17362 256786 238914 46104 -75544 -17146 19477 182764 224998 178747 120057 -138552 -206659
17351 -206659 -211638 -294688 -150323 -61177 -195804 -218106 -115080 -22327 139266 163970 -42530
17340 -42530 -167386 -35084 143422 249909 181293 1083 -80789 -216543 -246540 -181276
17330 -181276 -213583 -324908 -277120 -146192 -292894 -363716 -203969 -62410 -113459 -148555
17320 -148555 -177100 -71850 141843 245046 211034 197047 264858 112277 -219525 -385710
17310 -385710 -274706 -316333 -447571 -390161 -267045 -238087 -153526 11787 228657 240762
17300 240762 36590 83741 17248 -52278 -91974 -170685 -64128 95472 34569 -98202 -274389
17289 -274389 -375643 -328351 -222875 -115753 78496 51616 -221109 -252435 -366586 -428351
17279 -428351 -424354 -638601 -647569 -404364 -247249 -158713 -131041 -103870 -19623 34168 -41343
17268 -41343 -77323 -189804 -337453 -419564 -372784 -312237 -302791 -369133 -308350 -109052 94869
17257 94869 194540 215687 54191 -39167 -23699 42181 240178 237883 219485 158256 135055
17246 135055 58317 15495 -48857 -192899 -195844 -253291 -463657 -668299 -672147 -244137 99219
17235 99219 101049 5958 -203171 -382781 -437472 -443726 -512003 -517747 -413282 -103034 130185
17224 130185 125121 93500 79457 -64909 -177840 -219456 -96212 1772 33855 114396 140376
17213 140376 148979 27585 -144850 -281151 -448606 -427135 -249993 23816 243066 325194
17203 325194 100358 -103898 -141048 24995 213681 315980 394777 269575 160274 219641
17193 219641 395609 324484 206046 92576 -33409 -384770 -639700 -703110 -712951 -629325
17183 -629325 -640096 -547968 -405768 -456978 -458301 -248963 -24258 369861 628607 559896 235659
17172 235659 -298158 -627849 -524771 -481912 -686481 -906758 -878298 -653523 -441024 -250462
17162 -250462 -87321 -115213 -184108 -319318 -351717 -183440 -90922 -150833 -363249 -412085 -355036
17151 -355036 -526208 -722519 -641425 -639175 -591283 -411168 -192745 -92821 -193700 -345494
17141 -345494 -503146 -343215 -118907 -59121 -104149 -185808 -158499 28565 153030 95271
17131 95271 -10690 50812 231212 388606 513506 448436 195150 16738 -203870 -506310
17121 -506310 -481916 -299524 -44994 152129 -1485 -143827 -86668 -259280 -367919 -371408
17111 -371408 -300257 -187908 -278752 -370298 -293318 -33698 78918 111964 -26148 -93785 -153039
17100 -153039 -273049 -267549 -158050 -61964 -20019 -112710 -347679 -407945 -179159 -211622 -351391
17089 -351391 -212704 -49719 -163254 -168849 -14398 46444 17003 17675 -1290 42545 52621
17078 52621 42218 152697 462237 571553 353143 216635 151789 111754 145525 189858 125576
17067 125576 51287 -142871 -208543 -131683 -166692 -304232 -339150 -239483 -247129 -256696 -238527
17056 -238527 -279607 -231366 -263814 -192117 -110201 -343345 -501995 -366673 -34896 67118
17046 67118 -90154 -165796 -259167 -252835 -140690 -112087 -238874 -133920 123317 91006 -84755
17035 -84755 -82096 -56073 -238886 -530077 -508454 -259184 -255145 -392150 -463944 -380629 -134265
17024 -134265 78911 95152 95843 53517 105342 256602 321979 178918 -49405 -202798 -221336
17013 -221336 -172993 -204231 -143613 -63182 -161940 -205750 -346386 -497510 -494554 -386127 -311109
17002 -311109 -149798 -168013 -344937 -377014 -327574 -294581 -429505 -565025 -739086 -804421
16992 -804421 -656815 -464383 -179246 -86576 48924 319977 315940 194897 47150 -111663
16982 -111663 -138741 -301236 -671134 -714387 -621187 -527857 -429641 -547315 -476460 -323786 -339762
16971 -339762 -254725 -279092 -483020 -564427 -480290 -275218 -41016 169972 221008 -50568
16961 -50568 -204839 -258348 -275804 -401539 -478537 -277232 102438 77025 -175239 -143633 -132425
16950 -132425 -199783 -180835 -153147 -184707 -250598 -216356 -231115 -97395 -25810 -27252 63573
16939 63573 156602 97214 -95978 -247115 -274849 -258064 -14491 67923 -150823 -427878 -546478
16928 -546478 -555257 -474806 -324757 -341863 -533635 -528186 -265644 -198715 -316226 -161194 242104
16917 242104 491718 683951 562721 142374 -132991 -179370 -264635 -314021 -251609 -249622 -105089
16906 -105089 -44139 -147656 -189026 -275447 -239532 -94793 -18585 -52634 -86824 84480 37412
16895 37412 -156089 -191728 -237635 -387032 -401774 -335504 -295521 -291678 -407327 -284985 -131459
16884 -131459 -217228 -397130 -422400 -379118 -489886 -627952 -501067 -168924 103558 154262
16874 154262 76499 -89140 -213013 -96975 -6693 156704 12154 -141148 -12739 126699
16864 126699 129738 94985 -134072 -414943 -360665 -192947 -92348 21002 -51610 -227874
16854 -227874 -228728 -79682 81424 72473 55493 64473 -150313 -348107 -391789 -301885 -250835
16843 -250835 -282761 -402566 -592821 -643198 -488584 -303294 -374383 -419580 -285447 -205156
16833 -205156 -50688 62291 78131 68851 -56586 -199082 -155447 -87714 -154778 -138427 -32929
16822 -32929 137383 167811 242851 448887 570897 626642 560653 495279 460531 257398 247791
16811 247791 314665 299759 271076 305411 470844 478963 110061 -90679 -132076 -89620 -43304
16800 -43304 -43957 -149040 -301060 -416708 -402629 -273717 -168410 35494 257520 324772 394584
16789 394584 373270 325912 364520 154613 -261864 -391508 -410841 -148767 223146 177479
16779 177479 152632 208841 246519 79754 -106546 -53975 17526 181112 313515 229261 220753
16768 220753 372446 419132 403972 424893 320750 6788 -97296 148640 366344 402028
16758 402028 182990 69688 117679 244567 284093 125247 85224 107892 -3948 -111054
16748 -111054 -85550 1735 -23076 -236061 -323171 -319209 -381147 -211051 75737 219121 162711
16737 162711 21934 -49552 -178346 -288198 -286277 -221113 -231667 -285824 -178426 -164811 -293955
16726 -293955 -381228 -400587 -400666 -489670 -569074 -475856 -354314 -428772 -576432 -600835 -608171 -518642
16714 -518642 -293294 -9448 204014 50853 -136225 -215280 -389747 -455554 -347695 -111786
16704 -111786 -57762 -108015 -63482 -93751 -224597 -265215 -200280 -41295 33675 -150153 -174660
16693 -174660 -75851 102619 129587 -26979 -114985 -119345 74029 314239 488460 444459 295887
16682 295887 239070 237999 149197 138376 408052 321794 -92607 -103970 53644 55289 -149305
16671 -149305 -406290 -322227 -83422 24418 71231 64632 -182514 -427284 -564325 -762309
16661 -762309 -828801 -658535 -390824 -42349 46953 78667 260731 337634 225048 115300
16651 115300 -87432 -305089 -417160 -401902 -348590 -333387 -424433 -611570 -918003 -1151282
16641 -1151282 -1125907 -921928 -747861 -632207 -449595 -338988 -427378 -514963 -438048 -234295
16631 -234295 -227630 -257982 -165485 -261125 -424865 -416939 -402665 -524942 -509729 -413725 -494683
16620 -494683 -566645 -456906 -453447 -474555 -209321 -48390 -156297 -103774 -116751 -175766 -14289
16609 -14289 15357 49599 -60910 -203122 -345304 -405062 -395859 -422777 -353612 -163033 -71567
16598 -71567 -73183 -145518 -109051 -146718 -143288 -20452 -80928 -250956 -347916 -282950 -192112 -85894
16586 -85894 -137753 -185255 -69426 146139 184546 35168 91663 195389 143326 152950 108234
16575 108234 -126025 -337328 -353118 -470802 -560616 -573597 -556075 -670605 -713472 -505381
16565 -505381 -210247 -124608 -320517 -390222 -435050 -458784 -418435 -403094 -536259 -452171 -300885
16554 -300885 -213056 -187171 -25437 201775 123221 26937 -96907 -160149 -193042 -197836 27350
16543 27350 331250 307795 82352 -58492 116839 195501 196066 296470 316390 331784 321824
16532 321824 47992 -240458 -206864 -55612 -135105 -97047 34482 64397 164959 209762
16522 209762 123727 -62646 -20494 134243 156309 102438 -131954 -205907 -20802 61522 178558
16511 178558 413777 403102 146851 -110070 -178725 -158972 -170740 -226339 -173287 137136 370762
16500 370762 253054 28638 41932 38868 37436 17099 -50476 -146631 -273987 -327248 -228690
16489 -228690 -29442 64171 -55772 -211174 -153263 -61103 85237 176939 192146 3187
16479 3187 -310438 -484294 -427142 -522582 -516620 -299744 -155662 -214329 -399964 -443013 -397596
16468 -397596 -328630 -246760 -176864 -96537 -145055 -198183 -129950 -260318 -355605 -28175 333170
16457 333170 506372 445234 316791 188307 193461 373176 490500 421554 346280 164820
16447 164820 338089 646311 670873 454684 245892 161357 -55512 -65483 -111077 -280889
16437 -280889 -376126 -272807 -70158 117432 136639 68147 -94099 -94848 172136 169907 33408
16426 33408 37927 -16567 -242758 -362898 -326575 -248011 -127177 -44563 42725 211318 332748
16415 332748 287993 199646 -50468 -270905 -285735 -287294 -286515 -232837 -266376 -379831 -306316
16404 -306316 -120618 -66077 -323443 -748939 -858359 -590965 -294777 -199919 -251763 -174581
16394 -174581 -1855 232572 348000 435183 311943 -51344 -286963 -426676 -468668 -416685
16384 -416685 -262820 -93041 -9716 50059 95590 -7640 -47235 53135 40262 56646 86054
16373 86054 -45256 -215117 -240123 -152868 -143922 -166155 -88348 -3627 -108972 -266660 -338805
16362 -338805 -336267 -211814 -42135 28056 -131014 -294207 -284620 -169564 -146375 -189159 -85896
16351 -85896 -110521 -117307 -61273 -103045 -195423 -106250 -68871 -60621 221677 279796 33385 -58941
16339 -58941 -74897 4291 211502 491228 725113 647414 463426 484812 456097 218813 -161227
16328 -161227 -451414 -391849 -357220 -457529 -506245 -328351 -26468 83372 199228 243612
16318 243612 293316 238185 166929 219676 195196 146442 210658 216619 146478 27015 -151433
16307 -151433 -421096 -407106 -235000 -154600 -231092 -284527 -104409 124988 301623 354658
16297 354658 192679 28342 -71555 -162217 -150278 -99270 -17610 747 -118505 -167042 -46666
16286 -46666 -175819 -315711 -329576 -319950 -425669 -445733 -547136 -492199 -268918 -162341 -105682
16275 -105682 94220 168147 10362 -48372 -105586 -111607 -14602 2204 227126 623428 830622
16264 830622 750136 637477 470994 215805 -35406 -205444 -385484 -315180 -355392 -507412
16254 -507412 -590028 -675871 -634852 -505652 -292212 -157410 -218273 -188894 59509 193839
16244 193839 205164 321259 328730 162597 145919 70300 -164182 -198667 -107240 -32762 -177207
16233 -177207 -197271 72302 111156 17223 23749 -32305 -106863 -128232 -173875 -224469 -367711
16222 -367711 -322929 -27417 324703 553607 629827 536650 390224 259378 243476 125568
16212 125568 -128652 -338171 -353578 -237995 -151400 -361335 -456784 -386747 -348578 -300024 -275693
16201 -275693 -332734 -444244 -395835 -141596 42973 -47371 -127083 30529 -20566 -208801
16191 -208801 -256331 -218978 -38825 112930 -10134 -358609 -542943 -358456 -42353 157558
16181 157558 45153 -82528 -35167 -92794 -188923 -51106 253786 404866 409741 279103
16171 279103 165350 83116 -16665 -185487 -290217 -266376 -184086 -133198 -152774 -144554 -436055
16160 -436055 -736682 -727921 -726409 -659753 -327075 -131904 -99910 -199678 -289478 -332733 -328819
16149 -328819 -220937 -102151 90765 255578 243992 193613 271058 279909 154550 163550 173679
16138 173679 161528 213545 228752 125156 -22279 -113460 -206213 -268219 -143485 51504 314896
16127 314896 573947 371522 -32719 42893 271067 202810 65709 242461 409146 347153
16117 347153 324345 303899 287551 230061 199076 267093 231340 94212 -78052 -127083 -308363
16106 -308363 -450983 -443810 -528205 -454301 -202614 -121853 -129443 -133689 -145666 -43702 194476
16095 194476 17564 -294606 -240139 -2057 97840 98371 70454 117651 189707 191125 241369
16084 241369 195564 139730 183999 176233 143690 153791 192138 283768 271668 23273 -126720
16073 -126720 -233700 -384538 -678370 -737579 -587919 -329050 -111534 -6094 -129823 -261834
16063 -261834 -357595 -362193 -186577 -14533 52523 -67334 -321552 -603459 -693222 -621896 -418219
16052 -418219 -255553 -97435 727 173402 230012 226942 236678 314009 213959 -136393 -434981
16041 -434981 -497937 -327013 -122201 46613 194568 284022 433746 390949 110926 -42891
16031 -42891 -56309 -171460 -176991 -123839 -7070 244397 489835 398592 205838 268306 415131
16020 415131 174113 -70697 -208923 -305397 -250324 -218385 -42143 69689 -34597 -124467
16010 -124467 -69845 168907 230630 283637 478437 481915 201858 83455 53155 -131676 -204400
15999 -204400 -900 147890 75384 129258 108531 4910 50667 109936 59388 70103 128426
15988 128426 75685 -151790 -369135 -302317 -153440 -59042 -179432 -376681 -310044 -21592
15978 -21592 13382 -203120 -403450 -457731 -231305 91950 83055 -179595 -256905 -218216 -54896
15967 -54896 -40927 -148423 -66897 -146016 -290130 -324573 -346371 -456513 -489556 -603412 -666773
15956 -666773 -433702 -115740 85727 152792 44968 -95872 -163422 -198059 -475883 -556455
15946 -556455 -543952 -636512 -594538 -292122 -73844 -8115 236031 467148 475162 501099 503557
15935 503557 307113 70714 -132076 -125008 -131162 -192304 -250989 -130289 147864 165579 51411
15924 51411 193373 311087 157808 -102851 -38433 261048 417534 294799 -47404 -196286
15914 -196286 -37883 -154307 -164459 12945 -3520 -118176 -116924 154861 360117 287539
15904 287539 356364 330614 53265 -102983 -74853 56190 149115 262631 168755 5740
15894 5740 -242005 -456985 -350566 -27549 34710 -21514 -47916 31022 77650 -82866 -172174
15883 -172174 -84674 241092 462396 380488 186851 296758 526689 575601 545493 572862
15873 572862 405613 96207 -49763 -187584 -249262 -84678 159034 319455 516408 686966
15863 686966 843946 917840 708821 378391 157309 238867 371578 276441 -32145 -303359
15853 -303359 -185243 72623 329345 540472 639513 474684 266660 230698 184541 112166
15843 112166 165347 398158 353522 285388 431179 523797 397982 290357 289952 100362 -173957
15832 -173957 -399710 -641536 -692880 -472760 -272425 21774 185971 7589 85498 225186
15822 225186 47627 109708 227584 70698 50677 14120 -85564 24529 -26160 -147833
15812 -147833 -27417 143660 207791 349163 354131 189659 149492 220581 172026 -135401 -428972
15801 -428972 -654049 -669994 -454303 -294725 -142906 -136330 -414851 -577631 -387980 -110015
15791 -110015 168835 296691 331555 200930 159520 135486 59498 -144883 -369203 -566203
15781 -566203 -865511 -668079 -278190 -99046 -52727 -61425 -83854 -3520 75219 154950 253935
15770 253935 282411 134117 120791 271633 247559 135889 41156 -26003 -103472 -4261 157067
15759 157067 76850 -176973 -429419 -287245 7140 16418 -118940 -315786 -257837 -255363 -318477
15748 -318477 -301661 -374177 -248016 -97338 -92060 56934 145722 85110 -4655 57276 188451
15737 188451 -16174 -284433 -392278 -383295 -375925 -344482 -251039 -249471 -293747 -164672 -184648
15726 -184648 -219084 -103746 243468 325936 218726 50481 -16490 128417 316489 430827
15716 430827 370334 195981 -11870 -28772 87216 309626 499877 338807 82885 -39532
15706 -39532 -17451 79866 178915 216364 168307 71979 -97586 -260387 -279149 -185522 -122957
15695 -122957 -71088 -94772 -339956 -355583 -167542 -15481 -38572 -141540 -115830 79137
15685 79137 141936 53144 -52094 -71628 1590 -41482 164413 414315 235508 66641 -18046
15674 -18046 -50551 -118387 -8307 180916 212110 324632 434639 381874 532137 639258
15664 639258 471060 272336 134148 184751 214689 262700 274867 112885 -7200 11306
15654 11306 -35974 -82095 -59857 88366 237160 336695 367522 360545 422162 359470 277524
15643 277524 217075 126322 -73698 -155671 -76297 -54142 -151725 -65719 44059 30092 -32213
15632 -32213 -61614 118927 205782 -48280 -182012 -346802 -436745 -486961 -465061 -415033 -531169
15621 -531169 -531400 -396385 -243683 -173864 -266292 -346888 -152098 -37601 458 -131898 -222791
15610 -222791 -157709 -215255 -350127 -516114 -631310 -586779 -392333 -85214 -43176 -67597
15600 -67597 -138097 -181772 -396347 -535071 -394272 -194159 -15276 -13056 -349009 -671935
15590 -671935 -805369 -866801 -655960 -413465 -219071 -114722 -189436 -219173 -228921 -150734 -75831
15579 -75831 -95974 -260404 -204769 53823 122216 -47168 -332529 -476500 -502604 -470944 -453891
15568 -453891 -453824 -361145 -248003 -148412 -139385 -303784 -332567 -68049 87407 29125 36943 56904
15556 56904 124159 270042 261216 75756 -214395 -699279 -970706 -891137 -732277 -609008
15546 -609008 -604851 -422979 -28494 212143 364040 553659 697114 534042 182050 18916
15536 18916 -152908 -403881 -319889 -177629 -131710 45840 306569 387159 99202 -150029
15526 -150029 -275999 -273744 -127381 -2505 -37516 14917 144628 356767 485349 383479
15516 383479 24381 -135273 -130965 -146128 -137620 34454 111975 133727 62182 -251406 -368526
15505 -368526 -276822 -382369 -515360 -424399 -303166 -240612 -97930 -191000 -478549 -631096
15495 -631096 -590727 -492984 -329312 -201895 -246391 -325353 -360812 -209392 -44686 176769
15485 176769 293261 232663 72806 -125537 -341152 -489031 -600113 -492228 -310524 -216918
15475 -216918 -98029 -109887 -272869 -383075 -433423 -269127 156044 457154 511125 280568
15465 280568 51124 -84130 -147663 -73301 -16691 -79380 -32429 118947 197949 -60099 -407341
15454 -407341 -447043 -370130 -309479 -298762 -261290 -483448 -668557 -593146 -488630 -328993 -277165
15443 -277165 -126396 141420 432249 576924 500468 310538 70810 -42618 -21749 125968
15433 125968 96553 224387 307837 263334 233121 249872 284745 197479 14978 -48450 -48405 -57060
15421 -57060 1661 112067 101482 49188 -23168 -214149 -228199 -61101 -28560 -36106 179349
15410 179349 260073 234377 220443 333177 369425 543746 558858 463300 415229 284347 218198
15399 218198 200442 240488 235089 216173 217854 244890 281157 215613 220110 438574 508053 429294
15387 429294 247857 102449 -313173 -570329 -474295 -257164 -15532 -129695 -316187 -251744
15377 -251744 -79906 -54967 -193589 -139649 -200670 -182110 -58447 60924 89663 51914 206125
15366 206125 290506 214046 5487 -37705 -6212 87501 329925 266890 -86165 -122482 -29282
15355 -29282 -51306 -112506 -177104 -187340 -304557 -490732 -524670 -515078 -381734 -369563 -510683
15344 -510683 -590023 -682937 -757499 -812961 -674280 -369630 -300484 -329890 -389252 -512310 -517115
15333 -517115 -385137 -124596 4770 63457 199996 102453 113370 219054 71840 -293468
15323 -293468 -640144 -793718 -755083 -755102 -613911 -463429 -261978 -116138 -64104 72874 161569
15312 161569 32998 -111804 1424 323472 542699 408413 361254 309945 36302 -191968
15302 -191968 -343193 -420616 -429676 -419323 -411706 -360756 -237889 -376154 -347048 -146706 -194294
15291 -194294 -370517 -494147 -498655 -432357 -444176 -354840 -287254 -453676 -526406 -430139 -340188
15280 -340188 -373284 -409526 -350002 -285655 -366268 -584321 -549900 -274608 -134873 -295204 -376616
15269 -376616 -426106 -340244 -71892 -10633 -84524 -142195 -313111 -342717 -154446 124138 69532
15258 69532 -209880 -258718 -199299 -174954 13297 286158 326733 507429 577630 500711 385611
15247 385611 368694 288477 174791 180213 180661 -8897 -340088 -617598 -500929 -300486 -117727
15236 -117727 11666 -126362 -379890 -543722 -437729 -421683 -457199 -592844 -562950 -323876
15226 -323876 -18754 118974 84633 -137150 -169274 -48793 -89557 -193636 -445303 -624336
15216 -624336 -619490 -373205 -58233 49035 222112 349204 435071 375319 269888 9673
15206 9673 -354168 -461348 -314793 -153177 27397 117692 -61694 -250012 -304758 -425999
15196 -425999 -428650 -200637 -40020 -14052 -175249 -318353 -324270 -231321 -73219 1702 -82009
15185 -82009 -103092 -121672 -128652 -158293 -71408 -65989 -221682 -284613 -230964 -353298 -333667 -75216
15173 -75216 184378 272473 142097 97264 19355 -36904 -38475 21273 16649 128789 110734
15162 110734 68 -26867 -89838 -128633 -70249 -251226 -505588 -559888 -557921 -373159 -141279
15151 -141279 -135147 -171761 -178751 -97482 11851 106237 14151 -107932 -83843 -233365 -254555
15140 -254555 -251620 -313143 -341086 -345290 -263763 -67626 117462 143952 58829 -56149 -158931
15129 -158931 -216372 -138241 -106434 -242258 -299377 -324243 -259193 -171510 -149418 -144627 -55928
15118 -55928 9219 84460 175794 63790 52441 335112 439056 398018 322231 96519 -47326
15107 -47326 -44086 -173976 -240791 -289575 -238319 -361119 -503333 -474050 -336368 -316430 -212189
15096 -212189 7567 172408 88046 -112093 -161962 -175257 -88173 -28845 327248 781404
15086 781404 873093 562484 187194 -178562 -210529 -83091 4075 11044 12338 -79291 -131112
15075 -131112 75834 273476 321142 225320 13841 -30460 141711 258568 285233 287381 253180
15064 253180 207815 129485 43022 27759 173227 216010 352166 550970 506960 316737 139888
15053 139888 -62927 -267677 -329343 -318534 -149616 187020 298136 102730 165033 442635
15043 442635 392096 322218 301263 192706 100642 95625 105146 180725 284220 375775 402214
15032 402214 431150 436999 261790 120302 168496 349480 323650 171241 74969 -9330 -92711
15021 -92711 -204928 -391581 -543014 -575256 -348175 -219195 -270430 -328801 -438876 -460907
15011 -460907 -577709 -710432 -805255 -891729 -907146 -895841 -801136 -694856 -534893 -382988
15001 -382988 -430339 -777976 -957087 -798737 -495730 -273916 -245051 -220300 -46000 148702
14991 148702 329866 363350 194173 133044 281979 173577 -56705 -70769 81487 219138
14981 219138 352230 256805 -62487 -141034 -95902 -41634 -30776 -43818 -30305 51521 200311
14970 200311 213793 2340 -20073 77486 -63133 -215121 -209252 -207760 -339186 -250520 -86776
14959 -86776 -113920 -206184 -232853 -220351 -122543 149347 238989 90577 16070 -88634 -148616
14948 -148616 -205984 -393142 -392208 -198301 -158389 -185907 -229959 -117028 -53584 -98672 -231225
14937 -231225 -320740 -292106 -228039 -276407 -201764 -63336 -53587 -23289 -29800 -123311 -348083
14926 -348083 -583511 -572495 -490641 -396845 -332532 -308985 -165341 74592 176027 27568
14916 27568 -214759 -224365 -38101 44736 116064 -128029 -412958 -425930 -347407 -265373 14158
14905 14158 278244 208320 9320 -12127 555 -25324 -132360 -290127 -390646 -323091 -371883
14894 -371883 -485124 -386380 -169219 2544 -61429 -298858 -238266 -48 -4543 -16622 61076
14883 61076 118646 281575 410695 345563 339560 264846 76982 -31937 -158389 -235169 -167146
14872 -167146 171776 481437 643836 594103 328429 25762 -161773 -72719 74853 284743
14862 284743 329938 240019 204371 265095 204231 29990 -101126 -133342 -98573 -85665 -170294
14851 -170294 -277344 -271145 -308552 -389279 -415052 -299325 -212124 -187028 -37710 127389 208866
14840 208866 275523 220732 11864 109985 343754 417127 287671 77169 98444 283474
14830 283474 228605 129945 -39546 -346045 -515471 -723173 -1095130 -1165148 -765527 -479725
14820 -479725 -191043 -80154 -216047 -444580 -677500 -757227 -703416 -575750 -564389 -577513
14810 -577513 -348921 -58141 92692 64737 -17344 -192455 -374106 -455681 -488041 -442696
14800 -442696 -317990 -226607 -185244 -183507 -86188 -259035 -496776 -346690 -105088 11501
14790 11501 -67765 -8645 152939 144158 125530 175160 193876 164381 58409 84910 169739
14779 169739 43848 76597 274513 419340 525769 631613 712343 591142 319417 171209
14769 171209 198038 79041 -44056 -24507 -79324 -143053 -241458 -127581 -28444 -114188 -179012
14758 -179012 -114821 -42510 504 84493 106371 -168604 -488887 -597607 -336062 -237711 -247089
14747 -247089 -289277 -503499 -697721 -641903 -433603 -387902 -372100 -213020 79903 341650
14737 341650 333902 286492 219050 67796 53677 145598 26685 -137468 -19663 31773 31019
14726 31019 162050 184853 151354 239490 344748 402604 493466 591650 506110 389836 342809
14715 342809 362378 318185 96009 -201661 -264761 -386873 -560507 -643574 -617589 -557430 -585351
14704 -585351 -681526 -761568 -619187 -398141 -71846 -44804 -118681 -75309 -141530 -249474 -365772
14693 -365772 -472960 -573732 -530911 -299932 -148101 -26588 209429 302418 152833 84117
14683 84117 94108 -17369 -89455 -155685 -172800 -79935 -128643 -238347 -147534 -77833 -230346
14672 -230346 -448813 -680207 -704720 -401011 85976 322555 24415 -29111 100874 156882
14662 156882 161654 221646 117199 -132050 -259614 -138279 -42713 -49409 -152193 -300245 -214598
14651 -214598 -91972 -63600 99189 94988 41934 4140 51541 122120 137489 104091 122103
14640 122103 95381 119282 43810 99748 296536 437502 320378 143282 177660 300463
14630 300463 380498 360610 302396 54482 -261148 -319801 -277516 -223345 -73232 -125867 -332988
14619 -332988 -287987 -169256 56229 155948 -25737 -114700 -61878 -23838 -151121 -299820
14609 -299820 -393124 -193472 83112 -3419 -83314 -116571 -339087 -332217 -75215 141839 264042
14598 264042 408871 588402 711790 755089 791255 906488 856119 637292 322443 115880
14588 115880 143255 184690 289313 314964 267373 221045 254723 258586 309718 262317 203668
14577 203668 87593 21937 78205 111628 71218 157242 266969 136857 80440 -75109 -257505
14566 -257505 -310908 -201769 -165918 -167667 -74012 113872 144861 -61565 -202982 -37588 20380
14555 20380 -8487 -39311 -136806 -5701 48703 -48776 -182654 -215563 63641 415200 446188
14544 446188 374162 298630 248565 161929 170850 252967 198667 147898 107032 -26994 -203884
14533 -203884 -283556 -139005 14412 81384 40725 -75926 -115691 -77917 -191616 -342342
14523 -342342 -374343 -311297 -208216 -271174 -303751 -245684 -223899 -187232 -151610 -110910 -66131
$$ [...]
##END NTUPLES=NMR SPECTRUM
##END=
