##TITLE=C13_SAM_20.108''-THF+Na
 THF,1120 sc

 10.6.2019
##JCAMPDX= 6.0         $$ Bruker NMR JCAMP-DX V2.0
##DATA TYPE= NMR SPECTRUM
##DATA CLASS= NTUPLES
##ORIGIN= UXNMR, Bruker Analytische Messtechnik GmbH
##OWNER= root
$$ XWIN-NMR		Version 3.5
$$ Tue Jun 11 17:09:45 2019 Russian Standard Time (UT+4h)  she@DPX200
##.OBSERVE FREQUENCY= 50.327509
##.OBSERVE NUCLEUS= ^13C
##.ACQUISITION MODE= SIMULTANEOUS
##.ACQUISITION SCHEME= undefined
##.AVERAGES= 1121
##.DIGITISER RES= 17
##SPECTROMETER/DATA SYSTEM= spect
##.PULSE SEQUENCE= zgpg30
##.SOLVENT NAME= CDCl3
##.SHIFT REFERENCE= (INTERNAL, CDCl3, 0, 217.562)
##AUDIT TRAIL= $$ (NUMBER, WHEN, WHO, WHERE, WHAT)
$$ ##TITLE= Audit trail, XWIN-NMR		Version 3.5
$$ ##JCAMPDX= 5.01
$$ ##ORIGIN= Bruker BioSpin GmbH
$$ ##OWNER= she
$$ F:/spectra/data/she/nmr/c13/1/pdata/1/auditp.txt
$$ ##AUDIT TRAIL=  $$ (NUMBER, WHEN, WHO, WHERE, WHAT)
(   1,<2019-06-11 17:08:29.73 +0400>,<she>,<DPX200>,
      <created by zg, POWCHK disabled, PULCHK disabled
       terminated by command 'halt'
       configuration hash MD5:
       00 E9 B6 7A A2 85 ED C7 34 08 36 98 17 FE 4E 26
       data hash MD5: 32K
       E7 A7 0A 14 C4 76 41 F6 FA D9 B6 28 80 44 93 E3>)
(   2,<2019-06-11 17:08:32.51 +0400>,<she>,<DPX200>,
      <Start of raw data processing
       efp BC_mod = 2 LB = 1 FT_mod = 6 PKNL = 1 PHC0 = -391.4672 PHC1 = 32.80641 SI = 32K 
       data hash MD5: 32K
       AB 39 59 E7 46 69 B9 F5 9F 40 AA 6A DA C1 27 8B>)
(   3,<2019-06-11 17:08:35.93 +0400>,<she>,<DPX200>,
      <abs ABSG = 5 
       data hash MD5: 32K
       C3 7B E9 BC A0 EA F8 E6 35 56 37 78 CB 5A 1E 12>)
(   4,<2019-06-11 17:09:01.46 +0400>,<she>,<DPX200>,
      <pk PHC0 = 2.525844 PHC1 = -2.6 
       data hash MD5: 32K
       39 FE 6F F8 A3 F2 4D 59 08 D4 38 D0 8B 8F 30 48>)
(   5,<2019-06-11 17:09:04.37 +0400>,<she>,<DPX200>,
      <abs ABSG = 5 
       data hash MD5: 32K
       AD BA 64 CE 49 6E 53 1E 25 29 79 E8 07 D6 6F 2E>)
(   6,<2019-06-11 17:09:11.84 +0400>,<she>,<DPX200>,
      <abs ABSG = 5 
       data hash MD5: 32K
       82 24 A4 03 CB C8 8D 5E D7 9A 02 BA D4 F9 41 49>)
$$ ##END=
$$ 
$$ hash MD5
$$ B1 6A D6 F4 47 C4 1D 02 92 BF DB 42 39 98 DA 12
##$RELAX= 
##$RELAX= 
##$RELAX= 
##$RELAX= 
##$RELAX= 
##$RELAX= 
##$RELAX= 
##$RELAX= 
$$ Bruker specific parameters
$$ --------------------------
##$DU= <F:/spectra>
##$EXPNO= 1
##$NAME= <c13>
##$PROCNO= 1
##$TYPE= <nmr>
##$USER= <she>
##$AMP= (0..31)
100 100 100 100 100 100 100 100 100 100 100 100 100 100 100 100 100 100 
100 100 100 100 100 100 100 100 100 100 100 100 100 100 
##$AQSEQ= 0
##$AQ_mod= 1
##$AUNM= <au_zg>
##$AUTOPOS= <>
##$BF1= 50.322709
##$BF2= 200.13
##$BF3= 50.322709
##$BF4= 500.13
##$BF5= 500.13
##$BF6= 500.13
##$BF7= 500.13
##$BF8= 500.13
##$BYTORDA= 1
##$CFDGTYP= 0
##$CFRGTYP= 5
##$CHEMSTR= <none>
##$CNST= (0..31)
1 1 145 1 1 1 1 1 1 1 1 1 1 1 1 1 1 1 1 1 1 1 1 1 1 1 1 1 1 1 1 1 
##$CPDPRG= <waltz16>
##$CPDPRG1= <>
##$CPDPRG2= <waltz16>
##$CPDPRG3= <>
##$CPDPRG4= <mlev>
$$ [...]
##$SUBNAM4= <"">
##$SUBNAM5= <"">
##$SUBNAM6= <"">
##$SUBNAM7= <"">
##$SUBNAM8= <"">
##$SUBNAM9= <"">
##$SW= 239.97402068897
##$SWIBOX= (0..15)
0 1 3 0 0 0 0 0 0 0 0 0 0 0 0 0 
##$SW_h= 12077.2946859903
##$TD= 32768
##$TD0= 1
##$TE= 0
##$TE2= 300
##$TE3= 300
##$TEG= 300
##$TL= (0..7)
120 120 120 120 120 120 120 120 
##$TP= (0..7)
150 150 150 150 150 150 150 150 
##$TP07= 0
##$TPNAME0= <>
##$TPNAME1= <>
##$TPNAME2= <>
##$TPNAME3= <>
##$TPNAME4= <>
##$TPNAME5= <>
##$TPNAME6= <>
##$TPNAME7= <>
##$TPOAL= (0..7)
0.5 0.5 0.5 0.5 0.5 0.5 0.5 0.5 
##$TPOFFS= (0..7)
0 0 0 0 0 0 0 0 
##$TUNHIN= 0
##$TUNHOUT= 0
##$TUNXOUT= 0
##$USERA1= <user>
##$USERA2= <user>
##$USERA3= <user>
##$USERA4= <user>
##$USERA5= <user>
##$V9= 5
##$VALIST= <valist>
##$VCLIST= <CCCCCCCCCCCCCCC>
##$VD= 0
##$VDLIST= <DDDDDDDDDDDDDDD>
##$VPLIST= <PPPPPPPPPPPPPPP>
##$VTLIST= <TTTTTTTTTTTTTTT>
##$WBST= 1024
##$WBSW= 4
##$XGAIN= (0..3)
0 0 0 0 
##$XL= 0
##$YL= 0
##$YMAX_a= 7811867
##$YMIN_a= -1883383
##$ZGOPTNS= <>
##$ZL1= 120
##$ZL2= 120
##$ZL3= 120
##$ZL4= 120
##$ABSF1= 217.5618
##$ABSF2= -22.43564
##$ABSG= 5
##$ABSL= 3
##$ALPHA= 0
##$AQORDER= 0
##$ASSFAC= 0
##$ASSFACI= 0
##$ASSFACX= 0
##$ASSWID= 0
##$AUNMP= <proc_1d>
##$AZFE= 0.1
##$AZFW= 0.5
##$BCFW= 0
##$BC_mod= 2
##$BYTORDP= 0
##$COROFFS= 0
##$CY= -3
##$DATMOD= 1
##$DC= 0
##$DFILT= <>
##$DTYPP= 0
##$F1P= 0
##$F2P= 0
##$FCOR= 0.5
##$FTSIZE= 32768
##$FT_mod= 6
##$GAMMA= 0
##$GB= 0
##$INTBC= 1
##$INTSCL= 4.134877e-10
##$ISEN= 128
##$LB= 1
##$LEV0= 0
##$LPBIN= 0
##$MAXI= 10000
##$MC2= 0
##$MEAN= 0
##$ME_mod= 0
##$MI= 0.1934396
##$NCOEF= 0
##$NC_proc= -1
##$NLEV= 6
##$NOISF1= 120.0001
##$NOISF2= 80.00006
##$NSP= 0
##$NTH_PI= 0
##$NZP= 0
##$OFFSET= 217.5618
##$PC= 1.4
##$PHC0= -388.9413
##$PHC1= 30.20641
##$PH_mod= 1
##$PKNL= yes
##$PPARMOD= 0
##$PSCAL= 0
##$PSIGN= 0
##$REVERSE= no
##$SF= 50.3225993700027
##$SI= 32768
##$SIGF1= 140
##$SIGF2= 120
##$SINO= 11.81781
##$SIOLD= 32768
##$SREGLST= <13C.CDCl3>
##$SSB= 0
##$STSI= 32768
##$STSR= 0
##$SW_p= 12077.2946859903
##$SYMM= 0
##$S_DEV= 0
##$TDeff= 32768
##$TDoff= 0
##$TI= <>
##$TILT= no
##$TM1= 0
##$TM2= 0
##$TOPLEV= 0
##$USERP1= <user>
##$USERP2= <user>
##$USERP3= <user>
##$USERP4= <user>
##$USERP5= <user>
##$WDW= 1
##$XDIM= 32768
##$YMAX_p= 324073592
##$YMIN_p= -9326311
$$ End of Bruker specific parameters
$$ ---------------------------------
##NTUPLES= NMR SPECTRUM
##VAR_NAME=  FREQUENCY,     SPECTRUM/REAL,   SPECTRUM/IMAG
##SYMBOL=    X,             R,               I
##VAR_TYPE=  INDEPENDENT,   DEPENDENT,       DEPENDENT
##VAR_FORM=  AFFN,          ASDF,            ASDF
##VAR_DIM=   32768,         32768,           32768
##UNITS=     HZ,            ARBITRARY UNITS, ARBITRARY UNITS
##FACTOR=    0.368581032318806, 1,           1
##FIRST=     10948.2752037875, 0,            0
##LAST=      -1129.01948220282, 0,           0
##MIN=       -1129.01948220282, -9326311,    0
##MAX=       10948.2752037875, 324073592,    0
$$ Real data points
##PAGE= N=1
##DATA TABLE= (X++(R..R)), XYDATA
$$ [...]
15073e66681K38956L19512O39510O35031L7553r01408p05053p95879L26791R75744
$$ -566681 -327725 -8213 631297 1266328 1303881 402473 -302580 -1098459 -771668 204076
15063B04076K21438j34418j50262O64150J77684r77792r85192k20673k00376L87277
$$ 204076 425514 291096 140834 804984 982668 4876 -980316 -1200989 -1401365 -1014088
15053a014088P77577j13155k91480o4391O79592J32628n5304k03403L14419J15332
$$ -1014088 -236511 -349666 -641146 -705537 -25945 106683 51379 -152024 162395 277727
15043B77727k06082N57899R74662L11239k49725N0646m68096q45955n244R43231
$$ 277727 71645 629544 1604206 1915445 1665720 1716366 1248270 402315 397071 1340302
15033A340302k86538n26934n66987o18625J67318L58322N50346K34684K30685
$$ 1340302 1053764 526830 -40157 -658782 -491464 -133142 417204 651888 882573
15024H82573O5115n14014m27465m50283l92478o4614K56990K20836k86666p98308
$$ 882573 947688 433674 6209 -444074 -836552 -901166 -644176 -423340 -710006 -1508314
15014a508314K06179J231585P73706p65858p90493j24401q97328l92415K22011
$$ -1508314 -1302135 -70550 703156 -62702 -853195 -977596 -1874924 -2267339 -2045328
15005b045328O33935P03414P09905j80592K6329J38782k91384N187k04018P0387
$$ -2045328 -1411393 -707979 1926 -178666 -152337 -13555 -304939 -299752 -503770 -433383
14995d33383J39531m97537m54862Q69867P27276k26225l26133K51934P17068K88079
$$ -433383 -293852 -791389 -1246251 -376384 350892 124667 -201466 50468 767536 1055615
14985A055615j90726l20782m55821l98433m4348L46897L72165M18663L82573p97618
$$ 1055615 864889 544107 88286 -310147 -354495 -7598 364567 783230 1165803 368185
14975C68185q46491J02463q0746o60271n65173j90333J81549P4883K74705J252949
$$ 368185 -478306 -375843 -456589 -1116860 -1682033 -1872366 -1690817 -1615934 -1341229 -88280
14965h8280Q82745K71262j07730J31462L25779k57460j6981M78134N9362q1443
$$ -88280 794465 1065727 957997 1089459 1415238 1157778 1140797 1618931 1678293 1596850
14955A596850K06437k08549m34434J65539J91750n52846p30486J013648O68483
$$ 1596850 1803287 1594738 1160304 1325843 1517593 964747 234261 1247909 1916392
14946A916392j229936j364023k96464L2247J64241N87850N79082M29458o8201
$$ 1916392 686456 -677567 -974031 -941784 -777543 -189693 389389 818847 750646
14937G50646r14210p01847k02634j46558n126j66515J98065j22266J35306J098693
$$ 750646 -163564 -865411 -1068045 -1214603 -1219729 -1386244 -1188179 -1310445 -1175139 -76446
14927g6446Q43992j85546l41880l47708j6292M77020K38112K7164K98296J0813
$$ -76446 767546 582000 240120 -107588 -123880 353140 591252 618416 916712 927525
14917I27525p30246k15895j26634N20165K92844k06127o9087J74545o37693n27379
$$ 927525 197279 -18616 -145250 374915 667759 461632 392545 567090 -70603 -597982
14907e97982K0646k76958m04831J98091J33813J61972M14842l34704M3265j35376
$$ -597982 -577336 -854294 -1259125 -1061034 -927221 -765249 -350407 -685111 -641846 -777222
14897g77222l56706k60587k56840l6748L20721N99273N8649l07873q81910k51998
$$ -777222 -1133928 -1394515 -1651355 -1688103 -1367382 -768109 -709460 -1017333 -1899243 -2151241
14887b151241P90980P32765M28937L48594j37487Q1823K65596k40153l85167J48425
$$ -2151241 -1360261 -627496 -198559 150035 12548 94371 359967 119814 -265353 -116928
14877a16928M13715M73923M48784m72795o74208m15666n02942n52320K41352M89218
$$ -116928 296787 770710 1219494 746699 72491 -343175 -846117 -1398437 -1157085 -667867
14867f67867l07016o72762n33405k19756M18311O60360J24657O94530N64111l92888
$$ -667867 -974883 -1647645 -2181050 -2400806 -1982495 -1322135 -1197478 -502948 61163 -331725
14857c31725m18783m22642J14725R5424O40026L60194J92468j48985n92519o00571
$$ -331725 -750508 -1173150 -1058425 -963001 -322975 37219 229687 80702 -511817 -1112388
14847a112388m15023L64356O25139k4917M64178O98212N56323N10095K718m40613
$$ -1112388 -1527411 -1163055 -537916 -562833 -98655 599557 1155880 1665975 1668693 1228080
14837A228080j96661n38201j248582q20599j0949P27252N33429N17873L71605
$$ 1228080 1031419 493218 -755364 -1575963 -1586912 -859660 -326231 191642 563247
14828E63247n7125r01575p17285L4567N93856J46415j10702N93208Q1318J96678
$$ 563247 506122 -395453 -1112738 -1078171 -484315 -337900 -448602 144606 225924 422602
14818D22602j03415N299J82857m57075q87292o55591M1266M28848R64963P68976
$$ 422602 319187 324486 507343 50268 -837024 -1492615 -1451349 -1022501 -57538 711438
14808G11438k04077k68425j52314K90946O31028M04088l06951p01209l46941J59785
$$ 711438 507361 238936 86622 377568 1008596 1412684 1105733 404524 57583 217368
14798B17368N8008j65194J74655r475m8086k76466K23755N31217l23671l28229
$$ 217368 275376 110182 284837 275362 227276 -49190 174565 705782 382111 53882
14788E3882L12389k96359p0694O17628J4774p80267p34507m04648K43087J294612
$$ 53882 366271 69912 -782 616846 631620 -148647 -883154 -1287802 -1044715 249897
14778B49897N01878M56133M61731m39434j125481r82897o78934m68273Q43502
$$ 249897 751775 1207908 1669639 1230205 104724 -878173 -1557107 -2025380 -1181878
14769a181878R82775J82125j48586m805p23708m30035O57116Q75676N93988O89411
$$ -1181878 -199103 -16978 -165564 -170369 -894077 -1324112 -666996 208680 802668 1492079
14759A492079M22372k87385j41642j57380m68018r87105l82832L17591m83274
$$ 1492079 1914451 1627066 1485424 1328044 860026 -127079 -509911 -192320 -675594
14750f75594L7944O10533O8941l50678O44220P26627K44471N56024K29324j79119
$$ -675594 -637650 -27117 41824 -308854 335366 1061993 1306464 1862488 2091812 1912693
14740A912693j7658l43381r77878O71543R54303Q6097k99224j013626n65291J94043
$$ 1912693 1895035 1551654 573776 1245319 2199622 2285719 1986495 972869 407578 601621
14730F01621k13818j106145j079454l93720M25768J97073O48581N60166J94379
$$ 601621 387803 -718342 -1797796 -2191516 -1765748 -1568675 -920094 -359928 -165549
14721a65549P71595k72081j376656p10839m89429O44992P57226N2791L11402J14649
$$ -165549 606046 333965 -1042691 -1753530 -2242959 -1597967 -840741 -787950 -476548 -361899
14711c61899M73889L50020N63575J95401q22620n19663l02542l71679L34560J053519
$$ -361899 111990 462010 1025585 1220986 398366 -121297 -423839 -795518 -460958 592561
14701E92561M92292m99575k06458L89327P56260M65263m47557l28781o17680j014408
$$ 592561 1084853 585278 378820 768147 1524407 1989670 1542113 1213332 595652 -418756
14691d18756q89059l3645M49024k33479m6771M7052J59364M57119J12159M72045
$$ -418756 -1307815 -1341460 -892436 -1125915 -1172686 -1125634 -966270 -509151 -396992 75053
14681G5053j90194l95837L53324J238637P45314J27201o1349q31984n92506m9186
$$ 75053 -115141 -510978 -157654 1080983 1826297 1953498 1892149 1060165 467659 418473
14671D18473N37284K81502p73492j147548K03170m20950m93864K19107j73860
$$ 418473 955757 1237259 463767 -683781 -480611 -901561 -1395425 -1176318 -1350178
14662a350178r17686j41311O39580k25774n16630L02069Q07440J35629l61117
$$ -1350178 -2267864 -2409175 -1769595 -1995369 -2511999 -2209930 -1402490 -1266861 -1627978
14653a627978M66368P96388M14203J20815q3751P50172R00000J89978J5453r5016
$$ -1627978 -1161610 -365222 48981 169796 86045 836217 1736217 1926195 1941648 1846632
14643A846632J60675J26769l07116o4897j82170l48623j157704j022897o8083
$$ 1846632 2007307 2134076 1826960 1762063 1579893 1231270 73566 -949331 -1017414
14634a017414R7513p4997Q5326J33647M40639L32474J05912J03036L63370O48561
$$ -1017414 -919901 -994898 -909572 -775925 -335286 -2812 103100 206136 569506 1218067
14624A218067N32259P13404Q902o13350q70703j590721j196155J28123P76603
$$ 1218067 1750326 2463730 2472632 1859282 988579 -602142 -1798297 -1670174 -893571
14615h93571P20930M06742M1482k9480M69265R37632j96224l00700m98050q67937
$$ -893571 -172641 234101 275583 246103 715368 1653000 1456776 1156076 658026 -209911
14605b09911p53147M9122M87726L37254j94065o49216m85162K65732O62537Q39546
$$ -209911 -963058 -913936 -426210 -88956 -283021 -932237 -1417399 -1151667 -489130 350416
14595C50416N46605m84987j228222l27230N73934k49636k76922J34948J01134
$$ 350416 897021 412034 -816188 -1143418 -569484 -819120 -1096042 -961094 -859960
14586h59960m92505n13751k45387N62546J52832j60784M7324L54959J53545j15803
$$ -859960 -1352465 -1866216 -2111603 -1549057 -1396225 -1557009 -1509685 -1154726 -1001181 -1116984
14576a116984r4860Q2304o18820m91824O37726R35835N40647K86102J53915n21481
$$ -1116984 -1211844 -1129540 -1748360 -2240184 -1602458 -666623 -125976 160126 314041 -207440
14566b07440q21477k8675K21401N39173N15325K60621j52286k28901n33760N5629
$$ -207440 -1028917 -1057592 -836191 -297018 218307 478928 326642 97741 -436019 -380390
14556c80390L27655K36694k09446J76187L28466L700J58830L94445O43093O52262
$$ -380390 -52735 183959 -25487 150700 479166 482866 641696 1036141 1679234 2331496
14546B331496k48503q62454p28928l49016J66836J16975o20436j055219k53554
$$ 2331496 2082993 1220539 491611 142595 309431 426406 -194030 -1249249 -1502803
14537a502803p1142k77902K55632O42840Q22179O56380j61748n32049L06708J95894
$$ -1502803 -1573945 -1851847 -1596215 -953375 -131196 525184 363436 -168613 138095 333989
14527C33989m91875k31035J93464J13050j45950n43287m69491k38830M62514N40041
$$ 333989 -157886 -388921 -195457 -82407 -228357 -771644 -1241135 -1479965 -1017451 -477410
14517d77410J56378l6682m06186o78409K28473P97202p8083m11887l99432p05992
$$ -477410 -321032 -357714 -763900 -1442309 -1213836 -416634 -494717 -906604 -1306036 -2012028
14507b012028K60537P94449P1052j15657l14779K23712O68951N49025K17937J40998
$$ -2012028 -1751491 -957042 -885990 -1001647 -1316426 -1092714 -423763 125262 343199 484197
14497D84197R0039k63653j89058J18179j03930j032663p98188m86201N8235N16859
$$ 484197 574236 310583 121525 239704 135774 -896889 -1695077 -2181278 -2123043 -1606184
14487a606184O98430N03489O63233M83812k98976l50203p27145L7976P92011K18539
$$ -1606184 -907754 -404265 258968 742780 443804 93601 -633544 -595568 196443 414982
14477D14982p52688j123539j65811N77892m5931P88976J005271N28763m56804
$$ 414982 -337706 -1461245 -1627056 -1049164 -1095095 -306119 699152 1227915 771111
14468G71111m52027o41857n33654k32519j03941q7652L53241M30836N23691N1932
$$ 771111 319084 -322773 -856427 -1088946 -1192887 -1280539 -927298 -496462 27229 79161
14458G9161o05328j047895j433327m23192O42456O88496J34419M79222N49240
$$ 79161 -526167 -1574062 -3007389 -3430581 -2788125 -2099629 -1965210 -1485988 -936748
14449i36748K05048J7938m06912l25144O46948O13387L82045K37639M16280Q9693
$$ -936748 -731700 -713762 -1120674 -1445818 -798870 -185483 196562 434201 850481 940174
14439I40174j088062j021922m55792R30784P22870k64754o72152k06098K14613
$$ 940174 -147888 -1169810 -1625602 -694818 28052 -236702 -908854 -1114952 -900339
14430i00339l0114K50365M48450j02915K17940m15523j277936m91984j60482k3298
$$ -900339 -930453 -680088 -231638 -334553 -116613 -532136 -1810072 -2302056 -2462538 -2485836
14420b485836P40315P74957P62224m96581j410164j36240K49460O00895J567867
$$ -2485836 -1745521 -970564 -208340 -704921 -2115085 -2251325 -2001865 -1400970 166897
14411A66897J103521q62k81452l85645k17541k64170j65864q1504r7125l92233
$$ 166897 1270418 1269556 988104 602459 384918 120748 -45116 -126620 -223745 -615978
14401f15978M6842k97592k31115j33975m64308K753m0558j91831n700M2435n52732
$$ -615978 -569136 -866728 -1097843 -1231818 -1696126 -1693373 -1733931 -1925762 -1931462 -1889027 -2441759
14390b441759l9291P02657O28621j77351n94712m70164l89249j7305N65357P88540
$$ -2441759 -2481050 -1778393 -1149772 -1327123 -1921835 -2391999 -2781248 -2798553 -2233196 -1444656
14380a444656j24510j39112P90924Q88009n2335r14443m35021L93549N96645j42108
$$ -1444656 -1569166 -1708278 -917354 -29345 -81680 -996123 -1431144 -1037595 -440950 -583058
14370e83058m94493K8520m291k71655L71728L60711J00057n73546m17315K85600
$$ -583058 -1077551 -1049031 -1053322 -1324977 -953249 -592538 -492481 -1066027 -1483342 -1197742
14360a197742m3441M83078r6786p22158j55429Q1483k55475r773M19990Q18795
$$ -1197742 -1241183 -758105 -854891 -1577049 -1732478 -1650995 -1906470 -1916243 -1496253 -677458
14350f77458J359256J266770J66753p01334N320P7084p87737q00939K38628L6974
$$ -677458 681798 1948568 2115321 1413987 1419307 1496391 708654 -92285 146343 183317
14340A83317o72418m41452N15815L37323L76531M06239k13644n69987j52924O32383
$$ 183317 -489101 -930553 -414738 -77415 299116 705355 491711 -78276 -231200 401183
14330D01183N84544k47195j27684J58457k37232m45963n07985K54457P22933N0
$$ 401183 985727 738532 610848 769305 532073 86110 -421875 -167418 555515 555565
14320E55565l52048k02010N20195J17437n73740J41983M16891M18789k10347o52164
$$ 555565 203517 1507 521702 639139 65399 207382 624273 1043062 832715 180551
14310A80551j41892Q99987J71952n33486R1298k06114q7526r2064m35245m60979
$$ 180551 38659 938646 1110598 577112 668410 462296 374770 282706 -152539 -613518
14300f13518J70537P98545P09445L38852k88972n50685L1700l42078l62845l85893
$$ -613518 -442981 355564 1065009 1403861 1114889 564204 595904 253826 -109019 -494912
14290d94912R0472P44172Q11668J64203J14116k75535q46088o48624J87873j90765
$$ -494912 -404440 339732 1151400 1315603 1429719 1154184 308096 -340528 -152655 -343420
14280c43420K36164R82450N74264k43209m06058M3684j56178n02043m69948P99932
$$ -343420 -107256 875194 1449458 1206249 800191 843875 687697 185654 -284294 515638
14270E15638Q08952j36764l30569m30828p19854k70794p1185k08434L88110P85156
$$ 515638 1324590 1187826 857257 426429 -293425 -564219 -635404 -843838 -455728 329428
14260C29428J506L45150O7395l50152j42040L06237L95667N61366k56014o56008
$$ 329428 330934 676084 743479 393327 251287 557524 953191 1514557 1258543 602535
14250F02535k44161l42217k417J04792l71600J15116M7843m04002Q62035Q56674
$$ 602535 358374 16157 13740 118532 -253068 -137952 -90109 -494111 367924 1224598
14240A224598p92459o57969j34888N16756J58729K26994J102009N75778r3824
$$ 1224598 432139 -225830 -360718 156038 314767 541761 1643770 2219548 2125724
14231B125724k39435p44885j144852m12771J06577K9832L95074L26932k80432
$$ 2125724 1886289 1141404 -3448 -416219 -309642 -279810 115264 442196 161764
14222A61764K9425K13924j07568l96153K8551K27131j86446o78736l89774L81911
$$ 161764 191189 405113 297545 -98608 -70057 157074 -29372 -708108 -1097882 -715971
14212g15971O22588K08409k82412n05935j11962O22851k08084p62136M41664J147775
$$ -715971 -93383 115026 -167386 -673321 -785283 -162432 -370516 -1132652 -690988 456787
14202D56787J007875M90872m95320m93782K54028m07448p7613l2093j006243j65778
$$ 456787 1464662 1955534 1460214 966432 1220460 813012 735399 703306 -302937 -468715
14192d68715J127903J351886k01837n00222k65566o1155l60853J4464M81709L63771
$$ -468715 659188 2011074 1809237 1309015 1043449 982294 621441 635905 1117614 1481385
14182A481385L77402J18326k77454q71019j242451K71422Q52693K05725l88581
$$ 1481385 1858787 1977113 1699659 828640 -413811 -142389 710304 916029 527448
14173E27448p60657l50600l3102M58645J093884M20605n21674m2294N36803j64070
$$ 527448 -233209 -583809 -616911 -158266 935618 1356223 834549 792255 1329058 1164988
14163A164988j033285j111137K73181O08245P37270M88708j65471m10801r27728
$$ 1164988 131703 -979434 -706253 -98008 639262 1127970 962499 551698 -376030
14154c76030L5730R75091P58975m15278j017496l37121m46076l3373P69266K36208
$$ -376030 -340300 634791 1393766 978488 -39008 -376129 -822205 -855578 -86312 149896
14144A49896M96169N63340O2010M67744L20995j86585q71998o06359l02747j56707
$$ 149896 646065 1209405 1271415 1739159 2060154 1873569 1001571 395212 92465 -64242
14134f4242K26659M78036R97126M63601n11906j032859l78007M84003L92700L8579
$$ -64242 162417 640453 1637579 2101180 1589274 556415 178408 662411 1055111 1093690
14124A093690j20964Q23775O23766K21188j67075p28353q69458l65360J45837
$$ 1093690 972726 1796501 2420267 2641455 2474380 1746027 876569 511209 657046
14115F57046j86813j13933l49256J06496M72915L37462q6250Q2123K54054k89549
$$ 657046 470233 356300 7044 113540 586455 923917 837667 919790 1173844 884295
14105H84295l81662j82886j48967l11338r32899j023102J17443N04907J200429
$$ 884295 502633 319747 170780 -140558 -1073457 -2096559 -1979116 -1474209 -273780
14096b73780J465196o0496q32240o84489n28836k38690m9986M40746O50745K21707
$$ -273780 1191416 1130920 298680 -385809 -914645 -1153335 -1203321 -762575 -111830 109877
14086A09877K14304J81103N07386N10822L32237q41598j045536j25588O36251
$$ 109877 324181 505284 1012670 1523492 1855729 1014131 -31405 -156993 479258
14077D79258J02127J38693M18321M47037O43486M7039r70344j047323m28641J34695
$$ 479258 581385 720078 1138399 1585436 2228922 2275961 1305617 258294 -170347 -35652
14067c5652J18617N8768N0105O00353Q32712k10393p50788p80651j90610Q17010
$$ -35652 82965 141733 191838 792191 1624903 1414510 663722 -116929 -307539 509471
14057E09471M41374k44973K08093J87093k01933n46791o71834n3814j256m20751
$$ 509471 950845 705872 913965 1101058 899125 352334 -319500 -373314 -374570 -795321
14047g95321r6442J12235M05393R0628m50121p51357r86101q86935K71145J039343
$$ -795321 -891763 -779528 -374135 -283507 -733628 -1484985 -2471086 -3358021 -3086876 -2047533
14037b047533J85205P81018P66422L33832O2237l12920l66935p03400L21592P66117
$$ -2047533 -1862328 -1081310 -314888 18944 81181 -231739 -598674 -1302074 -980482 -214365
14027b14365J58598l57747o01372r1935N20619Q00902j41161m76875J11943J82722
$$ -214365 -55767 -413514 -1014886 -1106821 -586202 214700 73539 -403336 -291393 -108671
14017a08671N9103l21352m3665J72861p0501N03896J063978N29682m83920m03404
$$ -108671 -49568 -370920 -414585 -241724 -312225 191671 1255649 1785331 1301411 898007
14007H98007j19944k56902j35146j10558J28453L08266o52909j368819l78448
$$ 898007 778063 521161 386015 275457 403910 712176 59267 -1309552 -1688000
13998a688000K01564K90394j36014J58202K26615J01516M31976L01319q0142L46840
$$ -1688000 -1486436 -1196042 -1332056 -1173854 -947239 -845723 -413747 -112428 -192570 154270
13988A54270M72219m93028k51925N33726K63255j56872k79803p54756l77823p0403
$$ 154270 626489 133461 -118464 415262 678517 521645 241842 -512914 -890737 -961140
13978i61140l30455J23590Q7854j22334k90434n87139n21344O0453M78060K25750
$$ -961140 -1291595 -1168005 -1080151 -1202485 -1492919 -2080058 -2601402 -2540949 -2062889 -1837139
13968a837139P46504L13401J00562P14283O64437j629j048011m82564J90266P80070
$$ -1837139 -1090635 -777234 -676672 37611 702048 700419 -347592 -830156 -639890 140180
13958A40180M25558j74229R9085J39842m67061o45034O03243R93977P59633j76399
$$ 140180 565738 391509 490594 630436 163375 -481659 121584 1115561 1875194 1698795
13948A698795m72561q41246j274257n43091J00566O43432J007460J07360n70745
$$ 1698795 1226234 384988 -889269 -1432360 -1331794 -688362 319098 426458 -144287
13939a44287o6801P8458N43938R25212j35238J51168N75150m9782j33842J72755
$$ -144287 -211088 -132630 411308 1336520 1201282 1352450 1927600 1877818 1743976 1916731
13929A916731K04224j102725m47062N14906K99920l86389j265471j317648j240717
$$ 1916731 2120955 1018230 571168 1086074 1385994 999605 -265866 -1583514 -2824231
13920b824231l20301J44910P76155J534225M36057N14817P74275k90887r51150
$$ -2824231 -3144532 -2999622 -2223467 -689242 -253185 261632 1035907 745020 -206130
13911b06130l28985L16118L81083P4236K15116N81494J24785l94237o17765j281432
$$ -206130 -535115 -218997 162086 236322 451438 1032932 1157717 763480 145715 -1135717
13901a135717j010967O51409J462437P46056L4182O29881P07198j80151p97738
$$ -1135717 -2146684 -1495275 -32838 713218 747400 1377281 2084479 1904328 1106590
13892A106590q34322L33004L84878r0364M154K57798j19105q16501l89430N5145
$$ 1106590 272268 605272 990150 899786 903940 1161738 1042633 226132 -163298 -108153
13882a08153N39262L28648k96453r45296p03459P3122L10353J27507M714J00723
$$ -108153 431109 759757 463304 -481992 -1185451 -1112329 -801976 -674469 -669755 -569032
13872e69032R62178J207700N8919n78266m55964r5175L75776M27598K57762N4977
$$ -569032 393146 1600846 1659765 1081499 625535 530360 906136 1333734 1591496 1646473
13862A646473L38774L2411p6296L7999j27191m41780o69330N2181K14101j53794
$$ 1646473 1985247 2017658 1941362 1979361 1852170 1410390 741060 793241 1007342 853548
13852H53548k28208j78716o62924m60881M13493L33992o3931k9004j6377l14044
$$ 853548 625340 446624 -216300 -677181 -263688 70304 6373 -22631 -39008 -353052
13842c53052o51657l20157M22541P15196J247154P12038M3579p66490n73258M4341
$$ -353052 -1004709 -1324866 -902325 -187129 1060025 1772063 1815642 1049152 475894 520235
13832E20235Q0938P85151N19463r87893j100712j02478p45874m70267l95896M3222
$$ 520235 601173 1386324 1905787 917894 -182818 -285296 -1031170 -1501437 -1897333 -1854111
13822a854111J218613Q89687L51558m62212m76095m16535k15859k98218q07313
$$ -1854111 -635498 254189 605747 143535 -332560 -749095 -964954 -1263172 -2070485
13813b070485m49878N90712Q55696O70553R0913m04864J9446K26653L78366R09120
$$ -2070485 -2520363 -1929651 -1073955 -403402 -312489 -717353 -697907 -471254 -92888 816232
13803H16232l80388q96954K2529n8686n8414K59230P82223J495080R37991o37033
$$ 816232 435844 -461110 -438581 -497267 -555681 -296451 485772 1980852 2918843 2281810
13793B281810p05937o00384q19058k62711n8221J8475N0957k40352L7770l7736
$$ 2281810 1575873 975489 156431 -106280 -164501 -146026 -95069 -335421 -297651 -335387
13783c35387j69343J42144L29795N62785k09998p6777K14367l54162L65629Q04496
$$ -335387 -504730 -362586 -32791 529994 319996 243219 457586 103424 469053 1273549
13773A273549o05696j269976r52856n05215j228430o35755J105042J574704N68249
$$ 1273549 667853 -602123 -1554979 -2060194 -3288624 -3924379 -2819337 -1244633 -676384
13764f76384m20160q91252J8274J327636J637019M96423l32836o35285j102437
$$ -676384 -1096544 -1987796 -1969522 -641886 995133 1491556 1158720 523435 -579002
13755e79002p04342P3255O79272P64016Q6356J36126L36804O5095o51717o42166
$$ -579002 -1283344 -1210089 -530817 233199 319555 455681 792485 857580 205863 -436303
13745d36303o5084J24529j87451o0052O31136L92654m50748k99194j798M5099
$$ -436303 -501387 -376858 -564309 -624361 6775 399429 -51319 -350513 -352311 -307212
13735c07212J28568P88027O58827n55415m48593n82833p54529m38282L0151L70576
$$ -307212 -178644 609383 1268210 712795 264202 -318631 -1073160 -1511442 -1481291 -1110715
13725a110715J13919j097272o67361L06602O04144K62397J050961K31434k83054
$$ -1110715 -996796 -2094068 -2761429 -2454827 -1850683 -1588286 -537325 -305891 -588945
13716e88945P68434R79680N03813j61878m21490J6969J7785j33920n00432k66678
$$ -588945 179489 1159169 1662982 1501104 1079614 1096583 1114368 980448 480016 213338
13706B13338K03527l93902q26754j144407l09128O65120M34927q1532k22535j20626
$$ 213338 416865 22963 -803791 -1948198 -2257326 -1592206 -1157279 -1238811 -1461346 -1581972
13696a581972j88154L98715P81985J009738J094612P39140j14287J82662n98847
$$ -1581972 -1770126 -1371411 -589426 420312 1514924 2254064 2139777 2322439 1723592
13687A723592j242082o32287p81420o51378J65804O76339O52678L42359k40393
$$ 1723592 481510 -150777 -932197 -1583575 -1417771 -741432 -88754 253605 13212
13678A3212M5052J042739K98364O2662l92658j404678o16855k56128K75944L98451
$$ 13212 58264 1101003 1399367 1462029 1069371 -335307 -952162 -1208290 -932346 -533895
13668e33895Q45487J256041j6026J3942M0437j170060o90129N12307O33956J008975
$$ -533895 311592 1567633 1551607 1565549 1605986 435926 -254203 258104 892060 1901035
13658A901035M21272r34221j542697m20059M38751Q5656n96537J99890N42170
$$ 1901035 2322307 1388086 -154611 -574670 -135919 -50263 -646800 -446910 95260
13649I5260j04349n8101N29172N56667Q94346L90454k21506j405186q15137j57367
$$ 95260 -9089 -67190 461982 1018649 1912995 2303449 2081943 676757 -138380 -295747
13639b95747K32977P4890j99842j91480j34350o45731j209836J50768N97228N33035
$$ -295747 -62770 12120 -187722 -379202 -513552 -1159283 -2369119 -2218351 -1621123 -1088088
13629a088088m9009k56750L60420K43729K6640M08777j30986j71820N03065M33951
$$ -1088088 -1137097 -1393847 -1033427 -789698 -763058 -354281 -485267 -657087 -154022 279929
13619B79929N01449K35363n99617q01924p45646l14861N33293O26983k29440q00972
$$ 279929 781378 1016741 417124 -384800 -1130446 -1445307 -912014 -285031 -514471 -1315443
13609a315443l98164k75362l46909Q17688L4615K74630P32603R36925P39484k72187
$$ -1315443 -1713607 -1988969 -2335878 -1518190 -1483575 -1208945 -476342 460583 1200067 927880
13599I27880l20624n34205q75959n46173J73261j33567J71932P27313L17857j82743
$$ 927880 607256 73051 -802908 -1349081 -1175820 -1309387 -1137455 -410142 -92285 -275028
13589b75028o24752j41814Q1071P71957J383080N78769k87354p85130k73497K35639
$$ -275028 -899780 -1041594 -960523 -188566 1194514 1773283 1485929 700799 427302 662941
13579F62941O19909J42203n41621j0113N96656M05183o46035j188156M57177R84799
$$ 662941 1282850 1425053 883432 873319 1469975 1875158 1229123 40967 498144 1482943
13569A482943p62652j127719M94442J051984j02081q24998l26404J1383K88589
$$ 1482943 720291 -407428 87014 1138998 1036917 211919 -114485 -103102 185487
13560A85487K61020J65936q3409M58760Q52033J65500k76099q86645o67507j27317
$$ 185487 446507 612443 529034 987794 1839827 2005327 1729228 842583 175076 47759
13550D7759k31490m65314M881L96770R389N6595J1795l69622j35795J55710k21713
$$ 47759 -183731 -649045 -644164 -247394 -238005 -181410 -169615 -539237 -675032 -519322 -741035
13539g41035j41851k84619q132K73653j26823N62849M91165m0164l3674j23973
$$ -741035 -882886 -1167505 -1175637 -901984 -1028807 -465958 25207 -14957 -48631 -172604
13529a72604n04931l14822N18050Q50437Q70509K45815o55120n53733n86685K77744
$$ -172604 -677535 -992357 -474307 376130 1246639 1492454 837334 283601 -303084 -25340
13519b5340N22212l41525j053525k90657Q73012P29302K92767k09165q67861p45692
$$ -25340 496872 155347 -898178 -1188835 -315823 413479 706246 497081 -370780 -1116472
13509a116472k61050L99299R70661R44078l87693p31088M34277L8206k84202l68758
$$ -1116472 -1377522 -978223 -7562 936516 548823 -182265 252012 290218 6016 -362742
13499c62742r91120m54764L40012N42288P9885J33210K36675J36212j18123P6915
$$ -362742 -1353862 -1808626 -1468614 -926326 -846441 -713231 -476556 -340344 -458467 -381552
13489c81552j42439J32436j26924j07773L77199J86823k12240L07148K88057p3443
$$ -381552 -523991 -391555 -518479 -626252 -249053 -62230 -274470 32678 320735 247292
13479B47292r645L38121N01686K390J76035j08721k07348N5392L66978n26589
$$ 247292 237647 575768 1077454 1079844 1255879 1147158 939810 995202 1362180 835591
13469H35591q46558q35981q72388j52350L04003M37404K00024j25786Q9855N6061
$$ 835591 -10967 -846948 -1719336 -1871686 -1567683 -1130279 -930255 -1056041 -966186 -910125
13459i10125p0143O47614N31520n7680l10648o34715k60649K22829k01615j18051
$$ -910125 -980268 -332654 198866 141186 -169462 -804177 -1064826 -841997 -1043612 -1161663
13449a161663J23472n4128l42758K99904J163912Q59736P04143L42570m12958
$$ -1161663 -1038191 -1092319 -1435077 -1135173 28739 888475 1592618 1935188 1522230
13440A522230k34354l00175o20585J06457R74313L03161p14765r22313Q8975K09906
$$ 1522230 1287876 987701 367116 473573 1447886 1751047 1036282 113969 202944 412850
13430D12850M5451R6041Q9998N19824J55974j30193K49222O854k70572m58995
$$ 412850 458301 554342 644340 1164164 1320138 1189945 1439167 1446021 1175449 716454
13420G16454q80920l12778L19532L35802K92808M8901n53106p10909r5596L95060
$$ 716454 -164466 -477244 -157712 178090 470898 519799 -33307 -744216 -839812 -444752
13410d44752K47685r9636l3067N59161P78031m85110k42784n2530L63180L1250
$$ -444752 -197067 -296703 -329770 229391 1007422 522312 279528 226998 590178 621428
13400F21428o19758l39234k87013k83312J44976l34009j11278O02918O39033O3232
$$ 621428 1670 -337564 -624577 -907889 -762913 -1096922 -1208200 -605282 33751 96983
13390I6983L24560N54108k71730m58628m15892j45999L6450J14281N5327Q6200
$$ 96983 421543 975651 703921 245293 -170599 -316598 -280148 -165867 -110540 -24340
13380b4340j41051r2642K2211q1540m47881m89495l92581O8347K50420L11863
$$ -24340 -165391 -258033 -235822 -317362 -765243 -1254738 -1647319 -1578972 -1328552 -1016689
13370a016689P19911K76527n37031m59148j96481r206J70696N82593k35273m70633
$$ -1016689 -296778 -20251 -557282 -1016430 -1212911 -1222117 -1051421 -468828 -704101 -1174734
13360a174734N372K2506M22041Q25434R58455L08807N116j0152k11280m04415
$$ -1174734 -1169362 -1146856 -724815 100619 1059074 1367881 1372997 1362845 1151565 747150
13350G47150r86901o68492K79706J27749o56823L90641J830867L77128k30988
$$ 747150 -239751 -908243 -628537 -500788 -1157611 -766970 1063897 1441025 1210037
13341A210037L681n25303r31475l54858P45232M50385j40595n62594M86623M21977
$$ 1210037 1213718 688415 -243060 -597918 147314 597699 457104 -105490 381133 803110
13331H03110k42146J4959L6672J61447L9192l1457o32236n58116n8428R7371l5282
$$ 803110 560964 575923 612595 774042 813234 781777 149541 -408575 -467003 -369632 -404914
13320d04914N03296P74363p78386j137759p97959l77270q5034K89117L40803j36060
$$ -404914 98382 872745 94359 -1043400 -1841359 -2218629 -2303663 -2014546 -1673743 -1809803
13310a809803o10943J59519M0593K9853O15559P06279O01425M06399L13762r9096
$$ -1809803 -2420746 -2261227 -2220634 -2190781 -1575222 -868943 -267518 138881 452643 353547
13300C53547n57616o46389J17833R1810O46772J450790L72540r26958j334005
$$ 353547 -204069 -850458 -732625 -640815 5957 1456747 1829287 902329 -431676
13291d31676n87836J61366K97885M16786j8730M02413Q7684m41310J18689L44834
$$ -431676 -1019512 -858146 -560261 -143475 -162205 240208 327892 -113418 5271 350105
13281C50105N20905L50010J26505M8073j34758Q9407K43551k44158p10575l72968
$$ 350105 871010 1221020 1347525 1395598 1260840 1350247 1593798 1349640 639065 266097
13271B66097n45639m81250M12336L64234K50952j9726k68007l90488k88674J5132
$$ 266097 -279542 -760792 -348456 15778 266730 247004 -21003 -411491 -700165 -685033
13261f85033N41821M48568J76509l64743m16418m68673n13475o0273R41977Q84398
$$ -685033 -143212 305356 481865 117122 -299296 -767969 -1281444 -1341717 -399740 484658
13251D84658N87612M85370Q3450j17404R7781K90732K22061m46838j210623n43324
$$ 484658 1072270 1557640 1641090 1523686 1621467 1912199 2134260 1687422 476799 -66525
13241f6525j24841j11553n0458j14548J25312J7433m71229k19196L07296Q95772
$$ -66525 -191366 -302919 -353377 -467925 -342613 -325180 -796409 -1015605 -708309 187463
13231A87463L05262n04457k5614J194116J275991R276o64656n25993m54500p51773
$$ 187463 492725 -11732 -37346 1156770 2432761 2442037 1777381 1251388 796888 45115
13221D5115k36430J17501k61475n32951P9683l715K33723M02364j28332N7570
$$ 45115 -191315 -73814 -335289 -868240 -788557 -792272 -558549 -156185 -284517 -226947
13211b26947K22129J12012L92425L2926l160j0556p3683J12990m97525l65661
$$ -226947 -4818 107194 499619 532545 529385 518829 445146 558136 60611 -305050
13201c05050l35498j21980j6005M533K59215O4563K18031n86728r9132N23520
$$ -305050 -640548 -762528 -778533 -774000 -514785 -450222 -232191 -818919 -918051 -394531
13191c94531N66838N18619k41210j273459o76083J87210O36814O8468k52508J90948
$$ -394531 172307 690926 449716 -823743 -1499826 -1312616 -675802 -607334 -859842 -668894
13181f68894K31566Q62005M81196k27566M27604M00169k91961k86166M54308j2197
$$ -668894 -437328 424677 905873 678307 1105911 1506080 1214119 927953 1382261 1370064
13171A370064m3114J77829n83820J65308k86364o40676L26375L45405o82991j37542
$$ 1370064 1326950 1504779 920959 1086267 799903 159227 485602 831007 148016 10474
13161A0474L29629P4736L43945N57014o5884o21213r3932k26924l38165q8817
$$ 10474 340103 414839 758784 1315798 1249914 628701 534769 307845 -30320 -119137
13151a19137n43762l27104j09272k11050n48693J8931k43741p89872j7185N47862
$$ -119137 -662899 -990003 -1099275 -1310325 -1859018 -1840087 -2083828 -2873700 -2890885 -2343023
13141b343023J036976L46430J54450M29303O0203k62138L34479K55703m3409K51627
$$ -2343023 -1306047 -959617 -805167 -375864 -315661 -577799 -243320 12383 -31026 220601
13131B20601M62273j44355m30388j50969K48273L70906n63219L91537P80937j4734
$$ 220601 682874 538519 108131 -42838 205435 576341 13122 404659 1185596 1170862
13121A170862l62368n76256J2142M76225K69567Q5957K75631K11313l76916o20167
$$ 1170862 808494 232238 244380 720605 990172 1076129 1351760 1563073 1186157 565990
13111E65990n734P33161K01659m48401l55626m29141o55638m31615L7700J84813
$$ 565990 560256 1293417 1495076 1046675 691049 261908 -393730 -825345 -787645 -602832
13101f02832j52031J67049M80343o26067r25492k89075r6707N53933O72557K94620
$$ -602832 -754863 -587814 -107471 -733538 -1659030 -1948105 -2044812 -1490879 -818322 -523702
13091e23702q91936m23132P54171M00708M58950O31585K31462l91383K5917K0081
$$ -523702 -1415638 -1838770 -1084599 -683891 -224941 406644 638106 246723 272640 292721
13081B92721K3323P97442Q49267k47437P466r7048k42481J10804K20119K61657
$$ 292721 316044 1113486 1962753 1715316 1722782 1625734 1383253 1494057 1714176 1975833
13071A975833m5954m58357o26665o47166n24106J2924O72568K86121n66160J15217
$$ 1975833 1929879 1471522 844857 197691 -326415 -313491 359077 645198 79038 194255
13061A94255k34205n85421m34054L40985M44938l33756j77691L34918k29333m65995
$$ 194255 -39950 -625371 -1059425 -718440 -273502 -607258 -784949 -450031 -679364 -1145359
13051a145359K22884Q15159L44352L8086J19305m7608o97755n39414M76313K03836
$$ -1145359 -922475 -107316 237036 275122 394427 346819 -350936 -890350 -414037 -210201
13041b10201M30488R42830J89961j95825R1523l27830n40863j14712M15308L46940
$$ -210201 220287 1163117 1353078 1157253 1248776 920946 380083 265371 680679 1027619
13031A027619N94896L6118o96534m06936l08793p57159J21305O64503L05484n32158
$$ 1027619 1622515 1658633 962099 555163 246370 -510789 -389484 275019 580503 48345
13021D8345j014450p60467k06783Q34959Q08839N57629k40903p87756m47339l47056
$$ 48345 -966105 -1726572 -1933355 -1098396 -289557 268072 27169 -760587 -1207926 -1554982
13011a554982K78941M91064j9965k82427n68669J37427O92288N71320R37892K81928
$$ -1554982 -1276041 -784977 -804942 -1087369 -1656038 -1518611 -826323 -255003 682889 964817
13001I64817l82963r95259j061910p37642m15373m9272L05505J420023M77761
$$ 964817 581854 -413405 -1475315 -2212957 -2628330 -2677602 -2372097 -952074 -474313
12992d74313O28890n3932n30134l51514M38731K89958n73582k58741K41218N53930
$$ -474313 154577 100645 -429489 -781003 -342272 -52314 -625896 -884637 -643419 -89489
12982h9489N40989p8929l38206o5113M86608N48193l80406p77328l93824K72150
$$ -89489 451500 372571 34365 -30748 455860 1004053 623647 -153681 -547505 -275355
12972b75355M59361j59227m96416l21511L24592K22843l8051j36702p1118o2014
$$ -275355 184006 24779 -471637 -793148 -468556 -245713 -283764 -420466 -491584 -553598
12962e53598n54935n21947J27845K16915L90341M51982R18355J84155q87124j061128
$$ -553598 -1108533 -1630480 -1502635 -1285720 -895379 -443397 474958 659113 -228011 -1289139
12952a289139L1862O75287L90979k17404m31543j06338J31700l6900K05230L77499
$$ -1289139 -1257277 -581990 -191011 -408415 -839958 -946296 -814596 -851496 -646266 -268767
12942b68767J50528k78991J70878K69916m24500K29393Q86401P06919j03794l72055
$$ -268767 -118239 -397230 -226352 43564 -380936 -151543 734858 1441777 1337983 965928
12932I65928o01146j038718n80181p14187o43790P73491M39447M12780K38440
$$ 965928 364782 -673936 -1254117 -1968304 -2612094 -1838603 -1399156 -986376 -747936
12923g47936k68371K87154K21404J6579j77718M02991N32929m09729l74167J032528
$$ -747936 -1016307 -729153 -507749 -491170 -668888 -265897 267032 -142697 -516864 515664
12913E15664M80730q90754l03427k43648k98197K2939L24906m16826p71502Q751
$$ 515664 996394 105640 -197787 -441435 -739632 -716693 -391787 -808613 -1580115 -1571364
12903a571364P28429J000833L44858k9748Q7320k91741m97792l31573l3143k66506
$$ -1571364 -842935 157898 502756 473008 560328 268587 -229205 -560778 -593921 -860427
12893h60427J58769K11952L82558Q4320q7496k39811k48261R5120m26164k20588
$$ -860427 -701658 -489706 -107148 -22828 -110324 -350135 -598396 -503276 -929440 -1150028
12883a150028M0878M00356K77435l84383m58183R4592J072392J603028N30297
$$ -1150028 -1109150 -708794 -431359 -815742 -1273925 -1179333 -106941 1496087 2026384
12874B026384p58098k72002j81695L66384p84863q34876j719k48929N0283L36913
$$ 2026384 1268286 996284 814589 1180973 396110 -438766 -440485 -689414 -639131 -302218
12864c02218Q27567J44669l43073K25951R5076J19321k96700m18413J54949P51463
$$ -302218 525349 670018 326945 552896 647972 767293 470593 52180 207129 958592
12854I58592O10994L09478M92022N53462r28631j380257n19854q7690P62502Q27052
$$ 958592 1569586 1879064 2371086 2924548 1995917 615660 95806 8116 770618 1597670
12844A597670K8409j094185l27887L95192R43202N11193n11221j283681m85900
$$ 1597670 1626079 531894 204007 599199 1542401 2053594 1542373 258692 -227208
12835b27208N00643k33878o88909M83532P57092k33227l62993N63918Q32474L26553
$$ -227208 273435 39557 -649352 -165820 591272 358045 -4948 558970 1391444 1717997
12825A717997J61168L0901r4637m79157o69221q47647o39598m9990J36170J63111
$$ 1717997 1879165 1910066 1815429 1336272 667051 -180596 -820194 -870184 -734014 -570903
12815e70903J77913p1600J26015M6689O12006L17714K67145M0055l26795N18647
$$ -570903 -392990 -464590 -338575 -291886 320120 637834 904979 945034 618239 1136886
12805A136886L60099o27653q19278n57112k57561O25427N79836K34741L96569
$$ 1136886 1496985 869332 50054 -507058 -764619 -139192 440644 675385 1071954
12796A071954j96196o19721r86646M8380K78645j03460K82166P27564Q36002l20636
$$ 1071954 875758 256037 -730609 -682229 -403584 -507044 -224878 502686 1338688 1018052
12786A018052r57473j9361J475909Q89276k4795O9920m13017q77278m56735K4718
$$ 1018052 60579 41218 1517127 2406403 2381608 2451528 2038511 1161233 704498 729216
12776G29216l39152o03849j72450j85595k07348N038m77946m36823M01386P05741
$$ 729216 390064 -213785 -386235 -571830 -779178 -774140 -1252086 -1688909 -1287523 -581782
12766e81782P5489m72453l27307q1598k81632L25759O86522K6639M521j20873
$$ -581782 -506293 -978746 -1306053 -1387651 -1669283 -1343524 -657002 -630363 -625842 -746715
12756g46715Q0848O37886O62230k3329K08555P93502j36087m47832j256986o39448
$$ -746715 -665867 -27981 634249 610920 819475 1612977 1476890 1029058 -227928 -867376
12746h67376L08559Q20330p6507o28827N10763J154593j5447l21993m75104p41644
$$ -867376 -558817 261513 185006 -443821 66942 1221535 1206088 884095 408991 -332653
12736c32653k40856J16032R4726k13369j89909o9856k61077J67853P12798K8880
$$ -332653 -573509 -457477 -362751 -576120 -766029 -835885 -1096962 -929109 -216311 -187431
12726a87431q19879k57934N31566J29775l25459J2969N28763J165776Q99819K64267
$$ -187431 -1007310 -1265244 -733678 -603903 -929362 -916393 -387630 778146 1677965 1942232
12716A942232l83000p90348q76498p14411M03071N20109M19488j3731m23702j33139
$$ 1942232 1559232 768884 -107614 -822025 -418954 101155 520643 506912 83210 -49929
12706d9929l10679p2598J8772L46797O33892M80110K75672k19628M8927J04012
$$ -49929 -360608 -433206 -414434 -67637 566255 1046365 1322037 1102409 1151336 1255348
12696A255348M0293j43829P5460M1930j084816j357316P9208N25216n53289p54395
$$ 1255348 1295641 1151812 1227272 1269202 184386 -1172930 -1093722 -568506 -1121795 -1876190
12686a876190M9516N43345Q38582P17003j3736n6235p20411j339306K1643P18303
$$ -1876190 -1826674 -1283329 -444747 272256 258520 202285 -518126 -1857432 -1835789 -1117486
12676a117486P51816J88356M93755N47292l24639o05745J87322N22401j50236
$$ -1117486 -365670 -177314 316441 863733 539094 -66651 120671 643072 492836
12667D92836l82860O35109M44911k24585j57998j03717Q8474p39815p00189n70155
$$ 492836 109976 745085 1189996 965411 807413 703696 792170 52355 -647834 -1217989
12657a217989K68771p917l35969k943K15549K43501l75582K00232M45645j53733
$$ -1217989 -949218 -957135 -1293104 -1296047 -1080498 -836997 -1212579 -1012347 -566702 -720435
12647g20435n75301k12497L91609O83263J91256m63552o10687l94126j84956L75806
$$ -720435 -1295736 -1508233 -1116624 -433361 -242105 -705657 -1316344 -1710470 -1895426 -1519620
12637a519620J95495M3186P62778M99177o6359m89004l49349l73393q67712K2312
$$ -1519620 -1324125 -1280939 -518161 -18984 -85343 -574347 -923696 -1297089 -2164801 -2142489
12627b142489P96717O23477N18551P07001r1750n32546P8297J94235L01652M00675
$$ -2142489 -1345772 -722295 -203744 503257 411507 -121039 -42742 151493 453145 853820
12617H53820R98150J002367o8770q10943r60417j11578m00496P0873J07170m33320
$$ 853820 1851970 2854337 2785567 1974624 1014207 902629 502133 573006 680176 246856
12607B46856r12346q57559L97185M81679o12480n8067O93613R90671R40115O0654
$$ 246856 -665490 -1523049 -1125864 -644185 -1256665 -1314732 -621119 369552 1309667 1370321
12597A370321J26707K04612o11384p35944n11534o53001k13191J190080J197128
$$ 1370321 1497028 1701640 1090256 354312 -157222 -810223 -1023414 166666 1363794
12588A363794L86894m85731j320876j016913L24173P50605R7688p03645q3391
$$ 1363794 1750688 1264957 -55919 -1072832 -748659 1946 99634 -604011 -687402
12579f87402P04199J005256O54955o93427n36429j1881L48553J282243P19167
$$ -687402 16797 1022053 1677008 983581 447152 435271 783824 2066067 2785234
12570B785234m60641p57898o4052J38871k69827p49504j146064m06002J36599
$$ 2785234 2324593 1566695 1502643 1641514 1371687 622183 -523881 -929883 -793284
12561g93284N72473J084873K57413m00509k20642M06067K02425J21582P14246
$$ -793284 -220811 864062 1121475 720966 500324 906391 1108816 1230398 1944644
12552A944644K88191r8580q96750r21040o86175p07424n35650M01527R25299M60931
$$ 1944644 2232835 2134255 1237505 316465 -369710 -1077134 -1612784 -1211257 -285958 174973
12542A74973R64561J053603j69716j58074m11592k16802L6517J58034j6746J96590
$$ 174973 1139534 2193137 2023421 1865347 1453755 1236953 1273470 1431504 1414758 1611348
12532A611348P38120N27888r16268j362847o29128m73965n40794M10191J376721
$$ 1611348 2349468 2877356 1961088 598241 -30887 -504852 -1045646 -635455 741266
12523G41266J093845J96968j032614r56756j43747n0570m75357m76900O79132
$$ 741266 1835111 2032079 999465 42709 -101038 -151608 -626965 -1103865 -424733
12514d24733Q16265k62892k72009l3947n22923m74737J19676k91355l12628L51075
$$ -424733 391532 128640 -143369 -177316 -700239 -1174976 -1055300 -1346655 -1659283 -1308208
12504a308208P49943J165067J115162Q52787M14462r20825j186540k3967N54751
$$ -1308208 -558265 606802 1721964 2574751 2989213 2068388 881848 857881 1412632
12495A412632j3568O07969Q41232l44412q81081o98466k13252l5056k44205K63512
$$ 1412632 1399064 2007033 2848265 2503853 1622772 924306 711054 675998 431793 695305
12485F95305Q44830L93112j06512J47264m83418r38359l54968L92385o4705P8841
$$ 695305 1540135 1933247 1826735 1973999 1490581 552222 197254 589639 524934 603775
12475F03775K75596m9661l84271j033955l53654N67399P69878M17178J47682O5888
$$ 603775 879371 829710 445439 -588516 -942170 -374771 395107 812285 959967 1025855
12465A025855M6785M67035j37835m23249K02044J39532l5339p4777o68427m14578
$$ 1025855 1072640 1539675 1401840 978591 1180635 1320167 1284828 1210051 541624 127046
12455A27046M30566M22349m08324j67985K08479M5539K66629M62141J70511m61217
$$ 127046 557612 979961 571637 403652 612131 657670 924299 1386440 1556951 1095734
12445A095734q04341m84207j04459k06249J6883M75567j18861K58740P65747j44923
$$ 1095734 291393 -192814 -297273 -503522 -486639 -11072 -129933 128807 894554 749631
12435G49631r94846p34207P91315R00068l66318l86936J017077O42744o6072k48074
$$ 749631 -245215 -979422 -188107 711961 345643 -41293 975784 1618528 1552456 1304382
12425A304382k2632q9753q9389M1200K71930Q42084L15389p15776R4734Q15431
$$ 1304382 1281750 1191997 1102608 1143808 1415738 2257822 2573211 1857435 1952169 2767600
12415B767600J46751p73451p43828K986l9497k43014P3607O60171K094m05944
$$ 2767600 2914351 2140900 1397072 1400058 1360561 1117547 1191154 1851325 1853419 1447475
12405A447475q85040p77832l36228K25498Q73751J687805J752705N57483m80256
$$ 1447475 562435 -215397 -551625 -326127 547624 2235429 3988134 4545617 4065361
12396D065361j100603q19750l78606l14704K27587N98951J7105j07028l3838j6145
$$ 4065361 2964758 2145008 1766402 1451698 1679285 2278236 2295341 2188313 2154475 2138330
12386B138330K02193L22108q0053k56070L0071K25363l13216j60717P6432m12620
$$ 2138330 2340523 2662631 2582578 2326508 2356579 2581942 2268726 2108009 2184441 1771821
12376A771821o79936m46574N80475O48445N2590J74063Q69779N81628P58563M64225
$$ 1771821 1091885 645311 1225786 1874231 1926821 2100884 2970663 3552291 4310854 4775079
12366D775079M71425L94934q8642K87091J182530J579912K809970L887698N013095
$$ 4775079 5246504 5641438 5552796 5839887 7022417 8602329 11412299 15299997 20313092
12357B0313092P718392J0343879J3095896J5142301J5824649J3607580R567565
$$ 20313092 28031484 38375363 51471259 66613560 82438209 96045789 105613354
12350A05613354L739015l560552j0174853j4549898j5101414j3258286j0973476
$$ 105613354 109352369 105791817 95616964 81067066 65965652 52707366 41733890
12343D1733890q843409o105054l487439k163265j350388q30559q29736j682833
$$ 41733890 32890481 26785427 23297988 21134723 19784335 18953776 18124040 16441207
12335A6441207k100466k333787j471277j738965k076144n49442L71669k50337
$$ 16441207 14340741 12006954 10535677 8796712 6720568 6171126 6542795 6292458
12327F292458k53080P1027J11320l69388j52066M54257M91661M8372J41757o7626
$$ 6292458 6039378 6110405 6221725 5852337 5700271 6154528 6646189 6694561 6836318 6768692
12317F768692p22751n78862M2404O20703N53570L65594j95976j43125L05098J416787
$$ 6768692 6045941 5467079 5509483 6130186 6683756 7049350 6853374 6710249 7015347 8432134
12307H432134J169458N06852J188430K245786K861685L496313L637915M293528
$$ 8432134 9601592 10108444 11296874 13542660 16404345 19900658 23538573 27832101
12299B7832101O346178R380245J3989519K0119601K6196627L0425780L1988911
$$ 27832101 34178279 43558524 57548043 77667644 103864271 134290051 166278962
12292A66278962K8778329J9283062M880962r240626k2386248l0032474l1616079
$$ 166278962 195057291 214340353 219221315 209980689 187594441 157561967 125945888
12285A25945888k8808273k3236788j7211279j1748432p298250m616192l554699
$$ 125945888 97137615 73900827 56689548 44941116 37642866 33026674 29471975
12278B9471975k968609k242695k790653l401475k379387p49826q99722j456840
$$ 29471975 26503366 24260671 21470018 18068543 15689156 14939330 14039608 12582768
12270A2582768j429222j141920q68396p98302q19939k57096K89101P2175o3553
$$ 12582768 11153546 10011626 9143230 8344928 7524989 7267893 7556994 7629169 7565616
12261G565616N36353P35684K57710m13026n53922M66248J099071J58638r5210
$$ 7565616 8101969 8837653 9095363 8682337 8128415 8594663 9693734 9852372 9757162
12252I757162O78678N41117N37629O91170N28638O65154J315697K049095K500989
$$ 9757162 10435840 10976957 11514586 12205756 12734394 13399548 14715245 16764340 19265329
12243A9265329K391509L291917N579082P994208J0794285J5954292K2715331L0933267
$$ 19265329 21656838 24948755 30527837 38522045 49316330 65270622 87985953 118919220
12235A18919220M0175006M6775252M8297996M0651653K4887950M366515j6363617
$$ 118919220 159094226 205869478 254167474 294819127 319707077 324073592 307709975
12228C07709975l3093179m3602670m7209294m3555525l4368491k4912546j6748357
$$ 307709975 274616796 231014126 183804832 140249307 105880816 80968270 64219913
12221F4219913j1525524q319334n925754n376030m409107k590047k415609l018722
$$ 64219913 52694389 44375055 38449301 33073271 28664164 26074117 23658508 20639786
12213B0639786k374458k153927j510788o49334n56481j380758j391008o8817J08399
$$ 20639786 18265328 16111401 14600613 13951279 13394798 12014040 10623032 10554215 10662614
12204A0662614l06039j048095p67816j22792J80986J07096r5576j74852l59995
$$ 10662614 10356575 9308480 8540664 8417872 8598858 8705954 8610378 8435526 8075531
12195H075531l99897L1568L9819j34438K25558N80995M84460M36251P18035J154408
$$ 8075531 7675634 7707202 7747021 7612583 7838141 8419136 8903596 9339847 10057882 11212290
12185A1212290J535039K044695J720852K124970K879986M613847P511202J1138663
$$ 11212290 12747329 14792024 16512876 18637846 21517832 26131679 33642881 44781544
12177D4781544J5548243K1269048K7898492L1098650L1033192K6211496J6769638
$$ 44781544 60329787 81598835 109497327 140595977 171629169 197840665 214610303
12170B14610303L095802j1998660k3609534k9769094l1675344k9103603k3209562
$$ 214610303 217706105 205707445 182097911 152328817 120653473 91549870 68340308
12163F8340308j7176358j1692594q432821o002995m536673l276807k619697k070225
$$ 68340308 51163950 39471356 31038535 25035540 20498867 17222060 14602363 12532138
12155A2532138j474127j578234j102866j75349n32937j101579n40640j71241K8198
$$ 12532138 11058011 9479777 8376911 8201562 7668625 6567046 6026406 5855165 5883363
12146E883363J7253l31851m23453l60329p752J91697O28950N76027N69005l96332
$$ 5883363 5900616 5568765 5145312 4784983 4777231 4968928 5597878 6173905 6742910 6346578
12136F346578j276207n98618P05065L63476L68438R4008J013770R76124o40262
$$ 6346578 5070371 4471753 5176818 5540294 5908732 6002740 7016510 7992634 7352372
12127G352372l19246M71819l9810L00903M35966J139364J583230J967575K701751
$$ 7352372 7033126 7504945 7465135 7766038 8202004 9341368 10924598 12892173 15593924
12118A5593924N491213J0025479J2355091J2597826J3594103J5148452J4051935
$$ 15593924 21085137 31110616 43465707 56063533 69657636 84806088 98858023
12111I8858023Q878125J669785n811570j2166256j6234444j6521559j4019827
$$ 98858023 107736148 109405933 103594363 91428107 75193663 58672104 44652277
12104D4652277j0680380p462038o780050n213455l885546k742268j784022j082558
$$ 44652277 33971897 26509859 19729809 14516354 10630808 7888540 6104518 5021960
12096E021960o48491n00729l9206K37162n71313o34729Q7743O90946R1244m6871
$$ 5021960 4373469 3872740 3833534 4070696 3499383 2864654 2952397 3643343 3734587 3687716
12086C687716p50716k38367K25669N2592k55060k53387m72976n72928j45079k71322
$$ 3687716 2937000 2698633 2924302 2976894 2721834 2468447 1995471 1422543 1277464 1006142
12076A006142k95001K99981M74536p12562m35639j3788m85997n36590k55606R16670
$$ 1006142 711141 1011122 1485658 773096 337457 323669 -162328 -698918 -954524 -37854
12066c7854J265142O53585m51846j225095l82656O67585Q71408k03693l74621
$$ -37854 1227288 1880873 1429027 203932 -178724 488861 1360269 1156576 781955
12057G81955j97896j63502k18383P1083r1656m45646k57582n08030j87734O05303
$$ 781955 584059 420557 202174 273257 181601 -264045 -521627 -1029657 -1217391 -612088
12047f12088M76711N70142n85672l74451R33067O71519L42995l8727n46859r62985
$$ -612088 -135377 434765 -150907 -525358 407709 1079228 1422223 1383496 836637 -126348
12037a26348j86001K98861l4221l61953L55701R53551O47271J73284N07473l22343
$$ -126348 -312349 -13488 -47709 -409662 -53961 899590 1546861 1720145 2227618 1905275
12027A905275r40094o91410l85731J46163J60802K7171M16070L41799k08499m34652
$$ 1905275 965181 273771 -111960 34203 195005 222176 638246 980045 771546 336894
12017C36894m89611m75370J40314j68676n22367K01956L9586P88269Q12467M43225
$$ 336894 -152717 -628087 -487773 -656449 -1178816 -976860 -937274 -149005 663462 1106687
12007A106687k81244q08792p41825R8844M92355l87179r3359O19225Q63374N0505
$$ 1106687 825443 16651 -725174 -626330 -133975 -521154 -614513 4712 868086 918591
11997I18591o37156r95125n23987n1290N64209N82325k7771O5406m7732l64263
$$ 918591 281435 -713690 -1237677 -1288967 -724758 -142433 -170204 -104798 -152530 -516793
11987e16793l07839M58700N80589R7386l25966k01836N7490M93353l0716o7199
$$ -516793 -824632 -365932 214657 312043 -13923 -215759 -158269 335084 304368 237169
11977B37169o11804K4519J064886Q50861J28407R6494K93485R0304j88178n41757
$$ 237169 -374635 -350116 714770 1565631 1694038 1790532 2084017 2174321 1986143 1444386
11967A444386o58786n60963p11699m04189M26048N33012R51252N27920P3395n62429
$$ 1444386 785600 224637 -487062 -891251 -465203 67809 1019061 1546981 1620376 1057947
11957A057947l38622M0662l94825n14241L61774N20254k9690l18270k45876L43570
$$ 1057947 719325 759987 365162 -149079 212695 732949 703259 384989 139113 482683
11947D82683J35252k81201j002422q20113l7993N3777n43478m86495L85903Q47830
$$ 482683 617935 336734 -665688 -1485801 -1523794 -1470017 -2013495 -2499990 -2114087 -1266257
11937a266257L28326K42637N91707Q75514L7880j176179p07080K57744K25532
$$ -1266257 -937931 -695294 -103587 771927 809807 -366372 -1073452 -815708 -590176
11928e90176K89389j2509K00599Q84238N31468j073396j306879K25227M37780
$$ -590176 -300787 -313296 -112697 771541 1303009 229613 -1077266 -852039 -414259
11919d14259J95204j80212m50247N04544O68707J838M09510L4932l14663o0510
$$ -414259 -219055 -399267 -849514 -344970 323737 325575 735085 770017 455354 394844
11909C94844j39767k90312o00918n98621m1490J98202j30984m33711k27084k07496
$$ 394844 255077 -35235 -636153 -1234774 -1276264 -1078062 -1209046 -1642757 -1869841 -2077337
11899b077337K38087L48426J94768K49679n22224j108545k3888O5276J57945L38589
$$ -2077337 -1839250 -1490824 -1296056 -1046377 -1568601 -2677146 -2701034 -2635758 -2477813 -2139224
11889b139224j44283M57573L70316O1918p5291j55721n5392M09339P87416J115921
$$ -2139224 -2283507 -1825934 -1455618 -1393700 -1468991 -1624712 -1680104 -1270765 -483349 632572
11879F32572N98534J89588M8938m62547n36251n91928q50890K20635O09047K32867
$$ 632572 1231106 1420694 1469632 1007085 470834 -121094 -971984 -751349 -142302 90565
11869I0565J19912O40419O19780j31087n11266q14553l80550j14058m87970j30126
$$ 90565 210477 850896 1470676 1339589 828323 13770 -366780 -480838 -968808 -1098934
11859a098934L86387q50563j396866J83685J134616M91371J6997O62805J732640
$$ -1098934 -712547 -1563110 -2959976 -2776291 -1641675 -1150304 -1133307 -470502 1262138
11850A262138P40624n88939p77337l99428l50308l13809J62496K16997j4589L15139
$$ 1262138 2002762 1413823 636486 237058 -113250 -427059 -264563 -47566 -62155 252984
11840B52984J17954k33488J72989O94212M40067m81822k90343J45272k64220N22029
$$ 252984 370938 137450 310439 1004651 1444718 962896 672553 817825 553605 1075634
11830A075634J90021p99207j011513k86846l90347j21531P98018J082201n84973
$$ 1075634 1265655 466448 -545065 -831911 -1222258 -1343789 -545771 536430 -48543
11821d8543j247009n09319O06833J383250P78980N39599L98138L37152m80510
$$ -48543 -1295552 -1804871 -1198038 185212 964192 1503791 1901929 2239081 1758571
11812A758571n36253l25164o75344m91764L51831P5986j86185j70944l42324J95725
$$ 1758571 1222318 897154 221810 -269954 81877 157863 -28322 -199266 -541590 -345865
11802c45865M03497N7257K1763p36470q07569M07446M87257O07760L46123l04339
$$ -345865 57632 114889 136652 -599818 -1407387 -999941 -512684 95076 441199 136860
11792A36860r08679n58779K54107J517077J006710m20896k50567m54578p38626
$$ 136860 -771819 -1330598 -1076491 440586 1447296 1026400 775833 321255 -417371
11783d17371K41039K48010q47504n77149L85278M49179K50727J12553Q61187P76765
$$ -417371 -176332 71678 -775826 -1352975 -967697 -518518 -267791 -155238 705949 1482714
11773A482714J59006l17154J36137K66839k51983p35110N08329M04528q42164
$$ 1482714 1641720 1324566 1460703 1727542 1475559 740449 1248778 1653306 811142
11764H11142l98571j39746j17203j10256j54230o72124J2545P72806O83679J28375
$$ 811142 412571 272825 155622 45366 -108864 -780988 -768443 4363 688042 816417
11754H16417M60680j928l68839m17653K44769k8951j96693m3923l67916o47497
$$ 816417 1277097 1275169 906330 488677 733446 704495 507802 463879 95963 -551534
11744e51534N76180J111753l7430k77137O01318J065919n56943q44230j08336
$$ -551534 24646 1136399 1098969 821832 1423150 2489069 1932126 1087896 979560
11735I79560k19483l15402J10256K65843k37370n1003K29148k78379j85730k49564
$$ 979560 760077 444675 554931 820774 583404 532401 761549 483170 297440 47876
11725D7876m4442l89959j008255j000149M41951K221699J205241k53349n30494
$$ 47876 3434 -386525 -1394780 -2394929 -1952978 268721 1473962 1220613 690119
11716F90119M10123O53827K55009j9651j05822j663820j549407L80125J211284
$$ 690119 1100242 1754069 2009078 1989427 1883605 219785 -1329622 -949497 261787
11707B61787Q47472J63048q42464p86472n19412Q18014J028652N5563m59313n69365
$$ 261787 1109259 1272307 429843 -356629 -876041 -58027 970625 1026188 566875 -2490
11697b490O205J68788k74854n08492K89285L08562j40209J37021M22125j88166
$$ -2490 3715 172503 -102351 -610843 -321558 -12996 -153205 -16184 405941 217775
11687B17775o79028o37623K4732L39417l55281q32829J25993L11129J77737n826
$$ 217775 -461253 -1098876 -1074144 -734727 -1090008 -1922837 -1796844 -1485715 -1307978 -1313804
11677a313804J19521L20592J11550k23038l51776M3499j5213n34976j43546O14759
$$ -1313804 -1194283 -873691 -762141 -985179 -1336955 -1293456 -1308669 -1843645 -1987191 -1372432
11667a372432J041145J078400j85315j442048n45700l04326m26087r2915R90314
$$ -1372432 -331287 747113 561798 -880250 -1425950 -1730276 -2156363 -2249278 -1258964
11658a258964R97284K01945O81428L36694o12217p16997k19598O63710R41741
$$ -1258964 -261680 -59735 621693 958387 346170 -370827 -590425 73285 1015026
11649A015026K94207r23902j086505M1740J76101K6794K29982m16852L95273J60249
$$ 1015026 1309233 385331 -701174 -659434 -483333 -456539 -226557 -643409 -248136 -87887
11639h7887l48758j4970N46276J288172l12861r72299k51980R4924k60612k81212
$$ -87887 -436645 -451615 94661 1382833 1069972 97673 -154307 -59383 -319995 -601207
11629f01207o87114j29611M54798L67943m74483l207N26605K71009P86669N9595
$$ -601207 -1288321 -1417932 -963134 -595191 -1069674 -1072881 -546276 -275267 511402 570997
11619E70997p59535j374789q48024O26068Q95466l56814q13143L71805J011372
$$ 570997 -188538 -1563327 -2411351 -1785283 -889817 -1246631 -2059774 -1687969 -676597
11610f76597K44153L62635L58238l04423n88156M45663Q42631R7388j1569K62276
$$ -676597 -432444 -69809 288429 -15994 -604150 -158487 684144 781532 769963 1032239
11600A032239K81225K60776o99294m81595M9515L16777K58505l38967k04673n86676
$$ 1032239 1313464 1574240 874946 393351 442866 759643 1018148 679181 474508 -112168
11590a12168l48437K47008L21168L91488N83836N81228M77509k58270o07537o20012
$$ -112168 -460605 -213597 107571 499059 1082895 1664123 2141632 1883362 1275825 655813
11580F55813l50087n09114L25676K87224k76320o2646m10832q92985j85337N9715
$$ 655813 305726 -203388 122288 409512 133192 70546 -340286 -1233271 -1418608 -1358893
11570a358893l24205P4900O65043O39071K12108j37080j47944O3146n79486r80596
$$ -1358893 -1683098 -1608198 -943155 -304084 -91976 -229056 -377000 -313854 -893340 -1873936
11560a873936p77465j29840J420898J846517N83389l70291j68429N8111l86518
$$ -1873936 -2651401 -2781241 -1360343 486174 1069563 699272 530843 588954 202436
11551B02436J40334J84179o85884j97394M40544k54412j081606j4488J011190
$$ 202436 342770 526949 -158935 -356329 84215 -170197 -1251803 -1266291 -255101
11542b55101P26155M09203L54190k09402n75559q50789n03748Q9257J31019M39895
$$ -255101 471054 880257 1234447 1025045 449486 -401303 -905051 -815794 -684775 -244880
11532b44880j58517k94072R4524K08987o38428j286579m62602l25628l6765L62706
$$ -244880 -403397 -697469 -602945 -393958 -1032386 -2318965 -2781567 -3107195 -3143960 -2781254
11522b781254Q06595Q34311j05820J92514O46219N45652j93532k24977l74656
$$ -2781254 -1974659 -1140348 -1246168 -1053654 -407435 138217 -55315 -280292 -654948
11513f54948r46945n39384Q19973J258281N53853R6172k81306n01360o10426K30286
$$ -654948 -1601893 -2141277 -1321304 -63023 490830 587002 305696 -195664 -806090 -575804
11503e75804Q08423K1101j53241k2001r1p63248n5818N12380k2379O1765j98356
$$ -575804 232619 253720 100479 78478 78387 -684861 -740679 -228299 -250678 -188913 -387269
11492c87269M64001J021431M81197j43816M99453r7118p00865q57615n76636p1443
$$ -387269 76732 1098163 1579360 1435544 1934997 1837879 1137014 279399 -297237 -368680
11482c68680Q66260M78578J72861l98615q96648j97867K41789J82798k42956j050717
$$ -368680 497580 976158 1149019 750404 -146244 -344111 -102322 80476 -162480 -1213197
11472a213197l53984Q04293K02232l58473r8256R7311K54242J68162N50866N5935
$$ -1213197 -1567181 -762888 -560656 -919129 -1017385 -920074 -665832 -497670 53196 109131
11462A09131n40524m37432n0348J15459Q10146P64538J4483J08701l19131r50263
$$ 109131 -431393 -868825 -919173 -803714 6432 770970 785453 894154 575023 -375240
11452c75240j256415q37032J88841M70545P6139M91441L47795J89395M98108m10637
$$ -375240 -1631655 -2468687 -2279846 -1809301 -1733162 -1241721 -893926 -704531 -206423 -617060
11442f17060o22637o9065J69730O81294L24102j75652R6327M92174k06025n61375
$$ -617060 -1239697 -1308762 -1139032 -457738 -133636 -309288 -212961 279213 73188 -488187
11432d88187P1585K76059j21748O34067K66376p21020p40805m89163n00275n95291
$$ -488187 -416602 -140543 -262291 371776 638152 -82868 -823673 -1312836 -1813111 -2408402
11422b408402j73194P14271M60289j02778N97756P18689o8545M37095M78275M97392
$$ -2408402 -2581596 -1867325 -1407036 -1509814 -912058 -193369 -261914 175181 653456 1150848
11412A150848K78307N72087p67675q24319J041406l58502j357932o91618N71404
$$ 1150848 1429155 2001242 1233567 409248 1450654 1092152 -265780 -957398 -385994
11403c85994O46748M90612O54319J90598K15007m3067K36697m01976o60498K95154
$$ -385994 260754 751366 1405685 1596283 1811290 1768223 2004920 1602944 942446 1237600
11393A237600L64002K160k45721m03076k27955K28421J13136l51267J92860R08130
$$ 1237600 1601602 1603762 1358041 954965 727010 955431 1068567 717300 910160 1818290
11383A818290M3138l06852j261483j216226m82809M04912R73971J77851q03938
$$ 1818290 1861428 1554576 293093 -923133 -1405942 -1001030 -27059 150792 -653146
11374f53146j43193N34260K43929K34035Q46278M40969j150294j483786l67178
$$ -653146 -796339 -262079 -18150 215885 1062163 1503132 352838 -1130948 -1498126
11365a498126O00477M09168M62194j87753J68820Q31761J024253J54875q20233
$$ -1498126 -897649 -488481 -26287 -214040 -45220 786541 1810794 1965669 1145436
11356A145436l6194K12438n52120n02587p51667j61586N9948n38805j79980q0302
$$ 1145436 1109242 1321680 769560 266973 -484694 -646280 -586332 -1125137 -1305117 -1385419
11346a385419k92690k23176m58632L7340n17908n53039j81692Q63002J136406
$$ -1385419 -1678109 -1901285 -2359917 -2322577 -2840485 -3393524 -3575216 -2712214 -1575808
11337a575808M60359Q95044K23634K60305J65646j14565M52747M65360O87534
$$ -1575808 -1115449 -220405 3229 263534 429180 314615 767362 1232722 1920256
11328A920256K40276k43526n46667n62708J33139m63030j043357k22272K23634
$$ 1920256 2160532 1917006 1370339 807631 940770 477740 -565617 -787889 -564255
11319e64255l56908n16890j52106L44097j204p22369m88330L22071L51238O3627
$$ -564255 -921163 -1438053 -1590159 -1246062 -1247266 -1969635 -2457965 -2135894 -1784656 -1721029
11309a721029l1118N20133K24723q7255N88839N29635K59427r4201m53100l26304
$$ -1721029 -1752147 -1232014 -1007291 -1094546 -505707 23928 283355 189154 -263946 -590250
11299e90250k78214p6082K01663l61775N8493K68057m07846l07564N25215P47369
$$ -590250 -868464 -944546 -742883 -1104658 -1046165 -778108 -1185954 -1493518 -968303 -220934
11289b20934m0006k92265r0092N81772l4642n70617l51774N54591J195017K25841
$$ -220934 -260940 -553205 -643297 -61525 -96167 -666784 -1018558 -463967 731050 956891
11279I56891k99389n65994m34235N0990N35535K04157k96027k22588P4709K17146
$$ 956891 657502 91508 -342727 -291737 243798 447955 151928 -70660 4049 221195
11269B21195k50040J99751O45290M290M304M95410n43306p71473r90477p03928
$$ 221195 -28845 170906 816196 820486 824790 1320200 776894 5421 -985056 -1688984
11259a688984j15555m59305k94572K01719N87281J061438J061263j86377o67460
$$ -1688984 -1804539 -2263844 -2558416 -2356697 -1769416 -707978 353285 166908 -500552
11250e00552O64269J84110q09774m27137j07926p33733j266716j187639N06846
$$ -500552 163717 347827 -461947 -889084 -997010 -1730743 -2997459 -4185098 -3678252
11241c678252P71561P20568Q53415R48365L41759l40389J76673l5109O21141L88326
$$ -3678252 -2906691 -2186123 -1332708 -384343 -42584 -382973 -206300 -241409 379732 768058
11231G68058M04742N43738j49121r6704J58722j20505o51617k81112L47164K28343
$$ 768058 1172800 1716538 1567417 1470713 1629435 1508930 857313 576201 923365 1151708
11221A151708J53839M23009j09962o83294m14632j86438n87354p31065N3699J04573
$$ 1151708 1305547 1728556 1618594 935300 520668 334230 -253124 -984189 -930490 -825917
11211h25917m2235M65609R87791j7375J33358L86282P57961P78349n82606k52348
$$ -825917 -868152 -402543 585248 567873 701231 1087513 1845474 2623823 2041217 1788869
11201A788869M8433o26679l95144p83679q94358k9425L96263N52457M88143N28425
$$ 1788869 1837302 1210623 815479 31800 -862558 -891983 -495720 56737 544880 1073305
11191A073305o44182q30402k64913j35426k47470r79246j44246L90735L85425
$$ 1073305 429123 -401279 -666192 -801618 -1049088 -2028334 -2172580 -1781845 -1396420
11182a396420l91719q29037l09943Q3648Q41766M02521m9869p6450O8213M88600
$$ -1396420 -1788139 -2617176 -2927119 -2843471 -2001705 -1599184 -1649053 -1725503 -1657290 -1168690
11172a168690L10613J02547r456l97484n70601L2792R6269j46927n62532r883
$$ -1168690 -858077 -755530 -764986 -1162470 -1733071 -1700279 -1604010 -1750937 -2313469 -2323352
11162b323352k2702n7010j08887N27530M25089j5797p3199L10008K43846j19454
$$ -2323352 -2346054 -2403064 -2511951 -1984421 -1559332 -1575129 -1648328 -1338320 -1094474 -1213928
11152a213928M68777L23334M5199l09934j79253K38244K77447J13333R57531j38778
$$ -1213928 -745151 -421817 -376618 -686552 -865805 -627561 -350114 -236781 720750 581972
11142E81972j380769m04545J011727P34874n83722o37717K89381M93734L52545
$$ 581972 -798797 -1203342 -191615 543259 -40463 -678180 -388799 104935 457480
11133D57480O20450J6842p15492m52000m56681j13878m12329n68749j24646j73211
$$ 457480 1077930 1094772 379280 -72720 -529401 -643279 -1055608 -1624357 -1749003 -1922214
11123a922214M51581N52231N45300L66973K4524L54351O44567J14147J8527J36652
$$ -1922214 -1470633 -918402 -373102 -6129 18395 372746 1017313 1131460 1149987 1286639
11113A286639o39k81675m58991l05248j53794k2770N5876P6811n07034n27772
$$ 1286639 1286000 1004325 545334 240086 86292 63522 119398 196209 -310825 -838597
11103h38597J47510O2497J17052o18012m85911k44134j76883N54048K00097J73501
$$ -838597 -691087 -628590 -511538 -1129550 -1615461 -1859595 -2036478 -1482430 -1282333 -1108832
11093a108832L09787M60111J7876L22117P10973M5574j28700j50987j71170k05319
$$ -1108832 -799045 -338934 -321058 1059 712032 757606 628906 477919 306749 101430
11083A01430j059461k62844J59076K78231J159773J043575L58287n47348k10802
$$ 101430 -958031 -1220875 -1061799 -783568 376205 1419780 1778067 1230719 1019917
11074A019917j20903n2961n16810P1992P58411M12248l53168m06441n55324j209125
$$ 1019917 899014 846053 329243 401235 1159646 1571894 1218726 812285 256961 -952164
11064i52164p96775R28888J500710N81996n8751Q4387K95876K32427N8460p67148
$$ -952164 -1748939 -820051 680659 1262655 1203904 1288291 1584167 1816594 1875054 1107906
11054A107906j124367j94385M84812n24478l23602J4899K23609M40547k2869j145279
$$ 1107906 -16461 -210846 273966 -250512 -574114 -559215 -335606 104941 82072 -1063207
11044a063207o15581j23612m21964p43061n84657j02443L97886K87055J71192
$$ -1063207 -1678788 -1802400 -2224364 -2967425 -3552082 -3654525 -3256639 -2969584 -2798392
11035b798392M73670O27781Q1231L2050L64884k98806j71879N24849M17476m9842
$$ -2798392 -2324722 -1696941 -1615710 -1583660 -1218776 -1517582 -1689461 -1164612 -747136 -796978
11025g96978N26592O29798J34417j41693q0950n85700m00701K88225J11094m23198
$$ -796978 -270386 359412 493829 352136 271186 -314514 -715215 -426990 -315896 -739094
11015g39094l21927K94456J76464J48617N43224O20084K15456m25951j021024
$$ -739094 -1061021 -766565 -590101 -441484 101740 721824 937280 511329 -509695
11006e09695o91353j91160k52608m41567j96999J65431P23977O64273L88231Q7176
$$ -509695 -1201048 -1392208 -1644816 -2086383 -2283382 -2117951 -1393974 -729701 -341470 -254294
10996b54294N91544M70740M44952M02532q21480n8941Q19519n73703r46916n78152
$$ -254294 337250 807990 1252942 1655474 833994 775053 1594572 1020869 73953 -504199
10986e04199r1076k85125l79845M736K29511J068444N18711o1023p86022n32078
$$ -504199 -595275 -880400 -1260245 -1255509 -1025998 42446 561157 500134 -285888 -817966
10976h17966J87690O89434O10599Q845J84732j66927n09298o28318p1544M39323
$$ -817966 -630276 59158 669757 678602 863334 696407 187109 -441209 -512753 -73430
10966g3430M34964M68905L57456K50906m60686p66066m65114L31078N52577P2956
$$ -73430 361534 830439 1187895 1438801 978115 212049 -253065 78013 630590 703546
10956G03546K90736M26769q28601j014500J58505q5852m16518n65880r17325o0095
$$ 703546 994282 1421051 592450 -422050 -263545 -349397 -765915 -1331795 -2249120 -2309215
10946b309215Q34706N57590R26905O26058K75884K79841o1162k65999k46575k58872
$$ -2309215 -1474509 -916919 9986 636044 911928 1191769 1130607 864608 618033 359161
10936C59161l25189J67165K25450l5061m36219o72139q16529J42623L23801K78112
$$ 359161 33972 201137 426587 391526 -44693 -716832 -1533361 -1390738 -1066937 -788825
10926g88825O29361L26509N81950J099360Q23431j44023j137101q48141L64326
$$ -788825 -159464 167045 748995 1848355 2671786 2527763 1390662 542521 906847
10917I06847O01014M346r41711j331744r33646M82416P09475M0895k14575L97153
$$ 906847 1507861 1512207 570496 -761248 -1694894 -1212478 -503003 -462108 -676683 -279530
10907b79530J029372Q44021j54998o43034j29362L47933J89221o9381q14269n49300
$$ -279530 749842 1593863 1438865 795831 666469 1014402 1203623 1134242 319973 -229327
10897b29327m13620O6620M38784j91621j40644j0500n84346j022680n41873K04889
$$ -229327 -642947 -576327 -137543 -329164 -469808 -480308 -1064654 -2087334 -2629207 -2424318
10887b424318N53976P6558j86396l97763r1046M38140M45723K92251P96551O80483
$$ -2424318 -1870342 -1793784 -1980180 -2377943 -2468989 -2030849 -1585126 -1292875 -496324 184159
10877A84159l7065n86345k02052P3564J67625k48800l70543L07797P70117P55100
$$ 184159 147094 -439251 -641303 -567739 -400114 -648914 -1019457 -711660 58457 813557
10867H13557O17023j36866j099649r36783n87732J96497R06445j86422j30813
$$ 813557 1430580 1293714 194065 -742718 -1330450 -1133953 -227508 -413930 -544743
10858e44743j4592o34535R485N20141O80654M62583K11708q47155j47727M48695
$$ -544743 -559335 -1193870 -1184385 -664244 16410 478993 690701 -156454 -304181 144514
10848A44514j25830n13235r22242o92533r82032k34738N20551L91522M30113O31459
$$ 144514 18684 -494551 -1416793 -2109326 -3091358 -3326096 -2805545 -2414023 -1983910 -1352451
10838a352451Q13330K32369k17055O47289R92843J445084k66604p31636m16888
$$ -1352451 -539121 -306752 -523807 123482 1116325 2561409 2294805 1563169 1146281
10829A146281q93871o50321j1034P65689M11167R8010k58237p38880j07069N01952
$$ 1146281 252410 -397911 -408945 356744 767911 865921 607684 -131196 -238265 263687
10819B63687P64420O96679K26823n51231q54298m52286p39208K15668R62336J18174
$$ 263687 1028107 1724786 1951609 1400378 546080 93794 -645414 -429746 532590 650764
10809F50764q15657l41181k03329o55035j64832J31418M63224O15558N14407K55403
$$ 650764 -164893 -506074 -709403 -1364438 -1529270 -1397852 -934628 -319070 195337 450740
10799D50740j76340K46512p7060q16219n9140L29783J60828k04780J81949P83340
$$ 450740 274400 520912 443852 -372367 -431507 -101724 59104 -145676 36273 819613
10789H19613L44445N70562L0132j373845p31969J42677o64330o45277J73645N48813
$$ 819613 1164058 1734620 1764752 390907 -341062 -198385 -862715 -1507992 -1334347 -785534
10779g85534K78821O24364J408941R52047O14825k89063p24556J13392K66713
$$ -785534 -506713 117651 1526592 2478639 3093464 2804401 2079845 2193237 2459950
10770B459950K57246k60007p16543j167924p19918j51614O7363j81806J06532
$$ 2459950 2717196 2457189 1740646 572722 -147196 -298810 -231447 -413253 -306721
10761c06721J32981n24000m38038J82395Q10353O01998m44212n91644p32J61811
$$ -306721 -173740 -697740 -1135778 -953383 -143030 458968 14756 -576888 -577620 -415809
10751d15809m09612J22130J030848P23188K99425k30383p56274n24182m863J09625
$$ -415809 -825421 -703291 327557 1050745 1350170 1119787 363513 -160669 -165532 -55907
10741e5907k96078o85002l59094K69099Q96145P43006j75374N4659K03774J18338
$$ -55907 -351985 -1036987 -1396081 -1126982 -230837 512169 336795 391454 595228 713566
10731G13566j60564o1013l77228J37098O2165l94601m89893n21701J20525J43958
$$ 713566 553002 491989 114761 251859 314024 -80577 -570470 -1092171 -971646 -827688
10721h27688J16138n04509k9173K2328K61671O32408O32699J33698k02234Q5894
$$ -827688 -711550 -1216059 -1245232 -1222904 -961233 -328825 303874 437572 235338 321232
10711C21232m14043k71295l36537l61469Q41684Q32965j12082j65063j75591m05888
$$ 321232 -92811 -364106 -700643 -1062112 -220428 612537 500455 335392 159801 -246087
10701b46087m74344k77217M15067N83259J38647j81843L04197n94469j349403
$$ -246087 -720431 -997648 -582581 678 139325 -42518 261679 -332790 -1682193
10692a682193k79731P1617R04327J355386J79832q02100K01314K25716O47791
$$ -1682193 -1961924 -1890307 -985980 369406 549238 -252862 -51548 174168 821959
10683H21959P04595o54618j367172j165371l91070j40222O13823N42529J5665
$$ 821959 1526554 871936 -495236 -1660607 -2051677 -2191899 -1578076 -1035547 -1019882
10674a019882J01001J90654J03758L5741J79981M16202j07606q7619M22944Q32533
$$ -1019882 -918881 -728227 -624469 -588728 -408747 7455 -100151 -187770 235174 1067707
10664A067707L12752o78275p81846N40228J94380l80253k12260K89612P81378
$$ 1067707 1380459 702184 -79662 460566 654946 274693 62433 352045 1133423
10655A133423N82161n51817P8207Q05341N42460m64639j463124p83851j14275
$$ 1133423 1715584 1163767 1241974 2047315 2589775 2125136 662012 -121839 -236114
10646b36114J59750N72575M64917R59291P49316o88677m58459k65764o02991J00467
$$ -236114 -76364 496211 961128 1920419 2669735 1981058 1522599 1256835 653844 754311
10636G54311J40365P2721p13386j046129M48965R53081q6240k43443m0799m18393
$$ 754311 894676 967397 254011 -792118 -343153 609928 523688 280245 239446 -178947
10626a78947o01160o6097K92064L33633K25619k65306k14054J81702l06231o37371
$$ -178947 -780107 -846204 -554140 -220507 5112 -260194 -474248 -292546 -598777 -1236148
10616a236148n20881J2106M65212L287k9929m91426j40762Q09171Q01368M83560
$$ -1236148 -1757029 -1744923 -1279711 -1276424 -1306353 -1797779 -1938541 -1129370 -328002 155558
10606A55558K7470k67198J3116J63728L77422P9050n93723j21783M95462j1570
$$ 155558 183028 -84170 -71054 92674 470096 549146 -44577 -166360 329102 317532
10596C17532m08434J68021J073107P11861R4757k96001p57334o07700l69756j81159
$$ 317532 -90902 77119 1150226 1862087 1956844 1660843 903509 295809 -73947 -255106
10586b55106Q13396J16784j035755n25443J77539J24395J30529J90311j47444
$$ -255106 558290 675074 -360681 -886124 -708585 -584190 -453661 -263350 -410794
10577d10794q15730j259978o7969N24620O80111L32073O96697R49896N20467J355385
$$ -410794 -1226524 -2486502 -2554471 -2029851 -1349740 -1017667 -320970 628926 1149393 2504778
10567B504778O77071n90174r94174o13518L5742k90868L97483N61574n27251l52869
$$ 2504778 3181849 2591675 1597501 983983 1019725 728857 1126340 1687914 1160663 807794
10557H07794M5962k80745l55490k5328M91541N28607k7713n74564n36074n73830
$$ 807794 853756 573011 217521 192193 683734 1212341 1184628 610064 73990 -499840
10547d99840l38230j32634M1904J6843j26887j31333M5691M8666k57999L44460
$$ -499840 -838070 -970704 -928800 -911957 -1038844 -1170177 -1124486 -1075820 -1333819 -989359
10537i89359J53899n48408O32890J146071O09171n8361j182975J51370O84337
$$ -989359 -835460 -1383868 -750978 395093 1004264 945903 -237072 -85702 598635
10528E98635R4878r3590M61066O00064K38600J37724K20772n99377q08644p65148
$$ 598635 693513 599923 1060989 1661053 1899653 2037377 2258149 1658772 850128 84980
10518H4980m37756O25471N37315j31698K25291K98726j39012o39940j098042m62610
$$ 84980 -352776 272695 810010 678312 903603 1202329 1063317 423377 -674665 -1137275
10508a137275r3914L03202L72233o2363j91566k44939n27194m54564j51319L47375
$$ -1137275 -1231189 -927987 -555754 -618117 -809683 -1054622 -1581816 -2036380 -2187699 -1840324
10498a840324M84379N46458j23470l03005K27487P45868P83630N57933O67068
$$ -1840324 -1355945 -809487 -932957 -1235962 -1008475 -262607 521023 1078956 1746024
10489A746024K59546l95727q63884o31865l3983O56324M28853n8683o16404m28718
$$ 1746024 2005570 1609843 745959 114094 80111 736435 1165288 1106605 490201 61483
10479F1483o1779k93442J14829l4083n4531r2190o72243J67172L60565l06962
$$ 61483 -296 -293738 -178909 -212992 -267523 -359713 -1031956 -864784 -504219 -811181
10469h11181p59006r49135j45607R35333J93283o17562j167490l79559M26996
$$ -811181 -1570187 -2519322 -2664929 -1729596 -1536313 -2153875 -3321365 -3700924 -3273928
10460c273928N61005J82203J004185Q77559K87179J72387K15273M68638m3717
$$ -3273928 -2712923 -2530720 -1526535 -648976 -361797 -189410 25863 494501 450784
10451D50784j174195p77378J0687L70093O96926m62620o50494m01587J89209N42669
$$ 450784 -723411 -1500789 -1490102 -1120009 -423083 -885703 -1536197 -1937784 -1748575 -1205906
10441a205906O070k8066M84693k08803l58934L89600M28251K08342m84688r15431
$$ -1205906 -1199836 -1227902 -743209 -952012 -1310946 -921346 -493095 -284753 -769441 -1684872
10431a684872q996N66999n2391q73684o62198J87052J343326J644378P46188K20268
$$ -1684872 -1693868 -1126869 -1179260 -2052944 -2715142 -2528090 -1184764 459614 1205802 1426070
10421A426070j40250m31419j086874j526743p34664L35411L03404j82399L84854
$$ 1426070 1285820 854401 -232473 -1759216 -2493880 -2158469 -1855065 -2037464 -1652610
10412a652610L43206R0783o650p47927q39572J37068M21815M61190N55687K86310
$$ -1652610 -1309404 -1218621 -1225271 -1973198 -2812770 -2675702 -2253887 -1792697 -1237010 -950700
10402i50700M6335k55716q45310n02572M96705M42195N5189M05156O70781O3070
$$ -950700 -904365 -1160081 -2005391 -2507963 -2011258 -1569063 -1513874 -1108718 -437937 -374867
10392c74867j77911j23353J08065R3338Q6175K39212J20571J52048M93439k4128
$$ -374867 -552778 -676131 -568066 -474728 -388553 -149341 -28770 123278 616717 592589
10382E92589l58713M5125l46720m08207P9274J88503L40805r6137k71379m29597
$$ 592589 233876 279001 -67719 -475926 -396652 -208149 132656 36519 -234860 -664457
10372f64457J8622M81764K80680j84019K45430O83216j15154m50033M65016Q59067
$$ -664457 -645835 -164071 116609 -67410 178020 861236 746082 296049 761065 1620132
10362A620132M59182k10651J53558R68422j27676r19092j454878j318159j089236
$$ 1620132 2079314 1868663 2022221 2990643 2862967 1943875 488997 -829162 -1918398
10353a918398o77804N64775P39581N71721m9655j73851k38617M6399O47490N19070
$$ -1918398 -2596202 -2031427 -1291846 -720125 -769780 -943631 -1182248 -1135849 -488359 30711
10343C0711M43717m77576p97736l79694O4493j71884j26169k94220k32180k72167
$$ 30711 474428 -3148 -800884 -1180578 -1116085 -1287969 -1414138 -1708358 -1940538 -2212705
10333b212705n71423n01785k5122R98996J741652P37954M63841J10832n6990k89745
$$ -2212705 -2784128 -3285913 -3311035 -2312039 -570387 167567 631408 742240 685250 395505
10323C95505M66443J144030k85979n41089k17648N5823q68601o59269L03644R2027
$$ 395505 861948 2005978 1719999 1178910 961262 1017085 148484 -510785 -207141 -115114
10313a15114K13479J99952k40656K35819P64124L96684n35421n80708k71757Q33733
$$ -115114 98365 298317 57661 293480 1057604 1454288 918867 338159 66402 900135
10303I00135J041223k05097l91942o35563n58353k93710L62636L57980j17751
$$ 900135 1941358 1736261 1344319 708756 150403 -143307 219329 577309 459558
10294D59558r06686q55040K94532P57518O61570o3064j107758m75373M02395Q76492
$$ 459558 -447128 -1302168 -1007636 -250118 411452 348388 -759370 -1234743 -832348 44144
10284D4144k7631l73174j79456p42655n66244p3288O33489R28801N22587l48873
$$ 44144 16513 -356661 -536117 -1278772 -1845016 -1918304 -1284815 -356014 166573 -182300
10274a82300N39715N03127j023230j036498L36582O69012J09216l05388p76436
$$ -182300 357415 860542 -162688 -1199186 -862604 -193592 -84376 -389764 -1166200
10265a166200J59014N88975R51922O03555K5275Q70845P42079K05505j70390m98759
$$ -1166200 -1007186 -418211 533711 1137266 1162541 2033386 2775465 2980970 2810580 2311821
10255B311821r4814n52705m33500o31258m86006K22170J46152m22725l04791l42789
$$ 2311821 2217007 1664302 1230802 599544 113538 335708 481860 59135 -245656 -588445
10245e88445K45195k57807p14508o93299k13308Q78367J444085L53549m46819
$$ -588445 -343250 -601057 -1315565 -2008864 -2222172 -1343805 100280 453829 7010
10236G010j37881J55901L67568l6123o00483n23291k17213K88206M71024l56429
$$ 7010 -130871 25030 392598 356475 -244008 -767299 -984512 -696306 -225282 -581711
10226e81711q0481K94597K55250P1374L99369J62797j3845m04094p08161o44878
$$ -581711 -662192 -367595 -112345 -40971 358398 521195 507350 103256 -604905 -1249783
10216a249783O7408M39720O82182J230794R37846R3516r1478k39698o06583n04765
$$ -1249783 -1182375 -742655 -60473 1170321 2108167 2201683 2110205 1870507 1263924 759159
10206G59159K17940k34626n66291Q9705n31307m54443L63005N50136p3077q24302
$$ 759159 977099 742473 176182 265887 -265420 -719863 -356858 193278 120201 -704101
10196g04101k50474J07492J91134l3317p1144K19625N43775L6404l90414o88618
$$ -704101 -954575 -847083 -655949 -689266 -760410 -540785 2990 39394 -351020 -1039638
10186a039638l04101O42664N53460J93751L08421K04740K23953l53696k83112
$$ -1039638 -1343739 -701075 -147615 46136 354557 559297 783250 429554 146442
10177A46442K20908O91595L29736k65786o59106p97306m77154q05946o34260K66549
$$ 146442 367350 1058945 1388681 1122895 463789 -333517 -810671 -1616617 -2250877 -1984328
10167a984328J002280J60043j87195N01864N07994J50378p3407q3066O03477Q50506
$$ -1984328 -982048 -822005 -1009200 -507336 658 151036 77629 -5437 598040 1448546
10157A448546J168008L98965p08424n65651p60053q16946l51529L88075Q79820
$$ 1448546 2616554 3015519 2307095 1741444 981391 164445 -187084 200991 1080811
10148A080811L86142p28956l30927M19954J022041J027127L46113o24889o78120
$$ 1080811 1466953 737997 407070 827024 1849065 2876192 3222305 2597416 1919296
10139A919296l85505j311454j292572K87288Q40691K58301q1413l49945o47665
$$ 1919296 1533791 222337 -1070235 -782947 57744 316045 234632 -115313 -762978
10130g62978k1124K06952R604Q4290o07036R7713P44389L50623k27790j91715
$$ -762978 -784102 -577150 -567546 -483256 -1090292 -992579 -248190 102433 -125357 -317072
10120c17072m89040l00222m19636k62144L07882J11989P8747l14200J21702N86316
$$ -317072 -806112 -1106334 -1525970 -1788114 -1480232 -1368243 -1289496 -1603696 -1481994 -895678
10110h95678L7481j73835M97255P34223j73513p65077k9412J96572L22008o9147
$$ -895678 -858197 -1032032 -534777 199446 25933 -739144 -768556 -571984 -249976 -319123
10100c19123l25906n81257m32340L32565M38371N49282K63415J2207p62656n22021
$$ -319123 -645029 -1226286 -1658626 -1326061 -887690 -338408 -74993 -62786 -825442 -1347463
10090a347463K14533J41641j90146j23501K1679j38053j26965L14229o66996l04469
$$ -1347463 -1132930 -991289 -1181435 -1304936 -1283257 -1421310 -1548275 -1234046 -1901042 -2205511
10080b205511K0126j36035M83557P43961L0756Q8402Q58932Q70610M27438n41898
$$ -2205511 -2185385 -2321420 -1837863 -1093902 -1063146 -974744 -115812 754798 1182236 640338
10070F40338r00534r39920o46821K83977O84085Q61044M76012K9491O5548K76337
$$ 640338 -260196 -1200116 -1846937 -1562960 -878875 -17831 458181 487672 553220 829557
10060H29557M43219L4622m517j11043j13062k88036l1787J01282n41099n39775
$$ 829557 1272776 1307398 1302881 1191838 1078776 790740 758953 860235 319136 -220639
10050b20639j27304o16597r443K82102J58763Q16539J184099N98971r04936j303322
$$ -220639 -347943 -964540 -973983 -691881 -533118 283421 1467520 2066491 1161555 -141767
10040a41767R7199N5369p93935r21773l56951N92612N16940L44375j68026j81694
$$ -141767 -44568 10801 -783134 -1704907 -2061858 -1469246 -952306 -607931 -775957 -957651
10030i57651j85293l58572K72799p6922M47063N32609Q2745j83278o95746m25241
$$ -957651 -1142944 -1501516 -1228717 -1305639 -858576 -325967 -243222 -426500 -1122246 -1547487
10020a547487M45410M23498l53022n68973j69280K60984M60231K63546Q54926
$$ -1547487 -1102077 -678579 -1031601 -1600574 -1769854 -1508870 -1048639 -785093 69833
10011F9833J309332M65003p58058q87675j29305N25446L26300l71910l64880N6776
$$ 69833 1379165 1844168 1086110 198435 69130 594576 920876 548966 184086 240862
10001B40862K53002l9424J32247J7961o04625l22324k89929m36908M803L48110
$$ 240862 493864 454440 586687 604648 23 -322301 -612230 -1049138 -1044335 -696225
9991f96225j42834l4938O61356J089923j5594p70753J52610L71415O0912O56091
$$ -696225 -839059 -873997 -212641 877282 861688 90935 243545 614960 675872 1331963
9981A331963O91983M4349k42661p24906j65525j7551M74397k13791j041625j192397
$$ 1331963 2023946 2068295 1825634 1100728 935203 917652 1392049 1178258 136633 -1055764
9971a055764o86144N3638L62288O21316J73935j39761K33632O6820L32222M05358
$$ -1055764 -1741908 -1688270 -1325982 -704666 -530731 -670492 -436860 -370040 -37818 367540
9961C67540N16654L13216M19038N60683J12930k48279n47749k60842p18053m71783
$$ 367540 884194 1197410 1616448 2177131 2290061 2041782 1494033 1233191 515138 43355
9951D3355J66175M16346O4219o40408j296725k26409R56316Q49803J25998K97900
$$ 43355 209530 625876 690095 49687 -1247038 -1473447 -517131 332672 458670 756570
9941G56570K13296q65190k83557J32583L75565j37185r9897K62675n98234k98768
$$ 756570 969866 104676 -178881 -46298 329267 192082 92185 354860 -243374 -542142
9931e42142P99770R86482M84451m17684K61925M87240o45j399811j367101Q18
$$ -542142 257628 1244110 1728561 1310877 1572802 2060042 2059397 659586 -707515 -706697
9921g06697K59507J47487k35908l40260K3061N44574M52302P81156K2970o15329
$$ -706697 -447190 -299703 -535611 -875871 -852810 -308236 144066 925222 948192 332863
9911C32863n40470j36391p03895o26656R18717J504528N95107l08308r10571n36023
$$ 332863 -207607 -343998 -1047893 -1674549 -755832 748696 1343803 1035495 124924 -411099
9901d11099J90189L24245j96532l89339n6365L77577K90078j67422o43999m51129
$$ -411099 -220910 103335 -93197 -482536 -538901 -161324 128754 -38668 -682667 -1133796
9891a133796O9659O47898M89901J46979l58816l09158L15979K1171L73211Q31361
$$ -1133796 -1064137 -416239 73662 220641 -138175 -447333 -131354 -110183 263028 1094389
9881A094389J9371p55933k44878l06062m38689j7029j17713l91783P33128Q45629
$$ 1094389 1113760 357827 112949 -193113 -631802 -648831 -766544 -1158327 -425199 420430
9871D20430q667M99883O58829N22647j10161n29409l93830J4497N38994P02069
$$ 420430 411763 911646 1570475 2093122 1982961 1453552 1059722 1074219 1613213 2315282
9861B315282j4749m00972n88765p47887l63854l29980l21804k81909q1806N25889
$$ 2315282 2300533 1899561 1310796 562909 199055 -130925 -452729 -734638 -816444 -290555
9851b90555R22643J157385Q37238j65598j064842r20153o76467n40272m18843
$$ -290555 632088 1789473 2626711 2461113 1396271 476118 -200349 -740621 -1159464
9842a159464m7048r8896k84906m20439K37093Q60269J230066N80590J35067J11284
$$ -1159464 -1206512 -1305408 -1590314 -2010753 -1773660 -913391 316675 897265 1032332 1143616
9832A143616L45523j94532m9964M95828k69810n48129q86192q6863L23111J30350
$$ 1143616 1489139 1294607 1244643 1740471 1470661 922532 36340 -50523 272588 402938
9822D02938K34950n05266q95317j16481N02437m0320q9127M9822l72855J58406
$$ 402938 637888 132622 -762695 -879176 -376739 -417059 -506186 -456364 -829219 -670813
9812f70813R6748J8584k40918m81988P6940Q7343o8344j030052j279109K70328
$$ -670813 -574065 -555481 -796399 -1278387 -1201447 -1114104 -1182448 -2212500 -3491609 -3221281
9802c221281J133318J192937O81335L66843J81249j12876m18703j87072k09523
$$ -3221281 -2087963 -895026 -213691 153152 334401 221525 -197178 -384250 -593773
9793e93773J05290m16381k14436l11143j78076J71959J68334L65747L17244J18304
$$ -593773 -488483 -904864 -1119300 -1430443 -1608519 -1436560 -1268226 -902479 -585235 -466931
9783d66931M53469L15618l37791l97839r22903p11141l58O80954R36051k18271
$$ -466931 -13462 302156 -35635 -433474 -1356377 -2067518 -2067876 -1386922 -450871 -669142
9773f69142j80632M13936O22085j95932q45836j338065r98746K34372J213620
$$ -669142 -849774 -435838 186247 -9685 -855521 -2193586 -3192332 -2957960 -1744340
9764a744340J020737R06682J85843o52839l21237K89310L9824l41621p90617m16850
$$ -1744340 -723603 183079 368922 -283917 -605154 -315844 -276020 -617641 -1408258 -1825108
9754a825108J81889r1709k04216P60284Q65566M81869J77095k88428k4722M51456
$$ -1825108 -1643219 -1734928 -1939144 -1178860 -313294 168575 345670 57242 32520 483976
9744D83976Q8078k63891l1505J63006J060173P63980n06104j081703j060121o00945
$$ 483976 572054 308163 276658 439664 1499837 2263817 1757713 676010 -384111 -985056
9734i85056J49249n75490q71818n7007J327388Q64882l3156n29892l53838Q2080
$$ -985056 -835807 -1411297 -2283115 -2340122 -1012734 -147852 -181008 -710900 -1064738 -982658
9724i82658K20638K42636J81220l48619j47718l542l3161L26808M11033K30751
$$ -982658 -762020 -519384 -338164 -686783 -834501 -838043 -871204 -544396 -133363 97388
9714I7388j38542p24649n28475m43748j90615j25670N53828K89406J50103L68066
$$ 97388 -41154 -765803 -1294278 -1738026 -1928641 -2054311 -1500483 -1211077 -1060974 -692908
9704f92908k21949J92313k71687r28640p55501n96051J81201J245110N07082K12006
$$ -692908 -914857 -722544 -994231 -1922871 -2678372 -3274423 -3093222 -1848112 -1341030 -1129024
9694a129024J161679Q43212j19001r0641j04327J85627N022j67968m1656J83239
$$ -1129024 32655 875867 756866 666225 561898 747525 752547 584579 542923 726162
9684G26162l1445J51689j51019m91047l52732K04515N03024N73760K18214m84035
$$ 726162 694717 846406 695387 204340 -148392 56123 559147 1132907 1351121 867086
9674H67086q15398k24567k9101o28852p95304k59985K86804k21382J44018K48128
$$ 867086 51688 -172879 -201980 -830832 -1626136 -1886121 -1599317 -1820699 -1676681 -1428553
9664a428553P1161n8032k8324R33617O09375l39101l02210L22069O84785l94961
$$ -1428553 -1357392 -1415424 -1443748 -510131 99244 -239857 -542067 -219998 464787 69826
9654F9826o93995O497n49041r40251l77359M6332j85769R2522Q51122N15307J38099
$$ 69826 -624169 -617672 -1166713 -2106964 -2484323 -2437991 -2623760 -2531238 -1680116 -1164809 -1026710
9643a026710k64273m66373J57010J002150M66716k02689j137076n23793K10034
$$ -1026710 -1290983 -1757356 -1600346 -598196 -131480 -334169 -1471245 -1995038 -1785004
9634a785004M92766L77293N55895R05064J14403j087208n21655N13674j33770
$$ -1785004 -1292238 -914945 -359050 546014 660417 -426791 -948446 -434772 -568542
9625e68542j1751O1470k1911n82965L38602R86253N58861J75694k36494k30480
$$ -568542 -580293 -518823 -540734 -1123699 -785097 201156 760017 935711 699217 468737
9615D68737j98223r27982r64962k86721P67832J041647L99813R3359n25860r52263
$$ 468737 270514 -657468 -1622430 -1909151 -1141319 -99672 300141 393500 -132360 -1084623
9605a084623K28046R48345O02404J48552J81326K7415J11852j32864l33524n19122
$$ -1084623 -856577 91768 694172 842724 1024050 1051465 1163317 1030453 696929 177807
9595A77807J3755N41959N11674j25969l95193j45142k22349j92381r38175j96621
$$ 177807 191562 733521 1245195 1119226 724033 578891 356542 164161 -774014 -970635
9585i70635O5950m8614J14166m42227p65595l40850J72924O59093R28947P00349
$$ -970635 -904685 -953299 -839133 -1281360 -2046955 -2387805 -2214881 -1555788 -626841 73508
9575G3508M43983K92737K18074M42938k57772j239531n66468n0241j99012k77665
$$ 73508 517491 810228 1028302 1471240 1213468 -26063 -592531 -642772 -841784 -1119449
9565a119449r1790Q76949P64115q6009l73481k63098k89217k00389j88373K45043
$$ -1119449 -1211239 -334290 429825 343816 -29665 -292763 -581980 -782369 -970742 -725699
9555g25699O58242L15716l0888j15091p8000K59982M87149J41587k14571J82215
$$ -725699 -67457 248259 217371 102280 24280 284262 771411 912998 698427 880642
9545H80642K79653p15968p52119p18252l55652J88224N46954O48795K32866n03234
$$ 880642 1160295 444327 -307792 -1026044 -1381696 -1193472 -646518 2277 235143 -268091
9535b68091n26455k54259L61406J358006Q59559k75681p25378k89333n01585m42953
$$ -268091 -794546 -1048805 -687399 670607 1530166 1254485 529107 239774 -261811 -704764
9525g04764p00546p90919K28990J052927J168147M6811p02017j96521n07261J02988
$$ -704764 -1405310 -2196229 -1967239 -914312 253835 300646 -401371 -597892 -1105153 -1002165
9515a002165O42934p170k9803R0268M40704K32912K35973J64025k57399n529M8444
$$ -1002165 -359231 -366401 -396204 -305936 134768 367680 603653 767678 510279 504750 553194
9504E53194j90726J68943L2656R7477O67679r674k24911n62370p91104m44703
$$ 553194 362468 531411 564067 661544 1329223 1319549 1094638 532268 -258836 -703539
9494g03539J43183P11194K51280m12386J66152O47154o10090r29017j85827Q9823
$$ -703539 -560356 150838 402118 -10268 155884 803038 192948 -736069 -921896 -832073
9484h32073j78724p6859J75916J00713N73154P71999k52133L2920J18545j040461
$$ -832073 -1010797 -1087656 -911740 -811027 -237873 534126 281993 314913 433458 -607003
9474f07003m23759K50019O87005L79387N72312J2098L754q4311l19316k36774
$$ -607003 -1030762 -780743 -93738 285649 857961 870059 873813 789502 470186 233412
9464B33412q9113K74541k05401L12519K97645q9070Q4496j20117j62778n44524
$$ 233412 144299 418840 213439 525958 823603 734533 819029 698912 536134 -8390
9454h390o71228l54480J99659M61103P9197J84357n64925m72124P36035K13415
$$ -8390 -679618 -1034098 -834439 -373336 -294139 -109782 -674707 -1146831 -410796 -197381
9444a97381n82690N31985O80236L8822m42880j55430O70394L35933L43296k13200
$$ -197381 -780071 -248086 432150 470972 28092 -127338 543056 878989 1222285 1009085
9434A009085j047792m57889Q01503N83518P6202n66385k94453N35867M71125l84860
$$ 1009085 -38707 -496596 304907 888425 964627 398242 103789 639656 1110781 725921
9424G25921r33783k33688k33289k92160n12103M86783N81123l27218l78826R3026
$$ 725921 -207862 -441550 -674839 -966999 -1479102 -992319 -411196 -738414 -1117240 -1024214
9414a024214Q12027J327704P14555l83061n48174r37729m65192N43468J115571
$$ -1024214 -212187 1115517 1830072 1447011 898837 -38892 -504084 39384 1154955
9405A154955L19899N5810n09667n57237J44997M72048L48413O68244N66515N41408
$$ 1154955 1474854 1530664 1020997 463760 608757 1080805 1429218 2097462 2663977 3205385
9395C205385M06p90304o95375j011331p19470j18032J84914q38295o40195J1967
$$ 3205385 3205791 2415487 1720112 708781 -10689 -128721 56193 -782102 -1422297 -1410330
9385a410330m01098M5790J182420O24352M62312L48431l73446Q9705J54156L83262
$$ -1410330 -1811428 -1765638 -583218 41134 503446 851877 478431 568136 722292 1105554
9375A105554L84736J09100J8488p3233k22604n37095r38029L33085J032176J11613
$$ 1105554 1490290 1599390 1617878 1544645 1322041 784946 -153083 180002 1212178 1323791
$$ [...]
##END NTUPLES=NMR SPECTRUM
##END=
