##TITLE=C13_SAM_20.108 red
 THF+NA,22500 sc

 2.7.2019
##JCAMPDX= 6.0         $$ Bruker NMR JCAMP-DX V2.0
##DATA TYPE= NMR SPECTRUM
##DATA CLASS= NTUPLES
##ORIGIN= UXNMR, Bruker Analytische Messtechnik GmbH
##OWNER= root
$$ XWIN-NMR		Version 3.5
$$ Wed Jul  3 13:42:40 2019 Russian Standard Time (UT+4h)  she@DPX200
##.OBSERVE FREQUENCY= 50.327896
##.OBSERVE NUCLEUS= ^13C
##.ACQUISITION MODE= SIMULTANEOUS
##.ACQUISITION SCHEME= undefined
##.AVERAGES= 22500
##.DIGITISER RES= 17
##SPECTROMETER/DATA SYSTEM= spect
##.PULSE SEQUENCE= zgpg30
##.SOLVENT NAME= CDCl3
##.SHIFT REFERENCE= (INTERNAL, CDCl3, 0, 225.252)
##AUDIT TRAIL= $$ (NUMBER, WHEN, WHO, WHERE, WHAT)
$$ ##TITLE= Audit trail, XWIN-NMR		Version 3.5
$$ ##JCAMPDX= 5.01
$$ ##ORIGIN= Bruker BioSpin GmbH
$$ ##OWNER= she
$$ F:/spectra/data/she/nmr/c13/1/pdata/1/auditp.txt
$$ ##AUDIT TRAIL=  $$ (NUMBER, WHEN, WHO, WHERE, WHAT)
(   1,<2019-07-03 13:40:30.70 +0400>,<she>,<DPX200>,
      <created by zg, POWCHK disabled, PULCHK disabled
       terminated by command 'halt'
       configuration hash MD5:
       00 E9 B6 7A A2 85 ED C7 34 08 36 98 17 FE 4E 26
       data hash MD5: 32K
       46 8B F2 3F F9 61 65 F8 9E E9 B5 A7 56 22 80 77>)
(   2,<2019-07-03 13:40:36.81 +0400>,<she>,<DPX200>,
      <Start of raw data processing
       efp BC_mod = 2 LB = 1 FT_mod = 6 PKNL = 1 PHC0 = -388.9413 PHC1 = 30.20641 SI = 32K 
       data hash MD5: 32K
       95 08 A0 7E 58 3F 40 0F 27 82 82 72 6D 2F 02 F7>)
(   3,<2019-07-03 13:40:40.03 +0400>,<she>,<DPX200>,
      <abs ABSG = 5 
       data hash MD5: 32K
       CE 1E 68 03 7F A7 F6 2C 23 3A C8 F0 60 53 94 3E>)
(   4,<2019-07-03 13:41:03.17 +0400>,<she>,<DPX200>,
      <pk PHC0 = 7.480676 PHC1 = 1.4 
       data hash MD5: 32K
       E9 52 00 CB 20 65 B1 86 36 4B 26 E7 45 5F A1 C5>)
(   5,<2019-07-03 13:41:07.34 +0400>,<she>,<DPX200>,
      <abs ABSG = 5 
       data hash MD5: 32K
       C6 9D DD A0 DA 5D F1 B6 43 29 EA 8C C1 44 C6 38>)
(   6,<2019-07-03 13:41:34.48 +0400>,<she>,<DPX200>,
      <pk PHC0 = 1.05492 PHC1 = -0.4 
       data hash MD5: 32K
       D0 50 AE 5F 1F 33 DD A2 75 AD B1 C9 E8 00 E3 21>)
(   7,<2019-07-03 13:41:37.98 +0400>,<she>,<DPX200>,
      <abs ABSG = 5 
       data hash MD5: 32K
       74 D7 66 30 FF D2 C8 CB BE 4B BE F2 2B 13 D1 F4>)
$$ ##END=
$$ 
$$ hash MD5
$$ 90 4F 8B BA 63 F4 BF ED C7 32 5D 9F 25 E6 F8 0F
##$RELAX= 
##$RELAX= 
##$RELAX= 
##$RELAX= 
##$RELAX= 
##$RELAX= 
##$RELAX= 
##$RELAX= 
$$ Bruker specific parameters
$$ --------------------------
##$DU= <F:/spectra>
##$EXPNO= 1
##$NAME= <c13>
##$PROCNO= 1
##$TYPE= <nmr>
##$USER= <she>
##$AMP= (0..31)
100 100 100 100 100 100 100 100 100 100 100 100 100 100 100 100 100 100 
100 100 100 100 100 100 100 100 100 100 100 100 100 100 
##$AQSEQ= 0
##$AQ_mod= 1
##$AUNM= <au_zg>
##$AUTOPOS= <>
##$BF1= 50.322709
##$BF2= 200.13
##$BF3= 50.322709
##$BF4= 500.13
##$BF5= 500.13
##$BF6= 500.13
##$BF7= 500.13
##$BF8= 500.13
##$BYTORDA= 1
##$CFDGTYP= 0
##$CFRGTYP= 5
##$CHEMSTR= <none>
$$ [...]
##$SUBNAM4= <"">
##$SUBNAM5= <"">
##$SUBNAM6= <"">
##$SUBNAM7= <"">
##$SUBNAM8= <"">
##$SUBNAM9= <"">
##$SW= 239.972175391363
##$SWIBOX= (0..15)
0 1 3 0 0 0 0 0 0 0 0 0 0 0 0 0 
##$SW_h= 12077.2946859903
##$TD= 32768
##$TD0= 1
##$TE= 0
##$TE2= 300
##$TE3= 300
##$TEG= 300
##$TL= (0..7)
120 120 120 120 120 120 120 120 
##$TP= (0..7)
150 150 150 150 150 150 150 150 
##$TP07= 0
##$TPNAME0= <>
##$TPNAME1= <>
##$TPNAME2= <>
##$TPNAME3= <>
##$TPNAME4= <>
##$TPNAME5= <>
##$TPNAME6= <>
##$TPNAME7= <>
##$TPOAL= (0..7)
0.5 0.5 0.5 0.5 0.5 0.5 0.5 0.5 
##$TPOFFS= (0..7)
0 0 0 0 0 0 0 0 
##$TUNHIN= 0
##$TUNHOUT= 0
##$TUNXOUT= 0
##$USERA1= <user>
##$USERA2= <user>
##$USERA3= <user>
##$USERA4= <user>
##$USERA5= <user>
##$V9= 5
##$VALIST= <valist>
##$VCLIST= <CCCCCCCCCCCCCCC>
##$VD= 0
##$VDLIST= <DDDDDDDDDDDDDDD>
##$VPLIST= <PPPPPPPPPPPPPPP>
##$VTLIST= <TTTTTTTTTTTTTTT>
##$WBST= 1024
##$WBSW= 4
##$XGAIN= (0..3)
0 0 0 0 
##$XL= 0
##$YL= 0
##$YMAX_a= 153610754
##$YMIN_a= -76366583
##$ZGOPTNS= <>
##$ZL1= 120
##$ZL2= 120
##$ZL3= 120
##$ZL4= 120
##$ABSF1= 225.2522
##$ABSF2= -14.74524
##$ABSG= 5
##$ABSL= 3
##$ALPHA= 0
##$AQORDER= 0
##$ASSFAC= 0
##$ASSFACI= 0
##$ASSFACX= 0
##$ASSWID= 0
##$AUNMP= <proc_1d>
##$AZFE= 0.1
##$AZFW= 0.5
##$BCFW= 0
##$BC_mod= 2
##$BYTORDP= 0
##$COROFFS= 0
##$CY= -3
##$DATMOD= 1
##$DC= 0
##$DFILT= <>
##$DTYPP= 0
##$F1P= 0
##$F2P= 0
##$FCOR= 0.5
##$FTSIZE= 32768
##$FT_mod= 6
##$GAMMA= 0
##$GB= 0
##$INTBC= 1
##$INTSCL= 4.134877e-10
##$ISEN= 128
##$LB= 1
##$LEV0= 0
##$LPBIN= 0
##$MAXI= 10000
##$MC2= 0
##$MEAN= 0
##$ME_mod= 0
##$MI= 0.1934396
##$NCOEF= 0
##$NC_proc= 3
##$NLEV= 6
##$NOISF1= 120.0001
##$NOISF2= 80.00006
##$NSP= 0
##$NTH_PI= 0
##$NZP= 0
##$OFFSET= 225.2522
##$PC= 1.4
##$PHC0= -380.4057
##$PHC1= 31.20641
##$PH_mod= 1
##$PKNL= yes
##$PPARMOD= 0
##$PSCAL= 0
##$PSIGN= 0
##$REVERSE= no
##$SF= 50.3225993700027
##$SI= 32768
##$SIGF1= 140
##$SIGF2= 120
##$SINO= 11.81781
##$SIOLD= 32768
##$SREGLST= <13C.CDCl3>
##$SSB= 0
##$STSI= 32768
##$STSR= 0
##$SW_p= 12077.2946859903
##$SYMM= 0
##$S_DEV= 0
##$TDeff= 32768
##$TDoff= 0
##$TI= <>
##$TILT= no
##$TM1= 0
##$TM2= 0
##$TOPLEV= 0
##$USERP1= <user>
##$USERP2= <user>
##$USERP3= <user>
##$USERP4= <user>
##$USERP5= <user>
##$WDW= 1
##$XDIM= 32768
##$YMAX_p= 392436863
##$YMIN_p= -1134945
$$ End of Bruker specific parameters
$$ ---------------------------------
##NTUPLES= NMR SPECTRUM
##VAR_NAME=  FREQUENCY,     SPECTRUM/REAL,   SPECTRUM/IMAG
##SYMBOL=    X,             R,               I
##VAR_TYPE=  INDEPENDENT,   DEPENDENT,       DEPENDENT
##VAR_FORM=  AFFN,          ASDF,            ASDF
##VAR_DIM=   32768,         32768,           32768
##UNITS=     HZ,            ARBITRARY UNITS, ARBITRARY UNITS
##FACTOR=    0.368581032318806, 1,           1
##FIRST=     11335.2760802109, 0,            0
##LAST=      -742.018605779436, 0,           0
##MIN=       -742.018605779436, -1134945,    0
##MAX=       11335.2760802109, 392436863,    0
$$ Real data points
##PAGE= N=1
##DATA TABLE= (X++(R..R)), XYDATA
$$ [...]
8519d56471K8985L50338J59747K0236j10873q9821r4345j37280l6308L594K06196
8508a56002K59103P2887n2877N1220R0280j77711j75705j63545l2891R6317m6985
8497b35909j07709K9845J71291J43431L24271K96012j24811k40977k07383q1665
8487c3604J82476J17737L670J00448J15582J04986j97129k56267q48J39227q849
8476B67429j68131k18888j33540j32080o0940O5900J48282K45110Q8473j10153
8466h538j40081j38951M0771O7450R4362J48609M5265l8493k21658j26004K60554
8455a6714L07382j7185j3350o7620j21567k3548o8099O0896J97439J92430J4601
8444D44665j6168J86626P4559O9807K04151j72058k49179q2412j8233J31514j66891
$$ y = [-456471, -427486, -77148, 82599, 102835, -8038, -97859, -192204, -329484, -365792, -362198, -156002, 103101, 175988, 123111, 174331, 264611, 86900, -88805, -252350, -285241, -188924, -235909, -343618, -313773, -142482, 949, 325220, 621232, 496421, 255444, 48061, -33604, 148872, 266609, 270279, 370727, 486309, 591295, 394166, 137899, 137051, 276278, 267429, 99298, -119590, -253130, -385210, -446150, -380250, -231968, 13142, 101615, -8538, -148619, -287570, -246799, -179349, -84987, 63622, 108887, 70394, -151264, -277268, -16714, 290668, 273483, 260133, 192513, 70946, 47398, -20701, 40195, 237634, 430064, 444665, 428497, 615123, 689682, 759489, 963640, 791582, 542403, 459991, 441758, 573272, 406381]
8433D06381j39451m760j3071K8292K44890K09757L1767k1178K7544K3133j6409
8422G76895k60173k26881n3866r4034L2149J37087l9886j35758j622J15179r8741
8411A50349l58910l51414J23803L50512J25551R5956K87487q0550k30929j02698
8401I157J5367l3874P3015K09205N6932p8365j33280J86041M05103P1123p3259
8390G07165j79208K3651J48210k18936j51120K02213J40338M1936Q0104q98j89913
8379F03542l10144j81903N1574Q3865K9397J32125J88246J2356k70392r3401k00273
8368D4992l27065k7516K39370L63865L9277j23216k0192j56505m0333K10587J48715
8357C51979Q4500N3618J75447K40427j22365l94122k09061r7683P9429K01558
$$ y = [406381, 266930, 262170, 249099, 277391, 522281, 732038, 763805, 742627, 770171, 793304, 776895, 516722, 289841, 235975, 141941, 174090, 311177, 271291, 135533, 133911, 249090, 150349, -208561, -559975, -436172, -85660, 39891, 135847, 423334, 342784, 111855, 9157, 24524, -9350, 63665, 272870, 329802, 251437, 118157, 304198, 709301, 780424, 707165, 527957, 551608, 699818, 480882, 329762, 531975, 672313, 714249, 794353, 793455, 603542, 293398, 111495, 163069, 246934, 276331, 408456, 596702, 609058, 338666, 245265, 44992, -282073, -309589, -70219, 293646, 332923, 209707, 189515, 33010, -7323, 203264, 351979, 436479, 490097, 665544, 905971, 783606, 389484, 180423, 82740, 162169, 363727]
8347C63727J31070K94098J20036N3781K4246j01381M2496K53411K31230P2245
8337A484959L0793P026j59664k07259j18969j01823m262J93249J70238k0206j29125
8326A144957j88185k71467J3522Q5016Q0094l1630N06J31893j8883j78775j49557
8315F17491l5343J4028K5056J06189J55719N3816l9952k38803j62475o7524j49799
8304B78403k15880j08402J42368L09473J62365j06090j85545j70053j06170j1374
8294a0905J43762J14057j74466j66045L9877J47171R0564J84005j17639l72182
8284a21801k24099j12380K4488K98558J20904l4500L3891Q1850K28350J47901
8274D43162J7639q4098j38286j72686q4930J50929l2730j00986J28287j4121j10706
$$ y = [363727, 494797, 788895, 908931, 962712, 986958, 885577, 928073, 1181484, 1412714, 1484959, 1515752, 1522778, 1363114, 1155855, 1036886, 935063, 930801, 1124050, 1294288, 1274082, 1144957, 956772, 685305, 698827, 783843, 863937, 832307, 832813, 964706, 945823, 767048, 617491, 582148, 596176, 621232, 727421, 883140, 936956, 897004, 658201, 495726, 428202, 278403, 62523, -45879, 96489, 405962, 568327, 462237, 276692, 106639, 469, -10905, 132857, 246914, 72448, -93597, -53720, 93451, 184015, 368020, 250381, -121801, -345900, -458280, -433792, -135234, -14330, -48830, -14939, 66911, 295261, 443162, 460801, 376703, 238417, 65731, -19199, 131730, 99000, -1986, 126301, 112180, 1474]
8263A474M0501J66836Q7494J40938j2463k24215m7607J31733r505j13523q5105
8252G6558j4895q3383j90598r5947N9625n1781R890J06304J21521Q9829J08309
8241A35432J8453j51199k32084o8095N3415k6534L5375L14632K81977r8863q5622
8230A76887l4523l25747k52238J23938K93636K96748Q8501M3622K31984Q2874
8220G25682l3688l9260j68056r6166j07101j26117j32837K029J61050n2610k55518
8209a22592k00857j0644r2215j19934J37323J66269J67582R4743l9239M1941K15534
8198B37911K31830J00783j36175j98788j51964L7494Q6435j1093j87704j81984
8188a73255J37667K40498J63368j09458N9495n9005j65575J8146Q3592o3346j26733
$$ y = [1474, 41975, 208811, 296305, 437243, 424780, 200565, 152958, 284691, 275186, 161663, 76558, 61663, -21720, -212318, -308265, -248640, -300421, -290531, -184227, -62706, 27123, 135432, 153885, 2686, -229398, -297493, -244078, -270612, -235237, 79395, 361372, 262509, 176887, 142364, -183383, -435621, -311683, -18047, 278701, 367202, 410824, 642808, 725682, 691994, 652734, 484678, 388512, 281411, 155294, 22457, 24486, 185536, 132926, -122592, -323449, -334093, -426308, -546242, -408919, -242650, -75068, 19675, -19564, 22377, 237911, 469741, 570524, 434349, 235561, 83597, 121091, 207526, 196433, 8729, -173255, -35588, 204910, 368278, 258820, 318315, 259310, 93735, 111881, 195473, 132127, 5394]
8177E394j46169p6775k1683N366R8268K43916N8890k60517k43858P3231L65148
8166A01211M80841N3486l77879j22816K5535J96653J33630k32143k15857L5628
8156G8289K50699K11117r4456j62070Q2554j47589j018K4259m04423l71202Q863
8145e24977J33396K15412K72773M5387O3744Q5589j8353k85926k14237K07472
8135a9720Q2752j1804J73120M084k34134R1899K75829n3032j99372o1514m8344
8124b36K49553L48810j03775k11826j24647j42073j38709j19390j07168n19j78896
8113e28876k59809n0369K38854K55413K15107J5406J61522K06994J0178o9981
8103A94439r9851o6029r3981K541J1503p0918N8796P4053j21692r3375j3198r3125
$$ y = [5394, -140775, -217550, -239233, -233867, -135599, 108317, 167207, -93310, -337168, -263937, 101211, 582052, 635538, 257659, 134843, 160378, 357031, 490661, 258518, 42661, 78289, 328988, 540105, 445649, 283579, 366133, 218544, 217526, 241785, -162638, -533840, -524977, -391581, -176169, 96604, 141991, 205735, 291324, 272971, -12955, -227192, -19720, 63032, 51228, 224348, 228432, -5702, 86197, 362026, 308994, 109622, 48108, -236, 249317, 598127, 494352, 282526, 157879, 15806, -122903, -242293, -349461, -349980, -528876, -788685, -839054, -600200, -344787, -129680, -114274, 47248, 254242, 264420, 194439, 94588, 28559, -65422, -62881, -51378, -122296, -63500, 10553, -111139, -204514, -217712, -310837]
8091c10837j21947O4559J41908K54929M2170j73144o8974P713j08854j01517j59600
8080e33594O0809K08179l4326o3119R1220J06624O1728l0183l904R581j7445J49090
8068D660j36767k58882j46037j28215k54768r2361K11573J03398J58588K00051
8058c38760J60705J53453J55952Q1741k11092r5186J6050r2822n7197M4331j60129
8047c42954l40293k05615M0049K65227K79214J51013m4895j38229J29878K76441
8037F9836K15753p0595j34742J9962P7274j34244j14317J36856P2867l455J37313
8026B72508k4586l8822J37093M0835m6579k99532l08876j81866j12397K67738
8016b94484J31252j13000J42007R3239j63915j13988j3447n0535j77059j28702
$$ y = [-310837, -432784, -368225, -226317, 28612, 70782, -102362, -171336, -163623, -272477, -373994, -533594, -472785, -264606, -298932, -362051, -270831, -164207, -102479, -132662, -136566, -126985, -144430, 4660, -132107, -390989, -537026, -665241, -920009, -1012370, -800797, -697399, -538811, -338760, -178055, -24602, 131350, 213091, 1999, -93187, -77137, -169959, -227156, -182825, -342954, -683247, -888862, -848813, -583586, -304372, -153359, -198254, -336483, -206605, 69836, 285589, 214994, 80252, 100214, 177488, 43244, -71073, 65783, 138650, 135195, 272508, 247922, 209100, 346193, 387028, 340449, 40917, -267959, -449825, -562222, -294484, -163232, -276232, -134225, -40986, -204901, -318889, -332336, -382871, -559930, -688632]
8006f88632J20427J66772J74904J04098M6938J61999J72483j23340k18291k64455
7996c47097O9406K73870Q2807J22009K39428N5468q0303o7890m3984j25173j02572
7985G5969j80465Q9010K30162J29683J03161j34364j96916j91280j23984K4368
7975a74656K91688J68902k45897l16683m0538K68644M47182L09125j05281j70403
7965D32083m2570k16447p8190M5483j25099j19197J1162O869l1241l7513J10956
7954d3704R7778j23850p5783M9638j02064j25224J48602J53999N8516J01481K2455
7943A61844j16456k43109j9900J02155K71711J33534m2480m5078k25997j32468
7933a56244J60544J50760j12685k82464l42490k58991J18441K19579m5649P4195
$$ y = [-688632, -568205, -401433, -226529, -122431, -75493, 86506, 258989, 135649, -82642, -347097, -277691, -3821, 78986, 200995, 440423, 495891, 415588, 347698, 303714, 178541, 75969, -104496, -15486, 214676, 344359, 447520, 313156, 116240, -75040, -199024, -174656, 117032, 285934, 40037, -276646, -317184, -48540, 398642, 707767, 602486, 432083, 389513, 173066, 94876, 140359, 15260, -103937, -92775, -85906, -117147, -154660, -43704, 54074, -69776, -145559, -95921, -197985, -323209, -174607, -20608, 37908, 139389, 161844, 45388, -197721, -217621, -115466, 156245, 289779, 247299, 202221, -23776, -156244, 4300, 155060, 42375, -240089, -582579, -841570, -723129, -503550, -549199, -475004]
7923d75004L70918P0462k74635k95298q5326n3039J45795J25997K19442J6143
7913b34545l5784J1269J75J473J35500n4207k71325j66606q7731N1624l4061p4026
7901g58244P4488J58065j1441J13698K03945j15724k28792j95137j51685q2584
7891i93411J53595L52982O3630m7018K84584J78576q7056P7124K5056r9242J93856
7880A02676J12297P798j18619j24700Q500J9928L3246q2219Q3961J25780L4029
7869B02677k9899p3538p8008J80262J61205j19947j30218p6454P2425k7489k13721
7858a32705q6151J44522K70897N4186J09496N0431j34587l63960l79915J6826
7848d50960J35441K2018J7789O6102J0172k1181N850J0068K1792O702o7815n2641
$$ y = [-475004, -104086, -33624, -308259, -603557, -688883, -741922, -596127, -470130, -250688, -234545, -270329, -259060, -258885, -257412, -121912, -176119, -447444, -614050, -701781, -650157, -684218, -758244, -683756, -525691, -537132, -423434, -219489, -335213, -564005, -759142, -910827, -993411, -839816, -486834, -423204, -470222, -185638, -7062, -94118, -16994, 8062, -91180, 102676, 214973, 222771, 104152, -20548, -12048, 7880, 41126, -41093, 42868, 168648, 202677, 172778, 99240, 21232, 201494, 362699, 242752, 112534, 36080, 108505, 81016, -132705, -218856, -74334, 196563, 250749, 360245, 410676, 276089, -87871, -467786, -450960, -315519, -293501, -275712, -209610, -199438, -220619, -214769, -204701, -182909, -176207, -244022, -296663]
7836b96663j06234j89299P6353K76620K44176N4052J22064K55054n782j82682
7826B47659o1976j52279k00772j04253k8777l7752J94099J48227k75647k46902
7816e18373J21403R8039O0495Q7845n0069q3294O7273R6924k2173j00977j10534
7805c53441m2089o4136j21648O2079J29513J04794J8378j05707J34925K32037
7795e295j12036j42016K00097J58931J2824N3785J5356J9839k10809j31663j36492
7784b77479k09319l9877J70573j0401l17151r6381J77106J89980K46985L8972
7774a26992R74L1108P3581J28267J02086J03863L9460r5171l14195J7118J99843
7763A59942J92311J87477j2683j24446j29138l24525k60609q701L9891m0073L3094
$$ y = [-296663, -402897, -592196, -515843, -239223, 4953, 59005, 181069, 436123, 430341, 247659, 185683, 33404, -167368, -271621, -300398, -338150, -144051, 4176, -271471, -518373, -396970, -298931, -238436, -150591, -200660, -283954, -216681, -119757, -141930, -242907, -353441, -395530, -459666, -581314, -519235, -389722, -284928, -266550, -372257, -237332, -5295, -117331, -259347, -59250, 99681, 112505, 166290, 181646, 201485, -9324, -140987, -277479, -486798, -526675, -356102, -366503, -683654, -780035, -602929, -412949, -165964, -126992, -126018, -94910, -21329, 106938, 209024, 312887, 352347, 257176, -57019, -39901, 159942, 352253, 539730, 527047, 402601, 273463, -51062, -311671, -320372, -280481, -320554, -287460]
7752b87460q901q4718N6392K44667M6892K9746K5863q9780j98290k74955M1996
7741d98548K44411M4017j1205J21889R1503J73346L0516J4865j1652J67581L5189
7730D01912k94431k47128j28188J22421N7022J1003J23881K5493j22132q4714
7720a34861J25139J92986o0060j38905J12820J21005n8448p2646j7556P8968O1279
7709B09721j24195j86210j95924j30400l490J34209O9668J31905J465j79123r2778
7698c65152k79463k90316j02623j6919K69464O0737Q3232k7809K5926J46336q2722
7687e79309l67226j74552K4307J38926L44210K17876L2115M2898Q99n5029o7858
7676d42743p6380L2734J10514R4961K06266K68408o959m46083k56016J64644J36040
$$ y = [-287460, -296361, -381079, -324687, -80020, -33128, -3382, 22481, -67299, -265589, -540544, -498548, -254137, -210120, -221325, -99436, -7933, 165413, 195929, 210794, 199142, 366723, 401912, 107481, -139647, -267835, -145414, -88392, -77389, 46492, 71985, -50147, -134861, -9722, 183264, 123204, -15701, 97119, 218124, 159676, 87030, 69474, 148442, 209721, 85526, -100684, -296608, -427008, -430498, -296289, -226621, -94716, -93251, -272374, -365152, -644615, -934931, -1037554, -1054473, -785009, -724272, -641040, -668849, -642923, -496587, -579309, -946535, -1121087, -1096780, -957854, -613644, -395768, -363653, -320755, -319856, -374885, -442743, -519123, -486389, -375875, -280914, -74648, 193760, 186801, -259282, -515298, -350654, -214614]
7665b14614K3136m9372q106j13108k11483r7528R0827k8290K5204J47256J04327
7654c31751k0031k40906k68957R4770J2524Q0491K05489M1224P2082O6341k97742
7643e86466j48861J88230J15461L7478L3122Q3191J49771Q0098k3416j0139O114
7632g5417L7644J21316J48139m6029p7109m843L8857J14945J12319J38005j26505
7621C81322j89367K8008J02584J9745p9504k1646M2120j2380j54732j74501j42772
7610b01123M9207R6245j07841m0450J78229J47069J41186K0264k13199j88666
7600a19079k02076J1673R3040O5733J02157R2307Q5605M6788P5321j34658l04857
7589a88046j58406O9560J84816J84790J16518r1302j95897r7062k40389k82373
$$ y = [-214614, -191478, -240850, -248956, -362064, -573547, -671075, -580248, -608538, -583334, -436078, -331751, -351782, -592688, -861645, -766875, -754351, -673860, -468371, -427147, -355065, -288724, -586466, -735327, -547097, -431636, -394158, -361036, -277845, -128074, -47976, -71392, -81531, -75417, -37773, 83543, 231682, 185653, 108544, 103701, 142558, 257503, 369822, 507827, 381322, 191955, 219963, 322547, 342292, 262788, 241142, 283262, 270882, 116150, -58351, -201123, -151916, -55671, -163512, -203962, -25733, 121336, 262522, 282786, 69587, -119079, -321155, -309482, -216442, -150709, -48552, 43755, 129360, 176148, 251469, 116811, -188046, -346452, -276892, -92076, 92714, 209232, 117930, -77967, -175029, -415418, -697791]
7579f97791k0866M0485J20121K84688J38150K1375J07660P5563k36910j56367
7569c23892J99127j20549j96487o1741N8380R5265J09007j3697J73372M979k18012
7558b94248j12106m516J40592J286k61710j12527K25358K15644K68674J72135
7548B38582j20237k6300J44114j3982N8604K38111q7765m06337l73467j09947
7538d58624J36489K01811L6906r9843m047J56006L26910K25622j67555j52197
7528B01478O2483j51690j02607J90028O4913J5335Q2883k00062j1901J16078q1552
7517A85386j53055j65202j22088j33121n1318n6984L1538J12954K39608R0460
7507b1822r9623j1735J56229L5855l9963k8496J21858R553q9331j34433l9976
$$ y = [-697791, -718657, -678172, -558051, -273363, -135213, -113838, -6178, 69385, -167525, -323892, -124765, -245314, -441801, -503542, -445162, -349897, -240890, -254587, -81215, -76236, -294248, -406354, -410870, -270278, -268992, -530702, -643229, -417871, -202227, 66447, 238582, 118345, 92045, 236159, 222177, 280781, 518892, 431127, 24790, -348677, -458624, -322135, -120324, -83418, -183261, -187308, -31302, 295608, 521230, 353675, 201478, 263961, 112271, 9664, 199692, 264605, 279940, 362823, 162761, 150860, 266938, 185386, 32331, -132871, -254959, -388080, -439398, -496382, -464844, -351890, -112282, -21822, -121445, -133180, 23049, 58904, 18941, -9555, 112303, 121856, 32525, -101908, -141884]
7496a41884K05633L704p1801R0627J47897L386j82523p3849j26862j62242J7854
7485b90060O1280M3664l188k8506J4118K44935K21831L5076j38833J36608L7973
7474C34898j85429k80005K2867K95028q3030k03455j59215j80566R4697O4840
7464b79370J56059j00838j85168j75281O7651K20220L8368L2163r335O7291j52759
7453c20999j11113J39180k6877l1207K02463J22407o8727j39478q3227k1007J09143
7442b29442J65071N0748J13238P7945k51915j77076n9089J19890m040l9649O3418
7431a70901p0599P5736J08364N9713L390l9045n4892P4812J46232J33289m8758
7420B17341k07957j34151R5186J66336P1131k5708m0446M108L6600N9686R2240
$$ y = [-141884, 63749, 67453, -4348, 86279, 234176, 237562, 55039, -18810, -145672, -307914, -290060, -228780, -185116, -188304, -216810, -202692, 42243, 264074, 299150, 160317, 296925, 334898, 149469, -130536, -107669, 187359, 104329, -99126, -258341, -438907, -344210, -279370, -123311, -224149, -409317, -584598, -516947, -296727, -258359, -226196, -235531, -168240, -320999, -432112, -292932, -319809, -351016, -148553, -26146, -94873, -234351, -317578, -338585, -229442, -64371, -13623, 99615, 177560, -74355, -251431, -310520, -190630, -194670, -234319, -170901, -241500, -165764, -57400, 2313, 5703, -33342, -88234, -13422, 132810, 266099, 217341, 9384, -124767, -29581, 136755, 207886, 182178, 141732, 145840, 182440, 242126, 334366]
7409C34366k06050l76761k04147J7082K06322J43792N0546q8355j67504o1562
7399c52271R6011J90489l2655q4983Q1904M3879P4122m1538k16797j16378K05349
7388a52868K20173K50857P3877k3551r3194j21942p1075J8907J9174p0968l2319
7377A7071o260r1593J6746L4303j10372n7240k965J55208J36494j44829k5277
7366g8714J58843K16317l3108k26901j01620J24311J21327J77873O5317j19403
7356C04242k74008j47497J96764J83369P1171p7039k05023n2665j83824o5064
7346b49574J39957l7348j46911j10504J03933J54592k3315j36047J9107k9921
7336c16031r0735J34428j2864p9003O0745l1990j72457Q4523J77344N8318K90947
$$ y = [334366, 128316, -248445, -452592, -435510, -229188, -85396, -34850, -123205, -290709, -352271, -256260, -65771, -98426, -183409, -101505, -57626, 16496, -25042, -241839, -358217, -152868, 67305, 318162, 392039, 368488, 275294, 153352, 82277, 101184, 120358, 49390, 17071, 10811, -80782, -64036, -29733, -140105, -197345, -200310, -45102, 91392, -53437, -78714, 80129, 296446, 263338, 36437, -65183, 59128, 180455, 358328, 423645, 304242, 30234, -117263, 79501, 262870, 334041, 257002, 51979, -686, -184510, -249574, -109617, -146965, -293876, -404380, -300447, -145855, -169170, -305217, -286110, -316031, -406766, -272338, -285202, -364205, -303460, -335450, -507907, -423384, -246040, -187722, 103225]
7325A03225K49138J17292j13923k33175j38413P7069l6672o5156J73244K5052
7315A57681j15994j4140Q9746j24615j14238j08604k94284N4842J70848K2886
7305b75872n4033p7205n1777K9342K04835J09871p8104j43531j45644k7623q7910
7294e97651r2632O0833Q2798J5090K31449L02347J45788M8559k59728k00153j54752
7283d18052J2051O0177k5375l78R7798p5035r6619N4191n6010M5989K91869J49466
7271D0072k06641r998P1152m9933j16880q2228N828j04354J9586K00678Q3785
7260a48933J32336K9674o6440k89166k03086P7095K45831M9055K2888J59724k1659
7249a2681j17412j65905j02157j08112l6637J57072J77841L13394K93226P7063
$$ y = [103225, 352363, 469655, 355732, 122557, -15856, 61213, 24541, -40615, 132629, 157681, 41687, 27547, 117293, -7322, -121560, -230164, -524448, -469606, -298758, -275872, -329905, -407110, -458887, -429545, -224710, -114839, -192943, -336474, -482118, -509741, -597651, -690283, -629450, -546652, -531562, -300113, 2234, 148022, 196581, -63147, -263300, -418052, -406001, -345824, -371199, -371577, -273779, -348814, -445433, -391242, -447252, -401263, -109394, 40072, -166569, -176567, -105415, -155348, -272228, -354456, -348628, -452982, -433396, -232718, -148933, -16597, 13077, -53363, -342529, -545615, -468520, -222689, -173634, -150746, 8978, -12681, -130093, -295998, -398155, -506267, -542904, -385832, -207991, 105403, 398629, 475692]
7239D75692l3339j07440q4669J47619R1583k9936l7213k10869j26476P2274O5113
7228B22339K4806M2025J46521J31491k10554k40252M2907k5990k10035j45645
7218b22387R9690P5110j08661k41733R7557K60986K4875k74288j45446J00606
7208c33691Q951L7480K59295J50339r7069l30057j31092J19759K92642K19917
7198A96474j3324j48602k82142l70210q6660J66737O5947j5047J0072L75556L18009
7187B16810j71235k51502q8861J37156J13689P7695K23033N1608l19706l05543
7177c16856j35483j90062O0063L39565K88049M1583k48174r6007L6650J88809
7167c1863K69874j2824j58663o7933l5931j8936M4881p6804M6881Q4089p2716
$$ y = [475692, 442353, 334913, 250244, 397863, 489446, 459510, 422297, 211428, 84952, 157226, 222339, 247145, 289170, 435691, 567182, 356628, 116376, 159283, 133293, -76742, -222387, -122697, -47587, -156248, -397981, -300424, -39438, -14563, -288851, -434297, -333691, -324740, -287260, -27965, 122374, 25305, -304752, -435844, -316085, -23443, 196474, 183150, 34548, -247594, -617804, -704464, -537727, -471780, -486827, -476755, -101199, 216810, 45575, -205927, -294788, -157632, -43943, 33752, 256785, 308393, -11313, -316856, -452339, -642401, -582338, -242773, 45276, 86859, -161315, -257322, -220672, -31863, 238011, 225187, 66524, -1409, -37340, -56276, -11395, -88199, -41318, 42771, -29945]
7156b9945k49520j39124K34089m6883k37074j90097M7142J46396k763O2503L46216
7145e9060K14182j81873m10719k09439M5215K8315J28463J35808K02191K30469
7135A23552J62604k176K6507J86862R8753m6556j07945k34805j26033M4150l7861
7124H7052k11511r6137N7101j7332j45561K1254O5442J27883J77568K23612P6947
7113C66318j24869j18290j04091j96280m420R4214o8972P6025J13496r4332O2593
7102A392J92240L3651j9161q7010k9984K5432L9708O0946m5318r2888R8730K817
7090A80555R1947J25232K3212n5347p41J69393l5314J40343J18014j08612K7163
7079F75845J55950J40843J1129l4978O5505K15148M21735L65426N82266Q03580
$$ y = [-29945, -279465, -418589, -184500, -231383, -468457, -658554, -611412, -465016, -467779, -405276, -59060, 155122, -26751, -437470, -646909, -601694, -573379, -444916, -309108, -106917, 123552, 286156, 283980, 310487, 497349, 596102, 549546, 441601, 206796, 80763, 124913, 87052, -124459, -220596, -163495, -180827, -326388, -305134, -239692, -111809, 65759, 289371, 366318, 241449, 123159, 19068, -177212, -181632, -87418, -156390, -80365, 33131, -61201, 1392, 193632, 227283, 208122, 121112, 91128, 116560, 156268, 217214, 171896, 79008, 177738, 180555, 272502, 397734, 420946, 365599, 364858, 534251, 498937, 639280, 757294, 648682, 675845, 831795, 972638, 983767, 948789, 1014294, 1229442, 1651177, 2016603, 2598869, 3402449]
7069C402449Q89986J130100J493643J448078J262203J131889N26014m72671j377326
7060I434365j707297j657903j154648q61670o87190n69763n68853k72166j86501
7051A768374k15383k52796p9753N5773k23j789M1655O6215j89755l53702l95339
7040D43277k50642L1484O2686J61490O8617r0667j09673m3810M4716O5260q3462
7029B99276q6574J76322K52115N0189k0552R6090J93502J40838p355Q8330J76349
7018A358530O6510K32296L198r8749O5569j27091k3500J12149j11373j43652j96848
7007A137039l2786K3951j18627r2702o5145Q3333K60595L18797J86260J05430
6997A806145L04346M88501P03202M28839P07522R41405Q63316P91820P30394N33491
$$ y = [3402449, 4292435, 5422535, 6916178, 8364256, 9626459, 10758348, 11284362, 10811691, 9434365, 7727068, 6069165, 4914517, 4052847, 3365657, 2795894, 2227041, 1954875, 1768374, 1552991, 1300195, 1220442, 1276215, 1275992, 1274203, 1315858, 1382073, 1192318, 838616, 443277, 192635, 224119, 286805, 448295, 516912, 426245, 316572, 272762, 317478, 382738, 299276, 212702, 389024, 641139, 691328, 670776, 766866, 960368, 1101206, 1093851, 1182181, 1358530, 1425040, 1657336, 1660534, 1561785, 1627354, 1500263, 1476763, 1588912, 1477539, 1333887, 1137039, 1104253, 1128204, 1009577, 916875, 851730, 935063, 1195658, 1514455, 1700715, 1806145, 2110491, 2598992, 3302194, 3731033, 4438555, 5379960, 6243276, 7035096, 7765490, 8298981]
6987H298981J12652k84508q52137j115584q32780n95210o73381n34305m80089
6978C043639m33806k76709j61115j29856k24146l54196l03101j79540l9757Q7851
6968A029264M8130L5517K7939j80496p2305J00292J10347M957k26145j36145Q031
6957G49386N4996J89576j06377l01497k21738Q3443L3407k7169K8543l0917P3855
6946E25508j9139k3781K10310K30588O9871j95121j96612j86645j78409j5921
6936B20649L11358K56966k43050j87363P7748P839n3648n9493p047M5232J29353
6925D98544j48573k24894j4154K9214K4708J79401J34103j34136k66125K207K02165
6914B82460j02364k7421k487o052j38895O8383K30555L25786R768k17196Q9390
$$ y = [8298981, 8411633, 8127125, 7274988, 6159404, 5326624, 4731414, 4058033, 3523728, 3043639, 2609833, 2333124, 2172009, 2042153, 1818007, 1463811, 1160710, 981170, 941413, 1029264, 1077394, 1112911, 1140850, 960354, 888049, 988341, 1098688, 1103645, 877500, 741355, 749386, 804382, 993958, 887581, 586084, 364346, 447789, 481196, 454027, 482570, 451653, 525508, 506369, 482588, 692898, 923486, 993357, 798236, 601624, 414979, 236570, 220649, 532007, 788973, 545923, 358560, 436308, 444147, 390499, 331006, 323959, 369191, 498544, 349971, 125077, 110923, 140137, 164845, 344246, 478349, 344213, 78088, 80295, 282460, 180096, 152675, 150188, 144136, 5241, 73624, 304179, 629965, 639733, 422537, 511927]
6903E11927o8353k96589j01586R6331m5573J1277M4170L701n02j26276o5910L5096
6891b287j72998j69961K11723J83245J04600J52347n2956M948j25673j4943Q2349
6880B00394j1336N9254m1797k58864l08912K0731O3102j58695p2893J71620K76234
6869f1162J18057n6192N9016P9975K38944J5739l49651k92786M5309K16460O0968
6858G4677k8614j26205J7797J63310J08951J07815O2368J4549l39297l66815q5046
6847c96510M0287K7785m4614J53256P6006L0233M3485j22008k5128j105p5757
6836b94070j10161R6642J10655o5905K0884O9439J42996K8372l4664K5914j47082
6825a56980j07395N3502o3211O5192J53277M8188j22497o1539J3892N8358M0742
$$ y = [511927, 443574, 146985, 45399, 141730, 96157, 107434, 151604, 155305, 154803, 28527, -37383, -2287, -175285, -345246, -133523, 49722, 154322, 306669, 253713, 258661, 132988, 118045, 200394, 189058, 248312, 206515, -52349, -361261, -340530, -277428, -436123, -509016, -337396, -61162, 56895, 703, 59719, 139694, 378638, 394377, 44726, -248060, -202751, 13709, 74677, 46063, -80142, -62345, 100965, 209916, 317731, 380099, 394648, 55351, -311464, -396510, -356223, -328438, -373052, -219796, -143790, -113557, -70072, -192080, -217208, -218313, -294070, -404231, -307589, -196934, -262839, -241955, -172516, -29520, -1148, -35812, -9898, -156980, -264375, -210873, -274084, -208892, -55615, -7427, -129924, -191463, -177571, -119213, -78471]
6814g8471j1406j8350p0871J17993J53397N4793R7016q8374q6803m1341o7052
6803c9469l6340k7602M9101L14141K85510r398R6483M2750j51779j85041L7221
6792C75577J25224j68712j68139m5190j90857j44087J3606K7262J23840R0705
6782C9229J8162O3674R0639o8072P0414L4267k49151j58663J09641P8922j06099
6771g7037O5054J92406p0077l632j5443j83014o8143J99662J02946Q1215r914
6760B14023P6629J43647O0568M3054Q393p9480q6875k9110k453p8349q5582P2138
6748B56603J28160K4297L3904J90062J95953n0346k24204r8143M7264K91150K90010
6737A084710k1680j28191k39575k91845k0374n147p1964J86030K01462j77482
$$ y = [-78471, -89877, -108227, -179098, -61105, 92292, 147085, 244101, 155727, 68924, 27583, -39469, -75809, -103411, -54310, 259831, 545341, 535943, 632426, 675176, 523397, 338356, 375577, 500801, 332089, 163950, 118760, -72097, -216184, -202578, -175316, -51476, 39229, 57391, 121065, 211704, 143632, 214046, 248313, -838, -159501, -49860, 29062, -77037, -11983, 180423, 110346, 106714, 91271, -91743, -159886, 39776, 142722, 223937, 214023, 290652, 434299, 494867, 537921, 546314, 466834, 379959, 350849, 348396, 270047, 184465, 256603, 384763, 409060, 442964, 633026, 828979, 778633, 554429, 456286, 503550, 794700, 1084710, 1063030, 934839, 695264, 403419, 383045, 377898, 305934, 491964, 693426, 515944]
6727E15944j94343j56530j68761K2302K76805K84742j40499P3448K54889K2738
6717G90735n9007j10243P3915J93244R6816N1547k13690k03964l3820J39520K97284
6706A022337P7463k95244k67690o2809K0819J57193O6667j10957l25538l77389
6696i5148k30794j26163p7655L6657j46776R2366K36271M6222P9335J24947J55433
6685I4695K01790J87816P0831j34400j71088K4253O1992J27659L7049J11101M1848
6674F53546o1295J11492J26536k05597j63030L9745j03789P464l1598j89860k13383
6663b9769N0725J89865L31331K10843J8979n9532k0215j39178j80687n3376J0072
6652C29058m4485k0547K7007K13890R9493j49984j56713k76715k43230J5765K09433
$$ y = [515944, 321601, 165071, -3690, 18612, 295417, 580159, 439660, 513108, 767997, 790735, 731728, 621485, 695400, 888644, 985460, 1037007, 823317, 619353, 585533, 725053, 1022337, 1099800, 804556, 536866, 474057, 494876, 652069, 718736, 607779, 282241, -95148, -325942, -452105, -529760, -493103, -639879, -547513, -311242, -265020, -185685, -60738, 94695, 296485, 484301, 555132, 420732, 249644, 273897, 335889, 463548, 500597, 611698, 653546, 592251, 703743, 830279, 624682, 461652, 501397, 397608, 405072, 373474, 183614, -29769, 20956, 210821, 542152, 752995, 771974, 712442, 692227, 553049, 372362, 318986, 329058, 284573, 264026, 291033, 504923, 604416, 454432, 297719, 21004, -222226, -206461, 2972]
6641B972K164O2066J96817n8283P23L45106K10661k89298m28900k46537j82887
6630c85396M6656L61327K05122Q3572R1182l8968k98679j07748O367q9205o1534
6619a87304J32901K09021N1079J47019o5430k40764p1327L06360K72360k8088
6609E25827j82223l2499K29052R1870j22893k60549n2308K25216J04310n9701
6599D66102j9639J9983q5757k3459p460M2106O2109j06646j05650o591R829r8886
6587A46041l8710j22310J60683K37878P9369R0244m5474k18819j42537n8461J36717
6576B24621K09244j41384M9482K94388J62231R6514j25055j46422j02221j52241
6566C69157r0229k2455j12509j59262j70276j52336m7604J67026L01452J88987
$$ y = [2972, 5136, 67202, 264019, 205736, 206459, 551565, 762226, 472928, 44028, -202509, -385396, -338740, 22587, 227709, 311281, 402463, 363495, 64816, -42932, -36565, -125770, -187304, -54403, 154618, 205697, 352716, 287286, 46522, -24805, 281555, 553915, 525827, 343604, 311105, 540157, 632027, 509134, 248585, 196277, 421493, 525803, 466102, 446463, 466446, 380689, 357230, 349770, 391876, 453985, 347339, 241689, 235098, 244927, 146041, 107331, -14979, 145704, 383582, 462951, 553195, 507721, 288902, 146365, 87904, 224621, 433865, 292481, 341963, 636351, 798582, 895096, 770041, 623619, 521398, 369157, 278928, 256473, 143964, -15298, -185574, -337910, -385514, -218488, 82964, 271951]
6556B71951J5100r3885Q789R1930J03768R4413j06556k05979O3597J52257P7735
6545D73120R2392n2352j3260N3282K24888q3478k65842j45675r2470Q6671L55710
6534F32986L88000L2177k22436j52616M3601P9396r3976q9341p6378p0442J49012
6523F19983K54466J19554j84831l14187k80544J8195P2251N3874J38226J26072
6513F23059n8583j39910n9974n968J15416j61375j37013J81417k0244K0616p8139
6502B79302l0893R8114Q4529J9170P4371P7979j49432j41663j36730n8876J7184
6491A33055r3003l5863n2802p4279J7045J67407R7394M7579Q6995K22489k5193
6480D90824j49666j5522J66155J15512j28673K2275L22023M51472P14156R74814
$$ y = [271951, 287051, 193166, 201955, 293885, 397653, 492066, 385510, 179531, 243128, 395385, 473120, 565512, 513160, 499900, 553182, 778070, 694592, 428750, 283075, 190605, 277276, 632986, 1020986, 1053163, 830727, 678111, 721712, 801108, 707132, 617791, 541413, 470971, 619983, 874449, 994003, 809172, 494985, 214441, 232636, 304887, 358761, 496987, 623059, 564476, 424566, 364592, 358624, 474040, 312665, 175652, 357069, 336825, 357441, 279302, 248409, 346523, 431052, 450222, 524593, 602572, 453140, 311477, 174747, 115871, 133055, 40052, 4189, -48613, -122892, -105847, 61560, 158954, 206533, 293528, 516017, 490824, 341158, 325636, 491791, 607303, 478630, 500905, 822928, 1274400, 1988556, 2963370]
6470B963370J108165J017574j26821j081033j102466q67534n18500l43999j95633
6461H53123j1875j64069k63185k27074o0674O3189K45477K42109o8433r7925p1332
6450D39331k64789l46877n8401Q9879Q4342N5536j86332j02377n7561j4404K3300
6439c38353P8143l920J4691J69857N6942q0140J6726J07776J64554K8884j05098
6428A10062q1427j43972j98335n5621N6304J79748K05303o1931P3257J20987K7149
6417B31524j72019j50388o6252O1600J00030J83061J67520q7514j79955j21682
6407c4075l6939r870k4693o7228R9056N9037j45956p3252K54085m626r2246O4524
6395a2183r7575k22469j77063J7943N201j13561j08657R3707J21340J75961K20276
$$ y = [2963370, 4071535, 5089109, 4962288, 3881255, 2778789, 1911255, 1392755, 1048756, 853123, 841248, 677179, 413994, 186920, 126246, 189435, 434912, 677021, 608588, 510663, 439331, 174542, -172335, -230736, -140857, -56515, -979, -187311, -289688, -347249, -361653, -338353, -260210, -264130, -249439, -79582, -22640, -102780, -86054, 21722, 186276, 215160, 110062, 28635, -115337, -313672, -369293, -312989, -133241, 72062, 10131, 83388, 204375, 231524, 59505, -90883, -157135, -95535, 4495, 187556, 355076, 267562, 87607, -34075, -71014, -80884, -105577, -172805, -73749, -14712, -160668, -233920, 20165, 15539, -76707, -12183, -109758, -332227, -509290, -491347, -486146, -599707, -708364, -614657, -493317, -317356, -97080]
6384i7080J41621L1125l4696j62327m1506K05925Q0473J10217m3165k28038l49696
6373c87147q5185J08102J5802j65750k06766K3960M7779J58399K11274J82338
6363i7194R0792J28454Q6942J62655O2717j14357o9771j2143J9449j83152l33322
6352b58930N5301K54890k9609j38899k09599m3497J03435L9987o383J04399J31192
6341B287n2914P1337J319j27018j52522j68235n1801J20560K27158K60348n997
6330A24522j24536j66914p6983P1794K62612L49786R1052j42322j66748n774K878
6319B19367N6808J17875R3195J45585O9532k9914k15812k15329L466L12177J196
6308E58146k15635k3653r8533j87437M2949P6193j42051j73570L2685j0639k38748
$$ y = [-97080, 44541, 75666, 40970, -121357, -162863, 43062, 123535, 233752, 190587, -37451, -387147, -472332, -364230, -348428, -514178, -720944, -696984, -649205, -490806, -279532, -97194, -6402, 122052, 208994, 371649, 434366, 320009, 250238, 238095, 257544, 74392, -258930, -203629, 51261, 21652, -117247, -326846, -370343, -266908, -226921, -233304, -128905, 2287, -50627, 20710, 22029, -104989, -257511, -425746, -477547, -356987, -129829, 130519, 124522, -14, -166928, -243911, -172117, 90495, 440281, 531333, 389011, 222263, 216489, 219367, 276175, 394050, 487245, 632830, 702362, 672448, 456636, 241307, 244773, 556950, 558146, 342511, 318858, 220325, 32888, 75837, 152030, 9979, -163591, -130906, -141545, -380293]
6297c80293k65073j20793n1103J54134K75098K25290Q1755l9351K43311K59656
6287C82631l2817N4128P7988j46266j22988l05839j99119K39258P5601j43146
6277a20569n6422m1689r7860J40476O0177k21123m4035L2527J540J9854K63851
6266f3273J92906p0320j04275p8703N1772O3945r1134p5673P2090k6000o3887
6255a92552J34221J59332Q5008R855R5171Q5927M8831M9702o2667R3245M4752
6244E50825j91268k88106N4244J83660O4811j0223l28451m23849R3414L29170
6234C4227J2484L5031J20914M0221p5689k43968k55649j28008M6395N7197j39901
6223d96746J28833K38441J79467J34306O9948P7935P190J356j41916j13305L5223
$$ y = [-380293, -645366, -766159, -817262, -663128, -388030, -162740, -80985, -120336, 122975, 382631, 349814, 403942, 481930, 335664, 212676, -93163, -292282, -53024, 22577, -120569, -176991, -218680, -316540, -176064, -115887, -337010, -381045, -348518, -346978, -327124, -63273, 129633, 59313, -44962, -123665, -71893, -7948, -99082, -174755, -102665, -128665, -192552, -58331, 101001, 186009, 195864, 291035, 376962, 425793, 475495, 412828, 506073, 550825, 359557, 71451, 125695, 309355, 374166, 363943, 35492, -388357, -294943, 34227, 46711, 81742, 202656, 242877, 167188, -76780, -332429, -460437, -414042, -356845, -496746, -367913, -129472, 49995, 184301, 254249, 332184, 339374, 340730, 198814, 85509, 120732]
6212A20732R9692K40388J72262j8985j23307M8454J05890M783m1629k8927l20748
6201B58605l71810P1539L38122J699k66598k61837L7130K47298K86062J54019
6191D94229p6333k74429k08084K03941N34593M45485P1622p2201r7668M8103J74365
6180A243623O4929J67496L55353O12838O20979N95406N24184O18741O42369R62445
6170F408363J389460J895523K479331L291355M753870O625581P365930L377133
6162C7586546m044818p145545n844554l864935k976434k989011k782793k032735
6154E905721j389825q94059o51582n43082m36502j93683n6968k10058l27587j65309
6144A037066j77771k81818l7682K8485o1138Q2362L7771p9133p5413l0414j58979
$$ y = [120732, 220424, 460812, 633074, 614089, 490782, 539236, 645126, 649909, 608280, 579353, 258605, -113205, -41666, 296456, 298155, 31557, -230280, -193150, 54148, 340210, 494229, 417896, 143467, -64617, 139324, 673917, 1119402, 1191024, 1118823, 1021155, 1069258, 1243623, 1308552, 1476048, 1831401, 2444239, 3065218, 3660624, 4184808, 4803549, 5445918, 6408363, 7797823, 9693346, 12172677, 15464032, 20217902, 26843483, 34209413, 37586546, 33541728, 26396183, 20551629, 16686694, 13710260, 10721249, 7938456, 5905721, 4515896, 3621837, 2970255, 2427173, 1990671, 1796988, 1740020, 1529962, 1202375, 1037066, 859295, 577477, 539795, 568280, 507142, 589504, 627275, 548142, 472729, 442315, 283336]
6133B83336j48597J10523J53077J41756M5026Q741R864K84420K13704J68807J78641
6122A449298L79910Q02272J296268J271847K87073j087494j084593o20945m98752
6113B194884m72898l80786q2061K4998j91378n7078j23063r2997j8346r9625j27
6102G01523j0879j23531m0954L2477p9691j31560j19921j28290O8412K41864m9931
6091C59519j83781j03107O2712K20912J69358K03199K29630j78659l53315j34898
6081B91570p1801L7168R4130j7177l3883K2975J25319K13112j44097k46926p0690
6070A99700k63646k35349J17661K67222M00162K01019k08717j42768J0487n118
6060C40653J9533P6189J27294o6305k05576k03515K8814J76469J35148J34233
$$ y = [283336, 134739, 245262, 398339, 540095, 585121, 593862, 603726, 888146, 1101850, 1270657, 1449298, 1829208, 2631480, 3927748, 5199595, 5486668, 4399174, 3314581, 2693636, 2194884, 1721986, 1341200, 1259139, 1284137, 1092759, 1035681, 912618, 819621, 801275, 701650, 701523, 690644, 567113, 526159, 558636, 478945, 347385, 227464, 99174, 167586, 409450, 359519, 175738, 72631, 135343, 356255, 525613, 728812, 958442, 779783, 426468, 291570, 219769, 256937, 351067, 333890, 300007, 322982, 448301, 661413, 517316, 270390, 199700, -63946, -299295, -181634, 85588, 485750, 686769, 478052, 335284, 345771, 340653, 360186, 436375, 563669, 497364, 291788, 88273, 117087, 293556, 428704, 562937]
6050E62937M9582j56410l29611l31176k7131Q7077O405j25265k35058n2843k3807
6039e75300n7605Q9227N4474K22896J93777J05253J37303K3970j41940n0008j22279
6028a20232j51278J70729L54832J40516p2005J12241J32111M9798j61017l00377
6018A55318k56519j00770N3449J58671o445r8144P3003R2631K46072L3691K220
6007C53177k9420l5349n8621j38950K5704l3772j31925O5842Q0236m1370j1377
5996D4175L375L4991J47822K1949r7209k20037k31336J1367J72751P1093J48975
5985A07916Q1770l49933k11330K6668K31928K36608R4253J4915j81435q8958K04568
5974A66970J80285N8445j30062k76687l21294k64232L366L21344K42564J04795
$$ y = [562937, 612519, 456109, 126498, -204678, -231809, -144732, -138327, -263592, -498650, -551493, -575300, -632905, -543678, -489204, -266308, -72531, 32722, 170025, 193995, 52055, 2047, -120232, -271510, -100781, 254051, 394567, 322562, 434803, 566914, 616712, 455695, 155318, -101201, -201971, -148522, 10149, 3704, -94440, -21437, 71194, 317266, 350957, 353177, 323757, 288408, 229787, 90837, 116541, 82769, -49156, 16686, 96922, 55552, 44175, 47550, 82541, 230363, 252312, 155103, -64934, -296270, -284903, -112152, -41059, 107916, 189686, -160247, -371577, -344909, -112981, 123627, 217880, 232795, 51360, -37598, 166970, 347255, 405700, 275638, -1049, -322343, -586575, -583209, -261865, -19301, 85494]
5964H5494j42491j84271l2821K04021P8060k4934j00234k02076K65679J87214
5954A33641o4904p7957J072J04481J15177J20070R816r8104Q5255K00201j23745
5943D05003j93401j41011j78732q2199K2261J69988P0375j13766j10584k7707
5933a79773J48301J52578O9413n413m94o798j24740R3545K24202n552L3390J5361
5921D14020j84764j65043j46479j08246J12763L15947J55574k4674r835J46215
5911E05478m0689j54092j97122R6554K39707R8737K44677n918l47281m39091r0205
5900h9245J57588J53831J293r4203l070J51280K68470K64254P0550j13786k07115
5889E59847j98957j25513j22910n1008K64644N3085m9943J35351K20220N0937
$$ y = [85494, -56997, -241268, -274089, -70068, 7992, -16942, -117176, -319252, -53573, 133641, 68737, -9220, -8148, 96333, 211510, 331580, 341396, 243292, 328547, 528748, 405003, 211602, 70591, -108141, -190340, -168079, 1909, 72284, -41482, -152066, -179773, -31472, 121106, 190519, 185106, 184612, 177814, 53074, 146619, 370821, 365269, 398659, 414020, 229256, 64213, -82266, -190512, -77749, 238198, 393772, 369098, 359263, 505478, 464789, 310697, 113575, 210129, 449836, 548573, 793250, 787332, 440051, 960, -89245, 68343, 222174, 223467, 129264, 126194, 277474, 545944, 810198, 880748, 766962, 559847, 360890, 235377, 112467, 61459, 326103, 379188, 329245, 464596, 684816, 735753]
5879G35753J33187K46552p6582k59993j12535K5152q6040j14577J69810K35239
5869H95966J21803k1120k73860m16146j30359J11738K07400L12874K41225J70095
5859A219616J62018m1417J83615K14494n321J77004M03489M64833O1654j78015
5849B661970l30429k01393j02315r8451N8976L16955J86184k8797r8612j51759
5839B212329q8174n6723q1056j30633j09292k1236k8331k6138m513r5864k02083
5828A368286j73350J36472O8463k94810l62303j54459L9023N5838l09257j99861
5818A74042N3752J17201N2194k742J18295J76418O191m3595j29935r7426m3526
5807C80869P0047J18650J02059K39851P42j66825j96625k94669j34296J20480
$$ y = [735753, 868940, 1115492, 1038910, 778917, 666382, 691534, 605494, 490917, 660727, 895966, 1017769, 996649, 722789, 306643, 176284, 288022, 495422, 808296, 1049521, 1219616, 1381634, 1340217, 1523832, 1738326, 1733005, 1910009, 2313498, 2778331, 2839985, 2661970, 2331541, 2130148, 2027833, 1929382, 1988358, 2305313, 2491497, 2462700, 2364088, 2212329, 2124155, 2067432, 1986376, 1855743, 1746451, 1725215, 1696884, 1670746, 1666233, 1570369, 1368286, 1194936, 1331408, 1399871, 1105061, 742758, 588299, 627322, 683160, 373903, 174042, 227794, 344995, 397189, 394447, 512742, 689160, 695351, 651756, 521821, 424395, 380869, 450916, 569566, 671625, 911476, 912218, 745393, 548768, 254099, 119803, 240283]
5797B40283M5655l7034P022M1161J9891l1739j42923m2653N0979K4071K9789J86872
5785C91374K38965J74487J29084N361k78014q0361N8919k12652l99445l37045
5775c09327R5799J33832J9437K51978K69365Q9737j74632j86078n8806J23952
5765B55257k4450l63799j66053k9581Q8635K10027J11490J29892J68640J62554
5755E42612K28693J12371M5289j16883l17728j53160q0429Q5170J95278P8860
5745F20073K04488R4299j73116r0753k5428p5805j63071j66477k29799k48387
5735b53976O9280L93932Q6348Q178O0070J3374j57729j0378M3566r6129m1797
5724A14739O9277r8905j58423O0341J68653J56118J26034J82664R6124N2510j04224
$$ y = [240283, 285938, 248904, 255926, 297087, 316978, 285239, 142316, 99663, 150642, 174713, 204502, 391374, 630339, 804826, 933910, 939271, 661257, 580896, 639815, 427163, 27718, -309327, -213528, -79696, -60259, 191719, 461084, 550821, 376189, 190111, 131305, 255257, 230807, -132992, -299045, -328626, -239991, -29964, 81526, 211418, 380058, 542612, 771305, 883676, 928965, 812082, 494354, 341194, 260765, 345935, 541213, 620073, 824561, 918860, 745744, 654991, 629563, 553758, 390687, 224210, -5589, -253976, -184696, 209236, 295584, 303762, 363832, 377206, 219477, 209099, 252665, 156536, 114739, 184016, 85111, -73312, -12971, 155682, 311800, 437834, 620498, 716622, 769132, 664908]
5713F64908l99939l06831J8658K58828K54347R4494J29487J51426J53800k09885
5703H09293m25737r9594K34771J27431J09875J84047j12633r1264N7759J8750
5693H12698n9319o8427M3807k4033J87941K5304j97818q8798J38244N4036k36924
5682E86711r3070J43999J34500p5387M3457L6890k99046l20893j9692J42937R8553
5671C78959L0945J66884K02843J77921J7976m6334j2471p5056k14402J55934J81680
5660I64879j21497k45239p6137N7013o6849p3913J16579J33751K7400q0239j82062
5649D53686m8698K8902p4927j76842J64291K43600Q7424l7190j82606j79621j27933
5638A50086P4741J67635P2941R2131j10280k13919j55959J18615J66372L16321
$$ y = [664908, 264969, -41862, -23204, 235624, 489971, 584465, 713952, 865378, 1019178, 809293, 383556, 283962, 518733, 646164, 756039, 940086, 827453, 736189, 793948, 812698, 753379, 684952, 728759, 704726, 892667, 917971, 720153, 631355, 769599, 823635, 586711, 493641, 637640, 772140, 696753, 740210, 777100, 478054, 157161, 137469, 280406, 378959, 409904, 576788, 779631, 957552, 975528, 929194, 916723, 841667, 627265, 783199, 964879, 843382, 598143, 522006, 579019, 512170, 438257, 554836, 688587, 715987, 635748, 453686, 404988, 433890, 358963, 182121, 346412, 590012, 677436, 640246, 457640, 278019, 150086, 224827, 392462, 465403, 557534, 447254, 233335, 77376, 195991, 362363, 678684]
5628F78684K69705K55272R6887M7415k8750j96155l4291j78297k01519j04915
5618F04036q6927P4398J98528K06186M6357o8193J8248J74737J69567p8464j19885
5607A138588j98224j79417Q2217K2774J38635Q5031J13716J74911K67001K75145
5597A920377m7040k23674O5031k4028j06124J66864K12389Q1828Q1205K77993
5587B404821R2331m484p835j83649K4505K56376J02851l19403l36609l1038J03038
5576B100904J65000l6968m01312J18829O04598L14747j1614k5935L87501N47240
5566C762990M23896L67474O52329O87978M38178N69046P82964R74291J176443
5557I835589J172630J138475J754959K712675L637066N252426P906577J1056815
$$ y = [678684, 948389, 1203661, 1300548, 1347963, 1319213, 1123058, 1088767, 910470, 708951, 604036, 517109, 591507, 790035, 996221, 1042578, 974385, 992633, 1167370, 1336937, 1258473, 1138588, 940364, 760947, 843164, 865938, 1004573, 1089604, 1203320, 1378231, 1645232, 1920377, 1873337, 1649663, 1714694, 1690666, 1584542, 1751406, 1963795, 2045623, 2126828, 2404821, 2497152, 2492668, 2484833, 2301184, 2325689, 2582065, 2684916, 2365513, 2028904, 1997866, 2100904, 2265904, 2228936, 1827624, 1946453, 2551051, 2865798, 2854184, 2828249, 3215750, 3762990, 4186886, 4554360, 5206689, 5894667, 6332845, 6901891, 7684855, 8659146, 9835589, 11008219, 12146694, 13901653, 16614328, 20251394, 25503820, 33410397, 44467212]
5549D4467212J4279321J7046935J7888549J4810580Q085703l50683q704338j4514001
5541I3009278j6697060j5473263j2328771q656428n533024l851334l340940k845482
5533B4282976k679939k831382k868185k636740k097122j644154j063233n86739
5525G875482l54497q5141j01722o578Q8015R3829J89395J09189j05672k6399K02994
5514G878895K74821K69502J13990K56771R81258J120116J178854J411123J466361
5505A4951691J633292J809402J934627K322337L198185M553036O414953Q997687
5497D5815210J2890454J8694984K5580827L2036554L5550520L2998811K2832712
5490B26400072O815682j0895658k5878697l4042842l4551110k9617658k2085017
$$ y = [44467212, 58746533, 75793468, 93682017, 108492597, 116578300, 116227617, 107523279, 93009278, 76312218, 60838955, 48510184, 39853756, 34320732, 30469398, 27128458, 24282976, 21603037, 18771655, 15903470, 13266730, 11169608, 9525454, 8462221, 7875482, 7520985, 7435844, 7334122, 7327544, 7415559, 7509388, 7698783, 7807972, 7702300, 7675901, 7878895, 8153716, 8423218, 8537208, 8793979, 9775237, 10895353, 12074207, 13485330, 14951691, 16584983, 18394385, 20329012, 22651349, 25849534, 30402570, 36817523, 45815210, 58705664, 77400648, 102981475, 135018029, 170568549, 203567360, 226400072, 233215754, 222320096, 196441399, 162398557, 127847447, 98229789, 76144772]
5483G6144772j4985213r942388p000347n563019m804213m364657m114130l861107
5475B1509698l050246k264174j625341r96192o81890o24241m44238j74150j8701
5466A1630525J02037P8913J37468K46396K95727K15567L38540M52279N28971Q26206
5456A4852629J041841J144427J596667K009041K218726K397641K853395K934073
5448C1048440L279184M339292O029922Q661069J2150122J7450226K5276419L5232844
5440A43467518M6373484N4983751N5261935M2803935J9122530q734166l3821198
5433C19457789n0255476n5085580n0171102l9882518k8687066j9544227j3280583
5426F2551237r646614p400662o124351n498627n034741m222755l082079k275352
$$ y = [76144772, 61159559, 51217171, 44216824, 38653805, 33849592, 29484935, 25370805, 21509698, 18459452, 16195278, 14569937, 13573745, 12891855, 12267614, 11823376, 11649226, 11630525, 11732562, 11811475, 11948943, 12195339, 12491066, 12706633, 13045173, 13497452, 14026423, 14852629, 15894470, 17038897, 18635564, 20644605, 22863331, 25260972, 28114367, 31048440, 34327624, 38666916, 44696838, 53357907, 65508029, 82958255, 108234674, 143467518, 189841002, 244824753, 300086688, 342890623, 362013153, 353278987, 319457789, 269202313, 214116733, 163945631, 124063113, 95376047, 75831820, 62551237, 52904623, 45503961, 39379610, 33880983, 28846242, 24623487, 21541408, 19266056]
5418A9266056j642017j241839r74685q95627q84036n46447l10945q7783K0771
5409A2703448R930n7528j96555m15586j70954M8641K43352O01987Q39233R04841
5399A4510809Q41018Q26319J137629J655283J888562J933020K260692L407825
5391B8461157N076169O846049R467574J3439287J8794132K5821034L2422548L5259365
5383A75587315L1700132K0706555M010384j3991549k8082407l5398398l5634194
5376A18897838l0696342k3289341j6321096j1077157p420839n276312l884743
5369B0932008k902086k228362j769084j311704r77374p83224o23689p63922p03871
5360H868692l21372r2329j40547j60291j33702j63737K6486l7044l25174k21703
$$ y = [19266056, 17624039, 16382200, 15407515, 14511888, 13627852, 13081405, 12770460, 12682677, 12703448, 12713378, 12655850, 12459295, 12043709, 11872755, 11921396, 12164748, 12766735, 13605968, 14510809, 15351827, 16178146, 17315775, 18971058, 20859620, 22792640, 25053332, 28461157, 33537326, 40383375, 49850949, 63290236, 82084368, 107905402, 140327950, 175587315, 207287447, 227994002, 232004386, 218012837, 189930430, 154532032, 118897838, 88201496, 64912155, 48591059, 37513902, 30093063, 24816751, 20932008, 18029922, 15801560, 14032476, 12720772, 11743398, 10960174, 10336485, 9572563, 8868692, 8547320, 8454991, 8314444, 8154153, 8020451, 7856714, 7883200, 7846156, 7520982, 7299279]
5350G299279j44028j00966J10802M00387N25484M45347O09010O86066O42660O92757
5340A1166798Q35014R77295J568015K173837L030067M244935N782075Q147514
5332C7925550J1372384J4764517J6883030J6520880J2819648N583709l225634
5325A12644084j1173353j6401542j7943706j6454580j3079929r614709o529014
5318B1447251m404499l144397k103126j416803j249759j046418j047473p40672
5310F294104m84119n31723n33960n18788l31567k3264J00057n4643j57372k61354
5300C497371k31038j55992l48456n06658k85459K6800J71184J72340O7862K7211
5290B435165Q8142o8439j53763P2109J42337j24889N8059Q1990J45886K58204
$$ y = [7299279, 7155251, 7054285, 7165087, 7565474, 8090958, 8536305, 9145315, 9831381, 10474041, 11166798, 12001812, 12979107, 14547122, 16720959, 19751026, 23995961, 29778036, 37925550, 49297934, 64062451, 80945481, 97466361, 110286009, 115869718, 112644084, 101470731, 85069189, 67125483, 50670903, 37590974, 27976265, 21447251, 17042752, 13898355, 11795229, 10378426, 9128667, 8082249, 7034776, 6294104, 5809985, 5278262, 4744302, 4225514, 3893947, 3870683, 3970740, 3916097, 3758725, 3497371, 3266333, 3110341, 2761885, 2255227, 1969768, 1996568, 2167752, 2340092, 2407954, 2435165, 2523307, 2454868, 2301105, 2373214, 2515551, 2390662, 2448721, 2530711, 2676597, 2934801]
5280B934801M7732L8403J883q5195k50400k53556r6596m1990l8275p5469q3741
5269B097597l8300m9932k1548r884k39953k90049j6538J20018k4375l5174n9748
5258A432114k78242r7430J08236K46123J49166n2210k7322r612O1921J68820Q7310
5247A788874J18315J86168l9333j17736j59716J3104Q1110j02184k09355k186
5237A557061P0091L9284L0037J06028R5845r3137j05467q9411j33313l7585j3466
5226A425967R9646J33346M0594M6888J20628O8374K4468Q2274R3703J31605j17998
5215B149495k74047J1443J84926R1718J91674K29636J751j90439n7826J23892
5205B462223J72634K14350K09560J84393L11396N02733Q10153J099433L52089
$$ y = [2934801, 2982533, 3020936, 3022819, 2937624, 2687224, 2433668, 2337072, 2295082, 2256807, 2181338, 2097597, 2059297, 2009365, 1987817, 1977933, 1737980, 1447931, 1431393, 1551411, 1527036, 1491862, 1432114, 1153872, 1056442, 1164678, 1410801, 1559967, 1507757, 1480435, 1470823, 1532744, 1701564, 1788874, 1907189, 2093357, 2054024, 1936288, 1776572, 1789676, 1870786, 1768602, 1559247, 1557061, 1627152, 1666436, 1696473, 1802501, 1898346, 1805209, 1699742, 1610331, 1477018, 1439433, 1425967, 1525613, 1658959, 1699553, 1746441, 1867069, 1935443, 1959911, 2042185, 2135888, 2267493, 2149495, 1875448, 1886891, 2071817, 2163535, 2355209, 2584845, 2586596, 2396157, 2338331, 2462223, 2634857, 2849207, 3058767, 3243160, 3554556, 4057289, 4867442, 5966875, 6318964]
5196F318964p71966j015673p57264o54599m61918k95314l18262k46983k1758K4797
5186A800024p122R609k3298l43452l89773o8942Q0659K48526K20917j9566j38158
5175A369424k41013k85642j50858j23097p1720j42464k2966n7403l6142R6606
5165C34725R4131K02965K49088J64947j68519j79255L8014j4069m3069q8502K4341
5154F14797J37623K87548K64263p8557k74330j36594M5234O4321Q1744p9072j98436
5143G28541j36054r1725K8628o807R270Q0246p218j89778j66648l3744P1562J15562
5131D01835J63225J5294l17076l46263j9883J81394K11632K34633J76617L3648
5121G35056j85657j02825J15499O8603K36663q2048l82274j77123J52441P6842
$$ y = [6318964, 5546998, 4531325, 3774061, 3119462, 2657544, 2362230, 2043968, 1796985, 1775227, 1800024, 1792902, 1802511, 1779213, 1435761, 1045988, 977046, 1057705, 1306231, 1527148, 1507582, 1369424, 1128411, 842769, 691911, 568814, 497094, 354630, 331664, 274261, 238119, 334725, 428856, 631821, 880909, 1045856, 877337, 698082, 736096, 722027, 678958, 590456, 614797, 752420, 1039968, 1304231, 1225674, 951344, 814750, 859984, 924305, 1006049, 926977, 728541, 592487, 500762, 529390, 522583, 531853, 612099, 604881, 415103, 248455, 214711, 286273, 401835, 565060, 580354, 263278, -82985, -102868, 78526, 290158, 524791, 701408, 735056, 549399, 446574, 562073, 630676, 867339, 785291, 403017, 225894, 378335, 455177]
5111D55177j93850M2497J58913P2438o028j00818J05141K07119K48226J85678
5101A174493j42518k95632j54687J26989N5371k02231k77655K7861L87488K61481
5091I60960j65120m91490k62801L152M2482J09051J74895J94589j81795k43559
5081A40364o0575m6310L7661j13557l9882J14344J66721O0426R314l0992R7239
5070C34753q045k29864m9873P3957Q8002M9141M6602j952j31520q7861k3342J98983
5058B58981Q8921m5943j2509Q2422L30941L42454K0383j99476k98310j22076K47027
5047F92815L23627L1924k14051j35554r3166q7586p5666J04738L0625m2892j8016
5036E16798l707K8370l9198k77837j3250R4060j66700m952K84918J28179n4313
$$ y = [455177, 261327, 303824, 462737, 535175, 529147, 428329, 533470, 740589, 988815, 1174493, 1031975, 736343, 581656, 708645, 764016, 561785, 284130, 311991, 699479, 960960, 795840, 304350, 41549, 44701, 87183, 196234, 371129, 565718, 383923, 140364, 79789, 33479, 71140, -42417, -82299, 32045, 198766, 259192, 268506, 237514, 334753, 326708, 96844, 46971, 120928, 208930, 258071, 304673, 302721, 171201, 83340, 59998, 258981, 347902, 301959, 289450, 371872, 702813, 1045267, 1065650, 866174, 567864, 445788, 692815, 1016442, 1048366, 834315, 698761, 605595, 518009, 442343, 547081, 577706, 534814, 516798, 513091, 541461, 502263, 224426, 211176, 305236, 138536, 133584, 418502, 546681, 492368]
5025D92368o7946N3664K08121K54410K07652P2433j06467j74495L5307q6252l59486
5014E29309k41320K04424J50279k97565k56174K4276K18348L33223L891k14287
5004D54404K2522J6245o8803j01140q6472L2590J97237J20876P5319j23378k56093
4993B83307p1298K1566p4651j30742n9180j33479n4037J26156O6620K779J48755
4982A25796K72600o544j27019j28649m4937L7641P0405n3458J1666J19392O7272
4971C44165l6055R4977j15615j11178K7394Q481L8516P9558l5378Q2720j58846
4960B18739j53470J53289K30081J95180J3991J19469J78335K2237j99703k62981
4950E15167q6068Q7237K29491J34775P8394L2380j17456k8941Q6131Q0977j9387
$$ y = [492368, 424422, 478086, 686207, 940617, 1148269, 1220702, 1114235, 939740, 975047, 888795, 529309, 287989, 492413, 642692, 345127, 88953, 113229, 331577, 664800, 668691, 454404, 476926, 493171, 424368, 323228, 236756, 269346, 466583, 587459, 662778, 539400, 283307, 212009, 233575, 158924, 28182, -30998, -164477, -218514, -92358, -25738, -22959, 125796, 398396, 391852, 264833, 136184, 91247, 128888, 199293, 145835, 157501, 276893, 344165, 308110, 403087, 287472, 176294, 203688, 212169, 250685, 330243, 294865, 377585, 218739, 65269, 218558, 448639, 643819, 657810, 777279, 955614, 977851, 778148, 515167, 429099, 516336, 745827, 880602, 958996, 991376, 873920, 844979, 931110, 1012087, 992700]
4939I92700j05118j21750J1693O3753l05330m33363k29886j08167J1104J49672
4929g4692L47255K37709q2411K1209J42818J48172J06354l677m5862r8653j92798
4918E05424k19920P887K52892J77131J17224K97818K40639j24496m19234l82890
4908D52475k57138j03119o2240M7619J61183K02370K34773Q4168O513k61485n07062
4897a943j91458L02886M63777K41374J20909N0264P7736J65584K32046q5474k43676
4886A132025k360p6844j15314j63710k37785r1556M8852J4963J5157J01422r89
4875F23861L2334m8954m9032j38361l9181l5340j36168n6914K7011O2251J87304
4864D28811J80623J58910J80525O4951l8138j44982k6265n554P1393p3997k24251
$$ y = [992700, 887582, 765832, 777525, 841278, 535948, 102585, -127301, -235468, -224364, -74692, 272563, 510272, 427861, 449070, 591888, 740060, 846414, 842737, 796875, 698222, 505424, 285504, 293391, 546283, 723414, 840638, 1138456, 1379095, 1254599, 835365, 452475, 195337, 92218, 29978, 77597, 238780, 441150, 675923, 760091, 766604, 505119, -1943, -193401, 109485, 573262, 814636, 935545, 985809, 1063545, 1229129, 1461175, 1375701, 1132025, 1129665, 1052821, 937507, 773797, 536012, 444456, 493308, 508271, 523428, 624850, 623861, 656195, 607241, 558209, 419848, 380667, 345327, 209159, 152245, 179256, 241507, 428811, 609434, 768344, 948869, 1013820, 975682, 830700, 804435, 798881, 870274, 796277, 572026]
4853E72026N7289N42890M66463M0896j91762n6386j1000M1785j06037j67370N862
4842A194656r9675q5599n4248K4904l5100j45674J6435J99088O2392O1740j89862
4831I49057l22932q4208R9826J16400J42346K39225Q2584q158P1975n1138j22741
4820A112236j58642n2406l2834q776R6964N398k2225L7576j37019n7645J01751
4809H84378N5503L8240J43900J62117J25200O2305N724j52112k04955k18783k40229
4798F61288j01283j4872k59328k22402j2311J65989J42814K1502J6844J82049
4788E80290M3093k82781q9804l7965L2135J95443J65964r088k605Q1932J08169
4777G84783n2994j58385m7866j04626j58174n8218J9206P3918L6632J67333J53417
$$ y = [572026, 629315, 1172205, 1638668, 1679564, 1487802, 1431416, 1420416, 1462201, 1356164, 1188794, 1194656, 1094981, 1009382, 955134, 980038, 944938, 799264, 815699, 1014787, 1077179, 1138919, 949057, 626125, 541917, 641743, 758143, 900489, 1139714, 1222298, 1214140, 1286115, 1234977, 1112236, 953594, 901188, 868354, 859578, 956542, 961940, 939715, 977291, 840272, 782627, 884378, 939881, 978121, 1122021, 1284138, 1409338, 1471643, 1477367, 1325255, 1120300, 901517, 661288, 560005, 545133, 285805, 63403, 51092, 217081, 359895, 381397, 398241, 580290, 623383, 340602, 250798, 212833, 244968, 440411, 606375, 597287, 594682, 676614, 784783, 731789, 573404, 525538, 420912, 262738, 204520, 223726, 297644, 334276, 501609, 655026]
4766F55026k29880l30431j54637L3695L964J17280J82448J51228J15453O1721
4756F05867R3570K8633k2846p3746k05995j62615j01178j51758o8573Q9157J26285
4745A56801n5009R2705M1962k22244l21174j69135K44615L96953K53101J19986
4735E38561n3743L02j37956k74558m2690K75126L13432K4650J827J50678j04752
4724F90877j38122R3954O2985O4634k6538k06487n0211j24284k67568k8675Q1976
4713A52541O9084L7419J5206J02821O2117j41942j56380o8626K17277K41154O0793
4702E91464J20082K06659L8294o8967k42551j64981J95322K76687Q0724o0720
4692I72013j87436q5563r3956p1874M8255j26315P8349K53664J00580j90222p3651
$$ y = [655026, 425146, 94715, -59922, -26227, -22263, 95017, 277465, 428693, 544146, 605867, 699437, 728070, 705224, 631478, 425483, 262868, 161690, 9932, -58641, 30516, 156801, 101792, 194497, 236459, 14215, -306959, -476094, -231479, 165474, 418575, 538561, 484818, 485120, 347164, 72606, 29916, 305042, 618474, 643124, 644951, 795629, 690877, 552755, 646709, 709694, 774328, 747790, 541303, 491092, 366808, 99240, 70565, 152541, 221625, 259044, 274250, 377071, 439188, 297246, 140866, 72240, 289517, 530671, 591464, 711546, 918205, 956499, 887532, 644981, 480000, 675322, 952009, 1032733, 972013, 784577, 699014, 605058, 533184, 581439, 455124, 533473, 787137, 887717, 697495, 623844]
4681F23844k5299m9017j5110k65895m4967J49508k7245r4235k8953k8456o6548
4670A27627Q8702N6229J22594l8335k00058k0415O9295M867q6814o5262J8683
4659G7113K52094L68287J80327j47345k14487j21873Q326J95504K45300J82201
4649A025447k25145m96224l23754j4889J44681o258K03690J04252o8245k6850
4639C16705j41828j69742r5729N0105K19759n3772O315Q8596j02687o0862J77547
4628B34407J2800j85221j56354K6150L2080q003j22445J13879L52519K3643j2262
4617C11193o0927j70800k7024l9788k3754J61066L4848q8937L2667J91258K02132
4606E21934m6359k22932m9244k91420k34367Q7785K16301K7219R0157J53414J38457
$$ y = [623844, 598545, 549528, 534418, 268523, 223556, 373064, 345819, 251584, 222631, 194175, 127627, 216329, 272558, 395152, 356817, 156759, 136344, 205639, 210506, 123692, 58430, 77113, 329207, 697494, 877821, 730476, 515989, 394116, 402442, 597946, 843246, 1025447, 800302, 304078, -19676, -34565, 110116, 103858, 307548, 411800, 343555, 316705, 174877, 5135, -90594, -40489, 179270, 125498, 131813, 220409, 117722, 56860, 234407, 247207, 61986, -94368, -68218, -36138, -44141, -166586, -52707, 299812, 323455, 311193, 250266, 79466, 52442, 12654, -11100, 149966, 184814, 95877, 128544, 319802, 521934, 475575, 252643, 203399, -88021, -322388, -234603, -18302, 8917, 99074, 252488, 390945]
4595C90945p6282j40656J51131q882l15383l24334k48417o4721J35869J83995
4585c16735K41396L95570J98337p5169J27428j17757m91984j77438J48466J03932
4575C6046m017r0242j03809l5906N7479q2662n514R5334K41773J40852j01662
4564A47672l3024q0342m7736L3854j21491k28527j48385J46909J70443q9846j38700
4553c89173j46195n0851R692Q2098K57911J69666O797p2266K2194K01249O2177
4542A53299j48669l9282K1911m4163L5223m5861q241l8910L5471M4397P2000j39918
4530a02743J39353J49055M3501m3716l8311J46522j03219k43055j48196o7207
4520b68016J7482J30251K78186K44432m1251l28043j92646R0203K05775J16782
$$ y = [390945, 314663, 174007, 325138, 316256, 873, -323461, -571878, -636599, -500730, -316735, -75339, 320231, 518568, 443399, 570827, 453070, -38914, -216352, -67886, 36046, 32029, -58213, -162022, -197928, -140449, -223111, -228625, -133291, 108482, 249334, 147672, 114648, 34306, -13430, 20424, -101067, -329594, -477979, -331070, -160627, -250473, -389173, -535368, -586219, -576527, -494429, -236518, -66852, -60055, -132321, -110127, 91122, 153299, 4630, -34652, -12741, -56904, -21681, -67542, -75783, -114693, -79222, -34825, 37175, -102743, 36610, 185665, 229166, 185450, 147139, 293661, 190442, -52613, -200809, -268016, -250534, -120283, 157903, 402335, 361084, 33041, -159605, -69402, 136373, 253155]
4510B53155R3705l3355j57237M7703l6065j2470p6976n2949J1956k3393m7652
4499c3578m4544P1616J42323J67335p887l30553j90831j40440k21605k14173J59527
4488f42810J95274J04384K84833K22964J11686j45926j64103J12090q909j15376
4478d5893o6442q529P2928J16193N9913k6176m410p172J34862J14536N6574K3300
4466D19684O2698N636M925j65111j65780J21046K4003l7459Q4620j3331l17259
4455B3672p0607K31958M71k93035k32067N5984K81467J42045K4519K4276l5733
4444A52950Q0265j19421j88283K50006M30548l7867l25467j61634p6609L7525
4434D2013j445p2656K6799R912r7940r9723J77086J37430N9333R7440q0840r7688
$$ y = [253155, 346860, 313505, 156268, 203971, 167906, 155436, 78460, 25511, 37467, 14074, -33578, -78122, -6506, 135817, 303152, 295265, -35288, -226119, -366559, -588164, -802337, -642810, -447536, -343152, -58319, 164645, 276331, 130405, -33698, 78392, 69483, -45893, -112335, -120864, -47936, 68257, 128170, 101994, 97584, 90412, 225274, 339810, 396384, 419684, 482382, 488018, 492943, 327832, 162052, 283098, 307101, 269642, 354262, 340931, 23672, -46935, 185023, 185494, -107541, -339608, -283624, -2157, 139888, 164407, 188683, 152950, 233215, 113794, -74489, 175517, 606065, 568198, 242731, 81097, 4488, 42013, 40568, -32088, -5289, 4623, -93317, -193040, -15954, 121476, 180809, 278249, 197409, 99721]
4422I9721J07073O1278n1150k45353o2412N2884j49015k1689J45173j4183k05622
4411b83295r441J03950L8906R837k4288O1962O8146P1170K560N3250n6809j19204
4399h3256j05038p1043j64188j48262K5884q9211R2405L69591K20449n9785k15428
4388b27882j76186K8633J78305J05137O530P4563n9033n4258j9540j66813k52261
4377e62805o1737N3517K44285J96995l8476k61008m3773N8311P325k07446j32281
4366g47093O9573P655O2438J37171K43481M3287J11795K11242L2494k00319P5894
4355D7618L87828J70654j64381k44558j38954J32225K02279p7098j24250k1605
4345A69758N9199m2809k6245q7714l01672j97255M000J88715J00857K66922K39649
$$ y = [99721, 206794, 268072, 216922, -28431, -90843, -37959, -186974, -208663, -63490, -77673, -283295, -292736, -188786, -149880, -140043, -164331, -102369, -34223, 36947, 39507, 92757, 35948, -83256, -188294, -259337, -423525, -571787, -545903, -635114, -542709, -173118, 47331, -12454, -227882, -404068, -375435, -197130, -91993, -85463, -10900, -69933, -124191, -143731, -310544, -562805, -624542, -571025, -326740, -129745, -168221, -429229, -473002, -414691, -407366, -614812, -747093, -677520, -669865, -607427, -470256, -226775, -183488, -71693, 139549, 172043, -28276, 47618, 435446, 606100, 441719, 197161, 58207, 190432, 392711, 315613, 191363, 169758, 228957, 186148, 159903, 72189, -229483, -426738, -422738, -234023, -133166, 133756, 373405]
4334C73405M523j98226q3244K84652M3988j43089j62927j27988K0279k8471l6990
4323e4088O6970N7367J960p0661j64928j68708L3058n1304r1979q896N222P4567
4311c71420J46169J20975J42571J66494n3418r0500j28116j04833K8902n4169
4301a97345j13530k31213J54419K39184q5254K0026K50426J40742q4193j31780
4291c8518p8519l500L2267R0775k31756k97827Q1675J85477R4287K02244J37814
4280A74419k81262l02969j3821L05770K76678O5555j61593j90093L9637J00343
4270A2664m6519o531K40094P0241p7147q2715k10089m557J09122j36967k65449
4259c97853m5945R7804J68234Q0305r9577j74351j6005J18431Q9292j90667k60240
$$ y = [373405, 377928, 179702, 96458, 381110, 425098, 282009, 119082, -8906, 11373, -17098, -54088, 12882, 70249, 72209, 1548, -163380, -332088, -299030, -350334, -442313, -451209, -445987, -371420, -225251, -104276, 38295, 204789, 151371, 60871, -67245, -172078, -143176, -197345, -310875, -542088, -387669, -148485, -233739, -213713, 36713, 177455, 93262, -38518, -117037, -120537, -88270, 2505, -229251, -527078, -445403, -259926, -165639, 36605, 174419, -106843, -409812, -423633, -117863, 158815, 224370, 62777, -127316, -87679, 12664, -33855, -40386, 199708, 269949, 192802, 110087, -100002, -104559, 4563, -132404, -397853, -443798, -345994, -177760, -97455, -197032, -371383, -387388, -268957, -179665, -370332, -630572]
4248f30572J79353M93079L00760j12304j60928m3465M4874m0757o7306J17187
4238G9921Q6411J42272r6186j88245k78700n0716R7319n3297p16k0973N5430K26828
4226f52K63447k8707q9171J6770P2419R0829O0490l5944K627p6934j93475J20988
4214B02687J10739q525K0757L7343K4563k47809m47719k84725q678J90599J92707
4203b18061Q2565J04243L91611L74737K6845l94707k97586j89477q0683J7644
4193a82869k35591j24858J71898K38537L35448J78592j04122m5944L3407r511
4183B54987j73828q813M2338j7954q9219J9014Q0603K5161q0779p2506J89442
4172A68446L14146J18606K8648O872O0076j1363J5436j14555l81972l29896m0721
$$ y = [-630572, -451219, 41860, 342620, 230316, 69388, 25923, 70797, 30040, -37266, 79921, 166332, 308604, 212418, 24173, -254527, -305243, -207924, -261221, -261937, -282910, -227480, -652, 262795, 234088, 144917, 161687, 234106, 324935, 385425, 349481, 352108, 275174, 81699, 202687, 313426, 304901, 325658, 363001, 387564, 139755, -307964, -592689, -601367, -410768, -218061, -135496, -31253, 360358, 735095, 761940, 367233, 69647, -119830, -200513, -182869, -418460, -543318, -371420, -132883, 202565, 381157, 277035, 231091, 264498, 254987, 81159, 72346, 114684, 96730, 7511, 26525, 107128, 132289, 51510, -20996, 168446, 482592, 601198, 629846, 636718, 696794, 685431, 700867, 586312, 204340, -125556, -166277]
4161a66277J25365K5963L9039L15020J83474m2177k09994J7488p5458j21928J3801
4150A04316P8529R48R6364J67959N7218k7046j69777k92837k05980J08741K40368
4139A58803K40047K18282Q2528j09792j33405O0540K32816O7799M7229J13504
4129I78351j90311l64333j2683J11915J55472J55894J93129J77038Q0157J56556
4119A441185K04989N7504o7565R859L75406N98867O13767O70865R96878J297651
4109F199406K006112L343397M561362L169459j254051m190338l909264k740580
4101G185503j817553p31780m38936p21462p10625o26369l40410k31198k37137
4092A330033j36783m1400j0477m2236j87432k40162j18995M3399j5782j4508K2527
$$ y = [-166277, -40912, -14949, 24090, 339110, 522584, 480407, 270413, 287901, 212443, 90515, 104316, 182845, 183793, 280157, 448116, 505334, 478288, 308511, 15674, -190306, -81565, 158803, 398850, 617132, 699660, 589868, 456463, 517003, 749819, 817618, 864847, 978351, 788040, 423707, 411024, 522939, 678411, 834305, 1027434, 1204472, 1284629, 1441185, 1646174, 1703678, 1636113, 1645972, 2021378, 2620245, 3234012, 3904877, 4901755, 6199406, 8205518, 11548915, 16110277, 19279736, 18025685, 13835347, 9926083, 7185503, 5367950, 4636170, 4197234, 3475772, 2765147, 2138778, 1798368, 1567170, 1330033, 1193250, 1151850, 1141373, 1099137, 911705, 671543, 552548, 595947, 580165, 565657, 588184]
4081E88184N1156K5895j7713M7635q7034j18389r5828q750J26166k2577l7955
4070D50790r6280o1094J25539J50462l4333l72999k34221o2230N2476J28708J35031
4059A81849n6026l12919l11358j11684K44809K52011Q5017Q4952j1885j83591
4049a38825o9167o9815j39349R3837J52101O9162m3608m5744O6990r7028j51667
4038c73113J59282R4126l433p6430q5434J53623K50754O1526J73491J29132m0576
4027D42948m7814j2281N6146k9927l14096l32678l0650J64529K49592o3900p7128
4016D741P5455k7261J1635J43423J76925P1745k91303k01616J05386j00110q3827
4005a14807J91287J03518J24213K03374O8221O3221k2301L249L6766L1226J42237
$$ y = [588184, 639340, 665235, 647522, 695157, 608123, 489734, 393906, 385156, 511322, 488745, 450790, 354510, 293416, 418955, 569417, 535084, 162085, -72136, -134366, -81890, 46818, 181849, 125823, -187096, -498454, -610138, -365329, -113318, -28301, 56651, 44766, -138825, -207992, -277807, -417156, -323319, -171218, -102056, -145664, -191408, -124418, -221446, -373113, -213831, -119705, -123138, -199568, -285002, -131379, 119375, 180901, 354392, 483524, 442948, 395134, 382853, 438999, 409072, 94976, -237702, -268352, -103823, 145769, 81869, 4741, 80196, 52935, 64570, 207993, 384918, 456663, 165360, -36256, 69130, -30980, -114807, 76480, 179998, 304211, 507585, 575806, 639027, 616726, 619975, 656741, 687967, 830204]
3994H30204L38090J27248k08503j65894K3343j5991l7512j09792o7515j17249
3984E96429o2207Q6945O1467J31790p7667k98543k78499l7335K92727L55573K06011
3973I76691J78560j95794l00920J10030J18257L7794n735J31859K3709j52713
3963I21738R5788K59910L34766L51229K67735R5070L13996N64872N01103O50814
3953D357021Q61216Q78938N55906m35450r05494j035396p99418m13495j10928
3944B952900n3343p6345O7875k2077k79327k73037J9541k1640l73996m74692k28782
3933A237077p0853q6615n9743P4931J83659m2358k23811k91061q2326R1643J11057
3922H41600Q5983l5009j5209L7151R4702m069L1773O522j03013l10630k21129
$$ y = [830204, 1168294, 1295542, 1087039, 921145, 944488, 928497, 890985, 781193, 713678, 596429, 534222, 621167, 682634, 814424, 736757, 438214, 159715, 122380, 415107, 770680, 976691, 1155251, 959457, 658537, 768567, 886824, 924618, 918883, 1050742, 1074451, 921738, 1017526, 1277436, 1612202, 1963431, 2231166, 2326236, 2640232, 3205104, 3706207, 4357021, 5218237, 6097175, 6653081, 6217631, 5312137, 4276741, 3477323, 3063828, 2952900, 2899557, 2823212, 2891087, 2869010, 2589683, 2316646, 2336187, 2314547, 1940551, 1465859, 1237077, 1166224, 1079609, 1019866, 1094797, 1278456, 1236098, 1012287, 721226, 638900, 730543, 841600, 927583, 892574, 877365, 914516, 1009218, 1005149, 1036922, 1043444, 940431, 629801, 408672]
3911D08672p4972M4199L4240q8717k63124k37838J5198k9410J47905J20424p067
3900F9510l3261o7661J2996J5984J13304J10482L2223o0270p7574k0245m0848
3889E4640j9793K06927J56747k80604j33503k9188k28887j10205l7985N8773J54817
3878b08261J23546L46131J03378m2808R3253Q9619r3740K9069J80040J672k54954
3867C66945l45652j88992k09102q5304j9397O0034K01644J28449Q219K5604k7401
3856h4953r1188J1371J01349M3822R9655J39905Q4524j95048j56153j14561p948
3845a69225P8603P8199N4650N2279K47937K04332j132q9247J6897R5195o3724
3834E04764k32856k90771l37278n3796K62710J00964k54136k07882l4283L8260
$$ y = [408672, 333700, 377899, 412139, 323422, 60298, -177540, -162342, -191752, -43847, 76577, 69510, 36249, -31412, -18416, -2432, 110872, 221354, 253577, 193307, 115733, 95488, 54640, 34847, 241774, 398521, 117917, -15586, -44774, -273661, -383866, -421851, -363078, -208261, -84715, 261416, 364794, 321986, 415239, 504858, 411118, 440187, 620227, 621899, 366945, 21293, -167699, -376801, -462105, -481502, -421468, -219824, -91375, -83156, -57552, -84953, -176141, -164770, -63421, -19599, 80056, 219961, 304485, 109437, -46716, -161277, -169225, -90622, -12423, 42227, 94506, 342443, 546775, 545643, 456396, 473293, 568488, 504764, 271908, -18863, -356141, -409937, -147227, -46263, -300399, -508281, -542564, -504304]
3824e04304J15851M5082k06582k08144j62485K3015M12419K24364M9696k1552
3814b32640k19373P408K67078r0216K39K57001J88016r1447j13224M6732O6421
3803H5995l1779l4517j58373r4686P3175M7919j4199r8014J00759J30501q2166
3792g5385L2683R5992q8827L73o6860j57065J34313J08839j33730j16450N9892
3781b06225L6268j63748j32448J7663K44695N9686j41380l6800J62710R7426j97401
3770b59554j86635p9897N6621L14151K94804J81402J81790Q4367l39411j76448
3760G1190l1772j32630j9434J7026k5402m6192j5687p0042L3300J21028L4748
3749f3867K9537J34113J59854p0241k29694j14872J5496R613O2739n8676l6973
$$ y = [-504304, -388453, -343371, -549953, -758097, -920582, -897567, -485148, -260784, -211088, -232640, -452013, -444605, -177527, -267743, -267504, -10503, 177513, 86066, -27158, 19574, 85995, 54216, 19699, -138674, -233360, -160185, -112266, -126465, -224479, -123720, 6781, -75385, -42702, 53290, -35537, -35164, -102024, -259089, -124776, -15937, -149667, -266117, -206225, -169957, -333705, -466153, -448490, -203795, -144109, -285489, -322289, -159579, -62153, -259554, -446189, -526086, -469465, -155314, 139490, 320892, 502682, 587049, 247638, 71190, 39418, -93212, -112646, -95620, -121022, -167214, -182901, -252943, -219643, -98615, -63867, -34330, 99783, 259637, 189396, -40298, -155170, -139674, -130061, -67322, -125998, -162971]
3738a62971K08748K21540J027j55455j20862j35394o2655K50747J27985k9908
3728A42802j63900j37855J17125q6234j12249M6800J97161J10138j25861m4535
3718e6608O5596m3030L8695l2549m9375j2675q295Q8931J37336J40404l2409p6998
3706A59023N4199P7936o4522j55908j40557k48412k86931j06803l6267O1241Q3260
3695f03741q4220Q9838L37377J27239m3563j27583L8045R8113L9014r790l86J52833
3683A3176K15858J4247K964Q1526J650m4835j39788k04557J07644J36793l7892
3672A46786k53926j87580M0426J85260J89761J38079m6753j95719k5815P5138
3662F5657J67301J02036j10470l7011N0716l23985l24935j80718J13801L89287
$$ y = [-162971, 45777, 267317, 268344, 112889, -7973, -143367, -206022, 44725, 172710, 142802, -21098, -158953, -41828, -128062, -240311, -193511, 3650, 113788, -12073, -56608, 8988, -34042, 4653, -27896, -77271, -89946, -98241, -9310, 128026, 268430, 236021, 159023, 213222, 291158, 226636, 70728, -69829, -318241, -605172, -711975, -748242, -687001, -603741, -687961, -598123, -260746, -133507, -177070, -304653, -266608, -168495, -129481, -139271, -139657, 13176, 229034, 243281, 246245, 327771, 329421, 284586, 144798, -59759, 47885, 184678, 146786, -107140, -294720, -254294, -69034, 120727, 258806, 212053, 16334, -9481, 65657, 232958, 334994, 224524, 187513, 238229, -85756, -410691, -591409, -477608, -88321]
3652h8321L28661J03154k2459j17807j77758l2048J44156J92705L16845J04185
3642G51313j26148j65987j77242j29593k52073r6070j3393j24355k2976P8946
3632b77578M4149k5326k720P1744r3076p7502J1436R1430J12227K9516J31757
3621A6057Q4169J14816K9327r9088j93726j70855J7674J30333Q5035n9005j20922
3610a66185N0583J7512K6220J16260K49647K00615O8200l9529k38955k18104j30089
3599f3825j10646j24205k00497o1502J50917K54895K48374J10638P3107K22884
3589E00140R6232j89858Q793J185j37867j26665p9078l8274N1741J53257j43409
3578I6197k53913n2040P3826N2810J14814m1564j45253k98795k42874J02814K55736
$$ y = [-88321, 240340, 343494, 321035, 203228, 25470, -6578, 137578, 330283, 647128, 751313, 625165, 459178, 281936, 152343, -99730, -195800, -209193, -333548, -356524, -277578, -233429, -258755, -261475, -189731, -282807, -360309, -348873, -257443, -145216, -115700, 16057, 100226, 215042, 244369, 145281, -48445, -219300, -201626, -71293, 13742, -45263, -166185, -115602, -98090, -71870, 44390, 294037, 494652, 562852, 523323, 284368, 66264, -63825, -174471, -298676, -499173, -560675, -409758, -154863, 93511, 204149, 277256, 500140, 596372, 406514, 415307, 416492, 278625, 151960, 72882, 34608, 86349, 239606, 96197, -157716, -209756, -135930, -83120, 31694, -9870, -155123, -453918, -696792, -593978, -338242]
3567c38242K00647P859q3751K3982K27951K24185P8575p6230k22327J24712K58134
3556D25495k8512j23358j7926J85900k6885k74952k58097m5213l9248n751j61438
3545c69985j3199K66167K14974J40403J2631J8903m2153j58025O7283J58861q8106
3534B07754j15663j12231n7066K1291p7974L086j66195j34027O8541J41649K03097
3523a7738K00954J86764j4396k30468k10366j10481j75310j61596N6879J94109
3513b81649J08048p6435j1924K37084J18099j54805j56070n9697l5683N9723Q9417
3502a63892N5184k3171p8773p6728K19262K58471Q4369N2242Q5501j30065k30659
3491E1741k28351l25626k71239Q0226K45028Q4750o1571l0337J7269Q23L9026
$$ y = [-338242, -137595, -129736, -213487, -189505, 38446, 262631, 341206, 264976, 42649, 167361, 425495, 396983, 273625, 255699, 441599, 414714, 139762, -118335, -163548, -202796, -208547, -369985, -383184, -117017, 97957, 238360, 250991, 269894, 227741, 69716, 136999, 295860, 207754, 92091, -20140, -77206, -55915, -133889, -130803, -296998, -431025, -362484, -220835, -17738, 183216, 369980, 355584, 125116, -85250, -195731, -371041, -532637, -475758, -281649, -173601, -250036, -261960, -24876, 93223, -61582, -217652, -277349, -313032, -253309, -163892, -108708, -131879, -210652, -287380, -68118, 190353, 274722, 326964, 412465, 282400, 51741, -176610, -502236, -773475, -693249, -448221, -363471, -425042, -455379, -438110, -437287, -398261]
3480c98261J9551J7436J03050J56751R3751O1548N5132M0846k37886k42221K214
3469c28089J97512R7052j384J07672J35985R1413R290K38108J20545l2728N5026
3458F90402O3156j87787k84024j06839j13446j0009J48201k48866k80750k08443
3448e38405k04172K91748K63794K46135P7686k2278j37159J55250K14881j78599
3438A68881l51133j17496o678r0279o0333j0107k00155k04116J28682K09800J73894
3427c59040J25790J144K263k0279J1513M8931j9061l8890P7363J12130j7092m5713
3415a20941k5621L6241j79976j77298j8123K4055o5511L2025J11958M0169N5511
3404b87511O1917N1690p9499j51540j71894J38103J88185K9991j05620r179R7815
$$ y = [-398261, -378710, -361274, -258224, -101473, -7722, 53826, 108958, 149804, -88082, -330303, -328089, -130577, -33525, -34909, 72763, 208748, 300161, 309451, 547559, 668104, 635376, 690402, 753558, 565771, 281747, 174908, 61462, 51453, 199654, -49212, -329962, -538405, -742577, -450829, -187035, 59100, 136786, 114508, -22651, 132599, 347480, 168881, -182252, -299748, -306426, -396705, -457038, -467145, -667300, -871416, -742734, -532934, -359040, -233250, -232106, -229843, -250122, -238609, -189678, -208739, -247629, -170266, -58136, -75228, -120941, -146562, -110321, -290297, -467595, -485718, -461663, -527174, -495149, -383191, -343022, -287511, -225594, -173904, -253403, -404943, -576837, -438734, -250549, -220558, -326178, -335357, -237542]
3393b37542J91328J34155j52598j43111l9350o8135J24090K40560J49995J69215
3383C68607J64270r2142m77047l29023q8708Q821L6835K19683j56202k31958K12074
3372c64790L70874n3328m64617j38110N9824j8395J17930J73629R3498L11924
3362H8439L80720o889l47930k03390M2046K26527J22949m4985n1686k46316k73545
3351c14060k83596k10254R8847L51758K73652M8679k7499O6607K1905j5822p039
3340C178q2654k31730k11713j02463M7535J07141N6915j04199n3273K00217L3791
3329c37255J41988J64063j36231k01693j28719n7980o9101q8672P1582K12314
3319d29704J36857j25407j93192k563N8606J28459L38466K6812j65471j63831
$$ y = [-237542, -46214, 87941, -64657, -207768, -247118, -315253, -191163, 49397, 199392, 368607, 532877, 440735, -36312, -365335, -454043, -445222, -408387, -188704, -344906, -576864, -364790, 6084, -47244, -511861, -649971, -590147, -608542, -490612, -316983, -223485, 88439, 469159, 462270, 114340, -89050, -47004, 179523, 302472, 257487, 205801, -40515, -314060, -597656, -807910, -709063, -357305, -83653, -34974, -62473, 4134, 26039, 10217, 3178, -79476, -311206, -522919, -625382, -577847, -470706, -413791, -517990, -571263, -371046, -337255, -195267, -31204, -167435, -369128, -497847, -555827, -624928, -713600, -642018, -429704, -292847, -418254, -611446, -614009, -555403, -426944, -88478, -61666, -227137, -390968]
3309c90968j3242J97582n4899j10757j34695j18959J53258J67564j76302j21810
3299f03228J65261J21970K9495K40677J13577j89505j87540N336J6521J7746K05216
3288f4474J68192k1618j14532j8919J38103Q6893p7990n8916p1833r562J06485
3277F1829P9924K6429O9564j66330l80277L59J67757K99895K74688l3018j17972
3266B82848o3995k3853j41801k40263k94852p5218K75354K94915R9038j18984
3256f811j25163j09419p4528q7989k2517J70367J49227k22891K7990J64879k1148
3245a58003k2623j62676j22617J75445J28284n5582k10207o0200J77608J73141
3235a37430J02905K79279J3185j93040J32349K07522N4611Q6426M9985k06048
$$ y = [-390968, -404210, -206628, -261527, -372284, -506979, -625938, -472680, -305116, -481418, -603228, -437967, -315997, -286502, -45825, 67752, -121753, -309293, -303957, -287436, -269690, -64474, 103718, 82100, -32432, -51351, 86752, 173645, 95655, 36739, -35094, -44656, 61829, 141753, 168182, 237746, 71416, -308861, -308502, -140745, 159150, 433838, 400820, 282848, 218853, 195000, 53199, -187064, -481916, -557134, -281780, 13135, 112173, -6811, -131974, -241393, -315921, -403910, -426427, -256060, -106833, -329724, -301734, -136855, -158003, -180626, -343302, -465919, -290474, -162190, -217772, -427979, -488179, -310571, -137430, -34525, 244754, 257939, 64899, 197248, 404770, 459381, 545807, 595792, 389744]
3225C89744J6039J0255j21267p2953L8392M150m6391j79213k19330j60993o5980
3214d07547J2929l3886J36034J25097L8860q611m8103j66300j01827K65412L48318
3203A60376J75088J06683l8761o3940j10423k66813j57300j27929j68497q9297
3193e80813K24892K20006M9835J1609L5768N4660J33693q9305k54052j23898j20734
3182d38339N6307Q2586M4103K3979j7811K7332m4932N6938K1141m1944m734j53085
3170c88459r3123J0346L3852p5504J16201J92654J46957J80487J19073J50119
3160C92603O8342j46668j29257l6378k19911j80599r7796L3729J89648J86828
3150F0541J00543j67237j36495Q1390J17123K05579J02953j41562k11322j47456
$$ y = [389744, 405783, 416038, 294771, 221818, 260210, 264360, 217969, 38756, -180574, -341567, -407547, -394618, -428504, -292470, -167373, -128513, -137124, -185227, -351527, -453354, -187942, 160376, 335464, 442147, 403386, 339446, 229023, -37790, -195090, -323019, -491516, -580813, -355921, -135915, -86080, -74471, -38703, 15957, 149650, 60345, -193707, -317605, -438339, -382032, -299446, -255343, -231364, -249175, -221843, -266775, -209837, -188696, -230640, -235374, -388459, -481582, -471236, -437384, -512888, -396687, -204033, -57076, 123411, 242484, 392603, 460945, 314277, 185020, 148642, -71269, -251868, -349664, -315935, -126287, 60541, 161084, -6153, -142648, -61258, 55865, 261444, 364397, 222835, 11513, -135943]
3140a35943j63285m848J1666R7653N1756m2406l1949j9580m2650m6042P1586M1160
3128b12882j8962q772l648k0421k2346p5295k34735n2187K98600J24171J42265
3117h4212K49868J00525p7685j47433M7815J71135J96326K9132j82103j81192
3107A22176j34321l1391M6320o9348O0228J54666J67671O7861k07676k19614R7140
3096E3712R3152N1184J01960k4941j61799m9856m0829p7371j41611o099N0188
3085a52310K6689o3913J26J24536L3022J23185J51529j30888l12006k94123q0017
3074e74170L37251K74842r470j37252O429Q9861m6636j36308r0677J07778K9645
3063a48707O7637J91612J90132q0116j23717j15882P0758j9779k62159k4958j2851
$$ y = [-135943, -299228, -304076, -292410, -194757, -143001, -185407, -217356, -236936, -279586, -325628, -254042, -212882, -231844, -240616, -244264, -264685, -287031, -362326, -597061, -649248, -350648, -226477, -84212, 165656, 266181, 188496, 41063, 88878, 260013, 456339, 485471, 303368, 122176, -12145, -43536, 2784, -66564, -6336, 148330, 316001, 383862, 176186, -43428, 53712, 146864, 198048, 300008, 275067, 113268, 63412, 22583, -54788, -196399, -202498, -152310, -125621, -189534, -189408, -64872, -31850, 91335, 242864, 111976, -200030, -494153, -574170, -236919, 37923, 28453, -108799, -102370, -12509, -59145, -195453, -286130, -178352, -148707, -81070, 110542, 300674, 220558, 96841, -19041, 51717, 31938, -230221, -255179, -268030]
3052b68030O3088K02116Q7726l2888k09032j12598O752J03113N6029J49336J61456
3041B07068j54420k86855j47510j624J92313j11451k02683m539N6800J4340l6057
3030d74618P2225M8037j60914j12569k1478O9013J57685K7730J05182N6833Q1674
3019a51200L13437j5390m18245l32627O531K98973K6066p7833q5830n6146J58677
3008c33587K68551k8331k29859j96029j8504L9775J29171Q5414Q2048M825K3489
2997a73037j47249k81110k59053L9966J12233Q7525J52172J48089J57707J99099
2987C6342J53474J5023r8217J11059J97158l7919j24182O3234n1727j92758j79981
2976a08494k04999k65181l1468l2804j91516J3527j9512j10594Q9366Q8614Q9955
$$ y = [-268030, -204942, -2826, 84900, 52012, -157020, -269618, -262866, -159753, -103724, 45612, 207068, 52648, -234207, -381717, -383341, -191028, -302479, -505162, -509701, -452901, -438561, -474618, -402393, -354356, -515270, -627839, -649317, -580304, -422619, -394889, -289707, -232874, -151200, 162237, 146847, -271398, -604025, -597494, -298521, -272455, -350288, -436118, -492264, -333587, -65036, -93367, -323226, -519255, -537759, -497984, -368813, -283399, -201351, -196526, -173037, -320286, -601396, -860449, -820483, -708250, -620725, -468553, -320464, -162757, 36342, 189816, 204839, 106622, 217681, 414839, 376920, 252738, 315972, 264245, 71487, -108494, -313493, -578674, -610142, -642946, -834462, -820935, -840447, -951041, -861675, -773061, -683106]
2965f83106N4450N1102J59868O9743l8856P7623J48126M8392q2874O1544Q2690
2954e1298j17940J10748J54695k14767m93669r8254L69901K92173J18578J12811
2944A82978J06328O7187j42404l74002l01761m7627L3952m5929n8382j18301J11648
2933e86313K8305q2814J18434J73194Q8748J21377K56888J73947p616Q7947K58299
2922F30396O3617P541j55211l18571j45356o8232j51361L1920J98703R8577m0830
2911A51193k2774M6727K6245J14068L0550k80412j07133Q948j22530j45818l8878
2900c39814O9420Q0781J17016N3731O4259J50177M7933j60169q3514m1977j59081
2889b01238J47707J60900k35212l15050k21652J4924J34393K52034J25661L2580
$$ y = [-683106, -628656, -577554, -417686, -347943, -386799, -309176, -161050, -112658, -195532, -133988, -51298, -169238, -58490, 96205, -118562, -612231, -710485, -340584, -48411, 70167, 182978, 289306, 356493, 214089, -159913, -461674, -509301, -475349, -521278, -579660, -697961, -586313, -558008, -640822, -522388, -349194, -260446, -139069, 117819, 291766, 284150, 372097, 630396, 694013, 701554, 546343, 227772, 82416, 14184, -137177, -105257, 93446, 192023, 151193, 128419, 175146, 201391, 315459, 346009, 65597, -41536, -32588, -155118, -300936, -339814, -270394, -189613, -72597, -18866, 45393, 195570, 243503, 83334, -180, -42157, -201238, -53531, 107369, -127843, -442893, -664545, -649621, -515228, -263194, -137533, -104953]
2879a04953J14588J36792Q1293r6450j38911o6050j0729j40944j90659M1975J06464
2868b67584Q2727j1627J9412r696J4611M6685p0458j68912J27944J56970K34666
2857A54738J27116M303m142M6610o7538L2089k661k22655N0645q346j47286k779
2845c9906p3178k39097j93959j2261J79548M5114J05922j9293J11482k9729j51317
2834c16674Q5529J22743n2546j62649j00169J0010J09147K09897K95748J01615
2824C02651k6469j87201k56436J1793K13124J25196p6855m9396j05418q4622k68030
2813d01663k30574p4252J72719K11232N0458L7077K10956L65546K27888l909L8282
2802F03760j57257k08932N2104k04822j47595K09527J54285p5591o7593j03493
$$ y = [-104953, 9635, 146427, 227720, 131270, -7641, -73691, -84420, -225364, -416023, -374048, -267584, -184857, -196484, -177072, -186768, -172157, -125472, -195930, -364842, -236898, -79928, 154738, 281854, 286157, 282015, 328625, 261087, 293176, 290515, 67860, 118505, 110159, -37127, -39906, -113084, -352181, -546140, -558401, -378853, -333739, -227817, -247110, -135628, -165357, -316674, -231145, -108402, -160948, -323597, -423766, -413756, -304609, -94712, 201036, 302651, 276182, 88981, -167455, -155662, 57462, 182658, 105803, 56407, -49011, -133633, -401663, -632237, -706489, -533770, -322538, -272080, -235003, -24047, 341499, 569387, 565478, 603760, 446503, 237571, 289675, 84853, -62742, 146785, 301070, 225479, 157886, 54393]
2792E4393k04258L3404J9922m2450L8280J13110J00032N1830k2992j62759j16208
2781a37696O164J6359j23575N0424J41891J4431J3323j13345q1624J34538k026
2770h1136n3311k0504o3841K3586N5320J14345j52597j29250q9321N7313K28833
2759a10563K90740K59834K4037r3177j40516j89559q6286n2886L8952J12435j06632
2748e3621O7693R7000j54275j37257k0820n3554J09141J74938k5839r0048j21565
2737b08207q0546K30608L38767p4516l10577j86735K4259O9076R6902K39425N6365
2726A94821L058j7821m9690l4762r0651j60993k758M6407K2191L4956j9334p4737
2714a49313k9424j73963p6846J77561Q1702l9363j02715P9283J43071K5053j92809
$$ y = [54393, -149865, -116461, -96539, -138989, -100709, 12401, 112433, 164263, 141271, -21488, -137696, -131532, -115173, -238748, -188324, -46433, -32002, -18679, -132024, -213648, -79110, -81136, -134447, -154951, -218792, -195206, -139886, -25541, -178138, -307388, -396709, -339396, -110563, 180177, 440011, 464048, 370871, 230355, 40796, -45490, -98376, -59424, 53011, -53621, 14072, 111072, -43203, -180460, -201280, -254834, -145693, 29245, 3406, -86642, -208207, -288753, -58145, 280622, 206106, -104471, -291206, -266947, -197871, -100969, 138456, 194821, 197879, 180058, 130368, 95606, 4955, -156038, -158796, -112389, -90198, -55242, -74576, -149313, -178737, -352700, -429546, -251985, -170283, -209646, -312361, -233078, -90007, -64954, -257763]
2703b57763L37n5539j64661M676K03687L09487J84080r8922j71842o0745J19960
2692A2755K69496N1316j55861j75295l7369P5995l200j84888l3282J12808J44008
2681G6483o7326j65709m5054J41076J26376m8448r8577j8577q444J08069Q7164
2670H7033P8843O7939J3703N9413l4198j30351k46484j77351L9670J11831L9923
2659i0029K06493j8264k40590k40436J13665K41453J85358n9261k56323j41885
2649b99819L241J83366K32692n6490j77627j84186k12450P9695J49309M8301P4413
2638a59555J27250n0212r3786L8418j65165m13118o7650K27517K16705Q2423J82166
2627g5007Q4876N5538L5831k42926k85776j15018O0777K56659K59935K06125J04941
$$ y = [-257763, -257426, -312965, -477626, -472950, -269263, 40224, 224304, 125382, -46460, -107205, 12755, 282251, 333567, 177706, 2411, -34958, 41037, 37837, -147051, -180333, -67525, 76483, 9157, -156552, -201606, -60530, 65846, 17398, -81179, -99756, -108200, -131, 87033, 165876, 233815, 247518, 306931, 272733, 142382, -104102, -281453, -241783, -129952, -90029, 116464, 98200, -142390, -382826, -269161, -27708, 157650, 98389, -157934, -299819, -296578, -113212, 119480, 62990, -114637, -298823, -511273, -431578, -282269, -233968, -159555, -32305, -82517, -176303, -137885, -303050, -716168, -783818, -556301, -339596, -257173, -75007, 9869, 65407, 101238, -141688, -427464, -542482, -481705, -225046, 34889, 241014, 345955]
2616C45955k03037r8430J778j37149j91618k29458n8908J22541K44876L72713
2606A69263K68286j58534l36026k21955j20634J72104K66105R3854n2875k66893
2596a87305l60047k292L83316O3360k67895l0388M7547k00505p4323j9480K90510
2585c57502L62604r446O769j62311j27654m0619j60964j33948Q5912k1413o9716
2574f28288N9292J30917J31982K3693Q9405J55017j98792l85260j19803J47284
2564e94553P7842Q959J24572J78191o5177k3483J18089l4571k93937k70269j67219
2553i41556p7501J96437M6476Q8407L18705J34914J23506J91710P9199K22202
2543C82499K15538J43476m0364j80948L818j33073m66039l81720p9250m8834M7813
$$ y = [345955, 142918, 44488, 46266, -90883, -282501, -511959, -570867, -448326, -203450, 169263, 437549, 279015, -57011, -278966, -399600, -227496, 38609, 132463, 79588, -187305, -547352, -549644, -166328, -102968, -370863, -401251, -353704, -554209, -628532, -648012, -357502, 5102, -4344, 2425, -159886, -287540, -328159, -489123, -623071, -537159, -558572, -628288, -568996, -438079, -306097, -282404, -192999, -37982, -236774, -622034, -741837, -594553, -516711, -507752, -383180, -204989, -270166, -293649, -175560, -210131, -504068, -774337, -941556, -1019057, -822620, -776144, -687737, -369032, -234118, -110612, 81098, 160297, 382499, 598037, 741513, 701149, 520201, 524019, 390946, -75093, -456813, -536063, -584897, -537084]
2532e37084R1559R2767J11949R2614J06464J49008P7302j12489l8294j50855j29715
2521b46774J89974J13009J0128j4107L2244r5896j18715o1455l9279J3959P8124
2510a38788Q4682N6908p5528K948r4615k65646j3403O2354L16114J92990K4909
2499A52925M2771J15450M2776L4518r3065m30612l40787J0313L0126J55014J44611
2488a35960J21987P7462L4962p1560j0489k6406K2821J10039P1931j0480K89878
2477D74185K70577n5230k53818j30188R3583n5574j22289j45436p1198j63440
2467a58828j81525n3326p1065o0635J24544J67015J96949J2586j45806m4525P3412
2456a41204O7509j9649k1585J26576l788m7731m9462L4471J62399o907j11037
$$ y = [-537084, -445525, -352758, -240809, -148195, -41731, 107277, 184579, 72090, 33796, -117059, -246774, -56800, 56209, 66337, 52230, 84474, -11422, -130137, -191592, -230871, -216912, -138788, -54106, 2802, -72726, -69778, -164393, -430039, -443442, -381088, -64974, 128016, 152925, 195696, 311146, 353922, 388440, 295375, -135237, -476024, -465711, -435585, -280571, -135960, -13973, 63489, 98451, 26891, 16402, -10004, 12817, 122856, 194787, 184307, 474185, 744762, 689532, 435714, 305526, 399109, 343535, 221246, 75810, 4612, -158828, -340353, -393679, -464744, -525379, -400835, -233820, -36871, -24285, -170091, -214616, -141204, -73695, -93344, -114929, 11647, 7859, -39872, -89334, -54863, 107536, 100629, -10408]
2445a0408l957j79857j05860O8862m8924P7730K0920M7084J95001J50634p4556
2434A36669l21046j25432k0027M8108M3343P9074P1760J23927J06441k0190k9588
2423I3039k7323m5144o9128j63300k5882R5446J28791J50375Q4405o472j90531
2412B4276j99754j60371l6743O1106j439j01400l3092n8576j52001K7209Q3749
2401e47036R8007N088j46594L4462L18824J39438j04183j53831K063J62280n833
2390a97315k5484j02705k11133k26740N7587K69212L24040J93211j64398j09410
2380a93135q5300K7509K01231J81173K01596J44377k1474k75876j84717J21840
2370A17224L9731N9205j86786k01520j91k25608k92290L8477L14808K86995K8231
$$ y = [-10408, -14365, -194222, -300082, -231220, -280144, -202414, -181494, -134410, 60591, 211225, 136669, -184377, -309809, -329836, -281728, -238385, -159311, -87551, 36376, 142817, 122627, 93039, 65716, 20572, -48556, -211856, -237738, -142292, -13501, 136874, 221279, 214807, 24276, -175478, -335849, -372592, -311486, -312925, -414325, -447417, -505993, -657994, -630785, -547036, -449029, -443941, -590535, -556073, -237249, -97811, -201994, -355825, -353762, -191482, -197315, -222799, -325504, -536637, -763377, -705790, -436578, -112538, 80673, -83725, -193135, -278435, -250926, -49695, 131478, 333074, 477451, 455977, 180101, -4616, 117224, 156955, 216160, 29374, -172146, -172337, -397945, -690235, -651758, -336950, -49955, -21724]
2359b1724k48121P8748K00668Q252p8748j242N6336K2823k3382P6833J71136K6990
2347B68569k20333N0969q7494k34538p3737K2215O7559J81367J16559n7872P5663
2336A08927k1842j76103p0307J11005J14030P9106j31157j58943p2418J5284N7482
2325a44936q4671o819Q4772l2377K7637J95901j6204l21395k63662P1230K21720
2314b68804N4224j01222L0807k1819P4825K1287j17835L9333O0537J23241J42391
2303C6965Q3961J28142p836j31566r1837j20549O4232J41158J21646j20087l11294
$$ y = [-21724, -269845, -191097, 9571, 17823, -60925, -62167, -5831, 16992, -6390, 70443, 241579, 268569, 48236, 99205, 11711, -222827, -296564, -274349, -206790, -25423, 91136, 33264, 108927, 87085, -89018, -159325, -48320, 65710, 144816, 13659, -145284, -217702, -202418, -144936, -229607, -236426, -151654, -184031, -156394, 39507, 23303, -298092, -561754, -490524, -268804, -214580, -315802, -284995, -306814, -231989, -210702, -328537, -289204, -228667, -105426, 36965, 120926, 249068, 241232, 109666, 17829, -102720, -38488, 102670, 224316, 104229, -207065]
$$ [...]
##END NTUPLES=NMR SPECTRUM
##END=
