##TITLE=C13_IPACAT-34D
 CDCl3, 22100 sc

 2.11.2023
##JCAMPDX= 6.0         $$ Bruker NMR JCAMP-DX V2.0
##DATA TYPE= NMR SPECTRUM
##DATA CLASS= NTUPLES
##ORIGIN= UXNMR, Bruker Analytische Messtechnik GmbH
##OWNER= root
$$ XWIN-NMR		Version 3.5
$$ Fri Nov  3 13:45:12 2023 Russian Standard Time (UT+4h)  she@DPX200
##.OBSERVE FREQUENCY= 50.327896
##.OBSERVE NUCLEUS= ^13C
##.ACQUISITION MODE= SIMULTANEOUS
##.ACQUISITION SCHEME= undefined
##.AVERAGES= 18940
##.DIGITISER RES= 17
##SPECTROMETER/DATA SYSTEM= spect
##.PULSE SEQUENCE= zgpg30
##.SOLVENT NAME= CDCl3
##.SHIFT REFERENCE= (INTERNAL, CDCl3, 0, 222.624)
##AUDIT TRAIL= $$ (NUMBER, WHEN, WHO, WHERE, WHAT)
$$ ##TITLE= Audit trail, XWIN-NMR		Version 3.5
$$ ##JCAMPDX= 5.01
$$ ##ORIGIN= Bruker BioSpin GmbH
$$ ##OWNER= she
$$ F:/spectra/data/she/nmr/c13/1/pdata/1/auditp.txt
$$ ##AUDIT TRAIL=  $$ (NUMBER, WHEN, WHO, WHERE, WHAT)
(   1,<2023-11-03 12:19:58.45 +0400>,<she>,<DPX200>,
      <created by zg, POWCHK disabled, PULCHK disabled
       terminated by command 'halt'
       configuration hash MD5:
       00 E9 B6 7A A2 85 ED C7 34 08 36 98 17 FE 4E 26
       data hash MD5: 32K
       29 A5 7D E8 5E 42 B7 31 60 3A 2D 10 E6 0F ED 03>)
(   2,<2023-11-03 13:42:00.32 +0400>,<she>,<DPX200>,
      <Start of raw data processing
       efp BC_mod = 2 LB = 2 FT_mod = 6 PKNL = 1 PHC0 = -359.5706 PHC1 = 27.13753 SI = 32K 
       data hash MD5: 32K
       61 1C 66 AC FB 37 CD D4 68 6B 0A 86 F2 8B 25 05>)
(   3,<2023-11-03 13:42:03.09 +0400>,<she>,<DPX200>,
      <abs ABSG = 5 
       data hash MD5: 32K
       7D 51 08 46 DD F1 5B 91 FD CB FC A0 20 0B EE 5F>)
(   4,<2023-11-03 13:42:41.87 +0400>,<she>,<DPX200>,
      <abs ABSG = 5 
       data hash MD5: 32K
       7F 6F 8A 15 9F 81 07 E3 C7 FD 44 25 86 A6 B6 CD>)
(   5,<2023-11-03 13:43:30.64 +0400>,<she>,<DPX200>,
      <pk PHC0 = -18.04071 PHC1 = 0 
       data hash MD5: 32K
       53 60 72 0D 3A 04 D1 85 76 66 5D A8 F4 20 1B 88>)
(   6,<2023-11-03 13:44:07.09 +0400>,<she>,<DPX200>,
      <pk PHC0 = 20.82218 PHC1 = -2.399996 
       data hash MD5: 32K
       86 C6 34 BE 33 63 99 91 F3 77 3A 01 BC B3 86 05>)
(   7,<2023-11-03 13:44:11.07 +0400>,<she>,<DPX200>,
      <abs ABSG = 5 
       data hash MD5: 32K
       1B 43 05 C7 23 15 62 5C 86 B9 B8 34 D4 64 71 67>)
$$ ##END=
$$ 
$$ hash MD5
$$ EA 3A 01 A8 2D C8 E8 3D D9 5C 48 75 7D 92 E0 F6
##$RELAX= 
##$RELAX= 
##$RELAX= 
##$RELAX= 
##$RELAX= 
##$RELAX= 
##$RELAX= 
##$RELAX= 
$$ Bruker specific parameters
$$ --------------------------
##$DU= <F:/spectra>
##$EXPNO= 1
##$NAME= <c13>
##$PROCNO= 1
##$TYPE= <nmr>
##$USER= <she>
##$AMP= (0..31)
100 100 100 100 100 100 100 100 100 100 100 100 100 100 100 100 100 100 
100 100 100 100 100 100 100 100 100 100 100 100 100 100 
##$AQSEQ= 0
##$AQ_mod= 1
##$AUNM= <au_zg>
##$AUTOPOS= <>
##$BF1= 50.322709
##$BF2= 200.13
##$BF3= 50.322709
##$BF4= 500.13
##$BF5= 500.13
##$BF6= 500.13
##$BF7= 500.13
##$BF8= 500.13
##$BYTORDA= 1
##$CFDGTYP= 0
##$CFRGTYP= 5
##$CHEMSTR= <none>
$$ [...]
##$SUBNAM4= <"">
##$SUBNAM5= <"">
##$SUBNAM6= <"">
##$SUBNAM7= <"">
##$SUBNAM8= <"">
##$SUBNAM9= <"">
##$SW= 239.972175391363
##$SWIBOX= (0..15)
0 1 3 0 0 0 0 0 0 0 0 0 0 0 0 0 
##$SW_h= 12077.2946859903
##$TD= 32768
##$TD0= 1
##$TE= 0
##$TE2= 300
##$TE3= 300
##$TEG= 300
##$TL= (0..7)
120 120 120 120 120 120 120 120 
##$TP= (0..7)
150 150 150 150 150 150 150 150 
##$TP07= 0
##$TPNAME0= <>
##$TPNAME1= <>
##$TPNAME2= <>
##$TPNAME3= <>
##$TPNAME4= <>
##$TPNAME5= <>
##$TPNAME6= <>
##$TPNAME7= <>
##$TPOAL= (0..7)
0.5 0.5 0.5 0.5 0.5 0.5 0.5 0.5 
##$TPOFFS= (0..7)
0 0 0 0 0 0 0 0 
##$TUNHIN= 0
##$TUNHOUT= 0
##$TUNXOUT= 0
##$USERA1= <user>
##$USERA2= <user>
##$USERA3= <user>
##$USERA4= <user>
##$USERA5= <user>
##$V9= 5
##$VALIST= <valist>
##$VCLIST= <CCCCCCCCCCCCCCC>
##$VD= 0
##$VDLIST= <DDDDDDDDDDDDDDD>
##$VPLIST= <PPPPPPPPPPPPPPP>
##$VTLIST= <TTTTTTTTTTTTTTT>
##$WBST= 1024
##$WBSW= 4
##$XGAIN= (0..3)
0 0 0 0 
##$XL= 0
##$YL= 0
##$YMAX_a= 79235305
##$YMIN_a= -113116550
##$ZGOPTNS= <>
##$ZL1= 120
##$ZL2= 120
##$ZL3= 120
##$ZL4= 120
##$ABSF1= 222.624
##$ABSF2= -17.3728
##$ABSG= 5
##$ABSL= 3
##$ALPHA= 0
##$AQORDER= 0
##$ASSFAC= 0
##$ASSFACI= 0
##$ASSFACX= 0
##$ASSWID= 0
##$AUNMP= <proc_1d>
##$AZFE= 0.1
##$AZFW= 0.5
##$BCFW= 0
##$BC_mod= 2
##$BYTORDP= 0
##$COROFFS= 0
##$CY= -3
##$DATMOD= 1
##$DC= 0
##$DFILT= <>
##$DTYPP= 0
##$F1P= 0
##$F2P= 0
##$FCOR= 0.5
##$FTSIZE= 32768
##$FT_mod= 6
##$GAMMA= 0
##$GB= 0
##$INTBC= 1
##$INTSCL= 4.134877e-10
##$ISEN= 128
##$LB= 2
##$LEV0= 0
##$LPBIN= 0
##$MAXI= 10000
##$MC2= 0
##$MEAN= 0
##$ME_mod= 0
##$MI= 0.1934396
##$NCOEF= 0
##$NC_proc= 1
##$NLEV= 6
##$NOISF1= 120.0001
##$NOISF2= 80.00006
##$NSP= 0
##$NTH_PI= 0
##$NZP= 0
##$OFFSET= 222.624
##$PC= 1.4
##$PHC0= -356.7891
##$PHC1= 24.73753
##$PH_mod= 1
##$PKNL= yes
##$PPARMOD= 0
##$PSCAL= 0
##$PSIGN= 0
##$REVERSE= no
##$SF= 50.3227315983092
##$SI= 32768
##$SIGF1= 140
##$SIGF2= 120
##$SINO= 11.81781
##$SIOLD= 32768
##$SREGLST= <13C.CDCl3>
##$SSB= 0
##$STSI= 32768
##$STSR= 0
##$SW_p= 12077.2946859903
##$SYMM= 0
##$S_DEV= 0
##$TDeff= 32768
##$TDoff= 0
##$TI= <>
##$TILT= no
##$TM1= 0
##$TM2= 0
##$TOPLEV= 0
##$USERP1= <user>
##$USERP2= <user>
##$USERP3= <user>
##$USERP4= <user>
##$USERP5= <user>
##$WDW= 1
##$XDIM= 32768
##$YMAX_p= 457320350
##$YMIN_p= -3874181
$$ End of Bruker specific parameters
$$ ---------------------------------
##NTUPLES= NMR SPECTRUM
##VAR_NAME=  FREQUENCY,     SPECTRUM/REAL,   SPECTRUM/IMAG
##SYMBOL=    X,             R,               I
##VAR_TYPE=  INDEPENDENT,   DEPENDENT,       DEPENDENT
##VAR_FORM=  AFFN,          ASDF,            ASDF
##VAR_DIM=   32768,         32768,           32768
##UNITS=     HZ,            ARBITRARY UNITS, ARBITRARY UNITS
##FACTOR=    0.368581032318806, 1,           1
##FIRST=     11203.0474430531, 0,            0
##LAST=      -874.247242937185, 0,           0
##MIN=       -874.247242937185, -3874181,    0
##MAX=       11203.0474430531, 457320350,    0
$$ Real data points
##PAGE= N=1
##DATA TABLE= (X++(R..R)), XYDATA
$$ [...]
18092 87551 54307 107170 140475 40881 -147488 -379865 -577098 -661865 -593156 -271597 288636
18081 288636 818495 1149434 1335394 1385736 1333156 1167191 918968 762820 785575 843946
18071 843946 781785 588631 344068 85383 -211201 -481704 -604001 -594630 -622415 -697133
18061 -697133 -676171 -491239 -152881 204849 355927 315111 300421 351498 388136 386697 426787
18050 426787 609245 882800 1104743 1112216 878848 588847 368502 233114 172539 244204
18040 244204 561225 996384 1247935 1268418 1133549 891970 686776 717528 985984 1241353
18030 1241353 1354211 1353903 1299994 1328984 1548095 1896559 2193552 2237639 1998175 1522878
18020 1522878 938120 559657 487554 501880 438684 256136 -7714 -246118 -373297 -396568
18010 -396568 -392882 -431884 -434776 -268388 123209 791973 1556702 2143735 2470043 2599107
18000 2599107 2640111 2655093 2604051 2313876 1763506 1198442 766134 386670 -31967 -474466
17990 -474466 -796453 -841285 -661800 -489063 -444576 -402442 -233822 -3433 143900 79428
17980 79428 -298608 -852560 -1318918 -1608958 -1675125 -1429598 -937841 -469771 -216175 -163486
17970 -163486 -234594 -266935 -14989 552443 1084445 1268216 1225892 1146457 1054351 967171 868195
17959 868195 723543 648230 730487 919320 1076813 1057454 993730 1135190 1488430 1862499
17949 1862499 2104429 2196654 2128437 1882549 1570302 1309254 1129766 963860 750610 538242
17939 538242 307655 66957 -129609 -301304 -445149 -468736 -317292 -125739 -86585 -213951
17929 -213951 -406000 -508094 -343759 76940 509227 715445 703020 638998 647999 764015
17919 764015 847418 737409 501161 265145 84895 4802 -2398 -4388 -70864 -243015 -504109
17908 -504109 -831583 -1102873 -1100112 -816697 -497120 -273359 -126035 47105 285978 484522
17898 484522 492678 344122 183956 139625 283785 536015 756549 931451 1002706 971984
17888 971984 995433 1041642 1000285 832953 571932 325701 151466 9118 -98544 -136145
17878 -136145 -127990 -65771 49877 50983 -158389 -376100 -433438 -295172 49839 423437 625693
17867 625693 607330 426491 248850 210555 292580 468699 704215 875932 842997 593204
17857 593204 331180 231247 230601 301724 513993 797027 982876 999676 870896 722948 590074
17846 590074 493815 506792 607394 757743 1018602 1327424 1528116 1578862 1467615 1239766
17836 1239766 1037358 968803 1044226 1177733 1241470 1210440 1077273 954446 985531 1090516
17826 1090516 1192241 1282991 1397160 1542633 1763706 2090174 2407667 2518341 2339782 1956788
17816 1956788 1556734 1280524 1052424 831026 692295 603339 441313 171086 -115058 -405957
17806 -405957 -743603 -985559 -939389 -613341 -260639 -144852 -225078 -308582 -408780 -577303
17796 -577303 -809276 -1146420 -1590205 -2078742 -2487825 -2718876 -2723778 -2531980 -2241319 -1966976
17786 -1966976 -1785933 -1650430 -1425635 -1037876 -513724 53427 540060 805597 729251 388335
17776 388335 53559 -136594 -284245 -479930 -663934 -729797 -602705 -292644 83691 448122
17766 448122 811221 1182282 1508535 1730011 1848769 1990915 2330486 2994335 3971791 5087050
17756 5087050 6114428 7031252 8048588 9124248 9803506 9874914 9630938 9411251 9329194
17747 9329194 9347629 9433693 9682255 10251982 11160419 12206054 13170420 13837642 13997901 13644028
17737 13644028 13000538 12342977 11810529 11414341 11215330 11304893 11695126 12386331 13263686
17728 13263686 14059081 14462413 14272421 13720580 13226184 12952569 12749029 12442531 12054485
17719 12054485 11797664 11859661 12190070 12705008 13307724 13610368 13241018 12328677 11291156
17710 11291156 10375931 9583655 8926553 8454859 8180656 7959176 7608508 7105030 6428532
17701 6428532 5619717 4841590 4192954 3685962 3370934 3185266 3034936 2966350 3000617 3014284
17691 3014284 2896178 2609715 2215168 1828586 1434725 984937 520625 134321 -124882
17682 -124882 -268111 -380313 -578118 -835340 -1023824 -1077249 -994323 -768416 -486077 -323620
17672 -323620 -341456 -447293 -575997 -681021 -616444 -292064 161396 519999 670154 702208
17662 702208 814027 1061622 1244938 1281538 1282754 1290091 1276492 1224045 1080287 887040 797638
17651 797638 800853 763314 598900 330033 82322 -66410 -78590 76615 300042 452189
17641 452189 516402 526306 546407 654023 784144 743328 433620 -103134 -647067 -896051
17631 -896051 -789196 -579831 -475557 -415582 -306990 -275166 -443633 -688709 -788303 -696705
17621 -696705 -474410 -180803 78136 339747 725172 1116253 1273477 1163766 1006223 1061991
17611 1061991 1313067 1509618 1481468 1254244 986579 731726 424045 164852 86526 88548
17601 88548 74519 42508 28716 31763 -49632 -225332 -437069 -719183 -1049384 -1306334 -1403722
17590 -1403722 -1267666 -861295 -336882 26125 105883 22404 -141438 -303384 -256611 43789
17580 43789 406344 591791 561714 422944 285874 155738 -20180 -241304 -490583 -697756
17570 -697756 -714029 -526558 -376683 -426063 -588583 -737206 -829380 -843555 -733963 -481092
17560 -481092 -285719 -291793 -338724 -336907 -367780 -396222 -369917 -359141 -438256 -567011 -513144
17549 -513144 -171905 221179 348794 202592 4757 -39356 56076 203502 329228 318180
17539 318180 118098 -162907 -400851 -507688 -402706 -88740 285774 545894 626674 505607
17529 505607 282928 53889 -191017 -329045 -267745 -90558 76711 200436 257645 184868
17519 184868 95565 73141 52418 46727 174798 516168 931466 1248984 1427225 1495846 1484984
17508 1484984 1405432 1245532 944031 500173 83686 -174519 -321684 -440042 -646337 -990092
17498 -990092 -1365730 -1553168 -1360503 -892412 -386981 -13034 238789 373104 269559 -20722
17488 -20722 -250655 -309048 -360310 -576942 -878818 -1081598 -1143996 -1130120 -1031387 -744066 -286784
17477 -286784 126082 366308 438010 322209 147375 28878 -39366 -42328 21679 125837
17467 125837 192902 73040 -192393 -387925 -463099 -447723 -342880 -124823 114403 241948
17457 241948 281614 281278 307601 361155 340201 200603 -64451 -385325 -632792 -745819 -778797
17446 -778797 -808786 -808621 -623492 -229914 161718 350253 313760 125156 -92020 -223002
17436 -223002 -263444 -238543 -168860 -51544 -12490 -204288 -441741 -489899 -412529 -348930 -356318
17425 -356318 -364530 -300311 -159854 -29437 -109863 -482086 -909629 -1186592 -1349487 -1485637
17415 -1485637 -1592675 -1598600 -1460903 -1234627 -1036057 -874062 -684384 -416291 -111683 26820
17405 26820 -107358 -354548 -553991 -642883 -542811 -306078 -51252 269656 652920 894288
17395 894288 809851 517309 196686 -81584 -214552 -135931 106722 421644 699261 817170
17385 817170 704851 473108 315277 381281 558045 666874 632983 423573 108416 -197800
17375 -197800 -481909 -752781 -952384 -1019236 -1047560 -1150900 -1212814 -1106064 -828365 -442562
17365 -442562 -126824 81903 371583 778256 1142335 1306597 1344256 1457889 1649434 1768715
17355 1768715 1790423 1761298 1609804 1285925 905721 627833 463465 270517 32243 -195263
17345 -195263 -315656 -194182 103426 397581 581653 623635 587282 520278 453467 447534 530227
17334 530227 615903 609480 581249 553145 415659 211202 72820 101916 253341 348081 324044
17323 324044 255958 268853 350276 347872 286794 225377 178752 170763 132005 50095 56315 127655
17311 127655 97047 35670 107522 211785 111080 -279224 -749805 -996173 -900805 -625329
17301 -625329 -383208 -273745 -254195 -337832 -557824 -818292 -961290 -905643 -751555 -596240
17291 -596240 -448494 -308322 -85486 159830 246890 200029 160282 218040 342160 359734
17281 359734 163788 -59902 -59009 204558 627913 1113744 1538165 1710790 1571639 1327597
17271 1327597 1154678 987238 706600 217991 -402915 -940533 -1187875 -1161309 -1046291 -893707
17261 -893707 -614316 -175696 208706 349507 329765 334061 378511 368052 272852 116836 -99591
17250 -99591 -338356 -513826 -539247 -438518 -295452 -129707 18329 56556 -22896 -58306
17240 -58306 28079 152759 212469 217115 260651 298071 231239 32946 -244782 -540065 -823870
17229 -823870 -1087211 -1372479 -1671619 -1820846 -1794805 -1812691 -1867913 -1683615 -1191866 -525430
17219 -525430 103698 487047 586420 470703 240669 43251 -50271 22715 188651 347717
17209 347717 539817 840292 1245322 1668966 1888981 1733144 1326521 904938 566756 241241
17199 241241 -61663 -306045 -490032 -484556 -231504 53640 219583 304952 349958 396768
17189 396768 466688 524134 509245 361495 115362 -122350 -321834 -483686 -492108 -265624
17179 -265624 98663 439418 648110 739401 689526 489677 264671 147886 151928 203111
17169 203111 272320 349135 488967 697953 868010 906699 823583 740448 667210 425823 20905
17158 20905 -304617 -368112 -239595 -167078 -213493 -226689 -228802 -297989 -292702 -110813 143810
17147 143810 368396 538369 510424 158708 -432484 -1061181 -1537974 -1768028 -1731533 -1548123
17137 -1548123 -1387094 -1327002 -1315663 -1215709 -1031129 -831690 -615670 -439365 -343890 -279566
17127 -279566 -214574 -180016 -272089 -565420 -985689 -1340496 -1391365 -1067771 -561625 -130780
17117 -130780 74120 57255 -66115 -202303 -381348 -615877 -716588 -589592 -317311 -43156
17107 -43156 17426 -227640 -614086 -897262 -912533 -665081 -376479 -201242 -139412 -164427
17097 -164427 -243058 -256202 -113359 118531 399698 720949 949125 1047617 1061043 960207
17087 960207 771140 591827 552689 687095 912994 1131129 1205428 1121769 970781 683387
17077 683387 271182 -66191 -205987 -114050 124977 302745 307399 195513 8797 -195369
17067 -195369 -357461 -515849 -593079 -560930 -574091 -689620 -726387 -548740 -266603 16782
17057 16782 180572 85067 -92381 -87470 46068 107431 31783 -113118 -281199 -386572 -368329
17046 -368329 -246462 -35939 159278 221465 106028 -191098 -588823 -932369 -1163809 -1364250
17036 -1364250 -1589449 -1778630 -1818051 -1674798 -1446090 -1343419 -1456855 -1585024 -1629417 -1693345
17026 -1693345 -1742854 -1614287 -1310267 -1049437 -976138 -981785 -854960 -550069 -256630 -103997
17016 -103997 31888 266145 493372 537554 344933 28549 -266786 -411795 -388284 -309192
17006 -309192 -195689 -60645 -18162 -39971 -40245 -129582 -460687 -946134 -1404901 -1736766 -1911907
16995 -1911907 -1924427 -1737691 -1361669 -934284 -678659 -665375 -757646 -756800 -628177 -501168
16985 -501168 -395166 -246882 -72339 101120 310387 507731 595675 556762 463361 278824
16975 278824 -52116 -415729 -762740 -1005065 -1034288 -849767 -558921 -324782 -149423 83693
16965 83693 314034 362159 198323 -47146 -267092 -512749 -831451 -1100027 -1205229 -1145650
16955 -1145650 -801528 -116366 699179 1432899 1953136 2083899 1677714 1001862 538643
16946 538643 373301 240560 24734 -204431 -373645 -438747 -396828 -299625 -177536 -55046
16936 -55046 33144 54696 -15252 -148713 -283827 -436849 -631265 -761484 -783371 -788855 -795834
16925 -795834 -729329 -544416 -315984 -133043 8390 188224 442799 655505 640952 331070
16915 331070 -215017 -805388 -1225420 -1485372 -1671978 -1730681 -1649351 -1554534 -1570247 -1668252
16905 -1668252 -1764345 -1806714 -1675269 -1306426 -927687 -790830 -812113 -767216 -559025 -387533
16895 -387533 -529255 -886512 -1126143 -1182533 -1218038 -1306577 -1410040 -1463711 -1397837 -1204972
16885 -1204972 -954746 -692001 -549422 -612916 -816838 -1006314 -1008385 -785303 -513341 -366457
16875 -366457 -343191 -418794 -569337 -647151 -568952 -402975 -255923 -192966 -134110 -46153 26339
16864 26339 41568 -20006 -92959 -121625 -76067 34236 146903 250684 321149 282687 229691
16853 229691 222210 139277 7674 -8656 138806 389023 588804 601905 505290 461255 447369
16842 447369 398535 411233 504323 557494 559241 611018 711081 844215 954081 936660 796079
16831 796079 586852 334198 81440 -36758 -18756 20373 46303 1274 -133111 -216740
16821 -216740 -95227 197787 566464 875419 1082267 1269442 1483607 1728501 1887339 1886918
16811 1886918 1780384 1707326 1736651 1697167 1502590 1286140 1175393 1070872 827622 505280
16801 505280 102561 -376949 -728171 -730065 -448411 -189298 -199524 -462057 -706946 -851501
16791 -851501 -1036631 -1243450 -1338929 -1260436 -986334 -628054 -427305 -391482 -337418 -289481
16781 -289481 -361035 -539517 -780626 -985631 -1045038 -1074315 -1201663 -1376513 -1471423 -1395351
16771 -1395351 -1151829 -918607 -845266 -801880 -648395 -520917 -524292 -492908 -330502 -82876
16761 -82876 236998 647496 1098779 1431146 1561612 1529836 1361105 1038822 630971 251458
16751 251458 28752 42067 241693 423951 453551 383837 343313 356084 268951 12420 -246885
16740 -246885 -343065 -344903 -359291 -368994 -367627 -346972 -273601 -161416 -10224 164536 312056
16729 312056 419843 405414 172916 -155862 -418806 -511208 -377455 -176699 -148485 -307305
16719 -307305 -586574 -911854 -1230798 -1447199 -1441424 -1253109 -1036501 -942606 -968370 -1047476
16709 -1047476 -1174237 -1252674 -1193283 -1056424 -845997 -494543 -62012 368177 740848 942466
16699 942466 952828 927874 1059500 1371005 1654049 1707491 1540411 1319665 1188580 1090845
16689 1090845 916723 736004 703896 778400 853566 919199 1018594 1198860 1446695 1598139
16679 1598139 1520114 1328961 1205973 1138743 1051286 934793 809237 758816 819304 890536
16669 890536 883156 826152 743558 683400 660431 654389 674499 654694 480863 204544 47505
16658 47505 70154 75748 -97905 -354084 -547402 -635257 -690047 -732119 -726014 -682770 -632154
16647 -632154 -681319 -897245 -1132180 -1165197 -962889 -726153 -657783 -708595 -760166 -834108 -906656
16636 -906656 -913585 -844268 -703261 -517158 -300253 -42600 220555 413227 421605 185456
16626 185456 -220439 -667859 -1019398 -1115407 -988308 -764301 -445984 3512 484394 777055
16616 777055 813667 628085 292154 -82188 -380391 -603051 -842112 -1135979 -1459073 -1680321
16606 -1680321 -1673188 -1455292 -1152814 -896745 -759875 -749838 -783908 -810789 -866026 -849405 -671071
16595 -671071 -495566 -584469 -918303 -1269153 -1520652 -1665195 -1720811 -1644060 -1411794 -1061009
16585 -1061009 -709901 -482039 -376403 -318585 -185199 34671 231954 346559 373911 387282
16575 387282 548095 896551 1299575 1662261 1891363 1976896 1893335 1582858 1208486 931482
16565 931482 700910 474401 277252 175079 168399 224513 304479 341666 392203 531772 664095
16554 664095 718495 698065 603583 498525 471628 536764 731494 1050177 1389330 1660444
16544 1660444 1757535 1565255 1110987 538935 40180 -195944 -263001 -324337 -404286 -551099
16534 -551099 -762537 -926952 -1000272 -962624 -789537 -527172 -284012 -150568 -84159 -126409
16524 -126409 -265652 -347237 -302385 -78114 224181 457578 565056 455830 92289 -414386
16514 -414386 -843291 -1091313 -1163447 -1084758 -994282 -1081864 -1228838 -1181892 -964174 -719814
16504 -719814 -534372 -415958 -359652 -268592 -80417 190406 512622 781813 898418 870427
16494 870427 699267 394083 70866 -162848 -263819 -234664 -106084 -31702 -140563 -296230
16484 -296230 -322976 -279533 -291517 -280826 -78178 248379 438256 401225 244014 100574
16474 100574 27582 -41346 -116597 -207186 -282425 -198536 55745 335696 553851 722324 866009
16463 866009 931429 896168 772752 577342 404189 354799 245899 -85786 -442789 -663029
16453 -663029 -749044 -744274 -644970 -382438 5498 369603 500197 296701 -64226 -351485
16443 -351485 -490338 -484711 -423203 -401826 -422038 -482050 -589993 -607442 -336515 111317 476354
16432 476354 694423 779852 684526 416065 -17174 -619703 -1186621 -1514119 -1620310 -1581949
16422 -1581949 -1425075 -1108772 -748595 -527308 -397803 -288160 -266291 -365841 -456732 -405464
16412 -405464 -284530 -206356 -241755 -397882 -577404 -720604 -799028 -798316 -684746 -376782 107772
16401 107772 607938 1005738 1236364 1225028 906075 428016 -20380 -305953 -331221 -229881
16391 -229881 -130925 -72250 -146343 -351446 -418095 -161373 318682 777043 960231 763057
16381 763057 264951 -342075 -836958 -1081812 -1067255 -915638 -832065 -956721 -1216065 -1360051
16371 -1360051 -1305956 -1114766 -698350 -89681 406665 642529 668490 550711 361617 142211
16361 142211 -65599 -143862 -12302 242745 526560 654634 616744 602779 600015 527973 385172
16350 385172 282464 394112 725285 1179372 1593341 1766936 1722919 1537772 1215213 923161
16340 923161 844563 864583 761187 492803 252877 152206 85925 52768 197155 494840
16330 494840 707895 669938 445293 177290 -88516 -318050 -426451 -374169 -200046 14582
16320 14582 195417 278761 287407 288004 283407 224124 82016 -26513 -26800 -909 -1914 -63946
16308 -63946 -262501 -501852 -639876 -671552 -550499 -207858 261351 576001 553898 349208
16298 349208 215625 255459 339753 253553 95898 174632 421757 542346 390205 4535
16288 4535 -477407 -846762 -938793 -784696 -468651 -63798 191663 108109 -201805 -402995
16278 -402995 -263947 116923 485056 645274 576974 387749 219965 121018 80268 93006
16268 93006 126953 187712 288805 355714 363464 334517 292878 274423 312871 431452 609308
16257 609308 780351 866863 836453 729536 562836 308414 22765 -221619 -411857 -586431
16247 -586431 -709105 -621976 -350800 -69615 206557 498449 655911 582789 452067 449609
16237 449609 500894 415322 99587 -313089 -559310 -541764 -437148 -482922 -653416 -810713
16227 -810713 -817440 -592599 -274744 -161761 -366003 -744015 -1051903 -1094581 -918993 -764204
16217 -764204 -694862 -664662 -678645 -656928 -537758 -392180 -346595 -436722 -515243 -504097 -487258
16206 -487258 -564888 -782171 -1066978 -1241766 -1209157 -1075342 -916563 -712998 -479860 -231408
16196 -231408 47770 352683 612418 842976 1155293 1464766 1557256 1469922 1408238 1402430
16186 1402430 1401692 1428330 1455574 1424683 1327166 1197279 1085435 935589 764888 705329 799067
16175 799067 960268 1149041 1322605 1368203 1228505 930212 652949 495821 380407 339082
16165 339082 483883 761323 960508 940808 703971 353078 63000 -47130 -36141 -41830
16155 -41830 -126565 -256470 -430380 -649223 -862153 -1007499 -1084422 -1118178 -1011735 -723651
16145 -723651 -443597 -297501 -224739 -161168 -15487 322804 707677 877689 788287 530625
16135 530625 170941 -190224 -371094 -321698 -259946 -401887 -748020 -1143985 -1431327 -1603987
16125 -1603987 -1809548 -2051913 -2221272 -2351395 -2510631 -2588134 -2542763 -2459022 -2411487 -2445511
16115 -2445511 -2421585 -2129029 -1649187 -1229163 -977418 -929113 -1075839 -1362285 -1684904 -1927174
16105 -1927174 -1965139 -1643831 -1077725 -612825 -397179 -309835 -224619 -124138 -63407 -30157
16095 -30157 -36155 -98570 -135359 -143011 -117660 -34306 130185 415703 712783 817349 715624
16084 715624 526619 292565 71999 -90549 -223740 -315063 -400958 -523491 -675131 -798369
16074 -798369 -862642 -895394 -872238 -735148 -540514 -457923 -481732 -451093 -280853 32305 420147
16063 420147 748075 954125 977221 788359 624232 661930 743735 730185 646882 433948
16053 433948 143606 -34642 -20995 131178 249836 289184 382718 535540 550559 339339
16043 339339 27823 -223124 -405502 -558262 -603863 -484481 -305399 -262523 -383019 -493092
16033 -493092 -426436 -195872 46309 118471 -93333 -441773 -563078 -257947 299481 673777
16023 673777 657992 361483 -136941 -764144 -1274019 -1490380 -1340531 -832924 -250504 90468
16013 90468 183887 173288 115908 28985 -61212 -114189 -149392 -139651 -15355 159821 298582
16002 298582 412793 550860 690936 727218 625537 494425 403889 342325 280028 311660
15992 311660 511542 729929 802454 777345 717154 534525 196481 -147399 -329651 -361585
15982 -361585 -387271 -537823 -766892 -889559 -875806 -849467 -788694 -697174 -728773 -865832 -908313
15971 -908313 -799231 -689679 -664100 -733237 -862025 -980839 -1087079 -1171907 -1119784 -846172
15961 -846172 -472600 -215311 -42955 203972 405660 494561 605963 764817 875495 862336
15951 862336 718293 529188 371587 278298 348021 584411 806658 876474 810882 646031
15941 646031 477695 424570 437874 402488 292312 170572 77847 23556 3407 108129 370504
15930 370504 684213 1018124 1335078 1540243 1625617 1665708 1676237 1580972 1380493 1198897
15920 1198897 1117444 1102924 1088193 1018175 762530 249477 -333455 -758971 -947190 -929578
15910 -929578 -792004 -714716 -797848 -988191 -1267680 -1602018 -1924852 -2159141 -2281708 -2340336
15900 -2340336 -2315506 -2274887 -2367622 -2461755 -2324891 -1895557 -1222707 -469486 186279 676720
15890 676720 1056142 1340958 1518105 1583112 1490468 1265793 986722 802529 798932 882758
15880 882758 934789 894982 764794 640612 586872 604565 721248 857842 876935 774047
15870 774047 570801 258605 -116800 -473459 -711040 -722173 -461037 -80477 229752 392142
15860 392142 434885 429766 387741 368594 519389 810977 1033534 1046778 830119 504776 239678
15849 239678 62366 -47288 -58402 96103 418577 750150 871189 645821 122501 -470244
15839 -470244 -990628 -1362456 -1466759 -1208882 -762454 -444864 -261602 -150316 -170436 -239475
15829 -239475 -232804 -168106 -68554 99834 343844 584770 642546 412078 86512 -187093
15819 -187093 -421480 -610221 -729297 -788234 -841701 -949408 -1110959 -1188735 -1086169 -858229
15809 -858229 -572012 -246472 -11721 99012 181817 279124 471656 660844 723886 809426
15799 809426 1038318 1275630 1393683 1444787 1457825 1275099 833737 368757 83211 14057
15789 14057 242997 717690 1273747 1758791 1948249 1754521 1328342 876154 486905 169309
15779 169309 -42440 -64618 60495 172155 229324 333839 490072 562073 432832 144666
15769 144666 5886 237149 729423 1226002 1562947 1709217 1692938 1517495 1119291 535994
15759 535994 -111723 -696210 -1159155 -1369364 -1189666 -779011 -340765 96197 458476 681199
15749 681199 818207 873503 816492 697345 546144 277818 -35988 -181349 -56987 248176
15739 248176 485101 560674 540026 466043 396161 285409 96731 -76419 -181676 -257051
15729 -257051 -320970 -324822 -227581 -91643 -67384 -176758 -389871 -658702 -861003 -908309 -890835
15718 -890835 -922480 -955459 -916331 -780268 -552467 -262147 -100248 -162343 -316690 -492970
15708 -492970 -656002 -815431 -1100471 -1527093 -1970052 -2322329 -2551569 -2617586 -2471867 -2232992
15698 -2232992 -2099680 -2030712 -1851516 -1536131 -1171850 -800712 -404296 -40734 228161 340932
15688 340932 281135 131877 -82712 -369091 -643791 -794014 -860193 -891217 -762655 -418680
15678 -418680 76445 630732 1097187 1411134 1601568 1766774 1912942 1861414 1621444 1360190
15668 1360190 1136995 1046762 1136021 1273897 1316266 1343383 1429847 1440416 1292292 1065605
15658 1065605 822664 513671 202660 -37791 -189199 -164757 26000 159377 15893 -273015
15648 -273015 -428903 -374964 -203343 -1503 122432 165726 180101 162095 226929 441912
15638 441912 652190 672280 490146 187099 -189930 -642066 -1138394 -1529588 -1675933 -1644781
15628 -1644781 -1568129 -1346677 -935165 -484409 -16487 454967 753282 726382 427671 48336
15618 48336 -173977 -203893 -198886 -153629 -13103 173229 348001 477906 550575 563095 470623
15607 470623 218541 -158002 -543988 -802545 -838368 -646195 -402629 -365655 -468491 -425750
15597 -425750 -144871 264329 627872 836893 898329 896282 899859 920116 938494 963411 940725
15586 940725 844043 768607 725064 628328 511532 464164 437382 267636 2070 -146290 -198415
15575 -198415 -234116 -123442 121147 190773 26098 -122687 -151406 -146653 -177752 -284662 -519837
15564 -519837 -764606 -815998 -770039 -823071 -915307 -954023 -997758 -1107095 -1186978 -1193855 -1208814
15553 -1208814 -1270805 -1334749 -1286819 -1159326 -1099813 -1107270 -1080254 -1013239 -913782 -786735 -687278
15542 -687278 -630179 -575356 -509398 -406911 -225061 -55434 -13794 -36348 48928 293660 505135
15531 505135 507571 372654 249622 136235 -14366 -134933 -156281 -72391 35792 93175
15521 93175 106618 118797 129418 18035 -295175 -641889 -780939 -736932 -710252 -726518 -671542
15510 -671542 -526737 -324351 -213050 -298724 -440400 -497102 -451537 -369985 -394072 -483448 -495114
15499 -495114 -466441 -467574 -523312 -632962 -762370 -825149 -766866 -644021 -571115 -577831 -550627
15488 -550627 -440805 -269604 -81513 44660 120745 160408 159909 214688 367362 486847 443484
15477 443484 378399 511215 839726 1297579 1819973 2165972 2187796 2139730 2320749 2648373
15467 2648373 2806665 2706592 2367138 1864265 1384391 1022134 815202 771406 757974 669445
15457 669445 534437 466782 611930 929912 1211185 1339191 1351820 1309213 1221884 1053721
15447 1053721 743285 357676 87595 62584 256686 568794 854909 1026330 1083927 1006685
15437 1006685 820195 672068 555820 395345 167568 -30707 -71209 -45419 -16809 50894
15427 50894 150476 201855 170269 65039 -124228 -335707 -489149 -567285 -682719 -899702
15417 -899702 -1143383 -1335678 -1452432 -1550595 -1709104 -1962967 -2279326 -2596727 -2784408 -2716819
15407 -2716819 -2463869 -2232210 -2057047 -1858986 -1629303 -1428624 -1236969 -1024670 -822331
15398 -822331 -634790 -502259 -526480 -674577 -885384 -1063249 -1137211 -1134105 -1011663 -733426
15388 -733426 -408488 -102105 193844 418017 478946 401420 366489 431158 504674 543862 432080
15377 432080 85805 -306615 -496511 -400951 -182955 -54310 -29459 -37874 -155125 -472929
15367 -472929 -886707 -1247053 -1558098 -1826255 -1945720 -1777225 -1347203 -893810 -601175 -574526
15357 -574526 -779004 -1009252 -1134060 -1233666 -1406261 -1632470 -1763882 -1628600 -1204621 -691098
15347 -691098 -299782 20599 356702 628939 762842 749919 566550 289414 36496 -135048
15337 -135048 -327459 -623093 -902548 -1017824 -964806 -811434 -552779 -267738 6926 307823
15327 307823 535445 574491 470423 387146 435330 577114 733487 798841 583685 101718
15317 101718 -368116 -556915 -433063 -189922 2490 76595 62373 -15651 -170938 -270240
15307 -270240 -130776 81787 85866 -15687 -49785 -71055 -116544 -71562 117054 356422 530866
15296 530866 611050 573578 381951 63636 -221941 -398537 -482188 -448008 -245393 -5663
15286 -5663 50808 -9672 -23990 2680 -82472 -326293 -526099 -499509 -236214 33312 66931
15275 66931 -49832 -108689 -52409 -18641 -135568 -349009 -499173 -600878 -825429 -1079654
15265 -1079654 -1138012 -1091566 -1115546 -1170936 -1150202 -1069419 -1030113 -1046967 -987689 -821646 -589130
15254 -589130 -263317 107441 399275 569739 630279 595843 567809 580162 560223 525467 504027
15243 504027 422554 260894 157633 185674 218113 160488 -9573 -179770 -199688 -39661
15233 -39661 277161 665515 969644 1100766 1039216 741918 361015 175351 190310 227997
15223 227997 228392 138930 -102375 -335965 -320744 -72202 236765 477020 652236 900499
15213 900499 1293432 1788359 2281636 2577030 2622524 2488741 2175342 1679226 1127349 669142
15203 669142 326579 33932 -302494 -697354 -1055667 -1312543 -1409596 -1363002 -1224938 -1038942
15193 -1038942 -803214 -483199 -146913 120284 235317 215678 55042 -241157 -588543 -941841
15183 -941841 -1206881 -1378611 -1552268 -1699744 -1751747 -1733524 -1647490 -1412147 -1080727 -821094
15173 -821094 -709532 -722074 -798161 -827751 -768487 -692948 -563915 -359486 -208723 -139104 -124466
15162 -124466 -200293 -344983 -529450 -766481 -1043195 -1328553 -1532026 -1612299 -1589986 -1466192
15152 -1466192 -1230978 -912194 -578776 -227096 135691 431488 511096 282049 -102928 -366901
15142 -366901 -350076 -55712 346682 648353 799306 850235 847652 765084 644272 535228
15132 535228 393584 267048 204291 80238 -184257 -431841 -527522 -460247 -385752 -488448
15122 -488448 -834953 -1292091 -1682279 -2017605 -2245380 -2342074 -2420001 -2474455 -2340627 -1886126
15112 -1886126 -1182473 -462064 73420 327446 417990 505441 537099 432093 285182 256734
15102 256734 254671 132027 48053 92300 94908 64197 103886 123402 36660 -77036 -117950
15091 -117950 -84379 -21361 77481 249194 420508 492896 470281 501764 694901 1102442 1641475
15080 1641475 2004739 2022881 1820354 1621371 1499083 1367015 1180399 1010885 944653 992136
15070 992136 1068722 1150589 1281140 1359740 1391084 1452856 1436268 1302978 1205171 1187995 1207116
15059 1207116 1276674 1296576 1191270 985687 787780 701501 603792 364414 132349 19692
15049 19692 -55678 -237159 -595364 -1004858 -1300628 -1392005 -1281665 -1044306 -869347 -892279
15039 -892279 -971583 -908943 -762201 -774001 -904858 -853520 -510839 -23424 366281 465680
15029 465680 274249 -40709 -288391 -453011 -596950 -638575 -464763 -199577 -38466 -49692
15019 -49692 -218729 -411986 -459185 -383158 -281488 -157697 -10437 150513 390572 695705
15009 695705 899653 991223 1004155 971563 1062144 1228347 1276693 1160940 992957 907658 907466
14998 907466 921901 961228 1062954 1159483 1221650 1272843 1292308 1246755 1193621 1200105 1232536
14987 1232536 1254915 1249604 1225103 1218126 1178215 1006699 811533 755233 725373 602246 564129
14976 564129 625940 592386 412644 183727 34965 7214 -24031 -146689 -320765 -521331
14966 -521331 -776268 -1098750 -1436888 -1694776 -1793145 -1705579 -1410948 -979766 -574431 -391922
14956 -391922 -435963 -540044 -615824 -691483 -817779 -909270 -828943 -639613 -508256 -489871 -542849
14945 -542849 -525265 -348352 -113903 45751 80277 21844 -41921 110759 569671 1156098
14935 1156098 1703012 2003217 1894948 1442653 883170 401298 43491 -134277 -181084 -177815
14925 -177815 -165740 -163133 -138788 -170302 -317394 -491140 -671852 -787041 -699451 -419608 -100510
14914 -100510 135890 276314 225048 -173055 -787298 -1308754 -1540140 -1506187 -1400885 -1316709
14904 -1316709 -1224999 -1047013 -767009 -531063 -408423 -315811 -220010 -156448 -119201 -121285 -155046
14893 -155046 -226811 -344135 -416522 -418072 -445018 -474220 -363469 -112365 102547 234917 394804
14882 394804 585639 736154 810548 860848 913809 951533 926463 740679 484332 240738
14872 240738 -8380 -226486 -354617 -402445 -411890 -318173 -134630 22440 80890 167837 467715
14861 467715 821242 929526 757497 462684 216173 81678 -12556 -206753 -539552 -896750
14851 -896750 -1139450 -1235171 -1241222 -1215927 -1181727 -1169065 -1178068 -1166041 -1143247 -1185063 -1298858
14840 -1298858 -1265304 -1007636 -654994 -252667 142756 391142 402498 166002 -153439 -378513
14830 -378513 -581484 -820642 -1005640 -1015019 -860067 -689796 -634407 -656389 -605876 -377954
14820 -377954 13633 448559 823301 1027410 980915 781130 653457 696167 747126 632822
14810 632822 336280 -79370 -440020 -529214 -400373 -296530 -321236 -400150 -516964 -631158
14800 -631158 -588330 -344484 -5081 291711 407560 313238 86184 -122343 -254810 -399833
14790 -399833 -572701 -777307 -992998 -1180377 -1248048 -1153772 -973925 -738419 -466529 -184132
14780 -184132 21511 -7848 -278824 -655662 -963266 -1092250 -1063042 -926463 -756278 -624730
14770 -624730 -554097 -495815 -430442 -365005 -278023 -234255 -290107 -467566 -792625 -1211389 -1601861
14759 -1601861 -1900200 -1990918 -1696263 -1127118 -560046 -123351 196832 387857 419852 324438
14749 324438 140816 -138223 -421749 -588250 -644099 -604350 -448907 -256795 -62064 153669
14739 153669 367350 519816 518042 307976 -67025 -437242 -701614 -823722 -753885 -473431
14729 -473431 -149675 61050 271748 508621 648898 614313 401608 192981 121941 34900
14719 34900 -228325 -639231 -1029211 -1236539 -1268730 -1308085 -1530756 -1921078 -2343870 -2640062
14709 -2640062 -2649103 -2333540 -1892010 -1565475 -1402651 -1298051 -1220192 -1219068 -1353895 -1564641
14699 -1564641 -1653415 -1563096 -1373047 -1188679 -1040223 -856980 -610669 -428571 -380716 -304883
14689 -304883 -38266 335807 643894 782968 809007 840223 830475 615047 202835 -186882
14679 -186882 -403151 -495774 -527520 -490833 -446176 -437258 -490774 -624020 -706051 -586495 -380671
14668 -380671 -305698 -337017 -446766 -617541 -707304 -725832 -805454 -1018651 -1318539 -1513436
14658 -1513436 -1408897 -1096026 -853198 -838558 -923446 -863501 -640917 -421291 -262999 -152318
14648 -152318 -124472 -177112 -232553 -219999 -120506 -46141 -93260 -196378 -282412 -390106 -466311
14637 -466311 -392859 -250110 -144574 -49050 67000 223023 334230 305276 208963 119446
14627 119446 17456 -85539 -162611 -181566 -87448 101359 243073 223879 102003 -36694
14617 -36694 -202584 -404615 -595197 -759272 -869613 -958606 -1030574 -981802 -908251 -933402 -951313
14606 -951313 -846607 -721079 -695778 -775155 -843214 -742945 -489837 -297756 -333594 -553172
14596 -553172 -790885 -919013 -906444 -779032 -559520 -238294 159206 641100 1090074 1274952
14586 1274952 1138693 820572 446037 141456 21566 119126 472414 1045628 1598620 1928166
14576 1928166 2041806 1976644 1696032 1255166 885505 795621 979188 1224816 1327136 1207383
14566 1207383 922967 599913 258943 -120486 -374275 -303793 12275 290014 352085 210294
14556 210294 -2753 -188964 -336113 -470412 -616666 -686928 -592876 -321943 33498 323991
14546 323991 499665 629637 771874 886997 857507 643474 336690 35094 -221631 -423337
14536 -423337 -526288 -466636 -335583 -247044 -191985 -175457 -287313 -522817 -780293 -996518
14526 -996518 -1130420 -1152923 -1083791 -994588 -853473 -660937 -557849 -605335 -741136 -919765
14516 -919765 -1045956 -972423 -702916 -395919 -148257 33216 164249 265978 347305 367690
14506 367690 346957 414689 591474 755738 796369 753585 809810 1096317 1479714 1677549
14496 1677549 1582043 1318248 1112402 1049832 1019702 896057 687333 502533 390116 318191
14486 318191 262899 196441 82762 -47405 -104140 -103269 -171707 -350100 -599296 -776967 -823062
14475 -823062 -760993 -556810 -327073 -197671 -116700 -37788 40996 100383 48835 -190623 -573956
14464 -573956 -944678 -1112249 -1043933 -920886 -912365 -991712 -1104797 -1245538 -1291841 -1171374
14454 -1171374 -986716 -851424 -791438 -736917 -616335 -383107 3011 374307 551100 563236
14444 563236 480202 383913 340485 374303 449837 438247 324390 232372 183692 125727 46196
14433 46196 -74976 -218462 -277356 -196686 -135841 -185950 -224221 -197722 -189313 -160564 57045
14422 57045 433979 762633 929033 939835 792351 528029 210659 -138974 -443674 -498166
14412 -498166 -280016 19898 290418 578139 935450 1275844 1437146 1397208 1284740 1140203
14402 1140203 885175 559647 286930 56885 -215569 -537422 -776989 -845452 -827861 -901785
14392 -901785 -1119845 -1388465 -1666596 -1846092 -1837684 -1693867 -1598809 -1642993 -1721365 -1824644
14382 -1824644 -1977938 -2096326 -2069342 -1849007 -1516193 -1177262 -922699 -763302 -725513 -921014
14372 -921014 -1285635 -1613353 -1797902 -1807963 -1653701 -1404990 -1174580 -1068538 -1108165 -1139057
14362 -1139057 -1002602 -817559 -737750 -781563 -931960 -1134000 -1297967 -1330455 -1103776 -596349
14352 -596349 69380 700730 1135252 1310325 1280655 1238784 1441949 1837961 2142643 2179069
14342 2179069 1981924 1721535 1585430 1528328 1340958 929691 362523 -342105 -1094719 -1603600
14332 -1603600 -1734567 -1629520 -1416206 -1174048 -971885 -791288 -624318 -483228 -373822
14323 -373822 -341148 -333636 -267865 -235915 -227864 -145577 -4666 175194 340418 355843 156757
14312 156757 -184166 -550657 -866664 -1115995 -1370833 -1680032 -1854635 -1699151 -1255391 -652552
14302 -652552 -86246 267699 394276 391068 370047 358048 418608 527323 619639 717282 843723
14291 843723 936626 843179 535503 161570 -115085 -192886 -13305 331273 659796 972967
14281 972967 1338459 1589495 1548873 1192712 659818 251561 138099 146260 135517 129508 151706
14270 151706 156943 166505 195052 150572 61167 -70311 -227518 -348997 -453363 -580128 -662663
14259 -662663 -681118 -771073 -1005385 -1300160 -1504169 -1551478 -1475977 -1208921 -639280 133518
14249 133518 805570 1153227 1263420 1338466 1406393 1314909 1004686 642638 368495 167704
14239 167704 48590 -5976 4125 103511 249507 348487 301894 75400 -235207 -604089
14229 -604089 -975035 -1156185 -1177947 -1190514 -1234809 -1313102 -1423272 -1536770 -1598448 -1617524 -1603064
14218 -1603064 -1537175 -1525016 -1634448 -1760151 -1807102 -1787093 -1691899 -1493240 -1186990 -854156
14208 -854156 -576622 -347119 -179102 -146984 -200414 -158342 86670 440961 719302 763682
14198 763682 598272 323965 9627 -293922 -505763 -494302 -311986 -135851 -8674 50138
14188 50138 -12355 -107924 -147611 -190491 -313849 -501168 -725426 -899841 -941831 -908606 -849381
14177 -849381 -745171 -582748 -399465 -245674 -159079 -138163 -160507 -248796 -372242 -437548
14167 -437548 -380853 -215769 54613 442336 769387 793259 485006 -24668 -559768 -1030386
14157 -1030386 -1359450 -1467790 -1394954 -1208605 -958465 -722477 -574685 -549404 -645256 -757153
14147 -757153 -755650 -717108 -797347 -978329 -1106548 -1103650 -986009 -859344 -821341 -860902 -881888
14136 -881888 -810387 -633926 -413094 -360518 -570294 -934269 -1378123 -1745815 -1904721 -1925602
14126 -1925602 -1859503 -1634340 -1304594 -989318 -791363 -783461 -818390 -748206 -684040 -789101
14116 -789101 -984678 -1043723 -926946 -827419 -860242 -950942 -1017032 -989414 -879542 -767681 -667848
14105 -667848 -562612 -426294 -276122 -256096 -440387 -650078 -728031 -752670 -809127 -782171
14095 -782171 -582866 -395112 -380415 -432454 -394178 -363243 -448764 -545325 -594498 -598162 -569821
14084 -569821 -563053 -557991 -530768 -574365 -720064 -812165 -739664 -498801 -168032 132467 296877
14073 296877 373783 484286 641109 786239 806493 644477 384572 126644 -84501 -207253
14063 -207253 -222886 -238061 -342500 -528265 -877559 -1362649 -1708350 -1747521 -1581649 -1367609
14053 -1367609 -1174291 -1064135 -1051042 -1113116 -1269723 -1429326 -1455338 -1438589 -1566862 -1820265
14043 -1820265 -1983839 -1955791 -1840524 -1719202 -1591125 -1451139 -1331968 -1289567 -1341784 -1434498
14033 -1434498 -1547469 -1686936 -1762985 -1644160 -1344337 -988323 -633049 -210464 278663 632566
14023 632566 611127 313839 3484 -259917 -522190 -687581 -671017 -516831 -296780 -55121
14013 -55121 116952 206319 320286 476217 676109 881281 1009715 998153 842758 616209
14003 616209 362236 31360 -414973 -794988 -937608 -939297 -947762 -889875 -684754 -392827
13993 -392827 -93136 90796 99675 48898 111888 278545 397161 386483 254570 80660
13983 80660 -91327 -317641 -541774 -613401 -460901 -179230 6946 103288 301310 615912
13973 615912 882210 991313 977930 845023 616597 488836 596022 844326 1048245 1064771
13963 1064771 900184 714775 619676 611402 646997 684993 687012 711976 806782 916466 1061378
13952 1061378 1219588 1289680 1264391 1150670 898482 523749 108345 -275384 -549834 -707384
13942 -707384 -785767 -802506 -823392 -854850 -726847 -376481 32581 396008 567554 399705
13932 399705 24191 -220695 -155866 40020 156544 268518 464070 648489 704796 601225
13922 601225 450411 376626 335697 270290 229803 264310 379805 514955 526008 349688 34220
13911 34220 -318839 -448882 -242703 77967 279060 434680 658294 879883 982177 837551
13901 837551 419780 -61836 -356590 -341557 -46570 342886 618260 749988 835343 940409
13891 940409 1091189 1363183 1706872 1979909 2104472 2055264 1852799 1622791 1509841 1407826
13881 1407826 1156328 817093 485824 144190 -221566 -591499 -875283 -1035669 -1078764 -847425
13871 -847425 -360570 122645 413475 437844 257371 93240 116536 144900 -20673 -269266
13861 -269266 -435632 -467509 -347961 -129950 131979 430335 722657 942060 983655 845565
13851 845565 631677 400665 178307 -13294 -244677 -539760 -753067 -821424 -806794 -714853
13841 -714853 -491214 -224754 -108501 -159131 -215774 -146961 72287 329947 501897 566235
13831 566235 505456 303724 50654 -126907 -146984 -62964 24469 124090 217292 274762 418830
13820 418830 672471 874938 999901 1114430 1205781 1265569 1311642 1292123 1206513 1142381 1136573
13809 1136573 1112327 964600 752601 606903 582956 627593 603847 487204 409148 425849
13799 425849 493124 534299 479501 253880 -23550 -103003 86496 360343 490991 402286
13789 402286 247579 127759 -32484 -165471 -243179 -332676 -333781 -256901 -235454 -355181 -650495
13778 -650495 -972803 -1124337 -1160397 -1225361 -1272620 -1126886 -782604 -392062 -39511 246567
13768 246567 488290 709233 879020 939399 869881 736619 585670 303287 -185851 -783371
13758 -783371 -1250563 -1441729 -1432987 -1411247 -1475616 -1537965 -1500677 -1473353 -1532037 -1567138 -1544893
13747 -1544893 -1486530 -1377406 -1166476 -846227 -547631 -398413 -340403 -361120 -539927 -811222
13737 -811222 -1124497 -1472568 -1795169 -2005277 -1988207 -1818604 -1652957 -1511221 -1408715 -1356067
13727 -1356067 -1209058 -862223 -466833 -292622 -416587 -601737 -658682 -577071 -375947 -179855
13717 -179855 -104456 -104382 -103619 -97623 -130013 -123498 -5944 185389 359077 433812 444506 474157
13705 474157 578090 662109 593301 343327 27336 -129808 -131159 -156680 -260154 -340222 -345314
13694 -345314 -267552 -103654 35525 55995 50546 110101 178491 244757 244384 89148 -114059
13683 -114059 -319752 -542846 -761522 -918427 -944123 -888320 -889807 -1075452 -1470424 -1905592
13673 -1905592 -2110038 -2136662 -2196664 -2237835 -2134204 -1894246 -1502781 -968493 -480960 -228047
13663 -228047 -244466 -356109 -322290 -97705 161962 301855 292038 163462 -120740 -568482
13653 -568482 -1040226 -1353995 -1401646 -1187014 -787427 -345754 13626 201875 184417 -23783
13643 -23783 -352435 -652993 -782978 -654877 -284880 104940 277611 270632 247902 276966
13633 276966 316049 363484 448553 526090 551106 486888 271757 -23126 -153493 -31450 219959
13622 219959 503871 708147 691341 393033 -29917 -250651 -130819 109185 187986 34949
13612 34949 -233790 -539392 -793189 -886054 -783194 -576680 -442801 -420686 -461901 -596088
13602 -596088 -828728 -1023508 -1001426 -721341 -404949 -182260 -50893 -2476 -41550 -219305
13592 -219305 -426514 -446650 -264195 -84199 15794 46013 30139 67104 176615 361789
13582 361789 656641 989664 1174135 1131270 1042505 1010959 969157 968201 1069808 1136513 998985
13571 998985 716224 478469 248734 -72658 -471962 -900481 -1291937 -1595719 -1801188 -1916993
13561 -1916993 -1927504 -1771291 -1440322 -1061617 -776408 -575131 -320514 -75142 60727 161213
13551 161213 314080 484126 626253 776520 982031 1163987 1181746 1010262 687837 376290
13541 376290 291931 396429 409517 240176 27462 -132241 -124387 81980 333694 424240
13531 424240 324982 196116 124299 72708 56778 109260 257597 564503 1022272 1522818
13521 1522818 1890091 1960588 1715945 1267337 865196 701670 715870 878062 1156461 1352655
13511 1352655 1418576 1538368 1803689 2110834 2300799 2270468 1984577 1624303 1537956 1743272
13501 1743272 1857776 1759696 1568514 1323153 1016392 755236 685091 640994 411740 130321
13491 130321 -8595 -21831 -30712 -14677 126663 385053 721853 1093005 1347450 1366801
13481 1366801 1221048 1021281 842535 760342 789506 888758 960052 923645 770836 477826
13471 477826 94794 -214192 -416284 -590506 -811352 -1113667 -1464307 -1758484 -1790662 -1581392
13461 -1581392 -1379846 -1161128 -808114 -360884 42274 275238 348612 290668 66266 -230022
13451 -230022 -465185 -603987 -571332 -376766 -110148 113759 214591 233305 226320 244675
13441 244675 259587 100072 -254792 -544170 -600428 -553239 -624361 -813245 -923851 -938263
13431 -938263 -924006 -770049 -392165 101697 642882 1151547 1518086 1696688 1662839 1441554
13421 1441554 1146481 929290 897790 1054680 1308069 1508995 1521881 1363133 1176720 985305
13411 985305 727592 434027 146091 -133057 -322562 -347540 -247364 -50091 195130 339799
13401 339799 308757 199190 117072 169164 429619 808573 1181652 1391155 1407326 1345701
13391 1345701 1279712 1222717 1236139 1291148 1249957 1064405 830436 745897 779915 811853 906338
13380 906338 1024755 1044682 971526 784696 414983 -37116 -309635 -206757 149716 513787
13370 513787 778408 832219 576912 153221 -103289 -63887 129163 235821 102242 -176563
13360 -176563 -416920 -576520 -697816 -811521 -838561 -713553 -587496 -540092 -523210 -515396
13350 -515396 -508843 -531515 -652973 -878972 -1019410 -858593 -483008 -66521 245667 346978
13340 346978 296884 212587 182029 174245 86988 -56320 -164735 -260259 -324105 -226402 52450
13329 52450 374851 646254 839737 977706 1093781 1240277 1448728 1585282 1465193 1092969
13319 1092969 668246 374993 245828 304251 547557 795210 876480 796094 599076 287728
13309 287728 -139908 -556273 -790051 -782708 -621131 -458662 -343463 -219125 13748 367905
13299 367905 671814 864968 995787 1090581 1129526 998155 699352 421343 366987 506807
13289 506807 591470 535308 538736 774733 1110575 1264375 1155162 905532 723287 703937
13279 703937 703189 578091 458185 527516 775892 1097616 1342583 1389875 1268480 1177090 1268757
13268 1268757 1494504 1761800 2047536 2379920 2711091 2921362 2924072 2717971 2415803 2167984
13258 2167984 1952823 1689818 1471046 1506690 1850761 2299057 2679937 2937695 3022304 3043564
13248 3043564 3122435 3229138 3323279 3299077 3096106 2773712 2427540 2185884 2121326 2114056
13238 2114056 1971558 1648816 1305727 1209147 1461003 1921418 2335509 2475149 2372059 2147249
13228 2147249 1863526 1621445 1519382 1542154 1504728 1283659 977128 733471 645043 683207
13218 683207 674640 565575 404710 255709 166407 92577 73159 191260 474128 858216
13208 858216 1226404 1425051 1354873 1167068 1084022 1097628 1050690 830304 566677 414993
13198 414993 295070 167886 109077 164544 262016 295822 267826 303787 521382 794439 970549
13187 970549 1056483 1127294 1307483 1659738 2207148 2874371 3457514 3867201 4106342 4193864
13177 4193864 4161099 3992558 3663054 3193628 2634342 2048033 1534497 1226496 1181350 1342269
13167 1342269 1616101 1965089 2251420 2367979 2411861 2440660 2415216 2268948 2103032 2102007
13157 2102007 2227174 2372851 2467258 2489251 2485064 2441511 2374360 2338485 2303247 2215944 2084051
13146 2084051 2029613 2095253 2178373 2313077 2572018 2882633 3131173 3258861 3180607 2903229
13136 2903229 2628751 2550973 2700154 2930050 3020517 2918222 2761215 2654345 2587384 2589584
13126 2589584 2752737 3042024 3354812 3520972 3393553 3093407 2865388 2815478 2841914 2895802
13116 2895802 2963355 3053427 3149042 3220478 3279203 3285479 3112108 2752805 2407508 2279977 2421489
13105 2421489 2758497 3114807 3408247 3683717 3964714 4181908 4247880 4282000 4336152 4378592
13095 4378592 4407858 4401369 4318098 4218345 4129062 3951114 3669920 3374046 3105184 2814035
13085 2814035 2414403 1999354 1747035 1658062 1666189 1790498 2011515 2373327 2920107 3546491
13075 3546491 4075894 4296227 4272639 4239679 4286557 4322935 4271250 4231169 4255929 4367069 4612901
13064 4612901 4897216 5036655 5050372 5055811 5040083 5017405 5053125 5118652 5280354 5560730 5798598
13053 5798598 5870645 5781484 5672765 5626453 5701273 5964487 6313725 6634874 6957799 7251767
13043 7251767 7461504 7587708 7637463 7593001 7479686 7257023 6919280 6728921 6904125 7342238
13033 7342238 7797834 8178273 8420569 8452688 8391542 8446382 8745072 9266323 9894862 10478766
13023 10478766 10965912 11434420 11913748 12349405 12794136 13293547 13773350 14277904 14826769
13014 14826769 15364129 15958127 16682402 17500963 18358605 19318095 20308949 21171355 21901542
13005 21901542 22647490 23647244 25102035 26995101 29188347 31650829 34345518 37264005
12997 37264005 40479390 44072125 48190199 53063602 58814768 65509607 73458248 83194105
12989 83194105 95255723 110191244 128688277 151599554 179907432 214634369 256460683
12982 256460683 304644751 355486609 401562208 434363228 449564437 449210952 438848454
12975 438848454 423495859 405984199 387303284 367449006 345999382 322426773 296631255
12968 296631255 269247939 241545353 215141822 191281230 170251452 151824286 135949389
12961 135949389 122513313 111070119 101030507 91985599 83874744 76767295 70550747
12954 70550747 64928056 59803365 55227478 51174600 47605514 44463800 41585259 38861766
12946 38861766 36470613 34574462 33030495 31637516 30382391 29303031 28387106 27628826
12938 27628826 26928817 26260944 25734976 25436581 25352947 25463819 25764013 26204527 26777577
12929 26777577 27515677 28377626 29391959 30621598 32001321 33483322 35076787 36688432
12921 36688432 38081495 39103053 39787751 40363652 41177640 42444813 44117325 45961581
12913 45961581 47784460 49649398 51665928 53928879 56631891 59989105 64235924 69490771
12905 69490771 75783628 83420742 93044900 105244996 120430213 139377889 163449694
12898 163449694 193914617 231571243 276530434 327059348 378024729 421056339 448295999
12891 448295999 457320350 452002444 438457043 421216892 402393663 382645587 361985822
12884 361985822 339857887 315502251 288824461 260804730 233136962 207318870 184103518
12877 184103518 163743699 146179802 131062103 118015193 106741571 96873483 88199641
12870 88199641 80655795 74122070 68374200 63163307 58331063 53857804 49743249 45998132
12862 45998132 42674985 39762064 37287778 35216045 33461707 31966705 30644194 29438617
12854 29438617 28346590 27382563 26494426 25704446 25163853 24889822 24726362 24500091 24135360
12845 24135360 23690027 23267420 22956772 22932103 23251668 23645868 23929774 24205356 24594251
12836 24594251 25055571 25496263 25974407 26614746 27515388 28682971 29992343 31401372 33009331
12827 33009331 34875078 37013121 39518144 42397763 45574971 49150334 53328297 58267626
12819 58267626 64200213 71510546 80588018 91801095 105617706 122623898 143630261
12812 143630261 169760507 202212920 241817277 288298065 338961088 387570997 425621053
12805 425621053 446843366 450988626 442776296 427852630 409979767 390850637 370887666
12798 370887666 349762996 326823845 301605488 274410799 246557540 219657463 194905790
12791 194905790 172913364 153715501 136995955 122516064 110061076 99220186 89546160
12784 89546160 80825856 73057033 66141514 59883712 54315200 49534981 45379544 41648383
12776 41648383 38253657 35148494 32381153 29947495 27769115 25866427 24218107 22742125
12768 22742125 21379627 20100940 18899442 17739649 16665426 15755536 14949585 14185491
12760 14185491 13487319 12868655 12272280 11697062 11231537 10795226 10134116 9254436 8449396
12751 8449396 7967227 7840625 7911540 7897892 7588254 7041370 6516941 6185138 5989321 5768490
12741 5768490 5401466 4874569 4316705 3832670 3418873 3212468 3375549 3745294 4034780
12732 4034780 4116486 3982450 3811860 3784216 3793519 3728187 3601281 3416291 3150972 2884168
12722 2884168 2765451 2834568 3068326 3339737 3461046 3448958 3382970 3231531 3001764 2779032
12712 2779032 2661686 2709859 2825730 2867528 2827976 2702048 2473082 2242378 2092832 2037437
12702 2037437 2023785 2004078 2023808 2060702 2074789 2033322 1950187 1924889 2011306 2073538 1945067
12691 1945067 1742514 1769813 2120846 2557356 2881416 3166320 3385961 3382743 3173445 2860987
12681 2860987 2550578 2343037 2179163 1922368 1567281 1160738 818677 687397 690904 624901
12671 624901 466272 396532 503413 635530 636598 506101 315482 93648 -180520 -391549
12661 -391549 -434763 -335815 -159530 41740 227954 328065 310779 193081 11174 -216727
12651 -216727 -393073 -392494 -176985 106306 263987 261436 249359 361203 491610 539274 575920
12640 575920 647347 633524 340883 -204219 -694466 -939447 -975212 -846560 -602215 -350213
12630 -350213 -172502 15156 319384 708738 1031356 1068296 779884 365019 59007 -27344
12620 -27344 -18997 -86141 -233813 -375086 -441717 -476957 -575211 -701076 -731210 -636633 -468868
12609 -468868 -261775 -23564 145470 164254 116215 112077 174134 230180 266606 248379 123855
12598 123855 -102596 -328646 -446696 -448780 -388921 -336475 -262992 -129660 -4968 8366 -88865
12587 -88865 -231918 -382945 -497062 -457149 -282244 -139483 -14479 145908 257242 297266
12577 297266 334736 438792 662716 941491 1117546 1200024 1213397 1194352 1275457 1427807
12567 1427807 1469208 1359562 1266690 1325911 1412956 1336918 1171568 1138102 1254918 1366688
12557 1366688 1326101 1118529 998808 1148032 1494582 1869543 2091775 2052266 1751551 1409909
12547 1409909 1150868 968409 897258 908316 918887 851858 614388 229584 -111517 -293876
12537 -293876 -355993 -416733 -509208 -660452 -886238 -1064508 -1087208 -1012246 -957106 -895144 -748010
12526 -748010 -599628 -553470 -610017 -760063 -923975 -961276 -921461 -909112 -884108 -824893 -668613
12515 -668613 -332734 153071 562441 644285 420495 74264 -240997 -464766 -618252 -737061
12505 -737061 -812830 -794929 -630662 -429687 -360264 -510984 -753495 -826620 -683069 -546193
12495 -546193 -545529 -589818 -649662 -714645 -719631 -631694 -454287 -272181 -108317 7286 4688
12484 4688 -45556 -80890 -123555 -178236 -194532 -164840 -108324 -44429 -21353 -121343 -354532 -571242
12472 -571242 -618698 -545320 -462476 -419918 -453795 -652209 -899718 -932007 -686358 -316124 -76291
12461 -76291 -122622 -399468 -734547 -1027830 -1235843 -1279158 -1102546 -758443 -373266 -82978
12451 -82978 145704 353253 416191 291420 107201 11781 115182 416008 776076 1029981
12441 1029981 1080908 1006856 1026133 1175887 1277797 1262813 1173403 1040819 879018 655935
12431 655935 374131 82891 -150298 -310095 -390019 -386626 -377596 -437671 -533739 -658342 -826251
12420 -826251 -939922 -1016392 -1114001 -1106872 -893824 -573360 -324690 -211093 -183984 -159555 -78664
12409 -78664 -12642 -33274 -30643 79152 142692 90231 34386 23679 88463 240742 471888
12398 471888 777730 1057873 1176284 1098891 916588 735955 649386 663285 695917 732319
12388 732319 726789 619220 443168 237866 33947 -124950 -290820 -517139 -696168 -789541
12378 -789541 -900100 -1052705 -1205426 -1340543 -1443259 -1456001 -1336760 -1145709 -903062 -596000
12368 -596000 -353133 -322664 -460989 -561954 -468509 -230709 60971 329093 479626 532427
12358 532427 502416 399606 262531 126623 93132 132753 181664 181720 -10807 -344476 -659644
12347 -659644 -910861 -1128760 -1315692 -1411597 -1335571 -1125755 -900334 -837802 -1042348 -1349422
12337 -1349422 -1506778 -1379099 -1045348 -740113 -561218 -462127 -439215 -462987 -438794 -314314
12327 -314314 -115241 50864 77625 -5069 -125650 -216128 -207246 -100211 41921 161235
12317 161235 213260 204951 172731 188413 232910 219682 80582 -149849 -340627 -391615 -305105
12306 -305105 -176324 -46667 90611 143058 51614 -58564 -105712 -89607 -85329 -226515 -507218
12295 -507218 -711444 -682607 -513243 -363930 -256438 -72765 207994 550268 897771 1170245
12285 1170245 1359622 1474549 1500198 1406747 1241168 1147759 1135611 1051506 825942 547837
12275 547837 292036 122962 61048 70769 164479 273771 289854 171782 -33875 -142289
12265 -142289 -29692 234649 490029 604537 538739 389679 316768 356733 436371 576172
12255 576172 763612 926189 1082764 1237140 1419853 1671485 1899296 1997898 1939428 1723042
12245 1723042 1454689 1205478 972039 768309 652762 676944 761473 711442 456213 127253
12235 127253 -95619 -91921 130455 496817 870311 1083438 1099000 1057835 1078601 1113310 1044678
12224 1044678 857234 624199 418897 222985 -1636 -144515 -126747 -55677 103794 367779
12214 367779 594835 627933 444080 230741 171913 209047 204943 190833 201201 225934 212154
12203 212154 171315 202283 243961 199827 218496 434914 792815 1122155 1332329 1400501 1272163
12192 1272163 907479 394737 -168392 -758888 -1246140 -1481646 -1474233 -1382973 -1358785 -1381558
12182 -1381558 -1449888 -1618793 -1752933 -1636061 -1315401 -1054780 -992743 -943966 -728743 -470868
12172 -470868 -177487 225145 605962 755616 700885 758559 1034097 1286222 1323591 1213781
12162 1213781 1138309 1173053 1171809 993731 761294 588510 385875 138944 -92794 -311160
12152 -311160 -549624 -756846 -812982 -671375 -396643 -144127 80036 335849 564571 684184
12142 684184 716784 749917 867067 999562 1029255 1005175 1014390 1013899 978074 1028408 1187022
12131 1187022 1298849 1292892 1231106 1153918 1042571 854388 573602 282764 115204 52499
12121 52499 49279 171062 414783 626729 740060 815818 851639 735087 456981 181398
12111 181398 -23116 -175458 -202112 -53546 102596 46514 -178910 -300653 -190086 -5730
12101 -5730 126118 232081 372062 529009 684277 814545 752876 394678 -73076 -421763
12091 -421763 -525009 -491295 -537283 -780203 -1172401 -1533189 -1672962 -1531276 -1200080 -885853
12081 -885853 -722918 -677055 -695704 -671099 -530380 -364678 -279591 -187505 -132273 -294954 -483369
12070 -483369 -414494 -130777 153299 319153 356270 354470 438717 624129 831066 896919 724538
12059 724538 462655 375860 494823 703427 929191 1080904 1073896 910278 663436 421280
12049 421280 290140 292016 382209 540817 698604 717083 533251 241847 28863 53192
12039 53192 225822 340904 361787 382395 527584 796783 1021992 1082917 1020484 941029 836979
12028 836979 634653 356591 84721 -80890 -72392 131042 375576 422204 288566 201113
12018 201113 245165 355586 537918 876170 1300251 1625477 1783222 1767413 1536043 1116535
12008 1116535 705551 497932 480377 512025 514971 549434 677703 762888 704028 578385 417670
11997 417670 164039 -124379 -345893 -460823 -485053 -445512 -379585 -378584 -490263 -607944
11987 -607944 -609720 -514848 -403507 -287040 -245256 -306641 -424253 -451313 -231401 83019 294311
11976 294311 356973 271711 36641 -259489 -504749 -639870 -597228 -411319 -246100 -200889
11966 -200889 -242680 -240955 -136569 -45413 -84000 -284231 -557969 -745995 -760700 -654687 -563442
11955 -563442 -533184 -498563 -403583 -253672 -76375 37990 28171 -23191 -33400 12802 119883
11944 119883 221801 166576 -107744 -488229 -881201 -1200456 -1325933 -1313757 -1273524 -1238832
11934 -1238832 -1205504 -1179514 -1170721 -1164553 -1174361 -1172766 -1122620 -1076171 -1107307 -1166155 -1194723 -1167311
11922 -1167311 -986807 -658948 -336327 -99007 48213 95229 120221 184975 280175 347909
11912 347909 401424 444372 468409 545021 689152 880752 1001712 964456 883824 911242 1090444
11901 1090444 1375988 1574882 1432772 957508 390087 -147524 -607874 -935312 -1157092
11892 -1157092 -1285838 -1315045 -1286622 -1296146 -1326576 -1245448 -1048004 -819095 -598289 -418857
11882 -418857 -287077 -191455 -99284 -2931 -23387 -263759 -583492 -761796 -720480 -593203
11872 -593203 -558956 -659156 -873534 -1018135 -1005907 -975682 -957675 -823790 -486583 14618
11862 14618 516575 833394 904322 831958 704201 578368 522946 540008 622871 672264 648656
11851 648656 638973 619969 538898 455028 445380 497583 516337 368709 82542 -157301 -210909
11840 -210909 -81913 38094 -19433 -182584 -274730 -312411 -449004 -717707 -998152 -1150091
11830 -1150091 -1113121 -894807 -537502 -129317 200354 373190 450883 542912 632276 643696
11820 643696 548048 356398 44394 -308576 -475720 -361880 -172013 -179501 -315556 -375379
11810 -375379 -313667 -231939 -190575 -244690 -451524 -706386 -816791 -720973 -509777 -271955
11800 -271955 -41410 94543 98524 46386 -32712 -238454 -516809 -628699 -547078 -524673 -650233
11789 -650233 -785878 -875027 -948815 -963359 -879675 -661796 -339420 -43059 146534 232754
11779 232754 201988 36220 -157700 -270102 -291766 -328220 -361887 -267204 -617 375938
11769 375938 719966 978726 1203573 1494620 1818232 1990897 2065946 2156076 2159019 1950020
11759 1950020 1584124 1182720 887379 792216 804334 771423 677130 511376 361912 432625
11749 432625 666413 878542 1007404 1014802 887368 705606 582417 503391 411417 364562
11739 364562 352981 295228 178382 -27102 -292276 -468083 -486569 -351764 -44669 261291
11729 261291 315212 105812 -149341 -330811 -505527 -695880 -840204 -923956 -1002505 -1150828
11719 -1150828 -1323820 -1435385 -1491200 -1487868 -1475753 -1413443 -1202446 -872813 -556957 -344656
11709 -344656 -159011 79273 334499 583025 762101 757672 611800 435173 327577 361968
11699 361968 464075 462587 262501 -20090 -169153 -177217 -188027 -376620 -761899 -1162017
11689 -1162017 -1400600 -1389391 -1159579 -857718 -640207 -508547 -321536 1174 474782 1019237
11679 1019237 1389710 1525517 1521933 1349275 984911 600664 383459 368320 467915 582719
11669 582719 673847 790464 1011193 1284366 1533335 1745920 1911550 1934837 1746929 1441330
11659 1441330 1156500 932888 790597 878141 1201937 1544587 1704632 1750086 1808690 1753026
11649 1753026 1479374 1040981 491003 -98498 -546813 -734414 -736951 -634332 -459631 -238880
11639 -238880 54261 336695 480327 485139 369837 174238 -5712 -169509 -302226 -267860
11629 -267860 1269 398387 748218 1025306 1319106 1516782 1408241 1056382 641062 333682
11619 333682 289709 543510 967394 1372408 1672333 1869068 1981765 2033902 2006624 1746237
11609 1746237 1150017 459918 79474 29531 63244 18570 -134455 -354278 -579868 -752530
11599 -752530 -794403 -647940 -458967 -428934 -430068 -289329 -25989 239127 407982 484210
11589 484210 382856 107316 -133464 -166775 -48909 21188 7540 -37455 -110906 -239709
11579 -239709 -363108 -374842 -222722 96150 455741 714086 768337 553153 175682 -124925
11569 -124925 -321214 -460890 -487117 -403045 -262568 -104265 -30261 -40314 -30823 13725 30548
11558 30548 -23236 -57133 -3924 51983 51853 19491 -7882 13236 34089 57099 194180 350060
11546 350060 353457 202179 22576 -124171 -269967 -315094 -228884 -104126 26811 150908
11536 150908 174865 70961 -57931 -83692 47287 262668 474041 700335 1013168 1312845
11526 1312845 1395603 1248001 953428 566499 156691 -177230 -320527 -282285 -175135 -79927
11516 -79927 -93343 -243425 -513114 -847529 -1109505 -1102992 -866981 -679609 -647599 -660167 -655673
11505 -655673 -610888 -508864 -432509 -376003 -319109 -311407 -427330 -655169 -808256 -722952 -467542
11494 -467542 -268558 -249045 -310797 -327934 -310468 -366996 -503710 -649821 -802189 -871241 -807802
11483 -807802 -654116 -377447 -97850 30136 77912 232558 505494 700853 676088 543301
11473 543301 455739 380254 248700 135187 130211 181548 205590 206780 130793 -70110 -341465
11462 -341465 -661598 -995148 -1248491 -1308138 -1110422 -694624 -195077 154053 280062 289353
11452 289353 211430 -19949 -289305 -385359 -226181 157668 632988 1018952 1211757 1218642
11442 1218642 1125225 1008860 858899 604471 249049 -33755 -139094 -145928 -124397 -111333
11432 -111333 -72239 58791 158012 116186 31341 24290 21394 -107833 -339102 -558741 -636924
11421 -636924 -580811 -466309 -267967 -142888 -218722 -340434 -370362 -285437 -73524 204704
11411 204704 478390 797466 1206407 1622079 1906218 1956940 1814386 1552265 1236834 947614
11401 947614 727817 624522 531625 362876 183382 87725 76839 53834 60933 198898 431591
11390 431591 594959 494567 245163 173457 253108 158080 -253251 -797076 -1196321 -1342505
11380 -1342505 -1333181 -1270727 -1089049 -729847 -338779 -115299 -5439 144646 341988 477656
11370 477656 504743 453952 415182 452927 438938 230789 -125971 -495725 -742156 -819879 -873154
11359 -873154 -977156 -1109024 -1261272 -1406011 -1536469 -1564105 -1408211 -1145501 -919204 -692881
11349 -692881 -346034 -102 204318 304151 327836 251672 152172 147266 323240 595144 820105
11338 820105 990352 1125551 1209455 1294070 1442712 1621544 1740732 1687443 1458670 1234857
11328 1234857 1161060 1155633 1156686 1165950 1162905 1184390 1232602 1238505 1160993 1018169 890756 815607
11316 815607 712743 531825 242695 -134487 -405881 -416822 -275940 -127239 -15977 34534
11306 34534 8784 -26498 47683 311020 672552 960527 1097117 1079839 1010818 930721 686369
11295 686369 223042 -231614 -421212 -331122 -104443 118791 191753 -39795 -462771 -750384
11285 -750384 -742761 -502633 -187209 39915 105099 14762 -119519 -169185 -157607 -184831 -341897
11274 -341897 -601362 -855937 -1064507 -1224262 -1328992 -1321628 -1092701 -725985 -401404 -146966
11264 -146966 16744 41257 -24558 -118989 -257287 -452831 -733675 -1030056 -1086540 -739224
11254 -739224 -132361 454180 846210 987099 914782 777366 618962 401166 177161 15647
11244 15647 -178950 -568074 -1073954 -1446121 -1537509 -1397466 -1163035 -1028128 -1049507 -1110889
11234 -1110889 -1125398 -1141025 -1181953 -1192955 -1071001 -797705 -497579 -257668 -93784 -65465
11224 -65465 -192714 -267480 -122287 93651 128168 -7282 -198792 -334095 -360062 -367659 -331484
11213 -331484 -103475 314868 707156 858349 711682 394782 63499 -230188 -426766 -424903
11203 -424903 -318356 -263763 -297414 -351995 -317976 -173967 -43762 -81663 -285977 -471906
11193 -471906 -445784 -226781 -3747 104251 188308 378494 653528 888179 963732 931305
11183 931305 898885 803680 666246 636942 737512 855467 890370 823666 679630 529865
11173 529865 398582 230730 40487 12069 267612 612199 807293 783003 619458 498438
11163 498438 534116 775252 1172050 1495915 1540465 1239664 676827 126381 -169935 -223636
11153 -223636 -154909 -17713 219580 459027 542439 453764 292920 151316 5458 -132447
11143 -132447 -134650 -16317 110088 208154 322387 542880 909266 1262636 1462272 1438209
11133 1438209 1203387 937060 756575 665709 610486 519138 463450 566512 721545 702364
11123 702364 500489 212158 -91223 -298439 -370276 -382683 -378307 -333337 -220934 -8908
11113 -8908 299972 630322 836734 803927 638466 549572 576439 658769 732259 748217 771539
11102 771539 870617 1081674 1320095 1373512 1231321 1009147 779058 583000 515792 565338
11092 565338 612566 606386 535139 467783 528454 663718 701091 577645 275572 -144862 -543004
11081 -543004 -869155 -1125992 -1277087 -1313420 -1254334 -1068932 -868696 -811253 -855662 -878544
11071 -878544 -826265 -689244 -498143 -339242 -270905 -288450 -396226 -596319 -906319 -1238474
11061 -1238474 -1450433 -1538743 -1592305 -1705630 -1911129 -2127496 -2212265 -2095791 -1834684 -1538822
11051 -1538822 -1272514 -1057182 -911586 -818146 -738370 -656733 -482778 -193212 11357 20820
11041 20820 -23457 -32370 1998 93744 157573 149670 139228 196119 370275 632432 774098
11030 774098 635703 279806 -48682 -175137 -60132 238516 523715 669245 716439 716921
11020 716921 727443 701982 629334 595468 547751 388867 66200 -361618 -725779 -928838
11010 -928838 -984221 -976941 -883011 -611578 -177453 275230 636017 985645 1318056 1406850
11000 1406850 1120717 599000 91850 -312162 -631076 -775248 -819555 -977306 -1301752 -1713621
10990 -1713621 -2088336 -2324259 -2371690 -2197790 -1917611 -1682819 -1521181 -1374242 -1191556 -974119
10980 -974119 -779898 -610086 -431779 -258935 -89368 34089 56046 32795 10366 -35490
10970 -35490 -91452 -45361 213089 581147 883880 1071548 1232199 1312175 1129879 826189
10960 826189 706089 809345 961493 1102503 1300132 1460623 1488272 1474101 1505453 1558683
10950 1558683 1555412 1406973 1110948 813852 667446 695250 815124 945706 1025283 1045725
10940 1045725 961224 733624 467458 255997 122550 25260 -136754 -359783 -533803 -575203
10930 -575203 -453640 -198655 72377 175667 61603 -88245 -146510 -62434 177138 477519
10920 477519 728123 870237 890960 727826 374758 10531 -260564 -474215 -560516 -355931
10910 -355931 15650 281890 319221 180114 39794 20484 123957 283750 395051 392745
10900 392745 345416 365753 445809 490261 559525 765971 1101503 1432756 1530628 1294177 887973
10889 887973 585696 458140 399179 297430 153547 -13339 -155608 -168881 -97003 16441
10879 16441 187585 328736 298383 87318 -183000 -459961 -690226 -815419 -899951 -943233
10869 -943233 -866829 -718577 -511973 -208054 103433 391278 652660 873692 1164342 1568688
10859 1568688 1839197 1763103 1444001 1086819 753627 310259 -260836 -866167 -1397054 -1650130
10849 -1650130 -1543276 -1218914 -849777 -454618 -96193 128283 155754 -35689 -264332 -392823
10839 -392823 -449924 -525028 -669435 -732472 -622608 -450092 -321005 -252874 -223859 -250940 -377264
10828 -377264 -573777 -761995 -869732 -849394 -741016 -691579 -722694 -697389 -543265 -417622
10818 -417622 -465412 -613686 -703696 -619267 -443615 -333450 -273982 -202461 -98274 -5304 75717
10807 75717 239888 434996 430504 183779 -173573 -505566 -674690 -700699 -608200 -454391
10797 -454391 -408433 -412383 -348110 -250103 -164201 -156396 -226277 -228248 -103500 -15124 -15868 -4973
10785 -4973 45738 102801 169125 221067 277344 465330 878281 1372244 1726622 1775276 1580879
10774 1580879 1420399 1431625 1507041 1511931 1402326 1174811 925659 768663 579322 206994
10764 206994 -227853 -550758 -712390 -749638 -711710 -735502 -955107 -1205289 -1250569 -1050076
10754 -1050076 -690606 -218406 348937 854366 1174703 1224112 966328 512959 83097 -143677
10744 -143677 -196333 -200708 -202795 -201058 -237075 -334827 -405907 -464584 -604999 -727788 -711814 -632523
10732 -632523 -497660 -225492 188832 751367 1413294 1923196 1993587 1634633 1194375 989191
10722 989191 960975 835152 533843 251884 220528 411780 554573 497826 368070 276407
10712 276407 197441 119550 26914 -40188 -4477 135664 330763 449565 371954 85327 -402641
10701 -402641 -1008164 -1528571 -1779204 -1788515 -1679415 -1560444 -1514218 -1549080 -1567547 -1356849
10691 -1356849 -834337 -254092 64610 78173 5615 50610 233677 476541 738817 1003645
10681 1003645 1205971 1183304 945230 721919 572051 448825 350605 246087 48841 -190158
10671 -190158 -330198 -371451 -436516 -445250 -265645 -25467 83084 22121 -131510 -323795
10661 -323795 -501937 -652079 -841822 -1049101 -1111198 -948824 -690274 -445161 -232944 -197224
10651 -197224 -408241 -709019 -954522 -1123059 -1322427 -1613317 -1839659 -1870356 -1691111 -1402860
10641 -1402860 -1187599 -1080175 -896952 -548157 -185058 22321 108227 172920 309648 522732
10631 522732 705273 713078 453111 -33982 -558368 -943324 -1189388 -1349014 -1445795 -1514403
10621 -1514403 -1573228 -1561146 -1376069 -1089254 -890581 -819193 -835701 -899836 -922201 -822121
10611 -822121 -650524 -502013 -445011 -492475 -540573 -428700 -141136 156922 257135 116767
10601 116767 -101345 -185954 -33392 287322 583686 701030 617885 461015 339481 261081
10591 261081 264254 306095 172464 -208619 -515870 -455957 -102914 429794 985727 1397328
10581 1397328 1642600 1753607 1700236 1489695 1224999 1041253 908328 742480 600336 547810
10571 547810 591071 662141 750383 864201 953083 912488 697899 484086 367221 326905 322200
10560 322200 249976 140076 133822 282707 438893 468732 370057 174840 -32665 -197966
10550 -197966 -396704 -692425 -1012221 -1235194 -1324090 -1301081 -1255652 -1233757 -1188985 -1069999
10540 -1069999 -881805 -736772 -735835 -810820 -856667 -892254 -948262 -892220 -648912 -350061 -78521
10529 -78521 170461 367621 499585 629003 719674 745089 807200 859747 809137 631560 314262
10518 314262 -39452 -198629 -54597 241228 491070 557735 376828 -21593 -444062 -603752
10508 -603752 -428812 -111550 101956 119139 59665 54631 89174 56495 -47718 -160336 -214269
10497 -214269 -105144 64795 99855 -34722 -226478 -391689 -534514 -630910 -686248 -692498
10487 -692498 -633751 -574537 -599042 -719558 -897056 -1087660 -1270857 -1458210 -1595263 -1615978
10477 -1615978 -1562209 -1441010 -1241285 -1000158 -754682 -456621 -77571 174520 77536 -264347
10467 -264347 -618302 -848857 -940781 -855598 -495017 146417 888168 1502795 1912255 2058368
10457 2058368 1885833 1510745 1153324 924001 828660 837449 819822 740854 666484 590482 480247
10446 480247 330588 119942 -170171 -485664 -744283 -902379 -935506 -837959 -603831 -212445
10436 -212445 218592 460324 495619 488416 430281 287089 245383 368575 492321 575546 627155
10425 627155 600795 413707 51529 -417730 -782181 -888269 -779683 -484907 -54788 327261
10415 327261 515563 553920 542186 497467 385013 205188 29159 -76914 -164053 -254984
10405 -254984 -270307 -220731 -216025 -389641 -761079 -1196327 -1464559 -1439163 -1264627 -1193195 -1343021
10394 -1343021 -1595506 -1773382 -1870329 -1796712 -1519800 -1261217 -1120074 -1061204 -1037857 -979006
10384 -979006 -822898 -624073 -468743 -283005 -72598 37868 -9626 -145865 -269001 -275535
10374 -275535 -124873 68873 138515 8696 -314114 -727452 -1060124 -1192631 -1132844 -1058966
10364 -1058966 -1081696 -1097228 -1021874 -909361 -814571 -771665 -803366 -845965 -820050 -717441 -578938
10353 -578938 -461139 -370717 -285618 -152430 68204 366775 626036 713263 630383 501605
10343 501605 391176 299195 270836 233308 48401 -245423 -440824 -455848 -397276 -346229 -310968
10332 -310968 -399789 -654302 -897615 -1006856 -961385 -783234 -601188 -509587 -425327 -274797
10322 -274797 -164031 -221191 -451477 -721574 -871492 -887812 -745211 -475399 -246390 -153977
10312 -153977 -179955 -226101 -236986 -288063 -433865 -666288 -945124 -1153534 -1172225 -982257
10302 -982257 -732005 -641378 -726402 -796002 -662222 -349607 -89598 2386 34793 40237 -14509
10291 -14509 -139679 -310112 -440592 -512239 -596443 -676365 -677790 -606872 -517904 -445266 -402698
10280 -402698 -398922 -417369 -417577 -450601 -587399 -791189 -960425 -971660 -797096 -612331 -578564
10269 -578564 -668638 -769383 -886838 -1070384 -1226305 -1158482 -894901 -659218 -561058 -613371
10259 -613371 -820935 -1146355 -1550453 -1974523 -2279863 -2351350 -2249460 -2159814 -2067239 -1873399
10249 -1873399 -1615802 -1338349 -1058811 -729202 -273382 181675 427566 472347 472671 582524
10239 582524 876026 1261359 1568690 1675713 1593312 1406180 1236501 1186688 1255329 1281010
10229 1281010 1183492 1086546 1011500 871993 689853 502175 383868 394463 487125 567564
10219 567564 601299 637014 679446 699292 745335 899640 1103965 1203813 1111286 851528 570667
10208 570667 457856 516193 632045 741938 838559 950197 1013044 954133 860836 788583 649428
10197 649428 340222 -104856 -407548 -390593 -205116 -101978 -157633 -244462 -321214 -397397
10187 -397397 -422612 -391912 -388277 -550677 -816489 -973376 -1034346 -1082466 -1119629 -1132117 -1095365
10176 -1095365 -1032945 -1017922 -1030677 -1002666 -926434 -771296 -497685 -134977 285605 709718
10166 709718 1018542 1167625 1209609 1121987 902451 673663 589474 591825 589507 637223 755487
10155 755487 820842 676424 356823 21150 -207513 -284346 -201006 -49290 19389 -113338
10145 -113338 -526677 -1101964 -1530180 -1664624 -1569259 -1425019 -1318710 -1264162 -1261540 -1195119
10135 -1195119 -990852 -687494 -380089 -201457 -221536 -368992 -587305 -899579 -1165401 -1256149
10125 -1256149 -1238184 -1098648 -844175 -605989 -362988 -11508 380145 666945 771288 747061
10115 747061 710453 656469 594507 534064 376386 113880 -170047 -400064 -580102 -733829
10105 -733829 -794122 -730922 -549942 -271947 -21679 177996 416942 662798 794802 854078
10095 854078 972715 1122405 1204832 1163809 1028132 858048 682957 522591 386079 215627
10085 215627 -76472 -388901 -521884 -465122 -394941 -424319 -409031 -227518 120199 525735
10075 525735 797294 910698 1001583 1048854 993181 816364 528954 226458 -33896 -139492
10065 -139492 -68073 10324 78631 211380 331813 406064 465241 521338 579027 687731 925983
10054 925983 1252117 1493056 1499187 1262992 964977 716525 464550 161422 -221115 -659130
10044 -659130 -1031690 -1266327 -1412576 -1530902 -1575668 -1516003 -1415883 -1293778 -1025742 -581294
10034 -581294 -144217 187915 463961 676876 720880 568085 406712 472947 710031 855324
10024 855324 831009 777978 791058 828654 809469 754548 758847 815790 883099 864365 645196
10013 645196 336957 210339 274287 280859 92854 -262786 -636573 -866827 -860171 -558385
10003 -558385 -134813 166895 311452 378378 564758 857994 946744 821229 739537 800359
9993 800359 891239 837333 595146 230769 -221140 -684139 -982748 -1091867 -1122149 -1031823
9983 -1031823 -864076 -775228 -713043 -555965 -299784 45003 378303 538216 480871 286001
9973 286001 60342 -92268 -98671 -80225 -164897 -245754 -147020 83628 363194 579356 528981
9962 528981 239795 -82155 -347822 -489684 -472728 -360663 -282056 -433076 -781631 -1059202
9952 -1059202 -1123746 -938602 -551252 -138825 199630 510880 855180 1196086 1469783 1624692
9942 1624692 1596521 1427681 1221970 1062244 1041773 1153331 1237939 1116349 745768 294443
9932 294443 -111605 -557300 -1055339 -1445614 -1570144 -1366435 -888981 -310995 197202 615068
9922 615068 1034427 1396592 1542235 1490383 1433432 1380130 1239314 1103487 1015605 837895
9912 837895 605461 395676 155405 -55559 -176949 -169980 -37 294600 598830 829251
9902 829251 948964 963586 981654 1045486 1056098 981147 897488 813674 723215 671169 675211 652125
9890 652125 545830 354375 76027 -234186 -557255 -920995 -1253816 -1462174 -1592133 -1669406
9880 -1669406 -1609947 -1376681 -1053876 -762048 -535931 -313650 -113228 -5151 40548 32285
9870 32285 -10642 -46241 -17996 131709 304876 376498 348019 273898 199391 230381 476929
9859 476929 818471 1002892 962586 838707 780335 746196 697534 710548 799881 952824 1092338
9848 1092338 1080809 903448 585654 260116 134992 214585 296287 288759 286516 389646 523764
9837 523764 459450 176128 -44009 -11247 215777 487310 699476 821089 801244 687130
9827 687130 616462 556797 434731 280032 88159 -173088 -450789 -635264 -682325 -594894
9817 -594894 -425663 -262097 -60296 136127 116197 -198557 -623307 -965684 -1253542 -1496433
9807 -1496433 -1669790 -1816711 -1968797 -2122857 -2159272 -1976045 -1658138 -1340201 -981572 -576881
9797 -576881 -236566 1634 181553 293807 345028 440158 624696 769740 743498 571843
9787 571843 367919 223051 135248 39435 -70962 -166883 -246014 -319617 -384169 -438750 -518262
9776 -518262 -609895 -686439 -686526 -628268 -537681 -372554 -174325 -53166 -3937 -3056 -49651 -122459
9764 -122459 -212111 -306166 -323733 -197797 34635 277156 509276 742648 833456 677177
9754 677177 430294 312983 356004 484705 649548 725145 653813 503260 332431 226654
9744 226654 176995 123609 156122 303730 418683 498534 597560 670199 614070 378784 7759
9733 7759 -366705 -657478 -833969 -841516 -727988 -649171 -664851 -682431 -666774 -623300 -504589
9722 -504589 -342038 -205890 -82199 77118 254526 293842 165389 -17573 -168435 -245356
9712 -245356 -194058 -19163 118339 91780 -84256 -315717 -503434 -520206 -294358 58109
9702 58109 367918 531519 581788 623303 741224 908688 926684 736605 568549 511547 448314
9691 448314 350591 305424 370058 438816 345142 120328 -3377 57898 98800 -36532 -199607
9680 -199607 -313223 -483046 -722164 -922308 -969252 -947411 -987812 -1020903 -1007681 -903872 -666335
9669 -666335 -428928 -317479 -322697 -392637 -500944 -678096 -849444 -867531 -758451 -593394
9659 -593394 -419791 -262708 -112258 10642 38191 -50140 -186322 -271162 -211960 -27779
9649 -27779 145897 224221 221926 161301 113608 168227 264299 317309 325983 368503 533245 827368
9637 827368 1187040 1512143 1634912 1429609 1006514 709150 754927 964863 1042480 871363
9627 871363 496101 122028 12119 225601 562837 814443 894108 815281 654388 447243
9617 447243 242863 172379 298919 529157 777243 996645 1160004 1280779 1387557 1486802
9607 1486802 1524327 1462243 1304159 1086098 801688 421876 40923 -144933 -52080 162375
9597 162375 347210 557920 776502 850797 787797 717901 613680 399334 180126 114969
9587 114969 142750 164351 195077 278608 366837 311325 40809 -358607 -749596 -1013125 -1093806
9576 -1093806 -993474 -806179 -646949 -393742 83065 607169 893416 826889 534314 257578
9566 257578 153237 242603 363449 331614 140189 -79826 -261631 -382978 -355881 -146100
9556 -146100 113306 194363 51206 -70066 36887 351595 690532 784435 621693 479359
9546 479359 490513 493962 422846 390382 406523 349770 139253 -214782 -564222 -747709 -832919
9535 -832919 -908085 -867799 -762698 -766544 -817859 -803635 -690566 -499564 -343414 -241938 -107452
9524 -107452 45804 162513 145213 67568 51887 107012 156914 48049 -257807 -588862 -697116
9513 -697116 -534308 -263693 23431 304069 510556 539845 441273 300570 26753 -313091
9503 -313091 -493350 -515381 -509748 -460298 -291320 9356 413913 717319 746774 558207 282738
9492 282738 48464 -140753 -360191 -642554 -934002 -1052665 -936644 -720014 -533933 -503272
9482 -503272 -679229 -937876 -1157875 -1239201 -1177290 -1158960 -1231548 -1234438 -1096985 -943460 -797436
9471 -797436 -518787 -143604 169087 368656 494091 613399 772122 959414 1099634 1139527
9461 1139527 1025670 810393 646763 543598 385520 167315 -25694 -165238 -230927 -250211
9451 -250211 -336271 -494213 -542642 -432223 -217712 -14041 20835 -151180 -425296 -608580
9441 -608580 -533082 -216137 126972 356461 472501 484334 400027 188438 -101797 -332787
9431 -332787 -480969 -638008 -846710 -953760 -767230 -403732 -79429 239081 623040 981822
9421 981822 1252646 1439270 1509413 1474295 1469052 1496530 1407500 1188021 946146 818752 872940
9410 872940 1037840 1158472 1111943 909421 619204 284522 -74634 -383174 -500212 -402280
9400 -402280 -261798 -160255 -20749 111710 120005 -25831 -285933 -540249 -718949 -881342
9390 -881342 -1002708 -1024472 -960330 -876881 -758646 -515497 -197766 13813 47146 -17523 -36794
9379 -36794 35774 68806 -47325 -228112 -372251 -564569 -827196 -1077674 -1288796 -1455285
9369 -1455285 -1476646 -1281504 -977898 -644466 -349953 -191814 -212898 -341704 -408790 -302038
9359 -302038 -112676 19037 7525 -149484 -324816 -391325 -346430 -260343 -144020 -87462 -265038
9348 -265038 -639236 -962235 -1095815 -1071139 -912969 -668964 -443717 -196820 133398 378610
9338 378610 401742 356897 409327 497145 400868 96395 -125204 -60210 221499 506292 588678
9327 588678 459156 211240 -107698 -432663 -666652 -780851 -808947 -804655 -779511 -628731
9317 -628731 -369085 -193822 -112896 107896 479532 682059 522975 135733 -227620 -453651
9307 -453651 -610887 -740219 -836561 -923569 -1029104 -1155191 -1211220 -1041763 -640640 -152350
9297 -152350 317715 623409 536999 -1464 -710429 -1198858 -1379405 -1366108 -1249250 -1039758
9287 -1039758 -727404 -394327 -122439 71311 207331 341038 428789 336885 82730 -185215
9277 -185215 -470371 -780750 -919023 -802621 -593469 -327936 41691 402040 705944 941585
9267 941585 1019780 1000027 960179 882179 805877 866390 1053904 1149960 1024817 774257 480089
9256 480089 72576 -421768 -829203 -1015994 -1002497 -915323 -870037 -910857 -973917 -978988 -850582
9245 -850582 -588052 -245026 146302 607406 1169239 1656882 1934986 2074233 2126797 2076101
9235 2076101 1846724 1466904 1144050 1093547 1240887 1346161 1359383 1316194 1199397 1029287
9225 1029287 873074 779069 767376 784925 743712 568638 317680 61020 -178941 -329003
9215 -329003 -347599 -255963 -73017 174404 412545 573388 637773 703194 876969 1096005
9205 1096005 1230254 1214636 1078713 951544 927659 1003284 1049049 933924 706351 557482
9195 557482 554531 623356 711257 835132 1003869 1095074 1004361 736203 385560 102985 -82264
9184 -82264 -194683 -227853 -241680 -253080 -194896 -74714 15048 -9066 -84462 -117997 -229518
9173 -229518 -465514 -790908 -1228818 -1539952 -1415708 -966892 -506765 -217129 -149579 -184567
9163 -184567 -237271 -320051 -472810 -705364 -886330 -884548 -704960 -430788 -91579 266871
9153 266871 512508 640066 699682 647645 575136 634024 800412 979971 1116525 1202451 1328215
9142 1328215 1495590 1538478 1368937 1100408 856048 661155 515756 425717 350190 350335 445218
9131 445218 488231 336616 -4304 -395786 -722634 -995464 -1269858 -1490779 -1636542 -1705260
9121 -1705260 -1635295 -1447263 -1179508 -846332 -511099 -269577 -112425 -17860 -14175 -21249 87676
9110 87676 297137 426277 417061 306116 183084 205996 303924 204786 -121507 -479900 -705402
9099 -705402 -737152 -617504 -454956 -290130 -178145 -229879 -381982 -506561 -561725 -477364
9089 -477364 -230100 48341 242457 370705 448850 354528 52821 -211047 -256237 -240151
9079 -240151 -407861 -800798 -1212015 -1421035 -1339692 -1026812 -698733 -532198 -480294 -339428
9069 -339428 -62656 238207 511779 665633 624887 421345 195912 101817 92569 -26101
9059 -26101 -414075 -1034521 -1593492 -1824037 -1717025 -1430611 -1077931 -700094 -260408 186492
9049 186492 424356 405570 298624 235751 181560 102894 62069 81805 113152 103715 28265
9038 28265 6060 108925 166600 101657 2525 -37018 29207 118356 113958 61661 47123 65586
9026 65586 84170 9682 -188453 -446054 -710868 -904612 -1053039 -1177251 -1213385 -1091431
9016 -1091431 -826082 -571664 -482934 -411643 -185116 86496 298277 435700 451038 322558
9006 322558 133127 -39782 -263855 -489606 -536494 -420805 -259098 -104440 1273 22560
8996 22560 -18567 11675 288534 758621 1155674 1313907 1334195 1363611 1446520 1527330 1478624
8985 1478624 1256809 919951 509288 118092 -131619 -223598 -241335 -324826 -479909 -569786
8975 -569786 -528838 -369078 -191473 -84813 -49824 -99140 -126798 -14406 170064 236491 115983
8964 115983 -34122 -96884 -82519 -120920 -230747 -233187 -97405 29323 172715 423402 728732
8953 728732 1018896 1165072 1061588 804516 538052 322253 247634 302007 258034 -30570
8943 -30570 -475100 -811030 -879593 -825640 -762298 -607406 -278487 141000 508929 688426
8933 688426 696992 721330 775679 768982 706246 605166 434971 283125 181768 129969 206455
8922 206455 327261 370440 310017 98333 -302547 -692050 -778335 -557422 -247017 23581
8912 23581 246016 395514 475669 540283 613495 630388 524886 362820 342458 493739 606302
8901 606302 618589 557301 392679 124906 -209251 -584893 -875888 -950073 -880459 -757150
8891 -757150 -544004 -264871 -80493 -42363 -154865 -404132 -653153 -838920 -984194 -1100022
8881 -1100022 -1144873 -1113363 -994025 -781065 -582067 -489434 -428091 -234755 84725 352985
8871 352985 443146 389035 192814 -87949 -342644 -521655 -698438 -942106 -1133542 -1141319
8861 -1141319 -1002284 -767515 -467929 -154752 95826 258332 370926 417437 377550 260530
8851 260530 29221 -334626 -707152 -901338 -794003 -416016 89550 587182 917920 1029197
8841 1029197 969724 758187 420146 96971 -68966 -104229 -166036 -304689 -395445 -373649
8831 -373649 -257327 -38687 289095 551513 526221 276396 49079 -56885 -106251 -152237
8821 -152237 -206160 -290681 -336054 -257622 -165773 -224995 -321660 -290606 -176150 -127168 -207794
8810 -207794 -365127 -551247 -634866 -622586 -710214 -914794 -1053399 -1009508 -1024839 -1255901 -1455515
8799 -1455515 -1462296 -1299457 -1018340 -692431 -393934 -185221 13782 314723 626887 861050
8789 861050 992399 894844 515510 -44391 -571140 -836202 -838955 -646260 -306315 -28847
8779 -28847 31273 -37711 -36783 36215 83244 199533 425271 586117 593288 527698 460142 425299
8767 425299 432982 445327 399266 269948 83053 -49330 -104192 -178302 -229138 -182821 -119133
8756 -119133 -146479 -263032 -340670 -238310 -17261 105860 -10063 -364399 -721010 -838024
8746 -838024 -768657 -605778 -460864 -590975 -985427 -1272015 -1255438 -1083756 -1011117 -1051321
8736 -1051321 -978042 -708317 -359116 -75797 127903 337823 487588 460112 305661 161964
8726 161964 7038 -202925 -398359 -506124 -453964 -258304 -50251 130167 316440 506957
8716 506957 571628 367786 52626 -152994 -218530 -193244 -58165 69931 -43641 -329898
8706 -329898 -520523 -476292 -282908 -193945 -368181 -699657 -999101 -1205470 -1327635 -1369748
8696 -1369748 -1309466 -1149004 -863517 -393841 111667 409521 484660 451348 357740 233740
8686 233740 140324 115313 175693 379765 760577 1205807 1588583 1770033 1685020 1542609
8676 1542609 1619005 1786587 1775068 1627192 1518289 1472048 1345622 1070984 853633 819862
8666 819862 797979 677447 506961 315756 220249 349589 621423 895018 1133480 1237833
8656 1237833 1087801 798339 535928 344538 207404 132611 74740 -107866 -408330 -647008
8646 -647008 -752228 -768134 -783788 -853544 -1014179 -1224082 -1373825 -1409661 -1271317 -971740
8636 -971740 -675691 -519800 -425743 -304860 -241480 -279909 -269254 -68766 193046 306085
8626 306085 180542 -65928 -304462 -489948 -491024 -249596 111277 464049 795897 1091347
8616 1091347 1260831 1338840 1470374 1686543 1891073 1960057 1833335 1476230 897256 277273
8606 277273 -152938 -409937 -588895 -674094 -710981 -797440 -951519 -1148307 -1341562 -1537655
8596 -1537655 -1774184 -1923226 -1857434 -1569336 -1098818 -589337 -197051 -3946 44772 68045
8586 68045 146008 248318 291947 241928 217103 378064 653767 825384 756742 497951 176533
8575 176533 -195217 -658478 -1110581 -1433455 -1626815 -1722752 -1660025 -1448524 -1285829 -1280437
8565 -1280437 -1320673 -1260774 -1096703 -916802 -862517 -977515 -1103987 -1084535 -921600 -712567
8555 -712567 -531196 -417794 -391604 -497398 -683437 -783245 -637817 -315523 -50282 18734
8545 18734 -97054 -268977 -311665 -132152 113290 162959 -84341 -462878 -751873 -839076
8535 -839076 -792992 -686576 -507052 -352244 -310195 -329656 -301684 -171368 -23888 95055
8525 95055 249243 471891 758549 1059759 1303552 1394416 1336153 1234883 1149164 1112653 1144185
8514 1144185 1198560 1176899 1097499 1034222 859231 506111 146585 -28945 -25705 30197 99913
8503 99913 224961 267449 137396 -10144 -77238 -101462 -156515 -308352 -507117 -690514 -909458
8492 -909458 -1100243 -1128138 -992871 -841767 -779093 -843808 -962800 -977573 -859785 -693115
8482 -693115 -631161 -682743 -640437 -415282 -178712 -89585 -153007 -278198 -340534 -256036 -148834
8471 -148834 -223297 -382466 -407378 -308351 -208941 -255824 -538217 -886114 -1086235 -1152900 -1250892
8460 -1250892 -1447921 -1663097 -1758583 -1635169 -1398049 -1219317 -1180435 -1315163 -1568747 -1859560
8450 -1859560 -2092595 -2090179 -1763292 -1247202 -741272 -301582 122991 444658 490121 284093
8440 284093 5902 -211007 -355810 -401172 -321588 -223517 -259422 -448073 -660664 -816461
8430 -816461 -901845 -961624 -1134334 -1493868 -1917853 -2169687 -2108013 -1877433 -1613898 -1312707
8420 -1312707 -1060585 -910529 -768610 -599406 -457149 -366419 -325511 -326587 -382020 -402088 -283029
8409 -283029 -68321 166778 412034 611308 657380 489080 181369 -117946 -388348 -681620
8399 -681620 -992780 -1210412 -1269810 -1261012 -1189719 -957096 -639678 -345165 -120922 5846
8389 5846 129074 286644 351348 255787 52053 -194629 -472092 -737622 -926989 -1061037
8379 -1061037 -1181979 -1223526 -1140735 -1033790 -928310 -799382 -743277 -804112 -944213 -1102942
8369 -1102942 -1244761 -1380588 -1443544 -1357034 -1253488 -1211064 -1081251 -876972 -616104 -284467
8359 -284467 -95240 -81169 -56907 13439 48197 39705 83155 310781 652038 851629 800500
8348 800500 635841 524722 473050 521919 650849 657550 534377 427763 330950 189922 15296
8337 15296 -157382 -295235 -355227 -421442 -522134 -527733 -468719 -443289 -391715 -216731 49110
8326 49110 271899 453225 671619 941840 1160167 1185787 1088335 1009059 985735 917091 745359
8315 745359 619594 592907 513708 285341 -42471 -273243 -182450 180652 553981 792808
8305 792808 946313 974696 751762 438695 334154 488106 720939 814559 760326 621546
8295 621546 414798 99787 -296536 -628115 -866309 -1063363 -1120278 -983216 -699931 -339722
8285 -339722 -137615 -226363 -453432 -518783 -354732 -179200 -133679 -228966 -417931 -613041
8275 -613041 -763465 -826566 -713853 -327723 219855 647105 787936 663579 474468 480905
8265 480905 691001 855651 817966 659488 435974 122927 -220867 -415251 -362843 -238705
8255 -238705 -197066 -125796 84622 294160 246175 -28028 -302993 -420466 -308828 -46202
8245 -46202 144986 11033 -382819 -689574 -689046 -422232 -76040 175583 300153 411777
8235 411777 539847 606512 533305 320682 90391 -10978 64601 242313 331332 211020
8225 211020 -11583 -292714 -657518 -975258 -1017768 -715071 -257154 120999 343518 434129
8215 434129 451578 547602 749033 861086 808063 739407 833955 1057626 1145815 966703 577865
8204 577865 56778 -378170 -508509 -418435 -283460 -204856 -181336 -143769 -53277 77808 240997
8193 240997 379733 426765 441086 504311 571781 438765 54532 -410651 -844910 -1137304
8183 -1137304 -1144071 -907188 -666125 -646349 -803755 -881546 -703116 -347900 -28131 93534
8173 93534 -6625 -220354 -429101 -554402 -490998 -207942 101344 275148 366452 474003
8163 474003 582963 642011 603569 438662 200996 39614 56290 160124 164309 -1611 -276092
8152 -276092 -505985 -622635 -598887 -418164 -182565 84115 475405 979617 1430868 1634062
8142 1634062 1579940 1452129 1334281 1087392 676685 318666 92869 -85244 -90219 175156
8132 175156 522146 724737 738245 599513 317578 -15389 -123783 177911 651555 925047
8122 925047 1025086 1183210 1330842 1363131 1286845 1111601 897732 633241 281869 15212
8112 15212 92134 442326 748494 797991 546955 127202 -310294 -671367 -893898 -1038440
8102 -1038440 -1196567 -1394667 -1550597 -1512033 -1295564 -1004555 -686976 -304410 149381 541211
8092 541211 775969 888150 924891 796048 390202 -100117 -405547 -486029 -459426 -411844
8082 -411844 -415318 -474240 -530676 -464364 -237092 71350 363221 601026 795564 945841 1106169
8071 1106169 1262564 1310089 1293207 1304682 1285394 1152615 868520 486796 192081 103819
8061 103819 100518 -42477 -346641 -653604 -793697 -734286 -544499 -276934 18276 344509
8051 344509 666997 916514 1077118 1130957 993497 703566 417744 232481 255291 519366
8041 519366 810145 832029 533492 61438 -451310 -823443 -917425 -830242 -714155 -647209
8031 -647209 -655144 -679621 -687571 -725653 -745909 -750346 -830041 -927068 -942754 -860798 -742313 -503630
8019 -503630 -100893 321924 713905 1101028 1393729 1577737 1703855 1708426 1586964 1423317
8009 1423317 1233283 969255 598874 109418 -417202 -837508 -1033624 -1050827 -999748 -913992
7999 -913992 -775842 -562102 -371404 -333452 -360750 -301188 -212958 -277672 -445703 -494913 -403840
7988 -403840 -303143 -197747 -46172 197937 514970 652468 492563 258243 159549 171874
7978 171874 266222 372421 334165 76025 -345165 -706540 -863810 -853429 -761348 -634447
7968 -634447 -428822 -184253 18855 209419 412515 542606 504427 345567 132734 -89175
7958 -89175 -116319 199271 644686 899004 892601 764519 579847 285856 -104989 -481296
7948 -481296 -766877 -957208 -1055296 -1085401 -1081108 -1120437 -1244621 -1417659 -1584650 -1740296 -1891722
7937 -1891722 -1865587 -1534735 -989997 -418125 57260 424826 741601 1104768 1486546 1701959
7927 1701959 1684473 1477743 1177745 987762 998710 1066624 1042490 944391 802272 625426
7917 625426 572529 712811 917731 1033121 945265 688967 491988 530372 690973 852014
7907 852014 1009788 1204870 1421030 1539942 1531692 1472077 1390060 1239059 986811 641529
7897 641529 266720 -21220 -150788 -182300 -236068 -320480 -359506 -315824 -227946 -140659 -49965
7886 -49965 -11761 -19189 15004 91280 162217 235493 330184 437523 534203 634830 665909 503901
7874 503901 237857 -79571 -463653 -906227 -1345063 -1702326 -1885202 -1742266 -1268644 -729710
7864 -729710 -374960 -123231 203725 576543 849389 976790 1116506 1296186 1279893 988602
7854 988602 596259 242306 52639 30662 -18359 -135853 -238915 -291638 -294874 -343527 -554390
7843 -554390 -902888 -1204359 -1335144 -1308714 -1215782 -1129302 -1080213 -1133696 -1283555 -1459704 -1636860
7832 -1636860 -1850394 -2003731 -1863715 -1412792 -911896 -590342 -436349 -381782 -450114 -623489
7822 -623489 -732581 -694833 -541981 -411621 -413202 -397588 -225666 43697 281683 483272
7812 483272 663258 765147 769533 666778 474459 242726 -7580 -83004 119682 432628
7802 432628 663611 724101 695368 650398 595119 463100 136082 -366828 -835030 -1098077
7792 -1098077 -1169910 -1145461 -1075890 -1023006 -968845 -767317 -462098 -316658 -404270 -543892 -625941
7781 -625941 -662643 -658475 -551663 -365773 -155543 96648 384635 697747 964072 1212217
7771 1212217 1516496 1786474 1852555 1743825 1663982 1735800 1892899 1922968 1738976 1511319
7761 1511319 1336580 1158898 994007 829034 705587 684232 639049 468314 216842 -38729
7751 -38729 -281274 -477042 -594814 -639168 -589129 -442846 -196432 141493 427341 507514
7741 507514 482860 485170 504386 520383 591618 775550 1049966 1343230 1571333 1723201 1884450
7730 1884450 2052149 2151168 2211126 2271256 2282577 2138732 1752938 1176189 647726 363083
7720 363083 308453 428816 664237 852246 836709 622601 325999 70482 -137641 -269279
7710 -269279 -280091 -299338 -440333 -698862 -1029295 -1288731 -1363945 -1313742 -1168354 -832009
7700 -832009 -287494 293748 726281 893426 788044 503689 184345 -12292 -97347 -88574
7690 -88574 26405 156130 236553 290993 359046 422710 435125 497782 630230 746064 750418
7679 750418 544709 277069 141442 69878 51415 179457 424396 614419 647238 572844
7669 572844 365798 15293 -225262 -192742 -19114 136721 185303 145027 28558 -179989
7659 -179989 -375092 -396053 -111383 439889 952035 1186016 1149138 985971 790493 651867
7649 651867 645058 746863 935917 1106125 1219839 1337042 1429691 1515877 1611353 1619371 1442894
$$ [...]
##END NTUPLES=NMR SPECTRUM
##END=
