##TITLE=C13_IAMT-S27
 CDCl3,23000 sc

 30.5.2019
##JCAMPDX= 6.0         $$ Bruker NMR JCAMP-DX V2.0
##DATA TYPE= NMR SPECTRUM
##DATA CLASS= NTUPLES
##ORIGIN= UXNMR, Bruker Analytische Messtechnik GmbH
##OWNER= root
$$ XWIN-NMR		Version 3.5
$$ Fri May 31 12:09:27 2019 Russian Standard Time (UT+4h)  she@DPX200
##.OBSERVE FREQUENCY= 50.3278965144739
##.OBSERVE NUCLEUS= ^13C
##.ACQUISITION MODE= SIMULTANEOUS
##.ACQUISITION SCHEME= undefined
##.AVERAGES= 23000
##.DIGITISER RES= 17
##SPECTROMETER/DATA SYSTEM= spect
##.PULSE SEQUENCE= zgpg30
##.SOLVENT NAME= CDCl3
##.SHIFT REFERENCE= (INTERNAL, CDCl3, 0, 225.262)
##AUDIT TRAIL= $$ (NUMBER, WHEN, WHO, WHERE, WHAT)
$$ ##TITLE= Audit trail, XWIN-NMR		Version 3.5
$$ ##JCAMPDX= 5.01
$$ ##ORIGIN= Bruker BioSpin GmbH
$$ ##OWNER= she
$$ F:/spectra/data/she/nmr/c13/1/pdata/1/auditp.txt
$$ ##AUDIT TRAIL=  $$ (NUMBER, WHEN, WHO, WHERE, WHAT)
(   1,<2019-05-31 12:08:14.32 +0400>,<she>,<DPX200>,
      <created by zg, POWCHK disabled, PULCHK disabled
       terminated by command 'halt'
       configuration hash MD5:
       00 E9 B6 7A A2 85 ED C7 34 08 36 98 17 FE 4E 26
       data hash MD5: 32K
       6E 70 E1 55 A0 77 5D 89 51 0B B8 EE 83 71 DB 65>)
(   2,<2019-05-31 12:08:23.10 +0400>,<she>,<DPX200>,
      <Start of raw data processing
       efp BC_mod = 2 LB = 1 FT_mod = 6 PKNL = 1 PHC0 = -398.2569 PHC1 = 27.80641 SI = 32K 
       data hash MD5: 32K
       F5 24 D8 9C FD D3 B3 00 19 C1 C2 68 C4 F4 F8 D3>)
(   3,<2019-05-31 12:08:25.85 +0400>,<she>,<DPX200>,
      <abs ABSG = 5 
       data hash MD5: 32K
       B2 57 C4 92 8E 12 25 87 09 9C E1 A1 90 19 42 39>)
(   4,<2019-05-31 12:08:42.65 +0400>,<she>,<DPX200>,
      <pk PHC0 = -0.09074131 PHC1 = 0 
       data hash MD5: 32K
       1A 9B 4C A0 72 A3 82 C9 FA 66 A7 1A DB 87 3C E9>)
(   5,<2019-05-31 12:08:51.50 +0400>,<she>,<DPX200>,
      <abs ABSG = 5 
       data hash MD5: 32K
       B6 96 05 5D B2 51 29 72 53 8F 0E 0C E1 FF 79 67>)
$$ ##END=
$$ 
$$ hash MD5
$$ 3D AC 45 89 A3 BD E2 9F 61 99 8A A8 22 00 C3 ED
##$RELAX= 
##$RELAX= 
##$RELAX= 
##$RELAX= 
##$RELAX= 
##$RELAX= 
##$RELAX= 
##$RELAX= 
$$ Bruker specific parameters
$$ --------------------------
##$DU= <F:/spectra>
##$EXPNO= 1
##$NAME= <c13>
##$PROCNO= 1
##$TYPE= <nmr>
##$USER= <she>
##$AMP= (0..31)
100 100 100 100 100 100 100 100 100 100 100 100 100 100 100 100 100 100 
100 100 100 100 100 100 100 100 100 100 100 100 100 100 
##$AQSEQ= 0
##$AQ_mod= 1
##$AUNM= <au_zg>
##$AUTOPOS= <>
##$BF1= 50.322709
##$BF2= 200.13
##$BF3= 50.322709
##$BF4= 500.13
##$BF5= 500.13
##$BF6= 500.13
##$BF7= 500.13
##$BF8= 500.13
##$BYTORDA= 1
##$CFDGTYP= 0
##$CFRGTYP= 5
##$CHEMSTR= <none>
##$CNST= (0..31)
1 1 145 1 1 1 1 1 1 1 1 1 1 1 1 1 1 1 1 1 1 1 1 1 1 1 1 1 1 1 1 1 
##$CPDPRG= <waltz16>
##$CPDPRG1= <>
##$CPDPRG2= <waltz16>
##$CPDPRG3= <>
##$CPDPRG4= <mlev>
##$CPDPRG5= <mlev>
##$CPDPRG6= <mlev>
##$CPDPRG7= <mlev>
##$CPDPRG8= <mlev>
##$CPDPRGB= <>
##$CPDPRGT= <>
##$D= (0..31)
$$ [...]
##$SUBNAM4= <"">
##$SUBNAM5= <"">
##$SUBNAM6= <"">
##$SUBNAM7= <"">
##$SUBNAM8= <"">
##$SUBNAM9= <"">
##$SW= 239.972172938263
##$SWIBOX= (0..15)
0 1 3 0 0 0 0 0 0 0 0 0 0 0 0 0 
##$SW_h= 12077.2946859903
##$TD= 32768
##$TD0= 1
##$TE= 0
##$TE2= 300
##$TE3= 300
##$TEG= 300
##$TL= (0..7)
120 120 120 120 120 120 120 120 
##$TP= (0..7)
150 150 150 150 150 150 150 150 
##$TP07= 0
##$TPNAME0= <>
##$TPNAME1= <>
##$TPNAME2= <>
##$TPNAME3= <>
##$TPNAME4= <>
##$TPNAME5= <>
##$TPNAME6= <>
##$TPNAME7= <>
##$TPOAL= (0..7)
0.5 0.5 0.5 0.5 0.5 0.5 0.5 0.5 
##$TPOFFS= (0..7)
0 0 0 0 0 0 0 0 
##$TUNHIN= 0
##$TUNHOUT= 0
##$TUNXOUT= 0
##$USERA1= <user>
##$USERA2= <user>
##$USERA3= <user>
##$USERA4= <user>
##$USERA5= <user>
##$V9= 5
##$VALIST= <valist>
##$VCLIST= <CCCCCCCCCCCCCCC>
##$VD= 0
##$VDLIST= <DDDDDDDDDDDDDDD>
##$VPLIST= <PPPPPPPPPPPPPPP>
##$VTLIST= <TTTTTTTTTTTTTTT>
##$WBST= 1024
##$WBSW= 4
##$XGAIN= (0..3)
0 0 0 0 
##$XL= 0
##$YL= 0
##$YMAX_a= 139967733
##$YMIN_a= -119578503
##$ZGOPTNS= <>
##$ZL1= 120
##$ZL2= 120
##$ZL3= 120
##$ZL4= 120
##$ABSF1= 225.2625
##$ABSF2= -14.73494
##$ABSG= 5
##$ABSL= 3
##$ALPHA= 0
##$AQORDER= 0
##$ASSFAC= 0
##$ASSFACI= 0
##$ASSFACX= 0
##$ASSWID= 0
##$AUNMP= <proc_1d>
##$AZFE= 0.1
##$AZFW= 0.5
##$BCFW= 0
##$BC_mod= 2
##$BYTORDP= 0
##$COROFFS= 0
##$CY= -3
##$DATMOD= 1
##$DC= 0
##$DFILT= <>
##$DTYPP= 0
##$F1P= 0
##$F2P= 0
##$FCOR= 0.5
##$FTSIZE= 32768
##$FT_mod= 6
##$GAMMA= 0
##$GB= 0
##$INTBC= 1
##$INTSCL= 4.134877e-10
##$ISEN= 128
##$LB= 1
##$LEV0= 0
##$LPBIN= 0
##$MAXI= 10000
##$MC2= 0
##$MEAN= 0
##$ME_mod= 0
##$MI= 0.1934396
##$NCOEF= 0
##$NC_proc= 3
##$NLEV= 6
##$NOISF1= 120.0001
##$NOISF2= 80.00006
##$NSP= 0
##$NTH_PI= 0
##$NZP= 0
##$OFFSET= 225.2625
##$PC= 1.4
##$PHC0= -398.3476
##$PHC1= 27.80641
##$PH_mod= 1
##$PKNL= yes
##$PPARMOD= 0
##$PSCAL= 0
##$PSIGN= 0
##$REVERSE= no
##$SF= 50.3225993700027
##$SI= 32768
##$SIGF1= 140
##$SIGF2= 120
##$SINO= 11.81781
##$SIOLD= 32768
##$SREGLST= <13C.CDCl3>
##$SSB= 0
##$STSI= 32768
##$STSR= 0
##$SW_p= 12077.2946859903
##$SYMM= 0
##$S_DEV= 0
##$TDeff= 32768
##$TDoff= 0
##$TI= <>
##$TILT= no
##$TM1= 0
##$TM2= 0
##$TOPLEV= 0
##$USERP1= <user>
##$USERP2= <user>
##$USERP3= <user>
##$USERP4= <user>
##$USERP5= <user>
##$WDW= 1
##$XDIM= 32768
##$YMAX_p= 313742003
##$YMIN_p= -1220990
$$ End of Bruker specific parameters
$$ ---------------------------------
##NTUPLES= NMR SPECTRUM
##VAR_NAME=  FREQUENCY,     SPECTRUM/REAL,   SPECTRUM/IMAG
##SYMBOL=    X,             R,               I
##VAR_TYPE=  INDEPENDENT,   DEPENDENT,       DEPENDENT
##VAR_FORM=  AFFN,          ASDF,            ASDF
##VAR_DIM=   32768,         32768,           32768
##UNITS=     HZ,            ARBITRARY UNITS, ARBITRARY UNITS
##FACTOR=    0.368581032318806, 1,           1
##FIRST=     11335.7943870128, 0,            0
##LAST=      -741.500298977453, 0,           0
##MIN=       -741.500298977453, -1220990,    0
##MAX=       11335.7943870128, 313742003,    0
$$ Real data points
##PAGE= N=1
##DATA TABLE= (X++(R..R)), XYDATA
$$ [...]
18349 -105727 -92447 -206256 -327927 -212686 -88858 85080 324919 338374 71713 -101847
18339 -101847 -148645 -190353 -298595 -410606 -473019 -275983 -77245 -115139 -167344 -136613 -254939
18328 -254939 -608075 -691494 -376908 9869 211349 182425 153827 125399 94839 217903
18318 217903 449910 460086 224747 55526 -59068 -220641 -325151 -460529 -514588 -303099
18308 -303099 -81697 78363 276359 264177 177352 95391 -63450 -163265 -219735 -208665 -99408
18297 -99408 236120 513281 508003 390581 258054 259442 301204 278107 523206 699788 643332
18286 643332 365907 118943 319032 642782 639292 432508 281975 172521 71063 83584
18276 83584 197212 290867 198816 73023 127706 75273 -178374 -340583 -99516 177741
18266 177741 198572 134216 -35230 -230094 -186428 -57105 113803 265144 347190 265763
18256 265763 176803 98735 159951 267274 217233 269823 419887 464170 493579 479913 303445
18245 303445 -51166 -229132 -291760 -405499 -255550 -146712 -216363 -129553 -176651 -315475
18235 -315475 -300336 -66485 196714 219678 111949 45942 192316 109553 -127204 -161712
18225 -161712 -13995 55264 -56402 -170551 -141854 21677 45230 20960 -97738 -109077
18215 -109077 -21495 42677 -63668 107292 356372 385527 298661 167068 79776 21499 59002
18204 59002 55471 -91557 -302084 -263993 -159658 -176915 -238389 -191875 -227572 -300239 -387114
18193 -387114 -321094 -311206 -363340 -270534 -79582 156912 229409 127961 -34422 -278506 -369693
18182 -369693 -234039 67749 185680 29849 69496 395726 818181 1073033 1244892 1238688
18172 1238688 966680 724682 752676 1230096 2055304 2996511 4143478 4444452 3420206
18163 3420206 2597765 2215841 2041094 2032636 2232969 2908068 4179354 5293343 4799616
18154 4799616 3457096 2562634 2079259 1901390 1814791 1783834 1866956 2475431 3323225 4170092
18144 4170092 5413039 6995276 8109517 7997786 6613880 4836642 3549745 2789736
18136 2789736 2329118 2025529 1716611 1547650 1581215 1455464 1191294 1040029 949423 838158
18126 838158 940420 1059178 1050884 1029931 1188514 1336196 1290896 1441471 1872873 2484198
18116 2484198 2996404 3156943 3287017 3909059 5277754 7068383 9532212 12538039 15661597
18107 15661597 17578527 16096114 12624418 9517551 7264099 5569051 4436757 3808135
18099 3808135 3207369 2841262 2708564 2591182 2648043 2826845 3124736 3518953 4266439 5403802
18089 5403802 6837855 8745619 11346835 14644433 17480508 17364095 14431399 10894108
18081 10894108 8066127 6290231 5020138 4036702 3392555 2829511 1981258 1401890 1359093
18072 1359093 1433934 1291128 1072057 965181 993235 1129759 1205817 1246900 1431718 1375584
18062 1375584 1312749 1348315 1355171 1569680 1835063 2211328 3199468 4289274 4057296 3056586
18052 3056586 2391390 1870082 1324850 1001088 820041 564436 329626 207856 272402 329429
18042 329429 154507 95903 128309 91465 128048 157361 49205 93277 184009 326198 333541
18031 333541 -17962 -187607 -81522 110441 250715 321899 450921 512375 454791 530206
18021 530206 761115 945279 981498 893892 620346 424474 410624 656463 760828 533583
18011 533583 333326 177579 135214 205035 454391 812602 878165 618419 309428 210473
18001 210473 135876 186116 148877 -90903 -361059 -375681 -274269 -171831 -136240 -60560 263118
17990 263118 320022 326001 374797 232238 -87294 -238028 -243260 -201117 -60314 35400 118719
17979 118719 222914 206553 144227 15859 -75190 -180891 -98517 -114401 -82353 235156 333194
17968 333194 176642 65081 144925 321738 333680 222856 165814 -83644 -348968 -759355
17958 -759355 -933207 -572309 -35628 177719 272566 207162 188739 111859 -184331 -400986
17948 -400986 -341786 -287085 -301143 -364892 -381486 -233332 -18221 -32755 -232741 -161840 -13114
17937 -13114 86484 68151 109689 198491 345640 467934 267269 -188996 -228632 -120012 -228884
17926 -228884 -394936 -293032 -94514 9870 106781 177360 392027 556074 647198 649366
17916 649366 403245 209111 96034 50968 -2093 -210231 -395326 -474196 -441802 -400659
17906 -400659 -339223 127592 527858 677382 739413 650166 646699 687874 596187 458601 391308
17895 391308 244583 183465 153313 89627 41713 -90107 -423998 -784428 -784168 -494354 -278886
17884 -278886 -230411 -258012 -330867 -302205 -100076 183455 308071 127659 84046 3121 -255737
17873 -255737 -371539 -515397 -584025 -504000 -291885 -101888 -1754 73703 99538 46187
17863 46187 -1457 50500 126217 270751 323392 210921 -17243 -167321 -117329 144226 419223
17852 419223 527205 462628 188218 5575 -135324 -163408 18505 183452 279483 370179
17842 370179 521462 512779 419987 274212 82238 88720 109062 -28501 -96130 -113607 -1292
17831 -1292 188803 265719 25040 -289436 -604667 -701359 -547767 -290782 -96066 -36977
17821 -36977 -135355 -266374 -111121 -45172 -183395 -265594 -317417 -382885 -92851 203020 402196
17810 402196 433315 256915 192341 277955 461423 587324 543021 633570 694137 579302 354772
17799 354772 164161 67714 92915 -69566 -267833 -296961 -207127 -9735 123610 -17017
17789 -17017 -82066 -170369 -200610 -261384 -378263 -391262 -354518 -355827 -380616 -213334 39497
17778 39497 71051 -72485 -302946 -483737 -342448 -46684 356971 602206 596638 357281
17768 357281 233590 384207 353606 280415 303899 389015 455565 473832 452862 459424 656208
17757 656208 708192 501750 382852 176961 -142209 -320509 -302628 -366512 -557690 -665844
17747 -665844 -432075 -209755 -79991 170210 133595 -47167 -98101 -20839 -57109 -165345
17737 -165345 -228985 -179703 -234706 -203162 -136294 -114560 -49613 -264682 -380175 -308472 -136194
17726 -136194 23050 130521 187955 150697 -28465 -149194 -163009 -397532 -518157 -395156
17716 -395156 -215657 -38428 62844 -76048 -110586 -73107 -16714 -31555 -211763 -413201
17706 -413201 -185019 245926 424053 475497 545113 554755 540972 263854 -236705 -463982
17696 -463982 -339065 -199503 -196839 -196474 -147447 28225 149358 138814 83087 90068 -165037
17685 -165037 -447334 -368330 -170173 -53653 117214 270886 260434 98600 -83442 -218144
17675 -218144 -312757 -328235 -303822 -179141 -10351 -83322 20080 279455 380212 346925
17665 346925 304813 155906 29891 65627 43417 39583 205090 322352 217677 148761 -49514
17654 -49514 -68888 -118651 -263824 -335202 -425607 -591456 -596697 -532241 -510952 -420554 -374085
17643 -374085 -256684 -164393 -177629 -177312 -270605 -328506 -159610 -113154 -54396 87796 209331
17632 209331 280218 233013 36834 -119130 -178444 -142275 -32418 -44603 71384 347373
17622 347373 567870 625834 587214 210444 13989 31392 39171 124385 140574 61458 -126940
17611 -126940 -348089 -342853 -485170 -639494 -686678 -677828 -674390 -745397 -619952 -436843 -262374
17600 -262374 56763 305967 494665 578060 609348 434100 193487 202060 262194 302640 291628
17589 291628 223318 68852 -14244 2721 -42296 -5853 -98834 -177117 -161509 -37015 121863
17578 121863 402 -211191 -332047 -172902 -186987 -290642 -169077 44761 226261 171532
17568 171532 -7370 34313 209500 346785 415865 330824 -38553 -149506 36884 112588
17558 112588 -27771 46873 182631 8345 -124232 -139909 -263026 -337689 -457880 -666683
17548 -666683 -598136 -325722 -151971 -233687 -513085 -514315 -398726 -311496 -28968 7249 -27614
17537 -27614 -69860 -28962 59710 184063 393696 394969 263507 115094 -72633 3743 40910
17526 40910 -22458 -7655 -210364 -212061 -54750 132939 274072 257845 165896 -55862 -343381
17515 -343381 -468108 -388370 -269861 -125723 -157964 -351628 -456741 -245819 -35843 -75714
17505 -75714 -255200 -270978 51502 390386 403411 236489 191157 341501 535445 617309
17495 617309 450001 310401 304611 5047 -463165 -810580 -863614 -734893 -585238 -561135
17485 -561135 -675693 -749929 -718499 -733150 -495967 -227752 65094 523189 579111 592394
17475 592394 897153 864835 445985 -143738 -639151 -757848 -479202 -176933 -220523 -257798
17465 -257798 -334934 -400051 -557624 -716888 -603049 -349820 -54819 -104662 -247222 -252301
17455 -252301 -183297 -29224 111355 188964 297604 414702 432832 210004 -60137 -68370
17445 -68370 110741 191425 174696 14267 -150978 -241365 -363074 -411526 -341087 -320932 -145832
17434 -145832 269703 429517 484418 452902 337034 228545 128241 -127847 -264427 -136794
17424 -136794 2424 -109584 -508618 -464590 -218540 -173101 -241119 -205144 -82607 -64667
17414 -64667 3856 -139025 -228263 -74926 202184 182305 61014 7202 -272140 -505840
17404 -505840 -419557 -152715 86573 268087 327490 151011 -85392 -113722 -12400 140614
17394 140614 180442 1377 -37356 -90662 -214354 -237271 -3549 98188 106822 232665 169460
17383 169460 86043 -51779 23188 17689 -138420 -225070 -142373 -139043 -208676 -167230 89821
17372 89821 330864 280575 141725 79373 241438 420069 452417 467258 297998 154144
17362 154144 178538 190509 151578 72261 -121112 -365059 -504840 -313735 -74692 -84553 -177908
17351 -177908 -177233 -245725 -278130 -254081 -123354 -10733 16884 -31347 -32618 -65801 -245841
17340 -245841 -247291 -100023 105205 302841 414089 213680 -42021 -282831 -432614 -343956
17330 -343956 -229495 -119335 205457 541712 591330 398331 387797 578649 678432 636544
17320 636544 423706 111774 36975 2351 51295 45614 -152778 -134170 213665 653830 788079
17309 788079 580662 251926 19888 2272 148173 187761 290896 83115 -157233 -339347
17299 -339347 -497435 -406990 -392669 -655810 -759503 -744962 -676376 -615994 -585416 -737972 -911591
17288 -911591 -963791 -657775 -200056 -57145 17101 209838 400555 468857 461086 488685 478236
17277 478236 378147 370222 301543 129793 91109 76439 -26060 -111671 -9557 196142 408280
17266 408280 570725 595907 454250 191344 36056 -36681 -197632 -277890 -181433 -9855
17256 -9855 54297 -108073 -60856 71296 40592 -19043 -28573 36267 303787 465066 230669
17245 230669 -61185 -138265 -3693 87262 13397 -217303 -249884 -315865 -497595 -681739
17235 -681739 -843791 -734006 -721884 -751591 -579777 -376409 -422215 -577804 -748241 -793475
17225 -793475 -779275 -580751 -471757 -410372 -295062 -309997 -408091 -335416 -153466 -118334 -184407
17214 -184407 -210450 -63554 76633 61491 152056 259789 269208 316134 312122 268767 185652
17203 185652 170351 -42251 -88135 183514 260777 381753 363473 167525 150060 114781 28365
17192 28365 -8169 46223 121148 -28253 -105957 -29546 27028 15475 75378 86109 -84311
17181 -84311 -174643 -119173 -97838 -246494 -462241 -552306 -338935 -326199 -383473 -289757 -235782
17170 -235782 -200615 -211308 -207435 -231286 -351865 -242012 7431 225487 170315 47794 21447
17159 21447 -80182 -97812 30746 206162 45880 -336373 -526246 -166720 20395 -88582
17149 -88582 -329696 -419600 -330466 -381427 -597420 -692021 -589539 -603747 -659255 -490176 -320318
17138 -320318 -305162 -433601 -454857 -426676 -175493 -14793 79048 -33695 -229390 -291169
17128 -291169 -223852 -359277 -550894 -672225 -926497 -1072856 -907292 -780525 -736065 -670258
17118 -670258 -491429 -269278 -211841 -342416 -371793 -480129 -556878 -586017 -490161 -247315
17108 -247315 -233636 -269307 -169260 -365811 -498230 -451840 -358310 -353001 -445330 -377975 -390537
17097 -390537 -428355 -355046 -194003 -15288 129241 127127 13417 -90213 183153 393465
17087 393465 479221 609528 521870 219435 25759 -38079 196413 499194 373191 211077
17077 211077 323304 249748 53495 -70866 -280328 -633944 -626631 -354129 -132176 -158604
17067 -158604 -82214 157335 300508 371518 384282 265632 125928 32282 11000 -33192 173842
17056 173842 346233 223535 85763 77785 110362 128009 15991 -56670 -38742 -34608 59527
17045 59527 -3652 -80219 40544 56945 -162065 -173622 -45012 -36674 -150124 -340664 -488340
17034 -488340 -486068 -325821 -171868 -21316 246121 319171 319137 454105 536089 532153 523979 429599
17022 429599 194784 -83741 -167287 -216335 -419291 -489028 -533557 -554350 -444111 -305714
17012 -305714 -192418 -250368 -573223 -556654 -510152 -582478 -418004 -112200 -13244 -12995 91147
17001 91147 241084 87712 -166587 -343015 -464422 -625285 -641287 -447528 -206313 -92442
16991 -92442 -102695 -71574 48583 160639 248550 366858 475781 359924 252756 284207
16981 284207 272804 162277 115225 31825 -81228 47433 260570 191195 -138830 -295168
16971 -295168 -244840 83794 238045 46729 -250963 -485496 -602634 -625946 -479807 -268048
16961 -268048 -179347 -131005 -70224 -27038 -45675 -33793 -47176 -135497 -155180 -163065 -199165 -34259
16949 -34259 250238 338600 266998 156927 243554 281507 194561 231273 271090 111146 94140
16938 94140 47728 53242 110585 172969 169733 -8049 -101563 -3183 89970 -50791 -92391 -84205
16926 -84205 -114882 -95902 -67278 -135160 -265812 -200735 64258 240789 441722 568742 400239
16915 400239 212006 311585 279675 172412 292458 234741 -117892 -121728 94595 59910 -34438
16904 -34438 -53462 43687 207399 368178 577362 485321 297399 86273 -71280 60897
16894 60897 440914 574492 587165 649398 600143 594625 714879 591946 70970 -354652 -548805
16883 -548805 -517500 -372540 -200860 -47639 9861 163773 411544 453449 371558 374741 500368
16872 500368 442370 314744 312315 139488 -116881 -155974 -179482 -248342 -280258 -232620 -227259
16861 -227259 -264069 -61069 -38688 -54893 188276 294812 376482 451896 328035 165181
16851 165181 95855 24009 -281760 -606778 -781896 -690066 -354348 -277245 -382239 -394218
16841 -394218 -322762 1548 391892 594846 658205 569736 370622 284935 218620 120444 -65244
16830 -65244 -153839 -211811 -159481 -31190 -57863 -110764 -163716 -182005 -109441 -4425 111792
16819 111792 330022 395705 444694 561614 500026 395780 261537 83500 -53969 -102079
16809 -102079 36343 119245 236398 178843 105855 159527 291949 240167 155632 103494 -75183
16798 -75183 -341288 -319043 -259424 -236186 -188226 -132825 -108290 -229492 -305504 -218879 -127499
16787 -127499 -195313 -207505 -178270 -208120 -86882 102696 199305 346621 279983 134997 -10230
16776 -10230 84261 192499 122770 -172792 -469380 -500876 -374248 -334742 -335844 -356999 -339718
16765 -339718 -184900 -266641 -477334 -573087 -500467 -211046 -129836 -83020 -42773 -186856 -386164
16754 -386164 -378519 -155027 -139695 -290918 -330703 -319063 -492246 -680228 -707811 -487855 -376327
16743 -376327 -414822 -479772 -452826 -339546 -164276 263791 500069 479990 442392 400291 313079
16732 313079 254440 144774 45052 -73375 -271237 -298109 -197589 -100950 -270772 -553056
16722 -553056 -833082 -1175896 -1127445 -637046 -170843 -11052 188190 342899 131837 -55315
16712 -55315 -207445 -319010 -416259 -502509 -489255 -423108 -302572 -312114 -355251 -168727 230886
16701 230886 558599 621256 375644 -43523 -235451 -222255 -290734 -189713 -145219 -204063
16691 -204063 -148022 -131402 44350 283731 364830 258356 190945 19871 66411 135544 -56292
16680 -56292 -275127 -423330 -142789 198552 310217 448705 458307 344541 279980 355987
16670 355987 486400 626447 551225 301852 -89404 -336942 -111558 9097 -38832 39327
16660 39327 -103993 -361695 -375178 -37318 273985 345886 472324 355775 228362 109466
16650 109466 40846 59468 -4055 -13598 -61937 -272467 -265410 -290961 -321102 -414444 -545517
16639 -545517 -544757 -418232 -362072 -221095 -86876 -148840 -187159 -313483 -563777 -602596 -475304
16628 -475304 -448549 -378934 -307104 -279830 -471567 -619071 -448188 -140813 226208 459116
16618 459116 336941 -8859 -162252 10251 279558 340895 231647 48809 10120 5704
16608 5704 44973 154754 136681 -6875 -58919 -157935 -232336 -210130 -250378 -292619 -362887
16597 -362887 -109454 -49091 -76060 35986 8184 70911 10235 -165711 -116972 185496 453009
16586 453009 503944 407907 109492 -88493 -80243 -136459 -181643 -68268 -22194 -11225 178985
16575 178985 150918 25803 -44590 -154687 -265929 -421963 -436388 -474659 -742755 -974459
16565 -974459 -940291 -830541 -647467 -464428 -432890 -580483 -626885 -448863 -143445 95541
16555 95541 145199 326074 374480 310975 300886 262907 283819 251099 45393 -70479 31883
16544 31883 117415 207295 407970 655697 675501 321784 -69926 -171859 -39145 -7691
16534 -7691 -78333 -19288 38167 75982 85580 187160 168941 -18549 -105496 -30498 35136 52783
16522 52783 41964 -30882 28905 135510 101917 171270 177706 50175 -2972 23928 31204 -141005
16510 -141005 -296052 -320886 -178364 -80154 -282699 -390818 -143131 10880 -39725 -176851
16500 -176851 -239422 -129766 -88347 22772 67140 37518 -53349 -188589 -328644 -300743 -223010
16489 -223010 -179111 -5148 314497 212820 -152533 -221111 -322992 -513875 -412886 -220959
16479 -220959 -106154 79232 314703 322587 158516 118890 75616 -46861 -115014 -28275 109916
16468 109916 301035 327318 352828 421073 203464 22609 23110 91655 -36663 -324924 -279961
16457 -279961 -2620 302384 407552 375923 384639 269206 95911 -12391 -22020 -38428 -84423
16446 -84423 -103165 -122341 -68013 86002 356063 616043 705093 459382 43882 -147353
16436 -147353 -208006 -52565 128926 -81323 -402624 -514399 -329568 -130236 46460 58536
16426 58536 -217955 -391612 -436773 -269745 -181993 -217834 -130130 37224 170428 156406 278978
16415 278978 389433 358485 72294 -311193 -355294 -229105 -369083 -517768 -518080 -401693
16405 -401693 -283045 -110488 21642 -113503 -284175 -301013 -3958 354150 165645 -51872
16395 -51872 -72187 -53236 -5232 -59849 -301933 -563458 -698441 -651860 -548044 -425570 -218886
16384 -218886 -114198 -264453 -535276 -698901 -604549 -505977 -505133 -503279 -523450 -386637 -253705
16373 -253705 -103351 33233 -14165 -66067 -103406 -114858 66681 383787 625540 459233
16363 459233 161192 -62080 -185229 -279850 -215770 -174783 -192392 -343886 -426511 -328133 -200314
16352 -200314 -197421 -243325 -82504 18185 -102221 -260377 -473664 -550621 -423708 -372154
16342 -372154 -320810 -298702 -236769 -67633 -79316 -294838 -369352 -344121 -183744 -18073 -230566
16331 -230566 -615024 -728702 -689471 -709330 -641361 -247975 178963 353207 288610 337917
16321 337917 304899 181001 147202 35424 -78636 -43950 -22136 -113932 -75809 -113161 -135098
16310 -135098 92093 220599 145806 106249 -64864 -372824 -361841 -346803 -345760 -309699 -216330
16299 -216330 -61148 26019 111074 189175 224132 140949 67425 -143081 -456116 -484871 -332651
16288 -332651 -79833 12212 152866 166195 -37135 -157637 -283333 -286538 -150287 -47171
16278 -47171 60417 -41577 -263659 -380320 -389310 -353195 -187677 -112036 -176843 -79972 -141646
16267 -141646 -386232 -403967 -252727 -107416 39507 111521 240602 368163 200751 -85260
16257 -85260 -171257 83455 279065 259512 292565 244724 245179 97960 10751 -49617 -273334
16246 -273334 -345227 -342317 -345399 -326704 -270896 -320490 -260957 -25240 32062 51749 41704 -57184
16234 -57184 -147544 -238152 -196125 -152395 -180010 -214591 -150114 -95261 -167891 19615 287160
16223 287160 273509 -152967 -376894 -321649 -228281 -149655 -278288 -312735 -221719 -247099 -223839
16212 -223839 -322962 -432584 -341168 -197494 -182396 -266894 -243012 -34120 131286 36319 -277251
16201 -277251 -451277 -605520 -751090 -599133 -501893 -241375 6174 79958 115433 -112525
16191 -112525 -254901 -344727 -302541 -182931 -152329 -244325 -291246 -279095 -122373 47302 -55239
16180 -55239 -320913 -338221 -165781 -15256 39422 57167 210208 406496 369901 204460
16170 204460 209861 261426 349171 407450 432583 373552 382469 563721 620828 203643 -325402
16159 -325402 -251332 -136541 -199692 -232009 -122520 -52708 -120782 39007 323459 265984 233569
16148 233569 204218 168090 239208 132543 -23803 -207397 -214655 -110854 -181652 -203685 -18099
16137 -18099 248920 342525 188842 21353 -79527 -39785 126918 407006 601180 435922
16127 435922 293755 286074 368340 564628 722361 668960 567762 410242 93842 -247918
16117 -247918 -415676 -523547 -539384 -725461 -885044 -751839 -403682 -30720 60478 -179365
16107 -179365 -378286 -382658 -395906 -391575 -85397 222843 307857 542683 654279 422719 263455
16096 263455 545169 759550 636240 319507 148184 14153 9766 169723 252957 287087
16086 287087 217191 114033 2085 -36908 59126 163845 133471 184122 221903 158261 78583
16075 78583 -81430 -149183 -197141 -213465 -272702 -259824 -212755 -121084 -171010 -293086 -395569
16064 -395569 -413315 -502216 -352311 -39494 72441 21784 82697 -25726 -176690 -112955
16054 -112955 -5450 71565 173807 98489 52169 127780 122090 149419 67415 -2859 -70578
16043 -70578 50525 201130 175089 198690 226771 276239 314534 306901 204559 -195135 -349417
16032 -349417 -358093 -374371 -444607 -436519 -119777 79373 286035 514981 384805 235415 101647
16021 101647 -34962 117081 283841 281362 293867 192680 99791 126955 -8035 -122616
16011 -122616 -108104 -113558 -146934 -318582 -158892 70808 129343 365315 414945 117398 -102114
16000 -102114 -38233 11819 -36226 -205737 -48030 272368 289063 60616 -40052 -13725
15990 -13725 127988 130804 -7395 11332 159689 -105469 -459646 -521037 -378008 -473985 -543262
15979 -543262 -534246 -704128 -782530 -541179 -302356 -225449 -216623 -25315 216969 411213 555155
15968 555155 672178 668456 526643 401015 420720 400059 234318 90892 57761 115328 -19030
15957 -19030 -74008 -36543 14448 208879 400672 599051 726699 747143 610717 372301
15947 372301 337289 237086 19373 -319284 -518572 -464039 -273049 -101377 -88672 -70321
15937 -70321 -155944 -392484 -595695 -376780 -191419 -278732 -257066 -203785 -361058 -472505
15927 -472505 -389566 -100584 216037 414284 441414 361442 369139 297459 284084 215732 131354
15916 131354 245710 450288 541021 540552 619733 434458 269884 279776 194362 65029 5283
15905 5283 7699 -17411 -155308 -128968 -55863 -52130 -232021 -228592 20945 87786 -631 -152505
15893 -152505 -242463 -310152 -354556 -374256 -228966 -51978 29398 -97595 -226937 -246646 -93717
15882 -93717 107785 140400 165566 391171 734370 825171 533085 234599 8245 -53076
15872 -53076 -39269 68203 121767 223105 377382 347339 214396 -106230 -290118 -305636
15862 -305636 -444755 -481646 -540509 -611831 -696441 -737813 -433551 -49604 185037 493424
15852 493424 591934 346632 131725 196276 135941 -83282 -165705 -165797 -98028 -45799 79831
15841 79831 229459 128551 -515 91442 127715 28561 199688 294718 225912 27102 -117162
15830 -117162 -310309 -366259 -210245 -43277 9102 -39062 -171342 -176116 -78981 175583 321241
15819 321241 269690 7788 -48477 -24461 -115702 -80977 70477 141145 33129 -60401 1442
15808 1442 107153 172617 236319 261172 312879 372869 271057 119270 179251 140678 -29674
15797 -29674 -94264 -130617 -159396 -132587 14735 36842 -52456 -229334 -550262 -768564 -811549
15786 -811549 -596547 -379519 -457910 -584730 -759696 -754421 -366575 -123758 -122432 -177620 -6108
15775 -6108 208728 208759 179235 158764 169506 217753 223400 136028 115380 160119 119797 162914
15763 162914 125606 79637 160948 355591 419998 308868 183668 62463 -11036 -195996
15753 -195996 -383518 -385009 -213062 -80127 -187937 -263110 -60268 82910 -944 -129407
15743 -129407 -130459 132463 301738 232796 255086 299309 267388 231671 106467 180121 430398
15732 430398 474065 282366 142579 -89655 -153886 -262122 -288274 -301921 -340220 -178609
15722 -178609 149157 410248 382507 329357 210709 50994 94009 303722 331505 193508
15712 193508 74352 41039 -117487 -273978 -296899 -326317 -213702 -106334 -133287 -316800
15702 -316800 -473114 -273623 22575 156697 -110641 -305637 -277173 -80685 -18933 98659
15692 98659 272915 393305 461100 399849 271809 147103 75400 62065 74543 129722 168490
15681 168490 222826 107304 -174307 -172893 105374 570185 906811 831408 439966 177878
15671 177878 168643 122636 -9619 -204164 -461986 -483119 -405876 -297204 -56895 -78293 -354845
15660 -354845 -534877 -401593 -200344 -173222 -151988 -113056 10788 224678 201931 92429
15650 92429 248423 421808 351737 212090 62717 -120592 -173574 -308168 -479726 -405668
15640 -405668 -326795 -299671 -266734 -302143 -549009 -699554 -499512 -440308 -442559 -227642 11466
15629 11466 121958 254250 410130 397319 296822 158735 -1729 -240192 -405182 -402960
15619 -402960 -289692 -29732 176542 232793 182265 12691 -214585 -385847 -295888 -327357
15609 -327357 -491769 -434229 -432138 -393965 -245165 -122646 -160168 -130175 20503 265081 299169
15598 299169 312782 262881 256776 212191 218717 151054 -8822 -170167 -157589 -21439 5830
15587 5830 -95365 -112027 87260 359591 596371 737636 646863 364555 158218 68148
15577 68148 -173301 -477732 -353225 -111341 -151236 -246564 -413629 -641797 -700738 -560969
15567 -560969 -524784 -498581 -465971 -283158 -46780 -71863 -100857 -133863 -171789 -208592 -276418
15556 -276418 -212564 -118055 -199546 -448255 -559844 -476679 -441895 -324211 -226672 -303230 -400314
15545 -400314 -440280 -417350 -501923 -499479 -412397 -211520 18168 -66557 -186806 -343967 -531216
15534 -531216 -615519 -502261 -364976 -172523 -132053 -268590 -192575 -14592 246960 479970
15524 479970 389038 310716 537721 738970 529142 409497 406221 169287 36529 111541
15514 111541 102477 -149337 -47349 279442 266384 94286 134257 227348 168525 -11292 -171431
15503 -171431 -187660 19356 238326 179384 -12364 -234245 -574429 -754932 -843369 -773074
15493 -773074 -524063 -161645 77190 116736 -71947 -187917 -112268 233212 557762 525507
15483 525507 350002 147553 -13299 42498 206529 298903 394399 318481 86241 -154109
15473 -154109 -196738 -121013 53320 49631 65425 -52689 -223591 63748 463530 591937
15463 591937 495162 468068 363217 162276 72541 118363 279275 380125 282249 98151
15453 98151 -45739 -45789 -116268 -239514 -301363 -224526 -83087 -94174 -249816 -372175 -467330
15442 -467330 -474799 -532817 -501220 -373066 -101855 129464 52545 54143 -949 -86463 -223905
15431 -223905 -504139 -580151 -632423 -662658 -526559 -457672 -460628 -375326 -286302 -194251 1889
15420 1889 100214 66546 73219 82333 -166547 -412704 -589808 -611043 -574589 -592844 -606596 -445402
15408 -445402 -250296 -174928 -195661 -98712 84992 279608 370949 321222 168523 123720 240455
15397 240455 264747 70354 -91191 -224202 -126819 25613 235503 242287 -13599 -23556 14332
15386 14332 140843 178446 -22322 -65096 -51767 -231516 -322738 -309016 -326087 -301724 -204885
15375 -204885 -94027 -39621 -9008 -10941 63134 92758 130522 57464 -38309 31238 109102
15364 109102 45331 -37995 607 -53874 -157300 -294827 -362004 -376040 -467869 -486526 -341788
15353 -341788 -34071 71174 45060 49292 233360 376156 364258 352546 332483 138465 -190665
15342 -190665 -420619 -391903 -404894 -336075 -245556 -329125 -302958 -350048 -425415 -282590 -304382
15331 -304382 -537934 -617477 -594048 -575786 -608491 -740739 -646512 -345324 -172686 -110308 -69677
15320 -69677 -308571 -363787 -267365 -248671 -226442 -260116 -202136 -22763 188293 230369 -9448
15309 -9448 -298976 -372234 -464730 -462297 -249848 -136744 -222944 -198338 59742 134474 -101895
15298 -101895 -319731 -221042 -10537 -113717 -137759 -47787 -107548 7630 308156 469708
15288 469708 534665 485896 282409 96725 53529 57775 -63747 -162347 -123559 -91576 -88015
15277 -88015 -129509 -123938 -27147 82909 -14794 -213724 -200227 -38109 61547 71400 40947
15266 40947 -25536 -103232 -32931 -108410 -134238 -28711 -61063 -281503 -435427 -442820 -441595
15255 -441595 -490202 -505416 -266931 -130455 -262668 -382501 -412102 -435829 -480404 -573737 -588916
15244 -588916 -305785 174979 431032 217253 -132363 -332560 -376093 -248127 -149772 -241037
15234 -241037 -255547 -28670 31528 22717 -28433 -81323 -99930 -82015 -174377 -252759 -144374
15223 -144374 6804 107752 380395 499819 477667 531741 379003 94836 130048 267817
15213 267817 290796 153046 -108900 -201221 -241374 -39334 268425 109208 -164248 -196713
15203 -196713 -76616 -36648 -108632 21179 177699 260821 210774 63802 -100621 -153014
15193 -153014 -332932 -378855 -150802 -18066 -72791 -49760 -150308 -314388 -218933 -107675
15183 -107675 -96374 -23494 65188 -15564 -315864 -477627 -468554 -272517 -118774 -101023 -2048
15172 -2048 28652 -243173 -386373 -131342 111648 153787 93825 89532 -59454 -197069 -357783
15161 -357783 -399238 -196524 108321 198225 8782 -68136 61664 55805 -140180 -284145
15151 -284145 -257776 -292869 -473049 -575130 -452664 -42978 170237 47901 -79113 57434
15141 57434 211166 176313 53886 -35370 -192421 -339152 -366455 -482774 -501904 -274212
15131 -274212 -161895 -247864 -225168 -97324 -70674 -120560 -191200 -138784 63882 236414 229386
15120 229386 239897 241825 253279 194472 248523 302170 273547 156734 156856 307170 505696
15109 505696 587394 536313 450918 413291 296172 44371 -210331 -448768 -440987 -401026 -313655
15098 -313655 -115473 27695 134327 420306 667201 721224 768904 740844 632622 374490
15088 374490 149878 -11801 -26406 -126904 -116239 92954 200994 -5924 -352030 -343128
15078 -343128 -286791 -381920 -279892 -110370 43033 122309 129398 73573 -186896 -359524 -512010
15067 -512010 -682033 -662660 -468814 -195890 -155249 -306252 -554411 -525747 -426870 -380151
15057 -380151 -195896 181803 176397 -120780 -331089 -415441 -332280 -132553 -107232 -206234 -101259
15046 -101259 -23896 7260 22657 -226795 -536234 -458204 -153685 -73233 38826 237158
15036 237158 337569 200548 -122318 -295570 -367735 -464955 -556752 -584492 -509132 -433883 -323716
15025 -323716 2894 76760 -203780 -287602 -361550 -706760 -793797 -564096 -323671 -125508
15015 -125508 -8250 185748 290095 199629 26763 -230438 -327051 -311562 -154684 -94084
15005 -94084 -56952 -61704 -38081 112339 99275 -47739 -29154 105523 361118 558966 639849
14994 639849 573581 423881 215384 -11461 -252568 -441928 -606110 -484958 -422389 -407001
14984 -407001 -226329 -131079 22869 -11295 -139764 -129379 -111037 47671 253964 239482
14974 239482 263910 335269 209077 24291 125375 450660 695211 863311 637270 315185
14964 315185 334094 396631 533688 623844 490771 399374 291874 52640 -81952 -12900
14954 -12900 19011 13912 -58978 -327537 -442241 -482220 -540010 -406610 -257327 -207111 -126046
14943 -126046 -103839 -91575 -97511 -210512 -184760 3465 175966 30518 -163773 -53111
14933 -53111 227194 338364 342873 236489 -13221 -91945 160796 285933 156076 5673
14923 5673 86554 62495 -36333 -98094 -172124 -52484 55478 -9727 -263215 -492437 -645893
14912 -645893 -784017 -647542 -368842 -316295 -363839 -320505 -318090 -260052 -192251 -10435 83566
14901 83566 -55463 -295888 -474833 -764265 -859955 -690217 -525665 -447667 -601931 -609264
14891 -609264 -418248 -332881 -263829 -193177 -98157 -191960 -442611 -657009 -564700 -358751 -396058
14880 -396058 -411542 -344309 -220179 -164057 -23601 -149406 -292904 -279313 -208729 15781
14870 15781 174047 74303 -356332 -457274 -244808 -73088 -114471 -140262 -277792 -221728
14860 -221728 -62165 -49359 -100627 -241704 -298361 -358129 -388818 -431841 -660381 -633321 -407635
14849 -407635 -264711 -284948 -371455 -327833 -222271 -238987 -232291 -225560 -328927 -277254 -262505
14838 -262505 -409660 -483096 -265115 -131022 -247856 -323149 -212647 67094 335612 471018
14828 471018 508153 363827 75415 -135028 -327735 -317603 -101123 89086 233480 145632
14818 145632 34404 -164748 -331991 -217697 -98803 -215718 -320710 -247006 -190053 -159072
14808 -159072 -224988 -311619 -206885 -182579 -258477 -361025 -277435 -186229 -137446 -177113 -384887
14797 -384887 -404371 -349229 -309383 -127061 -113475 -229580 -153288 62782 228617 352670
14787 352670 192276 32068 -145372 -338465 -274112 -20531 182191 375947 361184 209845
14777 209845 71094 -25598 -40277 -15925 104487 155065 180482 237999 301653 236414 182800
14766 182800 346128 451424 358154 273203 407299 389979 110187 66078 218147 153162
14756 153162 44206 95694 95225 -8604 -149162 -307095 -498541 -554971 -453085 -210435
14746 -210435 65796 279472 238428 -50289 -172695 -245407 -222021 -258087 -191721 73112
14736 73112 186888 272655 317512 265143 63087 -131383 -93964 -171129 -327946 -284831 -238732
14725 -238732 -272256 -220519 -181116 -231706 -85624 -184369 -520104 -609759 -520062 -502824 -439087
14714 -439087 -352794 -159878 47368 57973 121443 103754 -17648 -168847 -407568 -549713
14704 -549713 -269175 -203410 -264634 -205979 4025 110710 3918 -17770 63155 108623 189477
14693 189477 613242 908462 792100 480572 59988 -187922 -159351 -15877 -131100 -293914
14683 -293914 -341240 -392197 -404388 -355578 -289824 -258002 -343528 -469332 -588982 -427819 -150092
14672 -150092 -109415 -197570 -196516 -37796 115207 103180 -178942 -375038 -460733 -444546 -339504
14661 -339504 -224563 129894 235142 -91874 -379354 -214353 262691 542596 812416 855553
14651 855553 540219 173186 -212238 -303263 -258799 -230586 -193393 -237929 -118164 86313
14641 86313 30331 -219579 -355674 -334329 -259220 -116932 28413 -19238 -42417 -137600 -251661
14630 -251661 -134399 124271 120681 -11369 -63960 -18497 225680 466560 408618 106152
14620 106152 17044 69411 -52909 -76470 -66965 -186495 -247407 -279253 -376297 -231336 -26942
14609 -26942 -96940 -212872 -339286 -252412 -67866 31205 16518 -10832 -38692 -9393 186553
14598 186553 342263 399259 188274 -37658 -55685 -13844 -125349 -304835 -360760 -337384
14588 -337384 -165503 70070 46765 -115802 -130493 -258033 -438263 -418699 -425014 -355966 -155428
14577 -155428 -394836 -739344 -577850 -191275 21595 148301 373010 415523 403185 351828
14567 351828 316965 367114 429309 494205 305207 12600 -280241 -532835 -686441 -890960
14557 -890960 -924182 -755760 -451239 -359203 -474939 -377592 -415497 -440359 -314634 -264638 -272690
14546 -272690 -140563 -17574 -105722 -383659 -335148 37493 70748 -33741 -24695 56282 231626
14535 231626 312814 207494 160571 260551 239738 341254 419069 306859 206285 173130 131075
14524 131075 101130 100676 -89325 -431485 -502552 -335254 -284513 -364950 -387638 -249297 -224210
14513 -224210 -389409 -459214 -407311 -368764 -229642 -171166 18010 6962 -77578 -98671 -255702
14502 -255702 -418283 -270040 6808 51378 -8047 -12123 -3656 -132831 -169140 -9148 199165
14491 199165 346611 260704 133280 33973 16878 -64328 -117759 -102822 -126411 -92643 90582
14480 90582 -90719 -446336 -424037 -263920 -14572 148912 70141 4392 -44608 24140 248713
14469 248713 323876 109135 -161193 -488327 -545873 -350914 -246701 27168 239471 232176
14459 232176 208951 88867 7341 81751 152844 114673 -944 -29496 -53605 -27405 36038
14448 36038 48754 117384 18546 -176604 -408021 -563771 -689799 -795481 -818672 -673551
14438 -673551 -289437 -15117 16341 -163159 -452114 -544512 -382962 -308869 -333820 -341183 -206324
14427 -206324 21768 199321 325043 457493 355304 199824 12597 -176034 -98255 204935
14417 204935 419436 408012 393332 562093 608867 493299 249193 98189 -99951 -172906
14407 -172906 -126953 -273626 -407524 -545274 -586272 -410015 -180421 -73046 -206613 -294116
14397 -294116 -298774 -128650 56733 93875 32767 -59642 -110332 -165825 -404833 -491100 -396290
14386 -396290 -361184 -278741 -317234 -412496 -262518 -69658 -8633 57795 221765 308229 319659
14375 319659 515991 744393 733362 688282 599230 476729 450134 325009 242348 228977 257789
14364 257789 230495 264684 352744 318058 378575 386324 218365 143153 74295 44484 95200
14353 95200 148707 134666 21383 -113324 7299 108735 86156 -131112 -177418 -192811 -205435
14342 -205435 -143862 -62003 -159795 -374407 -402176 -348290 -178261 54701 127400 -42142 -113914
14331 -113914 -25616 -77633 -67433 118988 314295 398316 288211 286308 212973 -159168 -601106
14320 -601106 -839776 -838240 -947105 -925498 -720197 -619474 -484353 -291296 -67770 -837
14310 -837 -239038 -398626 -531800 -709799 -576641 -273498 -99518 -184291 31598 411312
14300 411312 385418 282882 352326 285783 156464 130543 72807 217790 342773 424560 204004
14289 204004 -22103 -92109 -250859 -628171 -786987 -638880 -468657 -365503 -450627 -456995
14279 -456995 -453304 -454324 -484587 -506250 -253510 -93012 -179601 -305443 -279067 -124060 66141
14268 66141 189782 445454 724115 738246 562192 357153 332378 296378 289865 265430 284744
14257 284744 251661 175299 56982 15973 49013 -63009 -55266 -89604 -223449 -298546 -405573
14246 -405573 -437357 -287945 87505 445792 331191 -17020 -192954 -247046 -231181 -149318
14236 -149318 123722 185023 354949 348708 183599 40142 -133618 -287271 -219338 -51545
14226 -51545 97645 176041 253223 123255 -81628 -69816 69516 220491 298296 301676 61681
14215 61681 -173844 -251512 -376831 -387123 -374956 -344508 -71021 113701 22009 34212 258282
14204 258282 313286 277571 156721 137159 202116 179069 233808 376683 340223 141657 -36062
14193 -36062 -143998 -108397 -245369 -386745 -516737 -503066 -387145 -289854 -211754 -188737 -175279
14182 -175279 -229791 -136937 26857 124296 171983 197321 169770 225707 280588 168537 267507
14171 267507 261114 190391 316710 342710 289356 349388 321979 309142 289214 237987 133832
14160 133832 -167797 -454117 -534534 -526243 -398687 -336166 -404965 -494464 -555268 -167378 152088
14149 152088 138980 143617 202618 70885 -154496 -384904 -630081 -691958 -636473 -499394 -486997
14138 -486997 -365915 -64004 29096 -21376 -61090 -36539 94175 261543 299217 25268
14128 25268 -313570 -434428 -426725 -336097 -236180 -58054 35114 -37142 4319 52312 -223511
14117 -223511 -386645 -127069 108548 46902 -267450 -367423 -331773 -274353 -225364 96260
14107 96260 523843 577297 422984 374257 469532 442962 276056 20596 -156876 -65099 159595
14096 159595 103384 17371 111067 235819 322048 217362 -171618 -390048 -418938 -333218 -331883
14085 -331883 -398250 -418500 -282880 -79433 69433 369877 761435 796115 598360 455279
14075 455279 356822 258904 492479 798556 820743 504331 271764 218494 184092 85851 -121317
14064 -121317 -44326 121236 83592 -59300 -109555 -129876 -142717 -308817 -463451 -276328
14054 -276328 -129547 191459 423198 497089 373450 180741 -15935 18947 136258 -16562
14044 -16562 -140070 -211015 -214016 -105435 -55915 -78119 83349 185290 39857 -64524 -79248
14033 -79248 -4369 4727 -70456 -99397 -180402 -287596 -372061 -429134 -339077 -309758 -367984 -198200
14021 -198200 74994 81799 -138322 -141099 -78306 -64327 -81443 -55723 -125032 -234449 -123433
14010 -123433 6510 153590 252406 143343 108944 146660 -20024 -140407 -242710 -235168
14000 -235168 -240752 -622551 -730190 -514633 -241631 -22884 -21102 -94864 -161594 -147104 -189437
13989 -189437 -308553 -176506 -47543 9246 -52416 -63809 13118 106088 258051 163996 -146195
13978 -146195 -97531 -81689 -105840 -12601 88378 238111 311504 394922 439646 374228 177224
13967 177224 84640 160863 272157 317089 95537 -198581 -373891 -406207 -305610 -216703
13957 -216703 -137725 -37001 156897 181568 197371 298304 296121 441171 480701 458486 414151
13946 414151 246642 168268 331790 511368 474006 326535 94559 -126765 -322912 -365367
13936 -365367 -547286 -678933 -595780 -540967 -525129 -599977 -360807 -69107 28919 -2362 -122700
13925 -122700 -92909 70922 75662 190487 480353 496286 380155 167995 -88794 -293919
13915 -293919 -297686 -90788 -3240 -77908 -106750 -119333 -18212 -16337 -60510 -325605 -506112
13904 -506112 -462225 -355250 -316247 -431488 -370013 -25829 291022 436323 474768 521866
13894 521866 614303 465509 180830 -105581 -290862 -424104 -442704 -307350 -144423 -155872
13884 -155872 -355331 -478268 -395912 -418496 -473510 -625893 -581081 -141170 202624 150598
13874 150598 -131873 -206652 -199212 -24706 140496 8073 -123881 -435115 -691130 -665266
13864 -665266 -590434 -530437 -498390 -513345 -440584 -258149 -101418 45126 212438 129266 -76434
13853 -76434 -111675 -177916 -209928 -15938 73693 63585 134069 302878 306970 250410 580395
13842 580395 767225 690715 551204 374854 213675 235852 247047 138900 48459 90117
13832 90117 122762 -52962 -199359 -79542 161786 237848 -82268 -221093 -220034 -167893 -119996
13821 -119996 -145500 -71203 -68181 -129517 -169994 -48068 19428 46788 -125341 -406518 -501089
13810 -501089 -456258 -285700 -225355 -233608 -88752 -110360 -149983 -184740 -134098 -217243 -243691
13799 -243691 -165832 -171952 -99314 62964 165281 188014 156928 95657 -91950 -294613 -261891
13788 -261891 -335026 -603081 -702204 -553329 -496923 -290974 -69767 104779 226027 188325
13778 188325 102338 -8828 -90084 -9348 -30416 -93032 -147790 -186358 -45446 182431 348793
13767 348793 236207 -64712 -221816 -94608 120493 -1065 -313687 -381022 -305788 -234498
13757 -234498 -248179 -393817 -428591 -382301 -327715 -245256 -187461 -264219 -378757 -349668 -313390
13746 -313390 -236075 -311551 -416533 -654296 -775299 -656456 -507861 -600734 -720160 -697129
13736 -697129 -458781 -104744 159149 327532 323621 103319 -160783 -234503 -141610 -73761
13726 -73761 -52496 -10742 -49090 -25246 -39145 -305428 -566436 -526422 -252920 -255313 -242840
13715 -242840 -130166 -65147 -14956 20272 76594 112386 251908 163956 -32720 -55923 -107123
13704 -107123 9267 184305 392538 360253 54212 5278 103158 51431 -47907 -78721 -103228
13693 -103228 -61662 -172073 -433195 -591105 -532401 -579124 -513410 -274430 -294623 -410338
13683 -410338 -386781 -404836 -596846 -580178 -289611 -137465 -257319 -451055 -490018 -213231
13673 -213231 95457 96449 279914 336002 292501 337214 172289 -2698 111655 191005 71397
13662 71397 9581 53389 68899 5645 -7033 -56205 -65070 -20132 88752 125697 -31786
13651 -31786 -220370 -118569 26519 60058 -56838 -164892 -199617 -106995 59879 221583
13641 221583 370980 410981 166372 16291 92434 104719 -19470 -282150 -428945 -417680
13631 -417680 -222189 -150941 -123102 32673 235297 314033 104528 -77947 -44706 -103896
13621 -103896 -360839 -471380 -465144 -463687 -264830 -34987 -91638 -184515 -10279 154526 203706
13610 203706 164079 174332 111042 -20117 -397500 -724992 -707447 -439485 -271759 -248187
13600 -248187 -251333 -284502 -218990 -46818 100953 149125 207611 175699 105946 93804 157508
13589 157508 220868 312446 230927 133326 188413 133313 58122 11063 42365 76084 131964
13578 131964 249159 193326 52322 57200 73895 289507 503596 741083 841471 675438
13568 675438 388055 180644 73630 -58423 -169564 -150732 69738 347213 650204 733232
13558 733232 502435 299127 411533 580322 655431 740125 693465 436291 272457 356250
13548 356250 624024 808899 580328 168337 7891 -67597 35771 327569 506078 459320
13538 459320 362617 351465 262440 174819 82405 -21714 -22485 51333 182092 -6332 -231818
13527 -231818 -287185 -298254 -176504 -96751 -264921 -364165 -250615 -57692 221143 417863
13517 417863 433870 194855 9887 145788 379308 454667 339098 97623 30422 17969
13507 17969 190486 283784 100573 -23343 112315 154378 226195 185611 92419 178696 307078
13496 307078 260814 -52756 -351115 -383503 -262265 49074 294902 327089 427606 421166
13486 421166 382340 480496 533383 540993 589495 652936 808318 674121 532945 512067 219046
13475 219046 -69698 -103320 -56521 -6576 238343 349418 168758 169416 351445 327766 112099
13464 112099 67506 -27198 -244271 -307435 -408224 -501597 -108254 384625 279065 79957
13454 79957 127995 156172 128347 240167 500676 624389 673305 677111 482066 93476 -210618
13443 -210618 -217978 -122113 12138 163288 317697 117707 -204945 -240412 2683 106886
13433 106886 105675 266192 473828 304395 -4052 -13478 169853 382115 358354 235186
13423 235186 107426 217859 406147 469850 361480 292419 322837 417958 421763 301380 57071
13412 57071 100137 302874 340608 306393 249697 91863 -122743 -415751 -570542 -697138
13402 -697138 -557773 -184387 -77099 -121568 -168031 85214 483689 639369 614144 523930
13392 523930 434180 311457 325044 378288 386898 347055 108272 -163749 -137911 87965 116455
13381 116455 180865 342519 353393 179838 105551 280752 543096 642092 372554 -121145
13371 -121145 -404269 -237335 -77903 -49651 50782 289747 483586 632857 631253 368285
13361 368285 255550 299565 160749 21238 115689 152148 -94773 -465695 -706996 -596803
13351 -596803 -466772 -392321 -193872 -21006 196299 304091 217621 181436 234933 259240
13341 259240 239134 282846 403193 372188 131942 -49496 -231123 -166293 119591 334545
13331 334545 173918 8675 -103072 -35477 274245 385715 135524 -65546 280486 764432
13321 764432 967491 1000834 1156923 1128232 959130 929183 886168 655221 464549 484616
13311 484616 369034 118629 -30088 59962 153481 88372 96470 29025 29411 234523 349181
13300 349181 446488 608066 817009 882275 576088 292064 150897 198070 334781 243221
13290 243221 108743 43246 99518 223423 343756 202077 81511 186798 266515 335661
13280 335661 241961 -18160 -9598 168310 208536 182924 179376 174944 158261 393493 449557
13269 449557 280001 296177 610886 797426 755657 644223 603125 667020 687626 538138
13259 538138 390200 280928 360222 722774 857640 919244 899639 810205 627179 454376
13249 454376 436946 387282 173605 3696 228657 509058 682639 758187 756231 492086
13239 492086 269102 337226 412054 385245 417768 483144 488035 527342 445536 231979 14989
13228 14989 93916 296242 366420 370940 438011 616800 717013 952889 1053088 828864 690576
13217 690576 769718 694211 490118 325813 254392 289548 306591 296162 477319 595784 642461
13206 642461 642507 616510 655247 604149 584725 570948 670558 898840 1153330 1276865 1221286
13195 1221286 1061808 613816 131473 -9288 107088 378638 607412 563368 474401 319010
13185 319010 127239 116872 347674 691275 749879 536980 253937 178043 274754 263496
13175 263496 251400 157132 135586 18407 66577 300847 433356 658403 788806 846022
13165 846022 905912 675908 342431 387716 493413 446838 187964 93165 383775 636552
13155 636552 630136 593608 614644 585085 623194 688954 579950 243994 124906 248461 263245
13144 263245 284500 527089 819030 927589 944059 849649 647925 430706 404515 679006
13134 679006 898664 969130 950844 945240 1052959 1331888 1395713 1196923 1040377 1117450 1188184
13123 1188184 1075374 1072182 1149450 1052177 1006164 980015 913896 961856 947130 861835 748103
13112 748103 614811 424325 417454 600604 705992 763876 775079 843723 785298 783464 1035184
13101 1035184 1108233 1066862 1020376 953334 911186 907639 728652 729658 880617 843256 649362
13090 649362 574059 638922 870795 1072797 1062794 1013359 981414 990415 993110 1100201 1302486
13079 1302486 1346659 1225390 939892 1021749 1073315 1004563 982644 1022452 1078850 1023717 1102023
13068 1102023 1073923 954711 987132 1147618 1405302 1587439 1638851 1525210 1349341 1147617
13058 1147617 1166217 1225625 1396307 1706654 2042994 2339157 2300487 2053259 1788173 1732903
13048 1732903 1833530 1718510 1641821 1802511 1949812 2010000 1952543 2068649 2053010 1871351
13038 1871351 1823258 1887179 1923029 1995748 2048105 2153844 2369210 2571758 2616786 2641687 2553407
13027 2553407 2534087 2561428 2538655 2609441 2625956 2744093 3060633 3140681 3043695 3030550 3313948
13016 3313948 3517321 3237925 3011932 2867515 2709674 2946429 3316505 3697718 4020455
13007 4020455 4209204 4259545 4275024 4371854 4651247 4934080 5239801 5702683 5975342 6091025
12997 6091025 6331974 6716307 7238122 7713998 8352103 9094298 9846568 10691036 11584700
12988 11584700 12658466 13952664 15457858 17271712 19453135 22389923 26337782 31303752
12980 31303752 37638603 45952820 56849930 71397627 91098856 117845619 154248814
12973 154248814 201899742 256690569 300961024 308755128 275234573 222401591 171730386
12966 171730386 131508834 101595080 79831975 64081619 52468744 43633521 36742676
12959 36742676 31168534 26794962 23320609 20563408 18398970 16367123 14667428 13350688
12951 13350688 12173581 11046554 10107121 9509880 9094494 8571598 8071074 7672800 7407001
12942 7407001 7263671 7102211 7097565 6882473 6492221 6069964 5766481 5676283 5695790 5668607
12932 5668607 5667265 5771761 5596831 5311998 5204360 5246171 5336908 5407113 5504989 5550859 5571316
12921 5571316 5770888 5884120 6168193 6744235 7354662 7877145 8434226 9200010 9984443
12912 9984443 11078665 11881410 11832041 11275152 10812374 10518620 10548968 11140077 11733721 12155547
12902 12155547 12824554 13726060 15039729 16716080 18685539 21097664 24239705 28560794
12894 28560794 33998326 40626349 49390158 61226065 77029678 98536135 128077644
12887 128077644 168354176 220192262 276327887 313742003 307809001 263827476 208413243
12880 208413243 159660939 122162770 94651337 74385064 59369960 48308130 40068346
12873 40068346 33941552 29234071 25405704 22453344 20016782 17816020 15913962 14368297
12865 14368297 12993610 11884480 11084868 10262917 9628726 9093793 8487285 7918435 7459558
12856 7459558 7095922 7084282 6973105 6676391 6492020 6135449 5604373 5358190 5413192 5487431
12846 5487431 5188627 4871686 4810969 4732660 4824797 4887839 4925050 4981104 5064533 5221565 5334757
12835 5334757 5443021 5634654 5671231 5260296 5000724 5204437 5562528 5805928 6014216 6436603
12825 6436603 6771654 6966559 7415412 7816818 8128138 8675672 9177281 9781284 10673844
12816 10673844 11531354 12480870 13558698 15082824 17044756 19247337 21807785 25304953
12808 25304953 29994566 35706943 43024742 52734614 65777836 83174247 106884436 139167743
12800 139167743 182154753 234986746 286358008 310960589 291919462 243240905 190054679
12793 190054679 145374012 111399564 86489951 68333538 55006337 44894472 37232327
12786 37232327 31265987 26660274 23088386 20102254 17580747 15506032 13825904 12491442
12778 12491442 11463055 10326163 9399655 8801428 8212991 7627060 7025620 6412401 6005867
12769 6005867 5753989 5555732 5261546 4754209 4385968 4118240 3809862 3727973 3609641 3284109
12759 3284109 3184744 3029229 2778883 2598658 2592900 2438077 2199729 2123792 2287802 2302011
12749 2302011 2164747 2107008 1990980 1727631 1443233 1302126 1258425 1385482 1380226 1426568
12739 1426568 1511022 1325566 1168799 1329145 1381652 1177336 1109128 1202949 1140711 1225506
12729 1225506 1278461 1279608 1234566 1099605 1006163 847614 771312 845448 908886 951176 1052341
12718 1052341 1133274 1051377 942114 1035659 1155444 1165706 1022771 928181 904749 1038136
12708 1038136 1102787 938178 1021749 1218970 1423280 1405710 1112080 942258 923991 701577
12698 701577 402616 468895 623354 730095 816625 778011 715082 596486 761893 1004945
12688 1004945 935854 698469 691366 791546 950922 1069197 1020288 802638 648005 655748
12678 655748 511683 324625 146846 -148215 -213774 -123172 24435 171288 263805 186718
12668 186718 -77317 -182715 -156986 67445 206829 210034 156309 186731 446224 593243
12658 593243 568535 436756 500140 623382 716699 713571 634817 750114 722822 825892 996079
12647 996079 679229 243354 95962 48864 -7884 65756 201061 182349 261074 424426
12637 424426 473457 449648 486300 564181 413780 418700 583374 535667 422012 435369 205896
12626 205896 -60140 -49855 11589 -51359 -77452 29527 46855 9271 85035 269489 430053
12615 430053 388962 261100 348195 485018 674681 595590 338715 210050 155717 122974
12605 122974 74960 217590 515381 608275 544913 513906 733817 869754 754515 664728
12595 664728 460379 220531 336895 560684 596160 403765 248759 301376 275196 136794
12585 136794 29698 50496 253509 442855 541237 525132 575524 683811 587199 430593
12575 430593 414926 469275 533209 623343 670964 669116 857583 892698 854921 710740 526603
12564 526603 190894 101147 104438 74341 91022 57676 17811 57644 148459 265505 422502
12553 422502 518664 469598 405559 431838 388345 71972 -222119 -219781 -74071 39975 171694
12542 171694 250975 181677 241047 279034 252859 165632 48786 289769 648789 853811 889634
12531 889634 785424 568489 476314 515587 405689 348862 478772 380258 291926 238099 64207
12520 64207 22609 60438 142860 306511 359740 357619 273997 41910 -90834 -311239 -300969
12509 -300969 -207455 -80749 108482 -74148 -233071 -396545 -528666 -321061 -133358 71406
12499 71406 335087 551319 513672 384764 217649 90298 53748 201856 476732 465303
12489 465303 322732 36794 -100710 170576 358484 564853 678464 493566 256545 145991
12479 145991 -20971 -16391 30050 13570 192550 327692 326551 246566 43409 -146194 -176701
12468 -176701 20957 72939 13476 -101575 -288527 -459844 -486686 -567512 -404929 -192429
12458 -192429 -89455 -80644 -183138 -159435 -112325 -92920 -3880 -96917 -186996 -314069 -437189
12447 -437189 -506078 -572763 -479882 -325436 -122281 -27736 -76107 -11051 153578 389607 361201
12436 361201 52894 -141608 -227652 -151070 117366 210124 65728 -28342 -20058 113399 112237
12425 112237 -4244 2002 207330 413789 433147 486883 547188 511506 447204 311963 133056
12414 133056 150526 244666 251553 302194 301386 259095 380567 603724 668525 553826 225061
12403 225061 58042 24209 -114509 -181628 -37440 101882 32306 -177228 -455514 -551412
12393 -551412 -223678 36140 225941 287809 280870 396702 399817 320444 537913 776193 840246
12382 840246 751082 496581 384155 289518 243392 300316 322712 270293 341296 272530 157408
12371 157408 78123 -65355 -133865 -38285 109524 250934 352582 411723 424491 336508 355718
12360 355718 372767 261239 107003 -183508 -347509 -292429 -287811 -433571 -410663 -434654 -565943
12349 -565943 -498717 -525163 -817488 -1001607 -783679 -543326 -390127 -194613 89337 182451
12339 182451 34421 59293 78104 57312 -63504 -144115 -6004 156833 308023 455223
12329 455223 525750 272732 -21999 -59537 28161 82351 46050 1238 -99283 -166764 -40497
12318 -40497 63799 -9948 -198191 -173896 -258683 -481565 -497950 -354457 -18706 229772
12308 229772 346292 378598 158032 -117673 -147309 -157350 -117701 127773 420083 324833
12298 324833 119559 72264 137473 131006 185435 111234 -185562 -206259 -165492 -212188 -266556
12287 -266556 -269772 -147496 59102 92804 40980 -92155 -89719 -88257 -162568 -193934 -284104
12276 -284104 -238043 -93062 67661 189510 165168 22561 -73451 -182655 -218264 -133773
12266 -133773 -246368 -213989 100237 285262 331309 382226 361156 380278 253926 137751
12256 137751 -201222 -561683 -663611 -541317 -332076 -252240 -221602 -296507 -268390 -139020
12246 -139020 -8889 -32939 -162473 -224357 -129353 49461 195032 224877 191896 220562 113497
12235 113497 -152855 -384318 -410532 -179854 45569 135477 86184 204931 367597 486333
12225 486333 493034 422557 398361 173243 -149257 -270741 -46663 337288 406378 425095 294373
12214 294373 98580 -157471 -302742 -429907 -512728 -319939 -63730 215280 368173 357961
12204 357961 408735 296235 4886 -199651 -298990 -223664 -53115 50292 4079 -65570
12194 -65570 -67387 -37629 51742 174106 139101 -52314 -96458 -283446 -458015 -358846 -298679
12183 -298679 -240097 -332295 -518027 -817352 -891311 -730648 -589729 -604805 -759554 -630850
12173 -630850 -526958 -473941 -120208 251911 692669 828240 542194 115366 -57263 -186124
12163 -186124 -234082 -191869 -83405 30957 78617 -43370 -3610 124756 111731 -81975
12153 -81975 -134684 -109684 -16705 120620 181840 279018 235141 -68229 -212660 -81979 -20873
12142 -20873 7008 20876 25333 6330 60898 105460 1685 37212 252615 452680 448540
12131 448540 409244 285389 50235 43437 300293 514980 595046 556626 520745 541275 573478
12120 573478 500532 476463 328345 395581 483636 349362 119726 -20247 259185 324725
12110 324725 358036 426493 240654 -19969 -123764 -258559 -96582 52878 193059 485450
12100 485450 652957 758546 775240 750733 479621 218216 51916 -77292 -201511 -431389
12090 -431389 -626494 -474936 -152826 -175044 -282385 -252715 -71670 25610 61115 38678
12080 38678 -127122 -132024 -242131 -360050 -152952 174844 373470 193813 93187 231644
12070 231644 441150 348562 -327 -110272 248984 578062 631897 611430 549583 469044
12060 469044 412578 405843 242267 172996 159169 245083 401093 235127 -47716 -150328 -290517
12049 -290517 -576870 -730821 -463972 -146467 -147641 -133111 40310 57006 -59784 -120445
12039 -120445 -428188 -642822 -479696 -358731 -256434 -122046 -69691 -238525 -324716 -236220
12029 -236220 -193091 -324535 -546408 -629740 -723615 -505323 -52724 229473 284284 132295
12019 132295 -135869 -386527 -445874 -320476 -248324 -81140 299026 624852 625374 528723 323134
12008 323134 127041 11441 41250 235459 377084 453814 578170 850575 994272 877337
11998 877337 564017 301772 127269 -97266 -312670 -265303 -103650 30225 -59392 -123939
11988 -123939 -324449 -518071 -521030 -411543 -307609 -352246 -381215 -278110 -206383 -258194 -297956
11977 -297956 -452598 -419186 -471532 -469995 -405847 -425999 -457137 -489012 -431466 -313176 -326457
11966 -326457 -241959 -254907 -417491 -531714 -216760 290932 505686 404829 188093 157054
11956 157054 221188 219881 193475 -49085 -128935 -78623 197397 432874 519316 641267 799544
11945 799544 736076 466625 116256 159789 374438 425594 470229 463227 583417 690019 536465
11934 536465 71202 -285082 -421120 -312850 -210074 -82143 163144 171747 160382 145565
11924 145565 240031 388720 400081 221669 -77797 -363743 -348291 -155742 -64278 111165
11914 111165 215772 219454 363060 510951 246240 -82767 -72385 -63692 -180323 -77864
11904 -77864 99716 297520 137516 -91399 77383 219895 188154 193982 355123 501924
11894 501924 360983 4311 -97513 -6702 -226355 -232087 36029 3389 -155148 -12627
11884 -12627 99540 225589 379549 150921 -81636 165902 372610 322846 298426 222099
11874 222099 114965 163359 6050 -194652 -417080 -307802 -59595 -45110 -64600 -58648
11864 -58648 -222967 -387027 -196881 -14020 21004 -74808 -127455 -166729 -188810 -87937 -113145
11853 -113145 -177172 -198496 -96055 144531 479484 576485 510434 390263 170801 -78932
11843 -78932 -286898 -289125 -20301 228981 200603 -86892 -206307 -100266 -165411 -241016 -237660
11832 -237660 -189207 -82494 -33607 129553 381475 262027 57202 -125464 -308534 -409577
11822 -409577 -677160 -902751 -688029 -436048 -323576 -149846 39391 191998 256043 320261
11812 320261 199780 97124 -46402 -270592 -232713 -83474 -96175 -231684 -269095 -265428
11802 -265428 -199288 -206851 -219772 728 242611 311118 357205 222906 309141 632904 592831
11791 592831 416429 304148 225838 225426 89758 54941 169918 230665 106512 -60154 -75183
11780 -75183 -139499 -184074 -224684 -149325 -19169 109425 127147 161906 208872 148142 122512
11769 122512 34077 -2343 85591 28428 -15401 99131 148654 192152 123670 201809 354366
11758 354366 336938 355388 193318 191011 219664 -44927 38167 159837 194355 311444 551922
11747 551922 494044 446949 530022 399620 261721 295270 351679 303051 171204 223305 329019
11736 329019 359995 259546 129849 214029 515401 550156 127729 -356995 -417074 -238749
11726 -238749 51320 326393 509458 530852 435650 298536 119401 294162 538376 286096
11716 286096 -35619 237563 303433 -86266 -288768 -108463 -19147 -245572 -454220 -513119
11706 -513119 -581260 -613616 -394214 -174567 -52748 11526 50114 143020 219327 183631 140484
11695 140484 83736 -1592 -124677 -236295 -275237 -125507 103277 181099 62061 -130188
11685 -130188 -169833 -210494 -381282 -589204 -596301 -349172 -98953 -44302 10269 -62879 -184551
11674 -184551 -284046 -233539 -183222 -210419 -551116 -782523 -695831 -365772 -168219 -312140
11664 -312140 -423255 -293964 -178263 -126120 -85201 15495 4426 -188310 -243467 -290265
11654 -290265 -376077 -370607 -221073 -166030 -282964 -295511 -228176 -289614 -492424 -528987 -648634
11643 -648634 -784686 -721643 -420582 -200882 152353 515235 483765 184462 79273 176899
11633 176899 215620 249411 109228 40351 121542 72311 -65307 -148437 -106481 124377 339864
11622 339864 388743 330474 202951 -18424 -292589 -426932 -459731 -362134 -318798 -429393
11612 -429393 -393710 -113297 156423 258254 322537 147842 -242655 -353980 -160178 58813
11602 58813 96819 148432 257981 268456 18501 -187194 -131453 -125697 -52307 -19312 53000
11591 53000 311691 581414 730314 659333 516731 327038 185946 255973 286242 260495
11581 260495 244107 122610 -6832 -65095 -264288 -306935 -409379 -364962 -114796 -92592
11571 -92592 -95286 -110225 -22823 243237 401431 315644 12728 -232733 -226882 -22119 58930
11560 58930 -137726 -274742 -175188 67693 -11395 -383868 -592188 -410948 -61771 63487
11550 63487 73059 302423 542002 563696 458764 393719 287789 126682 8299 91630 418358
11539 418358 607579 436538 273029 294094 216719 -33957 -266913 -410237 -450316 -364071
11529 -364071 -336514 -535896 -562501 -373225 -165305 181181 464055 390975 116501 -20518
11519 -20518 -239442 -247257 9988 65218 -91192 70950 271482 85621 -380910 -645939
11509 -645939 -535566 -330160 -271073 -433340 -507865 -287598 -109769 97479 431246 442906
11499 442906 293409 181914 42946 -21193 -115377 -155370 7117 181355 168567 97194
11489 97194 331 -89210 -335691 -463938 -430758 -255422 -42634 49891 -30045 -68982 47366
11478 47366 146450 252759 332557 259437 258928 232605 180968 298590 263439 145338 135484 257214
11466 257214 257595 75933 38251 -189640 -199851 78452 148302 8266 -128961 -171125 -108895
11455 -108895 -6181 62542 59266 -14264 58556 138870 -56407 -305513 -284733 99952 589459
11444 589459 616477 445556 564508 650969 592311 636434 499321 188193 36229 109067
11434 109067 208683 154640 96095 4190 -120407 -117462 9323 21058 -95443 -73679 31839
11423 31839 140877 322624 504167 619851 666961 817570 922393 982010 827652 807386
11413 807386 818667 629929 385190 308091 319012 228040 198075 180867 -63314 -230418 116349
11402 116349 272338 190483 -75194 -411649 -710151 -806449 -732192 -627109 -607335 -606557 -522011
11391 -522011 -537892 -537829 -476582 -283558 -112239 22687 55371 -124545 -217971 -143164 -133143
11380 -133143 -347691 -317570 111113 408577 410207 332545 272038 202153 365634 531417 593103
11369 593103 500651 25675 -237966 -198113 -64068 -189971 -332008 -394114 -308951 -35019
11359 -35019 207291 279896 291548 364952 370163 133259 -114187 -120817 129505 166722 174756
11348 174756 266987 126632 -13699 -24854 114862 101585 -86861 -158784 -238366 -545724
11338 -545724 -567795 -259978 -91510 -103134 -93999 797 140939 169321 264732 365798 406905
11327 406905 263318 22221 -44776 550 56683 33522 84851 353301 667928 921441
11317 921441 893016 666266 376709 288951 287939 183635 184075 285135 244196 120892 168557
11306 168557 84373 31821 128866 239596 316038 439462 318508 40264 -42017 220925
11296 220925 529538 646394 535588 598377 743178 640878 718422 1028604 1305490 1466394
11286 1466394 1642880 1870353 1887371 1967293 2252153 2771565 3477908 4538311 6156774
11277 6156774 8716484 12416138 16465046 19117677 19402286 17100716 13155727 9535976
11269 9535976 6871255 5079198 3878757 3204046 2690436 2241561 2061973 1895895 1598733
11260 1598733 1228125 1057728 1070522 1022300 726354 353784 175493 174549 324531 293434
11250 293434 128521 340119 479031 438215 530873 613573 460202 53112 -153282 -118505
11240 -118505 -2596 147788 67789 -210855 -377357 -425699 -230031 -82909 53785 288969
11230 288969 531381 754838 667683 591089 658910 687692 465795 157428 138698 199298 343650
11219 343650 330096 146876 160474 93136 -41498 -82310 18473 -11902 -37935 102863 295121
11208 295121 324672 227287 260891 313771 210370 229172 367527 390317 286600 135621 159131
11197 159131 333716 317783 244599 259906 166972 160441 295544 264096 97156 -52269 -139481
11186 -139481 12260 279033 399776 535331 515049 405965 419738 435559 351094 311183
11176 311183 298166 190366 104732 183351 266063 252328 245390 197118 144203 100752 -23763
11165 -23763 -125590 -171092 -35482 112440 131337 106705 52056 207169 85654 45854 280542
11154 280542 496834 455153 308036 254836 106278 -117489 -291873 -329197 -295716 -431489
11144 -431489 -600636 -728027 -622408 -382186 -161558 78744 73767 -162137 -347394 -353952
11134 -353952 -80141 57920 9932 -167146 -234166 -75467 -74347 -204842 -317054 -268686
11124 -268686 -119319 36845 25110 -166137 -110752 4498 17729 -102742 -201755 -305518
11114 -305518 -140738 306749 388134 70749 -181050 -201439 -119556 -233495 -231339 -101917
11104 -101917 -178540 -354923 -562839 -572740 -314078 59892 181229 -124559 -301808 -346309
11094 -346309 -296080 -194506 -308583 -323441 -242849 -258196 -209017 -65633 -164439 -353150 -551794
11083 -551794 -499621 -348478 -345084 -444199 -532269 -494315 -252450 -69591 -169663 -200609 -80988
11072 -80988 -183902 -200290 13661 158386 183103 241777 266942 298103 234122 30997 -86181
11061 -86181 -98098 -192231 -129640 -15822 -76269 -255283 -472025 -396693 -60234 189441 344033
11050 344033 432602 306191 236268 195745 196363 273722 293837 184683 157179 79088 -132757
11039 -132757 -112432 47090 -115554 -161798 -6997 71805 -43122 -313253 -421946 -402370
11029 -402370 -444096 -404345 -161743 -80641 116593 233788 60200 -6326 -63387 -102812 -102713
11018 -102713 -73334 -219809 -284139 -68733 -119380 -220304 -122483 81021 216855 281984
11008 281984 315612 389983 412799 340810 342896 493965 555430 582463 493551 371671 247865
10997 247865 228131 304634 255493 130945 -60089 -195458 -439045 -502892 -358469 -372596
10987 -372596 -379007 -408247 -689314 -645975 -394447 -196960 -25135 74442 174147 93609 -32574
10976 -32574 -46689 -102671 -249549 -335163 -230250 -87034 -189238 -302807 -146797 156013
10966 156013 434230 627768 512250 378849 311437 281519 152481 80476 152048 234604
10956 234604 259825 170871 -15616 -225120 -304565 -303363 -282984 -195330 41964 371924 483444
10945 483444 342577 309242 223038 99159 102103 42883 -135024 7388 223437 328625
10935 328625 430462 451286 218988 101678 144167 225232 164222 -107626 -173920 -45762
10925 -45762 -87459 115905 409977 442637 384040 10145 -124860 63703 32581 -78750
10915 -78750 -186943 -406105 -478849 -335112 -162483 -74842 -214263 -45430 178137 178794 57219
10904 57219 -138338 -213084 -143127 -155483 -144789 -193601 -283748 -248998 -218399 -80019 109039
10893 109039 138934 39709 197533 352121 271111 193083 136393 -162737 -281353 -179738
10883 -179738 38643 120690 -42964 -181906 -177086 -96387 -5031 79539 145681 330233 469507
10872 469507 550285 483066 399405 479938 460410 356705 195498 18075 -27366 -68832 -182549
10861 -182549 -164779 1622 -22408 -236836 -285114 -306515 -229195 -208299 -256229 -144488 -88031
10850 -88031 42129 11756 110522 330499 519569 819669 834205 677843 817618 1038138
10840 1038138 1081502 863943 639143 540195 270744 146475 413837 607231 441849 258731
10830 258731 191384 11638 -122297 -245434 -263155 -194812 17763 165896 154017 210183
10820 210183 328089 282475 318691 442432 341689 253294 279672 435667 427033 148996 -114834
10809 -114834 -384992 -402343 -353808 -337702 -178718 108695 183057 81990 283840 505209
10799 505209 538715 525082 399682 573527 1049455 1275778 1452971 1999588 2571772 2633482
10789 2633482 2577860 2823166 3344566 4026412 5134243 7254200 10517043 14559621 17549738
10780 17549738 18091167 17338712 14382409 10204666 6864808 4553524 3334905 2716696
10772 2716696 2160478 1678345 1352113 1010851 738876 564605 559574 619593 721780 721950
10762 721950 562625 464455 385547 428564 252804 179236 188292 312579 469176 484194 264982
10751 264982 78348 81172 180109 213110 -44708 -228039 -222825 -362227 -603192 -708983 -540482
10740 -540482 -176635 30040 175649 170553 24059 -174476 -235409 -121231 67802 316299
10730 316299 263634 118422 101187 346801 548480 700582 648880 704166 827628 737668
10720 737668 618357 523998 433263 266282 3710 -24226 119732 313677 589620 634041
10710 634041 626421 591038 495821 280087 133240 90136 37063 18446 8920 -13396 -104838
10699 -104838 -300311 -352056 -258099 30699 11418 -362465 -622678 -602699 -438758 -136914
10689 -136914 178458 210504 135334 -135680 -380546 -335189 -303611 -193992 14502 162342
10679 162342 50557 -223148 -277206 -291056 -274780 -218525 -226689 -84133 303033 377221 143735
10668 143735 -159814 -305424 -410503 -474240 -514515 -507718 -330432 -252666 -345240 -381633 -600238
10657 -600238 -823384 -617646 -482265 -359980 -261863 -310148 -386084 -311211 -381090 -527946
10647 -527946 -476196 -273058 -39511 125084 202221 225172 88398 47640 91755 69086 -263928
10636 -263928 -623441 -555548 -117674 -149976 -491410 -637575 -601238 -501655 -410139 -268800
10626 -268800 -34501 117627 122414 54039 123170 150489 52195 -122834 -205465 -226620 -150572
10615 -150572 -63702 62173 -53482 -275206 -277947 -195807 -112655 -62527 65260 220238 286997
10604 286997 228513 51361 90469 364569 431183 400187 252183 149810 241516 389060
10594 389060 384589 254128 -10308 -117370 -77711 -63249 -43898 77626 174246 474167 474318
10583 474318 335876 291764 311719 318733 149458 76102 216198 360394 355731 194747 92385
10572 92385 124063 148693 198402 271000 191972 132172 196094 307328 475846 465761 403486
10561 403486 609575 697706 515634 481991 423806 454667 432255 248260 -33973 -63382 7315
10550 7315 63867 75153 19977 -163453 -188875 -27089 -130584 -233347 -432757 -364186 -86236
10539 -86236 13815 -81821 -108100 -59696 -88149 -160231 -147942 75766 224872 209903 108894
10528 108894 257982 448106 384664 223635 -36876 -378710 -571330 -568066 -272905 -5172
10518 -5172 91547 43574 16024 160228 336275 358196 338507 277734 21642 -35400 97726
10507 97726 214098 396189 343793 199670 261050 206475 151655 71366 -51858 54704 386054
10496 386054 608778 598928 477522 308142 38714 -343075 -449623 -236683 -165245 -91547
10486 -91547 37345 21023 -52522 -250571 -613727 -609481 -225776 143147 312521 403399 245811
10475 245811 -128036 -226612 -207349 -157676 -121398 -109291 -12743 -20431 -35548 17572 1244
10464 1244 243 28868 130783 181385 39552 -61179 -39483 -22269 -260070 -517898 -487016
10453 -487016 -399925 -417565 -166295 211094 345885 354838 345652 302627 257394 261840 233095
10442 233095 210568 255423 343771 557046 582642 485389 384220 182882 -150743 -327712
10432 -327712 -360721 -218669 -41357 57701 348688 619343 562626 282362 -29091 -79807
10422 -79807 -72050 -226266 -176204 -59385 108539 247221 77148 -46567 350959 546006
10412 546006 558466 616365 505221 477547 455938 474435 424508 377420 629568 645185 245519
10401 245519 -62808 -189453 -34818 129352 -20902 -88232 24145 -21646 -158374 -295090
10391 -295090 -329573 -60226 168426 168637 49529 -14271 1515 -210388 -377847 -207253 -73607
10380 -73607 -147559 -250459 -300546 -221593 -128203 -267795 -413402 -527735 -582222 -474376 -416944
10369 -416944 -321951 -141433 -171256 -230494 -320492 -413083 -543634 -683338 -609133 -409949 -336079
10358 -336079 -174550 119263 323155 494312 597746 519926 435707 267558 128708 -58026
10348 -58026 -86361 -98617 -274936 -284807 -333658 -292006 -264529 -179696 -185273 -434126 -644102
10337 -644102 -676432 -496090 -305359 -263705 -282807 -148945 -112725 -92984 27507 -114001
10327 -114001 -390353 -357886 -124208 1857 109055 187322 134372 82935 125405 129646 137547
10316 137547 155359 54418 -158936 -331199 -436156 -445450 -283701 -133825 54789 17101
10306 17101 -157048 -321253 -511737 -556482 -412223 -279841 -53995 115959 -37683 -132103
10296 -132103 -223907 -245715 -191541 -173958 -183073 -65240 13479 -85968 -101380 159522 381752
10285 381752 351145 230441 448751 656697 677504 565823 178561 -289993 -699134 -667426
10275 -667426 -356911 -280442 -309512 -139496 -19464 58625 218920 340933 368387 209736
10265 209736 -58899 -309494 -360208 -144484 -61706 -63709 22789 -53731 -169106 -277100 -459791
10254 -459791 -599614 -641239 -448462 -158252 53994 120513 124193 303184 374314 303803 105791
10243 105791 -159981 -266137 -438394 -616930 -692979 -602444 -411794 -98037 236989 237844
10233 237844 -35287 -82294 111209 293311 279501 307400 438097 362743 293827 461065
10223 461065 465916 396539 310061 323327 337087 142015 -118874 -138254 -34554 -26401 57284
10212 57284 80484 317846 727637 811507 599007 243658 -122688 -293719 -178123 198169
10202 198169 330260 45493 -87817 -24411 29790 159137 193861 161769 65403 101729 66634
10191 66634 -103694 -328859 -287497 -198708 -223713 -167131 -186251 -276197 -239560 -262239 -336484
10180 -336484 -499968 -722330 -698982 -309165 113451 261187 234627 184931 216226 308046
10170 308046 310754 180231 -42698 -319857 -417375 -249300 -96419 -5908 117844 30894
10160 30894 -132119 -301613 -325638 -161639 212179 455227 132739 -179065 -227864 -286468
10150 -286468 -502704 -604472 -641628 -658749 -631983 -665976 -684412 -670612 -631798 -602105 -672854
10139 -672854 -622055 -530664 -491182 -432265 -323866 -79581 60321 93839 65525 81535 177190
10128 177190 234703 170586 64184 49315 202005 142772 7962 110687 236461 276485
10118 276485 347586 546311 549732 566193 400870 217386 273284 224072 70383 -28147 -168611
10107 -168611 -148864 -112063 -206172 -434065 -595274 -814894 -824625 -478644 -158120 67957
10097 67957 226068 226081 323577 468862 394397 267183 291676 397110 445122 415109 188748
10086 188748 -102889 -326226 -503877 -452646 -173943 -56366 -220819 -304959 -32396 248320
10076 248320 379811 421959 413873 489884 411301 420669 589891 671818 632109 438486 242254
10065 242254 240073 437214 568561 516767 474857 488153 205626 64629 139199 282133 315661
10054 315661 268413 225492 477295 701915 795386 915092 991964 1320698 1817243 2333837
10044 2333837 2996827 3636084 3990388 3806383 3295852 2398106 1525498 1054122 608402
10035 608402 246444 -160827 -488323 -386687 -367118 -448644 -220861 164179 245832 264165
10025 264165 204323 -87481 -251422 -283307 -85809 79050 94260 191069 166504 48158
10015 48158 26161 -107282 -362944 -474169 -424669 -399774 -338260 -229241 -49145 86825
10005 86825 203895 286077 229614 188592 124726 85308 -136536 -442013 -410681 -109642 112889
9994 112889 55763 -223899 -499694 -704332 -590979 -314218 -48033 -54898 -110351 -136530 -141757
9983 -141757 -97368 -198855 -224673 -7154 163407 260024 211009 51397 -29877 -117660 -184643
9972 -184643 -283042 -275948 -273112 -301560 -312355 -232521 -39789 7636 -11076 71561 85316 64264
9960 64264 -117354 -180236 -94465 58666 124489 66780 -121479 -220539 -284912 -286375 -181309
9949 -181309 -128707 44030 421554 550655 546831 608720 739469 760651 612823 342654 170799
9938 170799 347010 457970 238427 89193 351686 447107 440513 332363 178887 225654
9928 225654 296036 204218 186533 89287 -100993 -187357 -200275 -154479 -30783 -540 -148943
9917 -148943 -90820 82504 -135134 -403747 -464396 -334395 -202430 -120262 -30397 86739
9907 86739 345363 656361 724056 656989 623930 680555 593802 405681 341259 415650 469222
9896 469222 497407 486105 415330 201939 88442 168143 224827 76031 -230481 -286139 -155659
9885 -155659 -31140 29417 90689 358597 743205 779513 562913 465320 435384 369703 309542
9874 309542 96390 -147605 -40064 71505 67806 234297 274733 247527 186236 115454 188386
9863 188386 282663 244702 169923 132247 52320 95178 81072 -89282 -59603 -129109 -228186
9852 -228186 -107303 19970 -212018 -509544 -595662 -620082 -682886 -805742 -774891 -694094 -313578
9841 -313578 -63479 -99751 -171243 -146901 -184579 -308465 -117501 98019 36171 -166558 -241200
9830 -241200 -150429 -132305 -167118 -190276 -208603 -190627 -154979 -153417 -401915 -601756 -529435
9819 -529435 -218977 24105 89311 63518 14705 -5239 -262412 -514288 -380583 -199824
9809 -199824 -276463 -352213 -337393 -154703 -79533 55885 122409 -6252 -132389 -216483 33772
9798 33772 290811 287725 319339 419110 345506 270684 184739 168272 264601 353847 309120 264818
9786 264818 290733 545668 514815 312631 96455 -155744 -269082 -373292 -494824 -591750
9776 -591750 -560379 -518252 -425412 -369438 -318016 -179887 -189500 -373296 -319760 -150910 -63680
9765 -63680 45369 -2601 -130432 -108775 -107215 -75519 -37164 -22818 24594 70842 114079 100923
9753 100923 -30322 -170786 -97869 36074 82101 22557 74172 130772 -43150 -95373 157945
9742 157945 286776 107803 -116920 -205625 -186737 -227013 -201143 -38615 56893 -27994 -132193
9731 -132193 -112017 -65908 46984 407772 738884 541715 126187 -113596 -54347 13343
9721 13343 -71577 -205380 -421225 -585720 -444859 -401038 -358785 -251505 -167449 -103880 68617
9710 68617 267999 456393 609573 651562 594194 576474 632869 574495 441037 323287 178851
9699 178851 -78817 -220877 -117770 246824 591894 587018 456720 323555 412482 510419
9689 510419 279659 8833 56461 127437 16892 -2527 15271 -136343 -162093 -113748 137602
9678 137602 444812 670090 635033 320380 220641 179985 239995 266853 342189 386028 202757
9667 202757 81327 147242 301319 520648 553998 479210 152470 -137282 11720 292366
9657 292366 479223 448490 317196 257111 305461 284074 246875 328354 559410 675612 721144
9646 721144 634205 534113 440552 404341 379219 341002 291673 327483 -19196 -495777 -431003
9635 -431003 -155819 -87845 -149716 -232209 -226259 -299797 -356962 -275015 -159079 -31539 66471
9624 66471 101155 -12612 -13947 185932 329378 68427 -159936 -186526 -145213 -199561 -221906
9613 -221906 -211799 -139645 -2990 -40519 -28015 -209949 -318569 -89603 -76517 -123283 -29297
9602 -29297 91972 210273 288815 289212 267471 173969 313634 270789 273171 426405 582888
9591 582888 610596 283225 -136768 -386324 -380553 -133825 -115923 -131596 -149028 -299587 -155040
9580 -155040 40304 295217 515681 459356 539157 856498 1376909 1854120 2223072 2768732
9570 2768732 3356281 3654286 3499382 2925524 2506786 2436145 2483316 2261353 1745076 1213732
9560 1213732 971167 949862 863364 823686 781196 802326 813834 639831 360082 390552 359921
9549 359921 208009 281126 457673 586614 386641 -51268 -98313 189101 262176 221435
9539 221435 58000 -157074 -133940 52149 187976 194175 114212 45896 12111 -27371 -127065
9528 -127065 -26185 169985 313435 411427 248086 128527 242682 187943 143658 315296
9518 315296 538082 534662 408940 254346 -69442 -116412 60279 105141 106038 178087 131624
9507 131624 79126 52118 198098 248329 178940 133098 -89513 -439570 -822713 -873902 -897309
9496 -897309 -839709 -626116 -564043 -637009 -431270 -302468 -389348 -696947 -785407 -658744 -681559
9485 -681559 -730669 -630113 -466622 -233955 -124245 -244336 -125122 45105 61737 102464
9475 102464 141035 86592 -81481 -161774 -50770 181075 341195 414894 442795 313174 31430
9464 31430 25239 276481 396356 278357 71061 -69892 -101651 -43096 51270 -7473 -59137
9453 -59137 -152406 -9312 459861 834476 894417 672215 395820 280057 226705 132992 36397
9442 36397 -161842 -344121 -502531 -649539 -420345 -248153 -200819 -226357 -141265 -103258 -169823
9431 -169823 68712 161841 -136329 -303380 -200020 -207437 -152588 -8747 277622 531806
9421 531806 478939 117014 -43050 86350 221680 66420 -103679 127097 353124 446138
9411 446138 406119 270570 182779 248310 274900 63874 -199269 -203005 61736 47432 169571
9400 169571 245784 183134 92588 114143 212363 228937 314600 338963 462265 549100 521245
9389 521245 434659 304199 191287 247941 247873 -52017 -180074 -261743 -468696 -456769 -362261
9378 -362261 -330669 -117344 213729 383593 473424 341541 259678 495297 542921 479145 333655
9367 333655 57526 -147716 -224041 -161235 161140 469863 554610 559608 507246 479401 562348
9356 562348 647558 522149 232437 279056 486348 464344 155455 43889 147466 -16961
9346 -16961 -286871 -250161 -124346 -85722 -58641 4904 73218 285376 281995 146681 22337
9335 22337 -100491 -272613 -384262 -268668 -49152 57829 23739 113798 232118 146744
9325 146744 36965 132209 248150 320981 466338 443309 323806 183983 -31704 -282589
9315 -282589 -392376 -379945 -254010 -208716 -177254 -210903 -276178 -238671 -99076 122241 96345
9304 96345 -103000 64019 301864 270579 31564 -195063 -277654 -380714 -461985 -511803 -453012
9293 -453012 -378368 -312373 -250636 -82838 21476 72794 208996 151601 -123052 -473511 -732948
9282 -732948 -581842 -393840 -385250 -287703 -417110 -593727 -688779 -533161 -229062 137953
9272 137953 451300 408744 149644 -240338 -461329 -361685 -197485 -123594 -163640 -120929 117358
9261 117358 204898 24501 -268633 -358256 -197891 89075 145299 36264 -198701 -398226
9251 -398226 -102627 271397 377888 315220 191712 -37224 -133051 -34387 -34737 -289815 -515562
9240 -515562 -618930 -728742 -898599 -937885 -691860 -573653 -648520 -513029 -192870 -13192
9230 -13192 -59564 -202358 -327341 -104901 -15265 -41401 106003 207498 194319 -103346 -434647
9219 -434647 -514297 -469902 -334204 -24311 192516 246594 285941 220843 87009 -62822 -131458
9208 -131458 -124459 -71286 65222 93790 -75105 -173310 -126539 -132851 -236279 -125793 156985
9197 156985 378678 187949 82328 232681 72208 -249732 -404041 -305633 -374391 -448899
9187 -448899 -472420 -332677 -317043 -160635 175054 241512 74200 -334416 -745742 -759178
9177 -759178 -637388 -363013 -3564 174942 235227 297446 276784 81314 -195371 -204993 40258
9166 40258 100346 37639 46999 -109848 -150858 -12237 70778 159715 119247 -1270 81045
9155 81045 82364 -7302 -75799 -39286 -62899 -22364 -43965 -197404 -278023 -293418 -281775 -25144
9143 -25144 164840 194193 90854 163042 383993 425106 395139 491493 404320 197900 118558
9132 118558 122558 319028 363196 280417 342136 283739 121437 46909 147793 165446 121194
9121 121194 203437 423658 585331 687181 715255 580618 566160 647255 449056 394267 582585
9110 582585 655240 767686 539428 78038 -152819 -77547 87514 144040 58401 126626 551980
9099 551980 758414 702823 603147 375115 326573 287519 298247 361313 274509 114899 -131080
9088 -131080 -472688 -421822 -181977 -137994 -278417 -214712 -55019 26685 84915 -40740 -278477
9077 -278477 -405022 -276199 -134872 -210085 -340728 -245574 -199166 -224890 17596 125976
9067 125976 123053 183892 116451 28700 -39367 -99538 76804 44282 -1868 194076 424895
9056 424895 452129 429991 526535 452915 333352 269490 357195 446390 388607 49574 -19423
9045 -19423 47778 1352 186477 404907 551545 606933 303061 -176514 -436571 -370099 -48042
9034 -48042 197651 200279 287649 252452 93599 285307 369569 223141 -14269 -102774 -164698
9023 -164698 -221925 -278431 -227425 98664 487215 810262 727883 500368 482097 378580 222426
9012 222426 151721 10527 292518 631136 528218 69314 -334680 -320996 -115885 -79673
9002 -79673 -132282 -138664 -352041 -497869 -571428 -372747 -54360 123452 105865 107024 227467
8991 227467 230636 60802 -33906 -78325 -171669 -239390 -215242 -179052 -28902 231035 226551
8980 226551 -45455 -448287 -505911 -301698 -312106 -431209 -477635 -81805 390711 653079
8970 653079 594542 241788 -74770 -426963 -537750 -545998 -463806 -313331 -177625 -23621
8960 -23621 36739 -148251 -227535 45838 153761 210764 71093 -169662 -249390 -292757 -248687
8949 -248687 -232989 -98625 160008 255268 165510 -2593 -48554 -242600 -628192 -891268
8939 -891268 -992652 -732380 -277621 33751 40389 16528 -316 -33518 -147618 -312266 -338853
8928 -338853 -143734 -58835 -177694 -224824 -169720 -105307 -9860 279110 323681 178417 28850
8917 28850 -55116 -30323 -67367 23813 81566 49647 461 -33167 60234 55739 125717 69108
8905 69108 -12635 87025 191085 138805 -29270 -342142 -558438 -631533 -562372 -313160 -220007
8894 -220007 -274268 -212961 68370 298665 526171 614522 489397 123198 -146212 -178403
8884 -178403 -246949 -318336 -291256 -333668 -267562 -89742 -134685 -308258 -206210 80677 194410
8873 194410 294439 281917 221461 20174 -249053 -295635 -231731 -150911 -181757 -230332 -390637
8862 -390637 -503222 -360222 -236549 -149109 -77614 6749 201282 300273 343073 430526 456889
8851 456889 311161 133312 -98228 -191296 -116310 -170020 -77586 100793 109793 -41289 -277398
8840 -277398 -466690 -445497 -171968 40114 233803 341076 246437 220366 293132 332267 395913
8829 395913 489018 486697 445407 199214 -22999 -130113 -211791 -223084 -270605 -127989 77050
8818 77050 262612 386529 302028 7877 -340233 -360594 -357640 -513979 -633488 -650117 -435008
8807 -435008 -52738 175685 163562 59345 43709 68258 27990 15642 82283 165926 249122
8796 249122 214857 -19568 -240025 -283601 -245637 -287031 -489382 -598927 -525155 -419217 -340504
8785 -340504 -358288 -449244 -531455 -309801 -603 184036 298673 345104 262318 306856 215151
8774 215151 165203 414251 625713 583265 500013 460546 288995 136861 76643 11888 -7891
8763 -7891 130638 256693 284185 138782 -746 -303994 -490588 -409900 -247328 -26286
8753 -26286 81050 14801 -75706 94817 229511 116764 -131019 -333433 -320182 -238019 -142728
8742 -142728 52108 182119 264666 335457 211269 -8948 -196094 -199244 126354 294701
8732 294701 113092 -87566 -182022 -158438 8940 214671 211341 215307 346284 428426 346282
8721 346282 195124 141844 326659 495687 326862 -118028 -481000 -502053 -423378 -192165
8711 -192165 48517 232352 209935 77884 45684 5192 -246826 -396380 -70320 239924
8701 239924 453389 586165 611284 404045 129622 -4121 -13829 138330 185343 185225 348886
8690 348886 436482 418815 341800 357990 308411 42278 -66392 -177606 -127732 -8202 -193390
8679 -193390 -520072 -650397 -596544 -482790 -270076 -164718 -116446 92947 270993 455941
8669 455941 552039 554218 523266 249708 49113 -63360 -133956 -241488 -195504 -113846 24867
8658 24867 151380 186509 41619 -185947 -12611 216915 242225 347839 325840 191539
8648 191539 35271 195668 341212 266932 143826 122918 265301 387323 188903 216297
8638 216297 451477 506801 411831 265975 147810 178273 263831 303002 506522 689403 630806
8627 630806 329306 125942 62070 65144 62560 14261 16736 -158063 -220048 -112820 -101697
8616 -101697 -303044 -421138 -372368 -254836 -134492 43257 110962 7557 -87133 -100473
8606 -100473 -29915 -59939 -80992 17742 -24507 -234206 -454283 -502056 -342874 -343049 -366619
8595 -366619 -166888 -108387 -183569 -37360 201648 422813 488818 396233 322718 274301 226946
8584 226946 236638 257019 384359 586817 805451 686992 454137 326720 427696 379965
8574 379965 301019 328715 151151 67834 28022 -14550 148950 418223 558032 564948 352802
8563 352802 97463 -36928 -194259 -302507 -301188 -173042 13001 246795 211082 -143158
8553 -143158 -514149 -546023 -496618 -230677 39664 74179 229921 355360 180407 126010
8543 126010 32657 -226793 -369295 -241674 -198182 -250323 -307194 -307157 -223799 -117868 -151575
8532 -151575 -129192 30389 116959 95772 -143945 -394198 -336580 -94290 28245 -104374
8522 -104374 -99836 129241 246816 335104 312484 81209 -164026 -181464 -125618 -159989 -33204
8511 -33204 69628 113112 85180 31495 116007 383022 278077 120743 -12928 -263797 -346172
8500 -346172 -273933 -404965 -470720 -175302 143272 237017 180929 213205 352822 455871 339526
8489 339526 58448 -153855 -97831 63316 102286 90799 -60337 -304820 -447328 -579186
8479 -579186 -680300 -626389 -437518 -109962 270943 357196 243913 313117 498679 716672
8469 716672 676349 514799 371910 132683 174627 402500 397596 188998 136170 166847 141119
8458 141119 180116 321703 462440 445664 272172 227688 241457 139410 -34850 -91341 -81386
8447 -81386 36703 300944 589207 537765 319997 -88682 -181733 -313578 -327227 -124899
8437 -124899 126593 232113 205322 252633 207388 136806 62837 -6116 -138584 -200780 -192349
8426 -192349 -195800 -227515 -241569 -122965 148853 407399 494415 365380 115034 26326 25905
8415 25905 137659 263910 147601 -106997 -343532 -449500 -409603 -332336 -216264 -168818
8405 -168818 -312646 -393723 -300957 -353665 -326318 -183067 -1855 84710 -126687 -273007 -374627
8394 -374627 -273514 -10571 114357 216348 350556 421351 341559 278734 115440 -175602
8384 -175602 -397944 -397531 -164892 92150 196306 287757 407687 210343 -151406 -205987 73877
8373 73877 294057 308050 226742 186097 14247 -327873 -294246 -88204 126498 343722 498085
8362 498085 432132 251288 150746 168432 102236 -69430 -177042 -234906 -251783 -135503 128383
8351 128383 359986 358210 303517 368576 278791 133815 77713 276214 283223 110500 56507
8340 56507 -79863 -292526 -488816 -646837 -568296 -436322 -224153 -53438 22219 -859
8330 -859 -106584 -140604 -158989 -197457 -232650 -89509 8184 -28548 14324 -66241 -145236 -140466
8318 -140466 -107022 22162 276816 547318 516087 220890 131035 70399 -126455 -176740 -65347
8307 -65347 -53184 -79342 -26335 -95114 -82465 54301 116044 195189 292288 322136 160152
8296 160152 131284 203889 269244 319625 277345 371608 306465 106628 62168 17917 96620
8285 96620 191903 -44595 -265696 -265440 -267329 -153829 -21378 -95556 -193349 -346946 -558218
8274 -558218 -613500 -530812 -458275 -296905 -189115 -124367 -56022 9650 107647 78091 76430
8263 76430 44982 -113910 -220328 -151865 -131903 -6240 142227 151817 134446 207449 160765
8252 160765 -115041 -187684 -103758 105749 282592 269609 60691 -34342 53029 113248 128828
8241 128828 131168 239644 451203 396643 170820 83889 209777 373508 529574 520182 296721
8230 296721 -86369 -427346 -329541 -54649 87691 155168 107440 -260123 -504500 -339081
8220 -339081 -14958 255596 422835 556432 667070 603212 374329 119029 -182562 -321457
8210 -321457 -300564 47556 151368 31508 -30203 -51865 -7285 136353 126050 -126715 -245460
8199 -245460 -196392 -186070 -156370 -76045 -29831 17250 -169244 -116837 -102364 -45351 16942
8188 16942 -2410 -92757 -238184 -411119 -529059 -568074 -493759 -212076 -88940 -57333 -97934
8177 -97934 -125754 -103419 -141363 -44690 169732 319242 100209 -118566 -207310 -314691 -212507
8166 -212507 -173732 -124417 -166136 -237901 -216844 -234187 -366416 -499762 -517314 -504471 -623557
8155 -623557 -660295 -425200 -220794 -313309 -487258 -600776 -459611 -366115 -154059 25928
8145 25928 119027 14771 -196672 -120700 84684 272538 164847 36523 185259 270057
8135 270057 341618 334968 319874 471627 580310 630919 646360 726307 691554 555121 440419
8124 440419 227337 36791 -63191 51715 299943 399821 310216 114106 147155 201408 81130
8113 81130 19942 -173271 -176121 62276 124493 -50868 31427 309373 527540 576097 304598
8102 304598 -14277 -216604 -271507 -184773 -29551 49664 51222 41518 315098 616192 510095
8091 510095 245260 20641 31007 131625 47408 -84555 -409042 -534908 -475383 -402447
8081 -402447 -441255 -345710 -28851 259944 418688 419028 134300 -287540 -325524 -181211 549
8070 549 190421 58096 67096 209237 216895 98817 92172 73149 -11374 29210 -150726 -210886
8058 -210886 145393 387682 239926 -66917 -57777 -75660 -162556 -81748 -50387 -188176 -278231
8047 -278231 -229470 -290462 -349458 -145826 -33542 -124703 -201793 -204435 -84217 93977 229048
8036 229048 440676 583509 529914 425281 223100 -213427 -479838 -512816 -594012 -605894
8026 -605894 -528349 -478678 -606374 -704545 -552344 -364297 -378461 -324747 -41682 104812 -15333
8015 -15333 -112342 -341833 -429360 -169294 -83997 -99320 -60537 -124443 -270655 -321678 -347927
8004 -347927 -468024 -472405 -421404 -186817 -11815 -160222 -188465 -117066 -152054 -158066 16017
7993 16017 106949 206926 260544 243085 107865 -56631 -185443 -443907 -553768 -719336 -914674
7982 -914674 -981481 -955892 -893873 -778894 -634895 -543436 -441990 -444923 -478437 -405307 -290008
7971 -290008 -212271 -152179 -32333 137501 -60151 -344892 -350482 -107060 207046 261493 215409
7960 215409 291492 405858 429567 339378 270167 273317 206590 287630 356913 265610 199975 174430
7948 174430 6140 -105908 -296916 -343151 -121196 -154506 -181570 -146120 -282573 -367961 -223066
7937 -223066 -56167 122522 318337 363865 280290 467734 554713 513620 644879 732097 772845
7926 772845 586140 381727 119574 -128898 -67204 189464 344617 261812 317739 432206
7916 432206 452942 254208 13158 -100300 -79999 1398 40265 -110157 -323548 -240994 -14709
7905 -14709 43873 41427 33677 191187 435861 464988 435704 402206 235047 346147 375805
7894 375805 265826 30988 -107413 85589 206848 291998 310011 405595 437057 461616 334207
7883 334207 78086 65551 -74260 8918 209386 186050 300815 392848 290539 156069
7873 156069 153046 332109 350843 261323 121293 -49921 -289389 -372442 -77430 93828 171069
7862 171069 188774 236568 148908 11880 -130129 -306381 -258441 -11064 325751 418670 284105
7851 284105 225917 108877 55329 164314 183537 -15160 -88500 -137079 -113605 -403890 -651397
7840 -651397 -687251 -583282 -145549 170748 108564 -74145 -282496 -331184 -301687 -237394 -102866
7829 -102866 -21181 38200 71941 10407 -100574 -206170 -61937 126612 64769 -124785 -133072
7818 -133072 135176 186579 119458 95937 -167588 -481644 -427552 -242329 -250168 -365374 -331449
7807 -331449 -211567 -181915 -203629 -262644 -315796 -289408 -114999 -135053 -126579 123222 93215
7796 93215 -256582 -409989 -350303 -266714 51720 272919 379907 354205 237434 179539 190888
7785 190888 89064 -135991 -166778 -15758 -7300 -92268 -170099 -203580 -161094 -94591 41509
7774 41509 -36819 -98972 -79309 -143653 -146239 -6142 189073 467559 684558 709543 694079
7763 694079 524837 238827 18603 115084 501382 517159 439763 403943 200113 74951
7753 74951 245012 185271 -296942 -576357 -217988 80264 118806 84110 136102 191582 126936
7742 126936 -14929 -8051 -47494 -132289 -42172 130962 201855 254318 356859 520608 428920
7731 428920 293965 163527 109663 -39851 -139010 -131678 -218146 -246407 -154514 -121786 -370851
7720 -370851 -559974 -609503 -326995 -120605 -32839 144965 153638 88459 33767 -52923 -95299
7709 -95299 -34420 141135 155667 116681 -2133 -60404 111980 228863 239457 196025 134964
7698 134964 64836 -144542 -348009 -513906 -692188 -895966 -765622 -363421 10778 -10140
7688 -10140 -245126 -436627 -429806 -310779 -290487 -383070 -363446 -165348 65324 187645 320300
7677 320300 205477 231262 324346 366614 397779 395599 330203 182904 36209 -211353 -245545
7666 -245545 -73899 150544 441992 530539 378457 100771 -201884 -309168 -252495 -66271
7656 -66271 133108 302742 318093 220671 29898 -276309 -383814 -213305 -144077 -41248
7646 -41248 167498 17878 -392438 -639704 -659123 -589193 -326812 -108122 -27407 -474 50257
7635 50257 47319 -106325 -39015 193361 352673 398086 325558 251556 141115 35615 15828
7624 15828 12301 54215 31879 37016 112461 41585 -40062 -341561 -564523 -649239 -607081 -440953
7612 -440953 -448052 -466313 -319651 -145509 -303466 -508637 -499312 -294418 68624 276191 241499
7601 241499 318086 502504 419979 391315 319118 24716 -240552 -192566 -87736 -151858 -84970
7590 -84970 -182213 -405062 -666101 -627300 -209510 137465 101256 254703 362918 201516
7580 201516 61740 -119120 -242768 -194301 -50318 55066 223755 213670 108344 61435
7570 61435 -113230 -261266 -318922 -408672 -302877 -330423 -497102 -470492 -274239 -159503 -174149
7559 -174149 -338716 -571699 -758705 -686944 -614408 -535134 -398252 -357136 -187520 50266
7549 50266 211320 80177 -170656 -384619 -611351 -597976 -374227 -174834 2621 38878
7539 38878 -75473 -60095 -83122 -190598 -382923 -461262 -232432 -131979 -43954 -2882 -223852
7528 -223852 -354113 -196844 -78718 -76133 -14681 141235 267341 167285 -78112 -221199
7518 -221199 -263758 -222359 -302370 -376283 -335168 -299533 -289819 -212637 -35475 -15386 -214455
7507 -214455 -199492 -115505 -94946 -134711 -85371 8051 -34159 120427 354411 303042 73394
7496 73394 166384 291466 290267 46412 -101706 -77238 57379 132216 328054 346426 267841
7485 267841 315327 327270 339712 397060 374441 276754 266890 91760 -211051 -393841 -381465
7474 -381465 -298185 -138577 -137358 -294476 -205872 -96357 -210388 -305397 -256471 -102422 256303
7463 256303 449088 183413 223012 428504 463469 517122 337271 141869 11598 177107
7453 177107 495717 690752 875501 828539 663011 483912 399223 414902 241588 46366
7443 46366 -39776 12046 832 44921 183463 156275 -103139 -233234 -121757 -155289 -183246
7432 -183246 -39232 -150992 -237016 -206327 -321247 -266679 -163480 -43697 -126160 -149486 -65821
7421 -65821 27514 29244 -63022 11040 157950 223153 224132 249184 306368 139401 116299 130119
7409 130119 -128380 -265290 -245480 -107523 203628 282757 58981 -321187 -440538 -142040
7399 -142040 -8801 -46253 130755 132681 -92730 -524787 -753055 -702987 -588360 -481915
7389 -481915 -514987 -494706 -470108 -438202 -476158 -600372 -495901 -612031 -674552 -427336 -265163
7378 -265163 -132192 -80019 -97544 -319616 -437274 -444908 -444390 -223686 -100235 -41868 -138470
7367 -138470 -346324 -536753 -573151 -359174 -85597 -66911 -61198 -107413 -359879 -527910 -481150
7356 -481150 -280003 -109528 -92672 -174446 -353881 -502627 -506266 -282762 -97400 1880 4209
$$ [...]
##END NTUPLES=NMR SPECTRUM
##END=
