##TITLE=C13_IAMT-134
 CDCl3, 24900 sc

 24.8.2020
##JCAMPDX= 6.0         $$ Bruker NMR JCAMP-DX V2.0
##DATA TYPE= NMR SPECTRUM
##DATA CLASS= NTUPLES
##ORIGIN= UXNMR, Bruker Analytische Messtechnik GmbH
##OWNER= root
$$ XWIN-NMR		Version 3.5
$$ Tue Aug 25 10:20:30 2020 Russian Standard Time (UT+4h)  she@DPX200
##.OBSERVE FREQUENCY= 50.327896
##.OBSERVE NUCLEUS= ^13C
##.ACQUISITION MODE= SIMULTANEOUS
##.ACQUISITION SCHEME= undefined
##.AVERAGES= 24900
##.DIGITISER RES= 17
##SPECTROMETER/DATA SYSTEM= spect
##.PULSE SEQUENCE= zgpg30
##.SOLVENT NAME= CDCl3
##.SHIFT REFERENCE= (INTERNAL, CDCl3, 0, 222.661)
##AUDIT TRAIL= $$ (NUMBER, WHEN, WHO, WHERE, WHAT)
$$ ##TITLE= Audit trail, XWIN-NMR		Version 3.5
$$ ##JCAMPDX= 5.01
$$ ##ORIGIN= Bruker BioSpin GmbH
$$ ##OWNER= she
$$ F:/spectra/data/she/nmr/c13/1/pdata/1/auditp.txt
$$ ##AUDIT TRAIL=  $$ (NUMBER, WHEN, WHO, WHERE, WHAT)
(   1,<2020-08-25 10:19:23.10 +0400>,<she>,<DPX200>,
      <created by zg, POWCHK disabled, PULCHK disabled
       terminated by command 'halt'
       configuration hash MD5:
       00 E9 B6 7A A2 85 ED C7 34 08 36 98 17 FE 4E 26
       data hash MD5: 32K
       A3 35 E2 8E A4 DB 52 A6 97 CE BA 1C C9 4B A0 AA>)
(   2,<2020-08-25 10:19:25.12 +0400>,<she>,<DPX200>,
      <Start of raw data processing
       efp BC_mod = 2 LB = 1 FT_mod = 6 PKNL = 1 PHC0 = -194.7158 PHC1 = -17.03759 SI = 32K 
       data hash MD5: 32K
       D0 9D 5D C5 2D 65 11 34 04 FE 79 4F 9D C3 21 D6>)
(   3,<2020-08-25 10:19:27.82 +0400>,<she>,<DPX200>,
      <abs ABSG = 5 
       data hash MD5: 32K
       F3 7E 6D 7C AD 9F E2 DE 53 4C EA 9E DE DC 01 45>)
(   4,<2020-08-25 10:19:56.46 +0400>,<she>,<DPX200>,
      <pk PHC0 = 1.536451 PHC1 = -0.5999998 
       data hash MD5: 32K
       D8 97 48 B3 CA 1F C8 5B AA 4D 3B 53 12 AB AA 6B>)
(   5,<2020-08-25 10:20:00.06 +0400>,<she>,<DPX200>,
      <abs ABSG = 5 
       data hash MD5: 32K
       03 B4 FA B6 DF D2 95 D6 89 82 9C D2 4D 4C F3 72>)
$$ ##END=
$$ 
$$ hash MD5
$$ 07 03 FE 75 FB 14 84 FC A5 E4 8E B3 B3 49 5E 9B
##$RELAX= 
##$RELAX= 
##$RELAX= 
##$RELAX= 
##$RELAX= 
##$RELAX= 
##$RELAX= 
##$RELAX= 
$$ Bruker specific parameters
$$ --------------------------
##$DU= <F:/spectra>
##$EXPNO= 1
##$NAME= <c13>
##$PROCNO= 1
##$TYPE= <nmr>
##$USER= <she>
##$AMP= (0..31)
100 100 100 100 100 100 100 100 100 100 100 100 100 100 100 100 100 100 
100 100 100 100 100 100 100 100 100 100 100 100 100 100 
##$AQSEQ= 0
##$AQ_mod= 1
##$AUNM= <au_zg>
##$AUTOPOS= <>
##$BF1= 50.322709
##$BF2= 200.13
##$BF3= 50.322709
##$BF4= 500.13
##$BF5= 500.13
##$BF6= 500.13
##$BF7= 500.13
##$BF8= 500.13
##$BYTORDA= 1
##$CFDGTYP= 0
##$CFRGTYP= 5
##$CHEMSTR= <none>
##$CNST= (0..31)
1 1 145 1 1 1 1 1 1 1 1 1 1 1 1 1 1 1 1 1 1 1 1 1 1 1 1 1 1 1 1 1 
##$CPDPRG= <waltz16>
##$CPDPRG1= <>
##$CPDPRG2= <waltz16>
##$CPDPRG3= <>
##$CPDPRG4= <mlev>
##$CPDPRG5= <mlev>
##$CPDPRG6= <mlev>
##$CPDPRG7= <mlev>
##$CPDPRG8= <mlev>
##$CPDPRGB= <>
##$CPDPRGT= <>
##$D= (0..31)
$$ [...]
##$SUBNAM4= <"">
##$SUBNAM5= <"">
##$SUBNAM6= <"">
##$SUBNAM7= <"">
##$SUBNAM8= <"">
##$SUBNAM9= <"">
##$SW= 239.972175391363
##$SWIBOX= (0..15)
0 1 3 0 0 0 0 0 0 0 0 0 0 0 0 0 
##$SW_h= 12077.2946859903
##$TD= 32768
##$TD0= 1
##$TE= 0
##$TE2= 300
##$TE3= 300
##$TEG= 300
##$TL= (0..7)
120 120 120 120 120 120 120 120 
##$TP= (0..7)
150 150 150 150 150 150 150 150 
##$TP07= 0
##$TPNAME0= <>
##$TPNAME1= <>
##$TPNAME2= <>
##$TPNAME3= <>
##$TPNAME4= <>
##$TPNAME5= <>
##$TPNAME6= <>
##$TPNAME7= <>
##$TPOAL= (0..7)
0.5 0.5 0.5 0.5 0.5 0.5 0.5 0.5 
##$TPOFFS= (0..7)
0 0 0 0 0 0 0 0 
##$TUNHIN= 0
##$TUNHOUT= 0
##$TUNXOUT= 0
##$USERA1= <user>
##$USERA2= <user>
##$USERA3= <user>
##$USERA4= <user>
##$USERA5= <user>
##$V9= 5
##$VALIST= <valist>
##$VCLIST= <CCCCCCCCCCCCCCC>
##$VD= 0
##$VDLIST= <DDDDDDDDDDDDDDD>
##$VPLIST= <PPPPPPPPPPPPPPP>
##$VTLIST= <TTTTTTTTTTTTTTT>
##$WBST= 1024
##$WBSW= 4
##$XGAIN= (0..3)
0 0 0 0 
##$XL= 0
##$YL= 0
##$YMAX_a= 78296238
##$YMIN_a= -161381902
##$ZGOPTNS= <>
##$ZL1= 120
##$ZL2= 120
##$ZL3= 120
##$ZL4= 120
##$ABSF1= 222.6606
##$ABSF2= -17.33621
##$ABSG= 5
##$ABSL= 3
##$ALPHA= 0
##$AQORDER= 0
##$ASSFAC= 0
##$ASSFACI= 0
##$ASSFACX= 0
##$ASSWID= 0
##$AUNMP= <proc_1d>
##$AZFE= 0.1
##$AZFW= 0.5
##$BCFW= 0
##$BC_mod= 2
##$BYTORDP= 0
##$COROFFS= 0
##$CY= -3
##$DATMOD= 1
##$DC= 0
##$DFILT= <>
##$DTYPP= 0
##$F1P= 0
##$F2P= 0
##$FCOR= 0.5
##$FTSIZE= 32768
##$FT_mod= 6
##$GAMMA= 0
##$GB= 0
##$INTBC= 1
##$INTSCL= 4.134877e-10
##$ISEN= 128
##$LB= 1
##$LEV0= 0
##$LPBIN= 0
##$MAXI= 10000
##$MC2= 0
##$MEAN= 0
##$ME_mod= 0
##$MI= 0.1934396
##$NCOEF= 0
##$NC_proc= 3
##$NLEV= 6
##$NOISF1= 120.0001
##$NOISF2= 80.00006
##$NSP= 0
##$NTH_PI= 0
##$NZP= 0
##$OFFSET= 222.6606
##$PC= 1.4
##$PHC0= -193.1794
##$PHC1= -17.63759
##$PH_mod= 1
##$PKNL= yes
##$PPARMOD= 0
##$PSCAL= 0
##$PSIGN= 0
##$REVERSE= no
##$SF= 50.322729756361
##$SI= 32768
##$SIGF1= 140
##$SIGF2= 120
##$SINO= 11.81781
##$SIOLD= 32768
##$SREGLST= <13C.CDCl3>
##$SSB= 0
##$STSI= 32768
##$STSR= 0
##$SW_p= 12077.2946859903
##$SYMM= 0
##$S_DEV= 0
##$TDeff= 32768
##$TDoff= 0
##$TI= <>
##$TILT= no
##$TM1= 0
##$TM2= 0
##$TOPLEV= 0
##$USERP1= <user>
##$USERP2= <user>
##$USERP3= <user>
##$USERP4= <user>
##$USERP5= <user>
##$WDW= 1
##$XDIM= 32768
##$YMAX_p= 312610214
##$YMIN_p= -1253990
$$ End of Bruker specific parameters
$$ ---------------------------------
##NTUPLES= NMR SPECTRUM
##VAR_NAME=  FREQUENCY,     SPECTRUM/REAL,   SPECTRUM/IMAG
##SYMBOL=    X,             R,               I
##VAR_TYPE=  INDEPENDENT,   DEPENDENT,       DEPENDENT
##VAR_FORM=  AFFN,          ASDF,            ASDF
##VAR_DIM=   32768,         32768,           32768
##UNITS=     HZ,            ARBITRARY UNITS, ARBITRARY UNITS
##FACTOR=    0.368581032318806, 1,           1
##FIRST=     11204.8891385315, 0,            0
##LAST=      -872.405547458802, 0,           0
##MIN=       -872.405547458802, -1253990,    0
##MAX=       11204.8891385315, 312610214,    0
$$ Real data points
##PAGE= N=1
##DATA TABLE= (X++(R..R)), XYDATA
$$ [...]
16066b07565n7393J6838J88866j02476o7416J68892Q9093J2624N81O5757J62138
16055B69939K2675k3735K3772R5258o1597j21015m191l24758k90221R1238R9409
16044b23226j18037P8062K10093K45645K03561k11608k40606k35638j318L44773
16034E1701l076k46968j17631Q6228J19325j92681j51386j5102P1726m9320M1905
16023d05279O2348m2327L0447k6239p2522j7114J30414K15122J12480j9439j91041
16012b23150j97028m2514O3373p1827P119L66777N19602Q3821m04394l11283M1808
16001a67696J09641J27732J03761Q1051J784k46472k66181k05842R9887Q8142
15991b74193j29685N6159p3231l25762j65093J32075J87613O2395q3866J22890
$$ y = [-207565, -264958, -248120, -59254, -161730, -229146, -60254, 28839, 41463, 42044, 107801, 269939, 292614, 268879, 292651, 387909, 326312, 205297, 201106, -123652, -413873, -322635, -223226, -341263, -263201, -53108, 192537, 396098, 184490, -56116, -291754, -293072, 51701, 48625, -198343, -315974, -229746, -110421, -303102, -454488, -469590, -397864, -447184, -405279, -342931, -385258, -354811, -381050, -453572, -470686, -340272, -125150, -12670, -32109, -223150, -420178, -462692, -399319, -471146, -464027, -97250, 422352, 506173, 101779, -209504, -167696, -58055, 69677, 173438, 254489, 256273, 9801, -256380, -462222, -362335, -274193, -403878, -347719, -420950, -746712, -911805, -779730, -592117, -529722, -613588, -490698]
15981d90698J91136j70510m9514N2276O1681l9748M5208Q1580k564k1649j55847
15970d98649L5170Q5510J61959J07948J15822P2882k64227n4739L70800L11123
15960D43599j07175l36681j41676j61739K7199K10638R9817O6401j26583m11256
15950d37456q8395K76106K16009j43892m13904j47603J64785L69664P8768k63811
15940c89729j52763Q1820K27232L56931L75394K6514l88592l40608J8255j661
15930a87207r0644j47036j11533K1083J20326J99994P5518R9113K51420N9155
15920B90189j00000Q7816o9644l30122p595N9605P862k5723J6638P7371r7803
15909i1406j89880r7982M5985Q5229M5598O4388J95448J41711J00506K48546j42651
$$ y = [-490698, -299562, -470072, -519586, -467310, -405629, -445377, -400169, -318589, -321153, -342802, -498649, -463479, -377969, -216010, -108062, 7760, 80642, -183585, -238324, 132476, 443599, 336424, -257, -141933, -303672, -276473, -65835, 33982, 100383, -26200, -437456, -525851, -249745, -33736, -177628, -591532, -739135, -574350, -204686, -125918, -389729, -542492, -460672, -233440, 123491, 498885, 525399, 136807, -203801, -185546, -187207, -277851, -424887, -536420, -515337, -395011, -195017, -119499, -20386, 231034, 290189, 190189, 278005, 208361, -121761, -129356, -69751, -61889, -87612, -70974, 6397, -91406, -281286, -379268, -333283, -248054, -202456, -138068, 57380, 199091, 299597, 548143, 405492]
15898D05492m31558k57186j66434J18157K26828J65065P0071j45367j85785p91
15888b01508L2130o5433p5717J43779J57273m0335j48202j8989k3496j47817M4507
15877c43808K77130K55109m8085n7390j5731p2473P7296k4993R7268J76235J47946
15866D68504r0998j48637q9550m5990j54112N9973R7631p7668Q0918K43610J42887
15855D86568k20809k11247J02251K29696J64765j81210j99979Q1284K62453L17671
15845H31443m405j84667k9771L354k16610k97242j40320R4170K46529J01767k12823
15834A91425j42538J09410P6542J4909J4493j10561j41264J42158J18038j03780
15824A68832j34040l01841j32905q5679J42042J85556J9029M4502J43361o058
$$ y = [405492, -26066, -283252, -449686, -331529, -104701, 60364, 130435, -14932, -200717, -201508, -169378, -234811, -310528, -166749, -9476, -49811, -198013, -217002, -240498, -388315, -343808, -66678, 188431, 140346, 82956, 67225, -5248, 72048, 47055, 144323, 320558, 468504, 377506, 228869, 139319, 93329, -60783, -810, 96821, 19153, 100071, 343681, 486568, 265759, 54512, 156763, 386459, 551224, 370014, 170035, 251319, 513772, 831443, 827038, 642371, 612600, 615954, 399344, 102102, -38218, 55952, 302481, 404248, 191425, 48887, 158297, 234839, 249748, 264241, 153680, 12416, 154574, 272612, 168832, 34792, -267049, -399954, -485633, -343591, -158035, -139006, -94504, 48857, 42799]
15814D2799R7563K51084j05005p0111P4391K9092j69153n6616p1658n8957j5701
15803e2272j08270k96116j59510K3731J80421P2943K0448J00679N1462m7667J00830
15792a13321J14888L9021n3702k02992j67848n7564Q2038K88268J93853j23811
15782a170M1372R9475j53228r9607j08282q4762J43701P3644m5454j37502j34153
15771d05966M7989p3537p3997m0765J75326J41296O4535J95394P2291l7305k14057
15760a48796j24490j8084J06612K50079J84466J07482M5469M0862m5717j54083
15750B43800j10359R6630m4980q4980J51140K7083m8982J5090j36499R304K16724
15739C33971j89759m31531j34506j32119j31594j2931J33995J56766M9595j1993
$$ y = [42799, 140362, 391446, 286441, 216330, 290721, 319813, 150660, 94044, 22386, -36571, -52272, -160542, -456658, -616168, -592437, -412016, -339073, -318625, -217946, -166484, -214151, -113321, 1567, 40588, -13114, -216106, -383954, -441518, -359480, -71212, 122641, -1170, 40202, 139677, -13551, -113158, -221440, -306202, -162501, -88857, -134311, -271813, -405966, -357977, -431514, -505511, -546276, -370950, -229654, -165119, 30275, 102566, 65261, -148796, -273286, -291370, -184758, 65321, 249787, 357269, 402738, 443600, 397883, 243800, 133441, 230071, 185091, 100111, 251251, 278334, 229352, 244442, 107943, 117247, 333971, 144212, -287319, -421825, -553944, -685538, -698469, -564474, -407708, -358113, -370106]
15729c70106J10805N323m3204J55897K68890M6542j25975M6518J73388K25826
15719D93904P8567l6082q4835p7480j91955k72969j80398N2783o1973l8235O4198
15708b54475J3944M910o5944j53769j27307m7440K4932M0315n7485P7436Q4308
15697d60575k39182O2875J96333J11318j3204l32961j38079J56032J81458L887
15687d72098l8663M1j52793q7335K9309k3510q3067J28410J97874J42142J60346
15676a99344J25565R8103Q6407K5524l8418O5121P9849m2673j67574k92395m4509
15665c04344K23597J78169Q2412j18629j0959n3293m6403J32897j97249j58497
15655b72299r9163J2118R8342J3946L6494J82675J80493O4932r2532n0232j64590
$$ y = [-370106, -259301, -253978, -297182, -141285, 127605, 174147, 48172, 94690, 268078, 493904, 572471, 536389, 451554, 374074, 182119, -90850, -271248, -218465, -280438, -318673, -254475, -240531, -235621, -301565, -455334, -582641, -630081, -605149, -564834, -622319, -544883, -460575, -699757, -636882, -440549, -329231, -342435, -675396, -813475, -657443, -475985, -472098, -510761, -510720, -663513, -750848, -721539, -745049, -828116, -699706, -501832, -359690, -199344, -73779, 24324, 110731, 136255, 97837, 162958, 242807, 200134, 32560, -259835, -304344, -80747, 97422, 179834, 61205, 50246, -3047, -49450, 83447, -113802, -272299, -371462, -359344, -261002, -247056, -210562, -27887, 152606, 217538, 125006, 74774, -89816]
15644h9816j46106r9846n0857j05135L8332J32741M376k07537j94685j09452J11227
15633g16758L2883R5873K62647J90631m2272j32903p291o9645J36627J92094j22468
15622a80582j56389j2721K0103m8601r2679q330M5133K00006J10802j37488k22062
15611d82808j82076p0348J63953L3332m5055l7125J34368K04850J08939N0822
15601a21148j28956q1939m5706O2454J82535M6293J6455K61578K70424k396k3556
15590D36038k0153j94183m8092l9412J21590K20636p6576l42234l41355J33467
15580a50274J97330R1621J49852o778K954L6556n6763N0777J45094J1176k10054
15569B61491j45834j06304p8533k72258k23428r634O5625O2661j01476j30374
$$ y = [-89816, -235922, -335768, -386625, -491760, -453428, -320687, -316311, -523848, -718533, -827985, -716758, -683875, -588002, -325355, -134724, -176996, -309899, -317190, -386835, -250208, -58114, -180582, -336971, -349692, -329589, -378190, -470869, -479199, -434066, -234060, -123258, -260746, -482808, -664884, -735232, -571279, -537947, -583002, -620127, -485759, -280909, -171970, -121148, -250104, -332043, -377749, -315295, -132760, -86467, -70012, 191566, 461990, 459594, 436038, 415885, 221702, 173610, 134198, 255788, 476424, 399848, 57614, -283741, -150274, 47056, 138677, 288529, 281751, 284705, 321261, 264498, 315275, 460369, 471545, 261491, 115657, 9353, -69180, -341438, -564866, -574500, -508875, -446214, -547690, -678064]
15559f78064p5559J85826M33683K00161o1288P437K1916o54q0503j25366n7002
15548b29413L9829L1605K86957K00341j14086k8929j08572k04901k2081J41979
15538g271J95148n1071q0214J31402n6340r2390Q2209j23789k74664k1253l8059
15527c36292p3589j22646l16317j85412J3493O6523J29337J29702K9211k6306
15517f92296P7284J75500J04541j06158j5462k6947o5010J06208J07901j91842
15507e26281k68584j24156J32250L66152N36441K71026q3370k57839p6677j88675
15497b19713j96517L5907R9544J08518R9669J70460K2313j85059k07388j15013
15487c87279R3513J85402M7803j55631J18797R8504j42263o5649N593p4028J36865
$$ y = [-678064, -753623, -567797, -134114, 66047, 4759, 12196, 34112, 33458, -47045, -172411, -229413, -189584, -157979, 128978, 329319, 215233, 186304, 77732, -127169, -149250, -7271, 187877, 136806, 56592, 187994, 131654, 39264, 121473, -2316, -276980, -298233, -336292, -409881, -532527, -848844, -1034256, -1020763, -954240, -824903, -695201, -665990, -692296, -615012, -439512, -334971, -441129, -456591, -483538, -548548, -442340, -334439, -526281, -794865, -919021, -786771, -420619, 115822, 386848, 303478, 45639, -31038, -219713, -416230, -380323, -280779, -172261, -72592, 97868, 120181, -64878, -272266, -387279, -293766, -108364, -60561, -216192, -97395, 1109, -141154, -206803, -201210, -275238, -138373]
15476a38373P3402k60436L9574K89253k8256l10806l67621j66420J59251L22532
15466c87900Q9963j44422r807l1136P4582J12324p0153M8694K38074N9061o0073
15455h0793k67267k81062j9479J24777O4337Q3751J19710J80939P2414k2682J37834
15444A12479K71080J18640r8014j41421p5121m3942j62590j27827m9401k67221
15434d63338O6137J55524M3127o6510K257M2431K96668K45135j9252j25528j75302
15423A349j74026O460M8264j4288N5361M6016l3725j30236j43100j31297j93762
15412f62984n6717J15095L48871J25587n6745O3561j06137L1398l9096k77353
15402e14520j63708k1489J03744J90305J33194O6190N0928j3055q1746M2739K8823
$$ y = [-138373, -64971, -325407, -285833, 3420, -24836, -335642, -703263, -869683, -710432, -387900, -297937, -442359, -452166, -483302, -408720, -296396, -366549, -317855, -79781, -20720, -80793, -348060, -629122, -648601, -523824, -459487, -375736, -256026, -75087, -2673, -25355, 112479, 383559, 502199, 404185, 262764, 187643, 143701, -18889, -146716, -196117, -463338, -397201, -241677, -198550, -265060, -262803, -220372, 76296, 321431, 302179, 176651, 1349, -172677, -166217, -117953, -132241, -76880, -30864, -64589, -194825, -337925, -469222, -662984, -719701, -604606, -255735, -130148, -186893, -123332, -229469, -198071, -237167, -514520, -678228, -699717, -595973, -405668, -272474, -206284, -155356, -168411, -250157, -207418, -178595]
15391a78595k02335k37983N9608J90320L7716l4487J17875J08737O1844k18165
15381b95465k22929Q1312J56125P0100P5231p302J6275m8422m2402J70012J10764
15370F3299J3246o6507K1758L8967o9391k3530P9540J5331j08886o4309n8737
15359a59219j05685j4577P9227M0601j6113k79593j94748j17471j04354N8493
15349h13439P6598L65372M47293J54697L0137k62092k72140J72364K22042P1984
15339A92816O5625O5706n4617r4777j16988j70998M2034N9350n8639j03520O6414
15328a07594J08397k1688j35173k9709K22495J04973l921N2928Q5941N7312q3041
15317B50920j08423j95500M5012O8087j60008j09504J66537Q4230q7436J49952
$$ y = [-178595, -380930, -618913, -559305, -368985, -331269, -365756, -247881, -139144, -77300, -295465, -518394, -437082, -280957, -210857, -135626, -142928, -126653, -175075, -217477, -47465, 63299, 76545, 10038, 31796, 70763, 1372, -22158, 57382, 72713, -36173, -100482, -159219, -264904, -279481, -200254, -159653, -175766, -455359, -650107, -767578, -871932, -813439, -736841, -371469, 75824, 230521, 260658, -1434, -273574, -101210, 120832, 192816, 258441, 324147, 269530, 174753, 57765, -113233, -71199, -11849, -70488, -174008, -107594, 803, -20885, -156058, -185767, 36728, 141701, 137780, 190708, 276649, 333961, 250920, 142497, -53003, -7991, 60096, -99912, -209416, -42879, 41351, -46085, 103867]
15307A03867K09175j05036j27722k75689k66901o5807K52996J45332l6344J1209
15297a54920r4952q9452j93337r8056K40685L65879R9753j47150q7246K21415
15287F2619J88979q4199m5152j97418j56473K4261N7100P4246r4465j43683j62816
15276d77001M5619J53183J32550K49233m4895j43402M3838J44149K19750J32291
15266D55315P7721l0082J2441j14689m23580k97201q0297N1582n2770n2345o0569
15255e14474n0933K05915L60423M0400l45535j8486J13121K1728K50024J94893
15245B57076q0128j83861k48147R3883K76750R5316K4325J58172J361l1395J19060
15234D82412J44638K9919j20890r9653n4660j32823l8887N2311M5324R1093J10791
$$ y = [103867, 313042, 208006, 80284, -195405, -462306, -528113, -275117, -129785, -166129, -154920, -249872, -339324, -532661, -630717, -390032, -24153, 75600, -71550, -158796, 62619, 251598, 167399, 122247, -75171, -231644, -207383, -150283, -76037, -170502, -314185, -477001, -431382, -278199, -145649, 103584, 58689, -84713, -40875, 103274, 323024, 455315, 533036, 502954, 515395, 400706, -22874, -320075, -400372, -348790, -401560, -453905, -514474, -565407, -359492, 931, 41331, -304204, -322690, -209569, -187841, 62183, 257076, 176948, -6913, -255060, -161177, 115573, 210889, 235214, 393386, 394747, 363352, 482412, 627050, 656969, 536079, 436426, 381766, 248943, 210056, 262367, 307691, 398784, 509575]
15223E09575k7672k14443j40018j68292p2211J44364Q2427m4814Q4992Q0512O5206
15212B99626j46194j27702J59269J89641K7277j55306j20917J19955J89180P1094
15202E05923k49770m31052j56040o6425o4963J33795J55035j77351l5101r7675
15192d83624m8496J72474J95739L2140j16053O691K92054J71374J72547J74076
15182E68922J11730j91015n13111l64188j36222j14952k9179J00779J08661O7835
15172c90740L9909J16982M7131J4773J04269O1242K9845P3540k13783j2947J20576
15161i203O1046l6014L6704J76721p3407r0491J52106q5008m303R7776K2703j14648
15149A33982o4701J99158K6340o7139j63132k46660j3976k0926R0797K17482J91026
$$ y = [509575, 481903, 267460, 127442, -40850, -113061, 31303, 113730, 68916, 153908, 234420, 299626, 153432, 25730, 184999, 374640, 401917, 246611, 125694, 245649, 434829, 505923, 256153, -174899, -330939, -397364, -462327, -328532, -173497, -350848, -385949, -483624, -532120, -359646, -163907, -131767, -247820, -241129, 50925, 222299, 394846, 568922, 680652, 489637, -23474, -387662, -523884, -638836, -668015, -567236, -458575, -390740, -350831, -233849, -186718, -171945, -67676, -6434, 23411, 96951, -116832, -129779, -9203, 51843, 15829, 52533, 229254, 155847, 65356, 217462, 132454, 128151, 225927, 248630, 133982, 69281, 268439, 294779, 227640, 64508, -182152, -196128, -217054, -126257, 91225, 282251]
15138B82251R1736L3839P8450p4184j75284k27728j68467n7621j8188j1299M9498
15127a96997n0282j05425J9933J32156J66265J93408R0033J16098k0586p2778
15117B71825j22349m8426l9147q0388j97005l11134m3038M48206K51507j74819
15107d4768k36167j74893J0202L1333K33216L27167J96089L4379j17175k9046
15097B30337O1539j14326l0388J55025J58389k17912k49665n710K4866l2433j80842
15086b01120j74658k4181J62841r2510l6651J45807L1839j33477J4647J63654
15076a43809J82963j12362k04483R8093J1869n8052m765J25104N6343K4247K5682
15065H30j86538k68971j31057K66561K52996m271p0480J05562K73452L01640j2711
$$ y = [282251, 373987, 407826, 486276, 412092, 236808, 9080, -159387, -217008, -235196, -246495, -196997, -247279, -352704, -332771, -200615, -34350, 159058, 249091, 365189, 344603, 271825, 149476, 101050, 61903, -18485, -215490, -526624, -569662, -121456, 130051, -44768, -280935, -455828, -445626, -414293, -181077, 146090, 342179, 376558, 259383, 230337, 291876, 177550, 147162, 302187, 460576, 242664, -7001, -12711, 12155, -20278, -201120, -375778, -399959, -237118, -329628, -366279, -220472, -188633, -322110, -307463, -143809, 39154, -73208, -277691, -179598, -167729, -225781, -230546, -105442, -49099, -24852, 830, -185708, -454679, -585736, -319175, -66179, -70450, -140930, -35368, 238084, 539724, 527013]
15054E27013j43233j68818j19698M1661m0091j80409P6335k9332o4917k7456m5307
15043a74252Q1982N9418m331k67572k18564J4525J67088L14700K60238K8894j20156
15032A41970j92350k43540m1818R0010J50101o4661O1458K16993o8183j95393
15022a45413k31476j44330n3289O7138L9785m6097R8267L14265Q1403k09191j76414
15011d05352j30753r0851p2371K998R8023p0457M7504K15726J82859J11360N7582
15000e3732j09867J4177K42908K54554O4985j13576k37791j81230j12749j19671
14990c51992P3433n264k26238K07158N80841L47879j21310k64970r8487N4898
14980A95948p8466j40420O3359j32964j59328o7294j12458P322N7289K28631J15812
$$ y = [527013, 383780, 214962, 95264, 136925, 96834, -83575, -7240, -36572, -101489, -128945, -174252, -92270, -32852, -37183, -304755, -523319, -508794, -341706, -27006, 233232, 262126, 141970, -50380, -293920, -335738, -245728, -95627, -160288, -98830, 118163, 49980, -145413, -376889, -521219, -574508, -507370, -467585, -513682, -415415, -101150, -19747, -228938, -405352, -536105, -626956, -699327, -696329, -598306, -668763, -621259, -405533, -222674, -111314, -53732, -163599, -149422, 93486, 348040, 413025, 299449, 61658, -119572, -232321, -351992, -278559, -283823, -510061, -302903, 277938, 625817, 504507, 239537, 141050, 195948, 117482, -22938, 40421, -92543, -251871, -319165, -431623, -424301, -367012, -138381, -22569]
14969b2569j13984q5052M0451O5656q0377l6607o1365n1981k8803N3709O696j67522
14957d81748l811K28747K58731O3629J46921J33093J21557j390k9678k05651k82743
14946e2343k15776k0952J08978J05208k4436j57077n5558K9088J05115J37945
14936c9808O0977q9811N6221M9546J81519N7835j5167n4068k80802j73933p5584
14925c23075j25038n3122J23470Q470o4192n7854Q7222O8284J01108J96370k8437
14914f6794j12768j67809j28242j31740J52931L42428L31344K01218j71165q5881
14904A63522k8733K16810L01985P8792k01519l54393l73058k44670L9428J22351
14894b79485J37585J34518O6583J47060L32196K49120k48411l34363Q5573J06396
$$ y = [-22569, -136553, -221605, -181154, -115498, -195875, -232482, -293847, -345828, -374631, -320922, -314226, -481748, -485559, -256812, 1919, 65548, 212469, 345562, 467119, 465729, 436051, 230400, -52343, -268119, -289071, -180093, -74885, -99321, -256398, -311956, -282868, -177753, -39808, 21169, -68642, -12421, 37125, 218644, 276479, 261312, 207244, -73558, -247491, -323075, -448113, -501235, -377765, -369295, -433487, -491341, -404119, -335835, -234727, -38357, -66794, -179562, -347371, -475613, -607353, -454422, -111994, 219350, 420568, 249403, 163522, 134789, 351599, 653584, 732376, 530857, 176464, -196594, -441264, -401836, -279485, -141900, -7382, 59201, 206261, 538457, 787577, 539166, 204803, 290376, 396772]
14884C96772j47197k83549k33191n9169J02696O9001K20180J77669j50643j76981
14874h4412j84322j00469k1315K4056J59840J09492M1595K07223K41848J90514
14864E84050J08371l48389m54651j33236J17725K0746j18885n1420J12572J59241
14854c876j17031j07166q1737J05109K09460k6782j91810k26746j37449J00484
14844d77544J15920q3343j98835j77323o4323J81752J86969P0089L7276O6151
14834c43211K29079J81852l6868n8450o4258M0140k6216j27900k18899o1617J60854
14823c25494m871j12641K7428M4457j27158K0299J34977N6944j32749l0838J60424
14812b89222J64110J41571K8895p4993j28369O4102O3847J03675J8250K0437J61269
$$ y = [396772, 249575, -33974, -267165, -326334, -223638, -154637, 65543, 243212, 92569, -84412, -268734, -369203, -390518, -366462, -206622, -97130, -55535, 151688, 393536, 584050, 692421, 344032, -110619, -243855, -126130, -105384, -224269, -275689, -163117, -3876, -120907, -228073, -309810, -204701, 4759, -22023, -213833, -440579, -578028, -477544, -361624, -444967, -643802, -821125, -885448, -703696, -516727, -446638, -409362, -343211, -114132, 67720, 30852, -27598, -91856, -51716, -77932, -205832, -424731, -486348, -325494, -330365, -443006, -415578, -371121, -498279, -477980, -343003, -286059, -418808, -449646, -289222, -125112, 16459, 45354, -29639, -158008, -93906, -30059, 73616, 91866, 112303, 273572]
14801B73572o8794r5388J25049J6818j69080r7977j11524r8246j35391m2199M2237
14790c60923O8240l1578q3001R1068J73265J65300K20330L3901P1315n0789n1834
14779B45294L2359k14089k00883J0282O3404R081j62969k74488j06451P8504K03180
14768c16776J50609O7641J58831N8191j96110k18588K3732n6545k69130k06105
14758h04250L089J01539O1688K02736J33646m3173j12500k8088J39655K01592
14748a44066K00394p1760o2547K6813j12877m6256J22125P7268l0386k8798J78222
14737A08132K82651J32266N8261k10909k74018J21526J02800p3110R6544j70442
14727A73701k74355p5022K07517P5209M5553m3294j09285J15934J71911n1793
$$ y = [273572, 204778, 109390, 234439, 251257, 82177, -15800, -127324, -225570, -360961, -403160, -360923, -292683, -324261, -407262, -316194, -142929, 22371, 242701, 276602, 347917, 297128, 245294, 277653, 63564, -137319, -127037, -63633, -54552, -217521, -492009, -598460, -519956, -316776, -166167, -98526, 60305, 118496, -77614, -296202, -272470, -329015, -598145, -804250, -801161, -699622, -637934, -435198, -301552, -344725, -457225, -485313, -345658, -144066, 56328, -15432, -77979, -51166, -164043, -210299, -88174, -10906, -41292, -70090, 108132, 390783, 523049, 581310, 370401, 96383, 217909, 320709, 247599, 344143, 173701, -100654, -175676, 31841, 107050, 152603, 109309, 24, 115958, 287869, 236076]
14717B36076o1510r397k2647N2596n5103k2587n7602l28392k93459j9246J29407
14706d51864M4484k3999L8872K8929Q1363N7513K9639l3298p5554R3650L03838
14695I3573J1568q1081j10724J7620K5973j57531M6281J59663P0266J52004J74608
14684D02220J58177J83959m8954l87505m00819j32592K879Q1315J75570N3703
14674H7953R9992n9307m5147L50786N7328k20112j86477l17268p944J96869J52603
14663A09276j83050j57277n6341L9215J92520m0014j82865J06720P2190j19610
14653b19236j36473J49450J96588J63361J16710L4573j13827j38586N7233j00227
14643I566j81661p4373J58622K44388J87244O7707j41914j74676q8471j62264
$$ y = [236076, 174566, 165169, 142522, 195118, 140015, 117428, 59826, -268566, -562025, -581271, -451864, -407380, -431379, -392507, -363578, -282215, -224702, -195063, -228361, -303915, -210265, 93573, 105141, 24060, -86664, -69044, -43071, -200602, -154321, 5342, 75608, 227612, 402220, 560397, 744356, 695402, 307897, -92922, -225514, -222635, -141320, 34250, 87953, 187945, 128638, 83491, 434277, 491605, 271493, 85016, -232252, -240196, -43327, 109276, -73774, -231051, -287392, -248177, -55657, -95671, -278536, -171816, -99626, -219236, -355709, -206259, -9671, 153690, 270400, 304973, 191146, 52560, 109793, 9566, -172095, -246468, -87846, 156542, 343786, 411493, 269579, 94903, 6432, -155832]
14633a55832j43631J79483N2799j20128l03517k24254K12170Q2016Q34o9034R498
14622d79596J96444K44308n3566k38525m2540J10936j05104q4233J14433R9877
14612b37566J63118J11231j44186k00904R175J75423J45663J49186L1551o3906
14602A38785m6415o7489K2269K05112Q5902p6764m7015J02364j26209k16460N0456
14591B4536N8540m917L136Q2076o2155K2402J1493o1590m7641J33305J36898j14180
14579A81903j79095o1996J41526K21313m4173l23695j83474L9423J98011m1312
14569e1569k23687k05732R8991K44077J10037q0386q8892r2590j0182K78238K76117
14558B54422N3697j48564n9305N2034j17172l2670j55137j393J61797J04548R2371
$$ y = [-155832, -299463, -119980, -67181, -187309, -490826, -715080, -502910, -420894, -420060, -489094, -479596, -283152, -38844, -92410, -330935, -373475, -262539, -367643, -451876, -337443, -237566, -74448, 36783, -107403, -308307, -299132, -123709, 21954, 171140, 202691, 138785, 92370, 24881, 47150, 252262, 338164, 261400, 214385, 316749, 190540, -25920, 24536, 83076, 78159, 81295, 163371, 101216, 123618, 135111, 73521, 25880, 159185, 296083, 181903, 2808, -59188, 82338, 303651, 259478, -64217, -247691, -208268, -10257, -51569, -275256, -480988, -381997, -137920, -27883, -108269, -197161, -289751, -299933, -21695, 254422, 308119, 159555, 100250, 152284, 35112, 2442, -152695, -154088, 7709, 112257, 204628]
14547B04628j68656l69653k66188L1816j21519p9331K11101L12363J44742J47167
14537D6470k5469J05453K67157j33320j50388k0227n4585J82419Q5667j27131
14527A76046j52064j82021j83652j22461j77969J22955M44887J07571k88020j32663
14517c87391J80499J28821j22818l1734o0347J41852J39849j70177k29491Q4420
14507c26517M23910J82200l61002k46884P3508O9481J65139J1245j3629J27917
14497A05368J28048m6883p8542j24381m1177J03508J28949j11132k91715p9980
14487c07937K18947K40027J20215m9328j7266j95695k88706k70099o7802J00620
14477e17024K31047J66821R9265k3467j14889O6785O1222J15865l1477j60663
$$ y = [204628, 35972, -333681, -599869, -568053, -689572, -768903, -557802, -245439, -100697, 46470, 21001, 126454, 393611, 260291, 109903, 89676, 35091, 217510, 303177, 176046, 23982, -158039, -341691, -464152, -642121, -519166, -74279, 33292, -254728, -387391, -206892, -78071, -200889, -232623, -292970, -151118, -11269, -181446, -410937, -326517, 97393, 279593, -81409, -328293, -254785, -185304, -20165, -8920, -22549, 105368, 233416, 186533, 107991, -16390, -57567, 45941, 174890, 63758, -227957, -307937, -88990, 151037, 271252, 221924, 204658, 8963, -279743, -549842, -617644, -517024, -285977, -119156, -19891, -43358, -158247, -91462, -30240, 85625, 54148, -106515]
14467a06515j09109k2229J77483j3488k08623l0556q4951N7558J48395J67488
14457b4547O6759k4677L0639M3936K00634O1359j0678O8851j05342k6740J74168
14446D54362p9401j02386J12139o0294k69827k55913p4170O6058P4720j58463
14436b93175k34666L0619L51759L99087M6524l2428j00833l41773k54634J07151
14426c22369J55348J29486R8509P0024K6365j4277k0826Q6350k41628l04037k7165
14415c64220K41900J64305j13516m33195l81585j47159N221O2203O2140P225o756
14404i03437R7742j48936k99359J60184M67099K90312L444j41932P9757K86109
14394a09017L06611N8678L3174j03822j97078m0941m3053J54529N1402j26538
$$ y = [-106515, -215624, -237853, -60370, -73858, -282481, -313037, -397988, -340430, -192035, -24547, 42212, 17535, 48174, 92110, 292744, 354103, 343425, 412276, 306934, 280194, 454362, 374961, 272575, 384714, 324420, 54593, -201320, -275490, -209432, -134712, -293175, -527841, -497222, -145463, 253624, 300148, 267720, 166887, -174886, -429520, -322369, -167021, -37535, 60974, 130998, 157363, 143086, 122260, 208610, -33018, -337055, -364220, -122320, 41985, -71531, -504726, -886311, -1033470, -1028249, -966046, -903906, -896681, -903437, -805695, -954631, -1253990, -1093806, -626707, -336395, -332951, -474883, -395126, -109017, 197594, 256272, 289446, 185624, -11454, -52395, -95448, 59081, 110483, -16055]
14384a6055j25472j47944j4712J32402P6614J26691R3935R6143J20789Q0384k25289
14373A97486l40576o0350o745J23450K45821P1657j93088k10011j59909J57262
14363a75003K64571K65906R2869j34800p2981j09927L1130J46789r5450j97720
14353A5384j36735K4854J85942J43646r6201k33841j64496j83906j88939J51041
14343d83251L99199K09134J48283Q3955k20221k66173k25998r7460J54111J78180
14333a20241M5840J7077p6014j60549j55043m5360N7752K20808K75670K28859
14323B88799l5065k42420l57169j01363J40442N0346K83192K07721n6653L5363
14313B13193L5427n0394M0285j96023m02462j42693K16834J60955Q8478J08648
$$ y = [-16055, -141527, -289471, -304183, -171781, -95167, 31524, 125459, 221602, 342391, 422775, 197486, -143090, -203440, -210185, -86735, 159086, 230743, 37655, -172356, -332265, -175003, 89568, 355474, 448343, 313543, 240562, 130635, 161765, 308554, 213104, 15384, -121351, -96497, 89445, 233091, 136890, -96951, -261447, -445353, -634292, -483251, -84052, 125082, 273365, 357320, 137099, -129074, -355072, -452532, -298421, -120241, -74401, -57324, -133338, -293887, -448930, -494290, -436538, -215730, 59940, 288799, 253734, 11314, -345855, -447218, -306776, -256430, 26762, 234483, 177830, 213193, 248620, 198226, 238511, 42488, -359974, -502667, -285833, -124878, -36400, 72248]
14303G2248J58287K13858n8486j91955r9834n0848l7429k7106p2987J02120n2774
14292d4906j14241N1341J1788k534J30285K20069P6462m7119j39736n3372l4666
14281E3371k7448K50613L13549J60817J10119P3224J07958l15737n41684l27773
14271a42991o3037M3237m912j7007J24652K95030J24996L0759J61429m9474j81861
14260C20821J17581J30807j65000l86493k73427j45796J23826J63744j12592j80408
14250d06937p9082k10963j20311j16496K7327K19742j2860J30414N70990K27791
14240B29615m8476K8393K05514R886n5838R0614r7854l35127k30191o3333j1329
14229b78126j20699j55334J42338J59561l5797j3349K02649J33661R8987J83098
$$ y = [72248, 230535, 444393, 385907, 193952, 94118, 43270, 5841, -21265, -94252, 7868, -44906, -159147, -107806, -96018, -98552, 31733, 251802, 328264, 281145, 141409, 88037, 53371, 25923, 276536, 590085, 750902, 861021, 934245, 1042203, 726466, 184782, -142991, -206028, -162791, -167703, -184710, -60058, 234972, 359968, 390727, 552156, 502682, 320821, 438402, 569209, 404209, 17716, -255711, -401507, -277681, -113937, -226529, -406937, -486019, -696982, -817293, -933789, -906462, -686720, -699580, -569166, 1824, 229615, 181139, 209532, 415046, 424932, 369094, 459708, 361854, 26727, -203464, -266797, -278126, -398825, -554159, -411821, -252260, -288057, -301406, -98757, 34904, 133891, 316989]
14219C16989K28270N0879k65745j96205M0899P1681N9801m1987m6521j37557k31031
14208a50527j16570q1110j34814Q116M9643O8141j71706j0943J71552J30p927
14197c76015O70q282J09166J20191J10739J40031N0190j60753l60301k67793j18184
14186g60341N8425J64992J62475K17848J69682j06023l46512m6140L15194J60682
14176i718j45504j58896m6389N4866J44520o8947J1876l3199J896J15020J05387
14165b9088Q3227j5201k1155l0299P9872j1991l3194K08391J42998n4832r8687
14154B20041J9887p4587O1859J29408r0225j26024j63793o8541j92108j04785
14144c88868N5870P3894L56830K32688J7472K7216J48464n7572k01618J93438
$$ y = [316989, 545259, 596138, 330393, 134188, 175087, 246768, 306569, 264582, 218061, 80504, -150527, -267097, -348207, -483021, -474905, -425262, -357121, -528827, -539770, -368218, -368088, -376015, -375345, -383627, -274461, -154270, -43531, 96500, 146690, -14063, -374364, -642157, -760341, -701916, -536924, -374449, -156601, 13081, -92942, -439454, -485594, -170400, -9718, -155222, -314118, -360507, -305641, -161121, -230068, -218192, -251391, -249495, -134475, -29088, 54139, 38938, 17783, -12516, 67356, 55365, 22171, 230562, 373560, 318728, 220041, 239928, 165341, 227200, 356608, 266383, 140359, -23434, -91975, -284083, -388868, -332998, -259104, 97726, 330414, 347886, 375102, 523566, 465994, 264376, 457814]
14134D57814O1737k76865m92063k58194M8812Q0299l02O4312L4998J50676J58967
14123C0191j26973l02648k30234j52670j20421O9043N4595j11497J9540L7127
14113h33947J18804L12655R2344m1076k9328P7400k2791l5332n4539M6961K1494
14102c47355j1923j99961j13139J03317K58456J58921P2099J72177Q6234J0823
14092A89649K729m6366k3902J86289k8928k10758j13139j51004j8145Q5837j09297
14081b37035n013J31555j18164k17230j02695M5998K32225l9093o0671Q4422Q9999
14070a95702k6253P0326J21061J8858N86O3536K18505J32200l8416j95386k85704
14059a16389o5126J29105M2233k03017j47961J38678J48241j5172m0783l0073
$$ y = [457814, 519551, 242686, -249377, -507571, -458759, -378460, -378762, -314450, -279452, -128776, 30191, -96782, -399430, -629664, -782334, -902755, -833712, -779117, -890614, -871074, -833947, -715143, -402488, -310144, -351220, -380548, -303148, -325939, -361271, -415810, -368849, -347355, -359278, -559239, -672378, -569061, -310605, -151684, -79585, 92592, 178826, 189649, 192378, 146012, 122110, 308399, 279471, 68713, -44426, -195430, -213575, -127738, -237035, -242048, -110493, -228657, -445887, -548582, -502584, -270359, -309452, -370123, -285701, -195702, -221955, -151629, -30568, -11710, -11124, 52412, 270917, 403117, 364701, 169315, -116389, -181515, -52410, -10177, -213194, -361155, -222477, -74236, -89408, -130191, -160264]
14049a60264j38997q0623J18190J72364J91904J303o3463l3237O8400K54004J82542
14038E12123p8101k39055k02891j22319j65362L2810N2984j53977j44134k40860
14028g48782j26354P9327J66298K05291K10575J1374q3108l0573j00862j45438
14018e62252N118J61907L3157k420R4436k785O8285l5282m5012r8683J11128K89711
14006A7308J30822r0618k2867J78542K6582l2911m453k58693m11247j99027L062
13995f63500j5209k3895J13278m6593Q5692L21022Q2752J44174L12092Q7443l12874
13984H4382l03727j90839p3340J71368R1864K11592P6965o3933J20082J4709o4853
13973G4270r9965n7206k3124o0723m7266q6398J20826J50928o8267j24329R2063
$$ y = [-160264, -299261, -379884, -261694, -89330, 102574, 103877, 40414, 7177, 75577, 329581, 512123, 434022, 194967, -7924, -130243, -295605, -262795, -209811, -363788, -507922, -748782, -875136, -795809, -629511, -424220, -213645, -202271, -285379, -315952, -416814, -562252, -557134, -395227, -362070, -364490, -270054, -272839, -204554, -239836, -284848, -383531, -272403, 17308, 148130, 57512, 34645, 213187, 239769, 206858, 202405, -56288, -467535, -666562, -663500, -678709, -702604, -589326, -635919, -550227, -229205, -146453, -2279, 309813, 397256, 84382, -219345, -410184, -483524, -312156, -220292, -8700, 68265, 4332, 124414, 139123, 74270, -25695, -82901, -106025, -166748, -214014, -300412, -179586, -28658, -96925, -221254, -129191]
13962a29191L24868L90037m9200m63324j54628R9669K181k5507o454p1457m9441
13951a32447l1988q2969p4877j91507p5441R965Q6975J0649k9238J19912J61051
13940b29915J00965p0464j57689o4942N2198O6865J43450K28873j3723k30278
13930a74660l01117N5169J42655j45301k30278J71101J50315k32750l4885J93821
13920d05930K93830K71493K14609Q5034j06370j38808j67583k85945M4052J81360
13910a4258p613j11515k1258J60413L9694j53275K73K44940Q0907j36171q7642
13899e505N2309M8462j13928k05070l61377k93386K32504M11972P9290P6974K09576
13888A31821L6138n6204m9252r0406J31421J5688l2319K7948o6426j30634o6369
$$ y = [-129191, 195677, 585714, 536514, 73190, -81438, 18231, 20412, -5095, -11549, -83006, -132447, -164435, -247404, -322281, -513788, -589229, -579264, -492289, -481640, -510878, -390966, -229915, -128950, -199414, -357103, -422045, -369847, -302982, -159532, 69341, 55618, -174660, -475777, -420608, -277953, -423254, -653532, -482431, -332116, -564866, -599751, -405930, -112100, 159393, 374002, 459036, 352666, 213858, 46275, -239670, -195618, -14258, -21871, -133386, -154644, 5769, 45463, -107812, -107539, 137401, 218308, 82137, -5505, 46804, 95266, -18662, -223732, -585109, -878495, -645991, -234019, -154729, -77755, 131821, 167959, 111755, 62503, -27903, 103518, 119206, 86887, 114835, 48409, -82225, -148594]
13877a48594P9190J42242J46715k36855k06230P4667L2542J9897K052j49824j52965
13866c97163j98282J5319M02846L4400j68204P1618J7874j06391K42766O7808
13856a7409k5106J55118o9289L3038K6621m9812L9832J06813j91102j74838J9681
13845a46453J50940P8629j4049o3313j24220O4643J81319N5164Q4332k268k17168
13834D7556j61132j61366r5996K29680K29759j62425k47158j52783J661J27137
13824c45067K80168Q1146k03835l89024k13346N0852J78542J07233J32528L34698
13814A3895L00139r5009j20318l7176R3870Q5266q0113q2811k35786l02216m2822
13803e03081J58109J03399J97813J442L2267J52582J45588M7642l2311r259p5442
$$ y = [-148594, -69404, 72838, 219553, -17302, -223532, -148865, -116323, -96426, -94374, -244198, -397163, -595445, -580126, -177280, -142880, -311084, -239466, -221592, -327983, -85217, -17409, -42515, 112603, 43314, 76352, 102973, 53161, 92993, 199806, 8704, -166134, -146453, 4487, 83116, 69067, 5754, -118466, -53823, 127496, 182660, 266992, 264724, 47556, -113576, -274942, -370938, -141258, 88501, -73924, -321082, -473865, -472204, -345067, -64899, 16247, -187588, -576612, -789958, -739106, -560564, -453331, -320803, 13895, 314034, 219025, 98707, 61531, 155401, 240667, 160554, 77743, -158043, -460259, -503081, -344972, -241573, -43760, -42318, -10051, 142531, 288119, 335761, 303450, 294191, 218749]
13792B18749M0449M3312j07961r6248K0382k6828j05649r3304l8858N3068l4448
13781a27336J62116J23707j6818K4888N315k05499j02550K9743j1470K0453k93398
13770c90849l11028N4263J91858K7435J02010O8934J5735J23530p6866j57408
13760c52386J27809K5854L2808N17l3717J67745L22383K09514j13224j61376j47769
13749G8158N8999J74142j08692k17505k2763K7507K92019L24475K5594k01361
13739D30573m38585m48392k52728k40693k1300J29630J51164M54717L64501L4086
13729A62973j13665k53994m2769J39871J01982K40186L13084K8543j26485o3483
13719C86243k01458k68009j85840O5149K08145J73889o6764p0303O2424r6417
$$ y = [218749, 259198, 302510, 194549, 98301, 118683, 91855, -13794, -107098, -145956, -92888, -127336, 34780, 158487, 141669, 166557, 171872, -33627, -136177, -106434, -117904, -97451, -390849, -701877, -647614, -455756, -428321, -326311, -257377, -241642, -118112, -194978, -352386, -224577, -198723, -165915, -165398, -199115, -31370, 291013, 500527, 387303, 225927, 78158, 137157, 311299, 202607, -14898, -37661, -10154, 281865, 606340, 631934, 430573, -8012, -456404, -709132, -949825, -971125, -841495, -690331, -235614, 128887, 162973, 49308, -204686, -247455, -107584, -5602, 234584, 547668, 576211, 449726, 386243, 184785, -83224, -269064, -203915, 4230, 178119, 111355, 41052, 103476, 7059]
13709G059o3753O4829J25063J90130J16474j66934l27985j15052q1609o4646R401
13698c07023K98312J08040o249o7196j68113j32055K2672K3351L3510P785L156
13687a83810K07434J08218r2966K146q0288J9249L09029J8922k38560k14532j6684
13676a61842L9567O1799j8232N0894P8231j55558j97868j25356m5139K9737K1756
13665d22011P2991M8057j03079j29773Q6000J19599Q7182J19664q4713k16093
13655d22176m4254R3062J57945O9479J461j17682K8030L3801r088P4247o7658
13644b02833J18485J19419j29306r0949j04198j97146l12698o381L19010J51367
13634c35230O3012K32571P1077j87558l15643j25891P1598L30699M14389K22309
$$ y = [7059, -56694, 8135, 133198, 323328, 439802, 272868, -55117, -170169, -251778, -316424, -307023, -8711, 99329, 93080, 25884, -142229, -274284, -251612, -228261, -194751, -186966, -183810, 23624, 131842, 38876, 41022, -39266, -20017, 289012, 307934, 69374, -145158, -161842, -122275, -60476, -78708, -27814, 50417, -105141, -303009, -428365, -473504, -443767, -422011, -349020, -300963, -404042, -533815, -447815, -328216, -241034, -121370, -206083, -422176, -466430, -373368, -215423, -145944, -144483, -262165, -234135, -200334, -209422, -135175, -202833, -84348, 35071, -94235, -185184, -289382, -486528, -799226, -805607, -486597, -335230, -272218, -39647, 31430, -156128, -471771, -597662, -526064, -195365, 219024, 441333]
13624D41333k06875k91823k80465j51046J6833R017J82159J58329N931n8505P5505
13613i9607J30643J37731n428k9171K709J4923j24367m5081J19538l679j01710
13602c499J1852l4674N4286Q9190Q4574r6823r1221J5211k0770j9291O7104J02914
13590A58853j70695j32612K04905J05593j76474j23268l292K19210J28355k02558
13580H017j91764r4493K49531M57506J71329j55207j53479j36129j69674j66184
13570a80547j05831K49854K31150J39287q1178j73104p5841J15230K46117Q114
13560C73251j90587k38410j49626J5631j45156k45628o6864J89800J25330J02709
13550b29550K84384J33294R7007M5369j99528j65281q4805N9162P5508L9951L9638
$$ y = [441333, 234458, -57365, -337830, -488876, -472043, -463026, -280867, -122538, -116607, -175112, -99607, 31036, 168767, 163339, 134168, 136877, 151800, 27433, -17648, 101890, 98211, -3499, 8353, -26321, 27965, 117155, 201729, 104906, 13685, 28896, 8126, -11165, 55939, 158853, -11842, -144454, 60451, 166044, -10430, -133698, -136990, 82220, 210575, 8017, -183747, -278240, -28709, 428797, 600126, 444919, 291440, 155311, -14363, -180547, -286378, -36524, 194626, 333913, 252735, 79631, 3790, 119020, 365137, 373251, 182664, -55746, -205372, -189741, -334897, -580525, -647389, -457589, -332259, -229550, 54834, 188128, 285135, 330504, 130976, -34305, -119110, -59948, 15560, 55511, 95149]
13539I5149j87731o1312N3311q2041P7275Q2563M3473K10381J56212o6652r2136
13528B28492k913P6973K01738K8261o5762l3416j44497l16000j57865Q4078J68636
13517F7725o3269k70003P9670J93846l4408p4277J37036O7256L8809R0629j30238
13506A02776j22049P1987m100R3978K58305K608j42986r7352o6808q749J50256
13495B37866P1723j39286M59n1835o1329j4634M4828J02927Q8847J06557P5934
13484D62057m5313n7708j213n8145r6671L2254J41947N6026j37840q5536J7303
13473B27161j40934j45406j08922j79949l6251J85894J64516m4837j90789j10854
13463c80371O8111J03455k1038o1724j35900M62J18802J41100R8835J2648j5886
$$ y = [95149, -92582, -153894, -100583, -182624, -105349, -22786, 20687, 231068, 387280, 320628, 228492, 225579, 302552, 504290, 532551, 466789, 433373, 288876, -27124, -184989, -100911, 67725, 4456, -265547, -185877, 7969, -26439, -100716, 36320, 103576, 142385, 233014, 102776, -19273, 52714, 48614, 142592, 400897, 403505, 260519, 163167, 96359, 87610, 237866, 309589, 170303, 170762, 118927, 57598, 42964, 87792, 190719, 279566, 386123, 462057, 416744, 359036, 357823, 299678, 203007, 235261, 377208, 433234, 295394, 209858, 227161, 86227, -59179, -168101, -348050, -384301, -198407, -33891, -78728, -269517, -380371, -312260, -208805, -229843, -291567, -427467, -427005, -308203, -167103, -68268, -55620, -71506]
13452g1506J2100m7047J02403l4945j11973o0068R9569R3145M5502o0742J96641
13441A63079K38662r946j48703o1149Q9382J78268J20544j06589J04788J54709
13431G23045k399J0387r3211k42966j57685j18713p4017j04112n4238J40016p9060
13420e2953j94929R1344L28933K70986K31786K15852k58821l19340j94679k54626
13410a36447j92020j3045Q9694J53553J4367P8285O9866r0794o8356j87333r7578
13399c79808J03232R5998o4221j29140k4469J88247L09999K06047O7113j03449
13389B69549j9836J61412L5254j95024j84904k57717l80751j63409q0465J876
13379h14015K89798J95679L7053J23478L05241J62407O2988J3928j03665P6870
$$ y = [-71506, -59406, -106453, -4050, -38995, -150968, -211036, -111467, -18322, 27180, -33562, 163079, 401741, 391795, 243092, 181943, 271325, 449593, 570137, 463548, 568336, 723045, 720646, 731033, 637822, 394856, 237171, 118458, 44441, -59671, -113909, 26107, -52953, -247882, -156538, 172395, 443381, 675167, 891019, 632198, 312858, 118179, -136447, -328467, -341512, -251818, -98265, -83898, -5613, 64253, -26541, -94897, -282230, -379808, -276576, -180578, -244799, -373939, -398408, -210161, 99838, 305885, 372998, 269549, 249713, 411125, 446379, 251355, 66451, -191266, -572017, -735426, -815891, -814015, -524217, -328538, -291485, -168007, 137234, 299641, 362629, 376557, 272892, 349762]
13369C49762M1248k00868j54272K7663J48323J25190j2905j30765q6845M4263
13359A50794Q8195l622j28318k2403n2917j39720J38957J53365j4133j32008m9627
13348a1437K10756J46678K06012K13032p7205j70179j23156n9374M4209J10348
13338D89684K58184J37406k94182k36335m0433o4441N7815J2152j08197o8548
13328A43105K07156L18175M0527p1618j46956j54991k2163K0747k0519r4139r0685
13317A28639n1345L0800R7678L685n2331m4288Q1271N5534L7001M9506j31390
13306B04760k34809m3361K52025J32848q9726m0566k37322l22788l9651J60002
13296b58588K77327J77482K70784K02209P9169j2555l30846j94911L7928J13701
$$ y = [349762, 391010, 190142, 35870, 63533, 211856, 337046, 324141, 193376, 106531, 150794, 238989, 235367, 107049, 84646, 31729, -107991, 30966, 184331, 170198, 38190, -11437, 199319, 345997, 552009, 765041, 687836, 517657, 394501, 335127, 379336, 489684, 747868, 885274, 591092, 354757, 314324, 249883, 307698, 319850, 211653, 143105, 350261, 668436, 708963, 637345, 490389, 335398, 313235, 333982, 313463, 219324, 128639, 77294, 108094, 205772, 209457, 157126, 112838, 194109, 249643, 286644, 336150, 204760, -30049, -73410, 178615, 311463, 221737, 181171, -56151, -378939, -418590, -258588, 18739, 196221, 467005, 669214, 748383, 735828, 404982, 210071, 247999, 361700]
13286C61700m2744J682j14321j33557J55882R2437l0374j7524j9133P2726k1431
13275C05343m2637Q110k1063J37724J16747Q880j10391k7495K55611R3252j44351
13264E79730r3174J8169J06225j15379k10915j59917K3931K9418L2209j40428
13254F9869m9371J16418R4895J44740K04039L1286k10108l41455k38033m1196
13244b18916R2524l8911p4754N6755L608J60396J46255P7286j0071J35830J54329
13233D84331l2407n3417j63650p1874k4021j15716j48929o2838J27513J86200
13223A25192J40617J28630J08521K5259N288j35479j35497j01378n6106j49548
13213d4501J22891J76228p6747p5301L4921L419Q4733J21840L40189K94072J16199
$$ y = [361700, 318956, 320638, 206317, 72760, 228642, 321079, 290705, 273181, 254048, 326774, 305343, 262706, 270816, 249753, 387477, 504224, 513104, 402713, 375218, 630829, 724081, 579730, 486556, 504725, 610950, 495571, 284656, 124739, 148670, 178088, 210297, 69869, 20498, 136916, 231811, 376551, 580590, 611876, 401768, 60313, -177720, -218916, -126392, -165303, -240057, -183302, -179694, -19298, 126957, 204243, 194172, 330002, 484331, 451924, 398507, 234857, 162983, 138962, 23246, -125683, -188521, -61008, 125192, 265809, 394439, 502960, 528219, 533507, 398028, 262531, 161153, 105047, -44501, 78390, 254618, 177871, 102570, 137491, 140910, 225643, 347483, 687672, 981744, 1097943]
13202A097943j67964l81647k59338m6947K32754M26239K60755K9185j50623j27175
13192I13182p7575j97050j41447m5071M8976J32081K74894K72618L7343o6004
13182A151947p2256j37960j93132j14832m7122r5563R9697n0877l01732k44373
13172f203n5953j26296n436L22513R4257j4692L2767L9722J80617J55282J60973
13161G77551K18946k6741k35147m3550j60536j46696L2738J75236K7443j23116
13151D96128j48253k06034r9531p3278q0893K2348J31765M5585P0295M6704J11015
13140C15851K43678J29819p4926j31876J71838J93594K7913p1940O4506J80968
13130A049425J45274n1587k97251l10971j3912M7153k4143J69521K87126j1182
$$ y = [1097943, 929979, 548332, 288994, 242047, 474801, 901040, 1161795, 1190980, 1040357, 913182, 835607, 638557, 497110, 452039, 501015, 633096, 907990, 1180608, 1217951, 1151947, 1079691, 941731, 748599, 633767, 586645, 491082, 590779, 539902, 238170, -6203, -62156, -188452, -193888, 128625, 222882, 208190, 240957, 280679, 461296, 616578, 777551, 996497, 969756, 734609, 691059, 530523, 383827, 416565, 591801, 619244, 496128, 347875, 141841, 42310, -30968, -111861, -89513, 42252, 87837, 158132, 204836, 315851, 559529, 689348, 614422, 482546, 654384, 847978, 875891, 803951, 868457, 1049425, 1194699, 1143112, 845861, 534890, 520978, 568131, 543988, 713509, 1000635, 989453]
13120I89453j24515l46M9130J27781J74401J13385O17j35221j21457j10173K2973
13109I86028Q2978K6819r7376q0454N0130J3793q1734K25106J25428l45896j74559
13098G30263L1976K13445K72495J22657r8993k12464j49174q8339r8167o4809
13088F58890p051k2134R3684K49250J22958O5843J20285j1105k31459j70453O6543
13077I35251J71034P0397R2726J10286O286q420R9812p5265j32548j22679j35942
13066A010938m2947k9048J04000M7343j39402j00006R1024K95270J99201j59894
13056A276479j11843N0212J11753n4683j2019j28440j43115J13229J12119L67456
13046A581148J60616N9042K28407K93940Q4848j31908k01248k08690p8643j03953
$$ y = [989453, 864938, 864592, 913722, 1041503, 1215904, 1329289, 1329906, 1194685, 1073228, 963055, 986028, 1069006, 1095825, 998449, 917995, 968125, 981918, 900184, 1125290, 1250718, 904822, 730263, 762239, 975684, 1248179, 1370836, 1271843, 1059379, 910205, 821866, 723699, 658890, 651839, 629705, 723389, 972639, 1095597, 1161440, 1281725, 1270620, 1039161, 868708, 935251, 1106285, 1176682, 1269408, 1379694, 1385980, 1377560, 1477372, 1402107, 1269559, 1146880, 1010938, 967991, 938943, 1042943, 1090286, 950884, 850878, 941902, 1237172, 1436373, 1276479, 1164636, 1214848, 1326601, 1271918, 1259899, 1131459, 988344, 1101573, 1213692, 1581148, 1741764, 1800806, 2029213, 2323153, 2408001, 2276093, 2074845, 1866155, 1787512, 1683559]
13036A683559j05492r5668q9794N7549K00545J38157j9197n191J32684J25531
13026B022683Q6536K5018j27807m11901q6642L34728L10297K55681K09110L16036
13016B933739J92731O9884J37382j23819p4031O7033m6861r0854p454J11147J55135
13005C324032O8262L1626J93798M43124O15032K83591R3351L47814P00628O24515
12995F725773K43372L25013N48971O35926O28220R06623J336680J446424J304922
12986A4101924J530762K210608K810363L346696M344622N886464P741817R913031
12978E1886287J2992975J7808558K4444344L3470940M4942818N4315442M9889692
12971B89751056J9755259k2235074m7212288m9412980m0707712l0836346k2987380
$$ y = [1683559, 1578067, 1482399, 1392605, 1450154, 1650699, 1788856, 1769659, 1764468, 1897152, 2022683, 2109219, 2134237, 2006430, 1594529, 1507887, 1842615, 2152912, 2408593, 2617703, 2933739, 3126470, 3196354, 3333736, 3209917, 3135886, 3202919, 3156058, 3065204, 3057750, 3168897, 3324032, 3392294, 3423920, 3617718, 4060842, 4675874, 4959465, 5052816, 5400630, 6101258, 6725773, 6969145, 7294158, 7843129, 8479055, 9107275, 10013898, 11350578, 12797002, 14101924, 15632686, 17843294, 20653657, 24000353, 28344975, 34231439, 41973256, 51886287, 64879262, 82687820, 107132164, 140603104, 185545922, 239861364, 289751056, 309506315, 287271241, 240058953, 190645973, 149938261, 119101915, 96114535]
12964I6114535j7230190j3139783j0018774p802685o465332n070403m156942l387880
12956B8842546k767341k498139k303402j884750j429327j257038j207100j227978
12948A4267471j161832o16334m17781p24154p27536m00744m24705o11574o55703
12939H527108n16130l78728k92035q3497p5985j71874l07312k39830j45747j31121
12929F184849k02540j28443M1511N1078K761K9222J10008K13515K40102L76418
12919F918481N12308O38714J131934J130922J207408J627605J724763P29176m57580
12910A5163731j033681j096691o46364l36636j49346j43222J40179O77792J059761
12901A3635523J248357J449217J931555K344790K558802L390970M767118O289529
$$ y = [96114535, 78884345, 65744562, 55725788, 47923103, 41457771, 36387368, 32230426, 28842546, 26075205, 23577066, 21273664, 19388914, 17959587, 16702549, 15495449, 14267471, 13105639, 12489305, 12071524, 11347370, 10619834, 10219090, 9794385, 9182811, 8527108, 8010978, 7632250, 7340215, 7256718, 7180733, 7008859, 6701547, 6461717, 6315970, 6184849, 5982309, 5853866, 5895377, 5946455, 5949216, 5978438, 6088446, 6301961, 6542063, 6918481, 7430789, 8069503, 9201437, 10332359, 11539767, 13167372, 14892135, 15621311, 15163731, 14130050, 13033359, 12386995, 12050359, 11901013, 11757791, 11897970, 12575762, 13635523, 14883880, 16333097, 18264652, 20609442, 23168244, 26559214, 31326332, 37615861]
12893C7615861Q115037J0622781J4175719J9422934K6934900L7401962M9437750
12886B03726944N6839759M5151415O892096l4424683n1810367m8366441l8219140
12879A39789583k8507532k0910672j5557968j1971864r364003p448411o041814
12872C9987319m950899m100938l363208k990347k567360k035921j608061j470079
12864A6900506j242385r38502q26392q17160p99268q60729q64245o32784l45169
12855I573872m74362p12279n42410m95786l40930k74349k37568j95922j56719
12846F143547n5346l2783O5937K0029L830j72946l07533J7537K58546K70007P1340
12835F282165j53728k84285k55067j79977J4691J59018J57540L46920M75954J69762
$$ y = [37615861, 45730898, 56353679, 70529398, 89952332, 116887232, 154289194, 203726944, 260566703, 305718118, 312610214, 278185531, 226375164, 178008723, 139789583, 111282051, 90371379, 74813411, 62841547, 53477544, 46029133, 39987319, 35036420, 30935482, 27572274, 24581927, 22014567, 19978646, 18370585, 16900506, 15658121, 14719619, 13893227, 13076067, 12276799, 11416070, 10551825, 9919041, 9573872, 9099510, 8387231, 7844821, 7349035, 7008105, 6733756, 6496188, 6300266, 6143547, 6088201, 6055418, 6121355, 6141384, 6145214, 5972268, 5664735, 5682272, 5940818, 6210825, 6282165, 6128437, 5844152, 5589085, 5409108, 5423799, 5582817, 5740357, 6087277, 6563231, 6732993]
12825F732993Q2059J53543K96940M65695O38496N72732O10441O63598M82470P41718
12815A1440685J071725J326613J573974K057268K794160L405092M142876N166646
12807C2979039O734761Q977983J1893007J5846247K1678809K9702141M0306222
12800A68118209N1338788N3949175L3926317p154752m1239547n1101943m4858799
12793A62977448l4461058k5513839j8993812j4432996j0953704q720000p037116
12786D2864923n587462m510214l916132l330073k947094k627728k035600j741770
12778A6168850j521099j319852j147189j148748p91782p31846p60325o85445m19303
12769G643261j57626l77124n10758m00995k59568l70449k43786k58179j89415
$$ y = [6732993, 6815052, 6968595, 7265535, 7731230, 8369726, 8942458, 9552899, 10216497, 10698967, 11440685, 12512410, 13839023, 15412997, 17470265, 20264425, 23669517, 27812393, 32979039, 39713800, 48691783, 60584790, 76431037, 98109846, 127811987, 168118209, 219456997, 273406172, 307332489, 300177737, 258938190, 207836247, 162977448, 128516390, 103002551, 84008739, 69575743, 58622039, 49902039, 42864923, 37277461, 32767247, 28851115, 25521042, 22573948, 19946220, 17910620, 16168850, 14647751, 13327899, 12180710, 11031962, 10240180, 9508334, 8748009, 8062564, 7643261, 7485635, 7108511, 6597753, 6196758, 5937190, 5566741, 5322955, 5064776, 4875361]
12760D875361l06431k63210j39101j78998k92724k8833j61721k70991M7188N3898
12750C334438j00526k78815k40058j68500j21473j23921j2732K28277K37081j56072
12740B597699l56150k53567N1361j2143l2238K524k58637k01482J79995J25494
12730A842856o7695j49015k95718k30972r7244O9033K74202K20063J7697j56434
12720A426773q8791r7567j5924J2864j45317k00628l4986J71776K02937K34361
12710A465498o592k39990p6771j24579j36748j32426R5881J65954J64596J60056
12700A334879l1387k09517O4337K18934r4165p7359m1140j47683j11855P8575
12690I83619J35215j27845j91894j64021o1838J0236k4537K26612J50931j04227
$$ y = [4875361, 4568930, 4305720, 4166619, 3987621, 3694897, 3666064, 3504343, 3233352, 3280540, 3334438, 3233912, 2955097, 2715039, 2546539, 2425066, 2301145, 2288413, 2516690, 2753771, 2597699, 2241549, 1987982, 2039343, 2027200, 1994962, 1997486, 1738849, 1537367, 1717362, 1842856, 1775161, 1626146, 1330428, 1099456, 1002212, 1071245, 1345447, 1565510, 1583207, 1426773, 1337982, 1240415, 1224491, 1237355, 1092038, 891410, 856424, 1028200, 1231137, 1465498, 1458906, 1218916, 1142145, 1017566, 880818, 748392, 844273, 1010227, 1174823, 1334879, 1303492, 1093975, 1158312, 1377246, 1283081, 1205722, 1164582, 1016899, 905044, 983619, 1118834, 990989, 799095, 635074, 573236, 583472, 558935, 785547, 936478, 832251]
12680H32251r9120j4791J40858N5419l37913j99786J54086J69673J06188K18654
12670A025519K0608m24060k32021R2802J11142n9169j72286j21848J155o4376
12660A77466k42942m4453J66821K77568K35386J83076J90975L5471n7538j04497
12650H17333j26177k7877m0745j40645k8980J85005J00762k7592j76130j62449
12640C72505J91215K21243L4957o8832k13886j27501K4092L5764K64580L10657
12630A044794J53777N2778p5365j54604k52195k17052j36028r3437M4496K5399
12620C92563r4553j50590m4553k1595j3431N1189J04465K07425Q258l8071K2866
12609D23973Q3086j03581j30854j35284J3155J19765K78958J48148k26219j51667
$$ y = [832251, 733131, 718340, 859198, 914617, 576704, 376918, 531004, 700677, 806865, 1025519, 1046127, 622067, 390046, 482848, 593990, 534821, 362535, 240687, 241842, 177466, -65476, -109929, 56892, 334460, 569846, 752922, 943897, 979368, 921830, 817333, 691156, 663279, 622534, 481889, 452909, 637914, 738676, 711084, 534954, 372505, 563720, 784963, 819920, 751088, 537202, 409701, 433793, 469557, 734137, 1044794, 1198571, 1251349, 1175984, 1021380, 769185, 552133, 416105, 322668, 367164, 392563, 298010, 147420, 102867, 81272, 67841, 119030, 223495, 430920, 439178, 401107, 423973, 507059, 403478, 272624, 137340, 150495, 270260, 549218, 697366, 471147, 319480]
12599C19480j87734J3433K35412N2314J7077q98o8109j79455o5085m7637m5123
12588D3675m5802K1468J69585P2757n4681n8145j25932K5993J72390O0029j15279
12577A66058q7765K6588q8983j24031K65025K77900N7375p0662j05052J58660
12567D75113J59645N8943K2762l0682q8476k04778j55855L6939R9917O9702J17219
12556E60449J2280r775N9292O3412j172k32101l06992j73119J26404J86185J83998
12545D68861J28965J73771J9606j31516j96810j05492J71691P5445L7761K9740
12535F72022j26394k95857j21917K54662J08769m959j38950k00079L4910J97683
12525C79890j8388n5140j41232q4709n0291Q2508L28589K71879K19343j1590k11803
$$ y = [319480, 131746, 145179, 380591, 432905, 449982, 449084, 380975, 201520, 136435, 88798, 43675, -2127, 19341, 188926, 261683, 207002, 148857, 22925, 48918, 221308, 281337, 166058, 78293, 104881, 15898, -108133, 156892, 434792, 492167, 421505, 316453, 475113, 634758, 693701, 716463, 685781, 597305, 392527, 236672, 273611, 373528, 443230, 560449, 572729, 562954, 622246, 685658, 684486, 452385, 145393, -27726, 98678, 284863, 468861, 597826, 771597, 791203, 659687, 462877, 357385, 529076, 604521, 642282, 672022, 545628, 249771, 127854, 382516, 491285, 486326, 347376, 147297, 182207, 379890, 361502, 306362, 165130, 80421, 30130, 112638, 441227, 713106, 932449, 920859, 709056]
12514G09056j63220q1773o3396r0224O6994P6929J39094K3508k44860j41068K0129
12503B51169J14473R2560K8524J4598p6543K711J51528O3735j12521J29195J51603
12492H11032L0783j77105k95427m15529j39443j20163l9511R6898K12303K16542
12482A80380J06821P6852j11318l77372j59020M9863o539Q9193J76429M9150k7924
12471D6515Q4756J80730o202n546j7945O853O5658j96517n0699J56114O4113R7511
12459D25341J66042r946r1097j85636r8389j31157k40046p9611n1280n1194J92105
12448a54868L22436L55311j97332l15317J6235K60350J22349J19724J2707J36170
12438F77765R2464j76665r4634J59458p1364j92080m1430k8343k19818m473K15768
$$ y = [709056, 545836, 464063, 400667, 310443, 377437, 454366, 593460, 616968, 372108, 231040, 251169, 365642, 458202, 486726, 501324, 424781, 427492, 579020, 642755, 530234, 659429, 811032, 841815, 664710, 369283, -46246, -185689, -305852, -345363, -248465, -36162, 180380, 287201, 364053, 252735, -124637, -283657, -233794, -240333, -151140, 25289, 74439, 46515, 131271, 312001, 305799, 300253, 282308, 289161, 354819, 158302, 107603, 263717, 327830, 425341, 591383, 581437, 490340, 304704, 206315, 75158, -164888, -244499, -295779, -346973, -154868, 167568, 522879, 325547, 10230, 26465, 286815, 409164, 528888, 541595, 677765, 770229, 593564, 498930, 658388, 587024, 394944, 353514, 325171, 105353, 100880, 316648]
12427C16648J54359n4000K1321Q5847j16201j37923J38790J98588J2933P6523
12417F96885K01924K39557J0447k16578j87727k11552l20115j46886q712J05536
12407A62779J65382K06154N1910r4834q6915j5275n6653m4392j30044k82603k21039
12396c45530J9019M0600l2610Q0042L14171K75805o3063j18486J59545J12810
12386D42303j74494k16855k03268M995K81847J22321o6306k9727J58048L6332
12376C55196k52671p6925k65433j53159J64590K01350L6098J4458Q2865L06247
12366D12616J76841o3195k40052k94166j68935J48696L23129N1108M0720J2215
12356C98977k96875n8542J33022L9494o2282j26940J10853J54791J24560J12725
$$ y = [316648, 471007, 417007, 438328, 524175, 407974, 270051, 408841, 607429, 620362, 696885, 898809, 1138366, 1148813, 932235, 744508, 532956, 212841, 65955, 57243, 162779, 328161, 534315, 586225, 491391, 404476, 389201, 332548, 288156, 158112, -124491, -345530, -326511, -285911, -318521, -238479, 75692, 351497, 288434, 169948, 329493, 442303, 267809, 50954, -152314, -147319, 134528, 256849, 190543, 160816, 318864, 355196, 102525, 25600, -239833, -392992, -228402, -27052, 9046, 23504, 106369, 412616, 589457, 526262, 286210, -7956, -176891, -28195, 294934, 346042, 386762, 398977, 102102, 43560, 176582, 216076, 153794, 26854, 137707, 292498, 417058, 529783]
12346E29783q9377l67117p9853K69881J19931k20921M9966N3703j88816k1017
12336E6163L6135j74997l15365o1998o2658r806J09557R6895J59199P9006J01337
12325A3468Q3264j131P6862N6492q2514j59182j43196K3636r4587N3866K60482
12314H7460R0194j74310j27101p6443p7403q7151q4868r5701M8384P4074j68410
12303e91275r2244O5359K70307J86205J17716L0000j79241J16952R8085m3859
12293b1995O0003L1765K2360R1181p5965k18088j74596O8305K98342K54414K14818
12282E50544P2439k2625k28150m2302L9921l8389j42611K970q7665k56929j26300
12271b79097J30156K29525R1161j7758J60106L51287N5853k32333j66008j51234
$$ y = [529783, 440406, 73289, -6564, 263317, 383248, 162327, 212293, 265996, 77180, 56163, 92298, -82699, -398064, -460062, -522720, -532526, -422969, -326074, -166875, -87869, 13468, 96732, 95601, 172463, 228955, 146441, -12741, -155937, -132301, -226888, -173022, 87460, 177654, 3344, -123757, -200200, -277603, -364754, -449622, -545323, -496939, -422865, -591275, -683519, -618160, -347853, -161648, -43932, -13932, -193173, -76221, 21864, -21995, 38008, 69773, 92133, 183314, 107349, -110739, -285335, -217030, 81312, 335726, 550544, 622983, 600358, 372208, 329906, 369827, 331438, 188827, 191797, 104132, -152797, -279097, -148941, 80584, 171745, 153987, 314093, 665380, 721233, 488900, 322892, 171658]
12261A71658p4009R8026O2454J01751R8539l4898r5006q8417L4661N8926r7595
12250B36090J17153N2194k30318k66916Q5788L45727R6842k54679l41474m63184
12240f22777j24158K74218L61270K23985J17767R4242j03552j73802j03049N4489
12230a367K30650L18074j6841k50459j02073J26228N6399k2844r7755j17796R56
12219A23172K7387O9071p6519j5629N3756L9091k26398k05027j21873R5673J67262
12208g0034J2507j24876j20791K899J61561J01198L8283J32270j03979j42719
12198a13681K46034K71999K67325J54792l08285l02383o0931k29579j84178K09565
12188d9322K63330K26471j30637k95214M4090J78980k162m15046k33433K36741
$$ y = [171658, 97649, 195675, 258129, 359880, 458419, 423521, 328515, 240098, 274759, 333685, 236090, 353243, 405437, 175119, -91797, -6009, 339718, 436560, 181881, -159593, -622777, -746935, -472717, -111447, 112538, 230305, 324547, 220995, 47193, -55856, -1367, 229283, 547357, 530516, 280057, 177984, 304212, 360611, 337767, 240012, 122216, 123172, 150559, 219630, 143111, 127482, 181238, 220329, -6069, -211096, -332969, -237296, -70034, -57527, -182403, -303194, -300295, -138734, -37536, 747, 133017, 29038, -113681, 132353, 404352, 671677, 826469, 518184, 215801, 154870, -74709, -258887, -49322, 214008, 440479, 309842, 14628, 58718, 237698, 235536, -179510, -412943, -176202]
12178a76202J64203Q76r8803o1386J32258J27164M8429j80674j61351J06011K39559
12167A40084K3982n9279j27551j89972Q4181J73295R954K6305J64124M6971k5439
12156B66655q5774k6218j72986j30681L9708K5898N4646k8668p6350L231J10542
12145a9997M8550j75625j15554P171J09471Q5199n8220j29833J9572J09892o1630
12134a81004j10153k05616L7227J74378O9332K64126K76277R7718j19070o2776
12124B40439M4526o6314J20411O1348O865M3248r3651P214R4953P7701K7664k06719
12112C57685k62551O3432K08294j3357j53383N7222k7087j63661k59459j68793
12102c61658m8266N6177J05488J24981J27185J50375K18803J53417k05896l20786
$$ y = [-176202, -11999, -11123, -109926, -171312, -39054, 88110, 136539, -44135, -205486, -99475, 140084, 164066, 104787, -22764, -212736, -128555, 44740, 54694, 80999, 245123, 292094, 266655, 180881, 154663, -18323, -149004, -109296, -83398, -28752, -57420, -133770, -130539, -19997, 28553, -147072, -262626, -255455, -145984, -60785, -119005, -248838, -229266, -119374, -181004, -291157, -496773, -459546, -285168, -215836, 48290, 324567, 422285, 303215, 240439, 284965, 218651, 339062, 400410, 407275, 450523, 356872, 364086, 459039, 536740, 564404, 357685, 95134, 158566, 366860, 353503, 200120, 257342, 230255, 66594, -192865, -361658, -409924, -353747, -248259, -123278, 3907, 154282, 373085, 526502, 320606, -180]
12092a80j73726k5018M9782R3222M0548P1657J7216p6223j43798Q041L32030P8626
12080B72177r7569q966j05912j29126N4440k786j76791q7116R291J75966L79615
12069B83223J25733k11951n5756K3683o7816L7789J48848N7242J9926k5731n7060
12058B78130J5356n8049j57103j74603k41854n2429Q6495J51791J51322J77775
12048A76831M6919n4647j63222j21743o1750L5936K16768K57594L8429j18571
12038B52544j01875n1621p7926q5486j49665j45181J62096N8629m9021J41763
12028d5743K8017j74559J77385K32023r4926k13987o605J59864J42642L7708k9198
12017B12621K01115M43312J23544k84427k19588p5581K9067p1100j83268p3076
$$ y = [-180, -173906, -198924, -149142, -55920, -15372, 56285, 73501, -2722, -146520, -138479, 193551, 272177, 174608, 165642, 59730, -69396, -14956, -17742, -194533, -281649, -272358, -96392, 283223, 408956, 197005, 141249, 164932, 97116, 134905, 283753, 340995, 360921, 335190, 278130, 293486, 235437, 78334, -96269, -338123, -390552, -304057, -152266, -944, 176831, 223750, 169103, 5881, -115862, -177612, -141676, 75092, 332686, 371115, 252544, 150669, 99048, 21122, -64364, -214029, -359210, -197114, -138485, -187506, -45743, -17726, -192285, -14900, 217123, 122197, -91790, -98395, 61469, 204111, 241819, 212621, 413736, 857048, 980592, 696165, 476577, 400996, 430063, 358963, 175695, 102619]
12007A02619J2449o5396j04908P836k1707L0128L172k7085j5258j2370N20j08216
11995a98216Q3531K5358m4630J53149K91786J77927O4634L621j31569j53810k08032
11984F3749q8091O6330J11185j00963k23917l1665J23495J58855o1457k03818
11974a86297k1709J96728O2958j50498q5617j36377j33407l0821n594n730N6968
11963d39396J26900O2235m0456k7146j83298r6523l0965l8659J41344J17247l8193
11952d46910J88870J78346O1129j91405k86796m1485P7996K38360L13346K19755
11942C11206J60557j97939j79419j02146o5264J09005J61652m7120J6242J94553
11932C61327n0774j24184r667J50561O1692j81033l22329k15921Q1144K87090
$$ y = [102619, 115068, 49672, -55236, -47400, -69107, -38979, -35807, -62892, -78150, -90520, -90000, -198216, -114685, -89327, -133957, 19192, 310978, 488905, 553539, 557160, 425591, 271781, 63749, -24342, 41988, 153173, 52210, -171707, -203372, -79877, 78978, 17521, -186297, -208006, -11278, 51680, -98818, -184435, -320812, -454219, -485040, -490634, -496364, -439396, -312496, -250261, -290717, -317863, -501161, -597684, -628649, -667308, -525964, -408717, -446910, -258040, -79694, -18565, -209970, -496766, -538251, -460255, -221895, 91451, 311206, 471763, 273824, 94405, -7741, -73005, 36000, 197652, 150532, 166774, 361327, 310553, 186369, 176702, 327263, 388955, 207922, -114407, -330328, -249184, 37906]
11922C7906J43902j69036p6369P4680l8010J2969K13609m640j25101j5375k10544
11911a56009j44589L05750K64193J82079N2664p0420k28702j22779P4847J7377
11901A74411o5625l07056k01692J73706M81362L95060j51647k47731K956J99088
11891D52832J59044j18265p1176n0968J93869J42631j69484q2843K3463j55843
11881C23260j98737K15388J71101l87868l42144P5138K39839L7550n123Q483j03898
11870C2989j50212j5434O1162J71535L20562J02850j02971K4952j02439j73297
11860A69697k29343l92487q1463J66747Q3415K9380M7495J12529K0046J32705
11850E8721L6558j93486j90206J90818K63478O6519l2591l7142J31717p5134j45259
$$ y = [37906, 181808, 12772, -63597, 11083, -26927, -13958, 199651, 195011, 69910, 54535, -156009, -300598, 5152, 269345, 451424, 504088, 433668, 204966, 82187, 157034, 174411, 108786, -198270, -399962, -226256, 255106, 650166, 498519, 250788, 253744, 452832, 611876, 493611, 422435, 371467, 565336, 707967, 538483, 455640, 479103, 323260, 124523, 339911, 511012, 123144, -219000, -143862, 95977, 133527, 128404, 136887, 32989, -117223, -132657, -71495, 100040, 420602, 523452, 420481, 445433, 342994, 169697, -59646, -452133, -533596, -366849, -283434, -254054, -206559, -94030, -73984, 58721, 95279, -98207, -288413, -97595, 165883, 232402, 199811, 162669, 294386, 219252, 73993]
11839G3993J13460L03160J47645j13214p5024o0512p3326R9131k36182k08307
11829b9176p5929j79916J88996M05627J52420M8013J25080M5377q3973j05378
11819D91141M2113j00313k51096l03415k64871J75214O9816j39883M4834K12551
11809b3909p138j91447j34886N6886J48165n6509P7472J11814M090k922j52659
11798a71043l00545J56466M31004J02609M9651J02909j43953n4265N3554j67626
11788E8761k1197K86794m8727k09638k52k6046J54605K78967J59958j13293q5568
11777D34364J71325N1571j91526m18690l58633o8717Q6813J06713J47040r3000
11767a32740P3665Q7957p7612R8037K08149m4192l17279L4727J38085l133M6464
$$ y = [73993, 187453, 490613, 638258, 525044, 450020, 389508, 316182, 415313, 179131, -29176, -105105, -285021, -96025, 309602, 462022, 510035, 635115, 680492, 596519, 491141, 533254, 432941, 181845, -121570, -386441, -211227, -141411, -281294, -236460, -23909, -31047, -222494, -357380, -300494, -152329, -208838, -131366, -19552, -15462, -18384, -171043, -471588, -315122, 115882, 218491, 268142, 371051, 227098, 172833, 226387, 58761, 37564, 324358, 275631, 65993, 65741, 39695, 194300, 473267, 633225, 519932, 434364, 605689, 657260, 465734, 47044, -311589, -380306, -293493, -186780, -39740, -132740, -59075, 28882, -48730, 49307, 257456, 213264, -104015, -69288, 68797, 65664, 112128]
11756A12128j08467q7726P2878K6211j14042o6100K23775J89575k0037k00533
11746B7662j27497J97512J78147K2257m2848J05552J51419L8438L1751L00069
11736H82462L36538l09562n22593m61705l048n45J9030K22665K42187n6386l45098
11725C945k47854j24104q3047O5915K4996K2075J07549J36403K24995K6226j61841
11714d742j39680L4335J52907J83328J6703n0155J3678K01931Q1672j61954k78070
11703D9953k73299j29519j02129L722R0095j9524o936K2146J78327J16200Q3906
11692A2942N7452R1523L9439l0010j15448l28731k94576L5402M46103N30343K17904
11681F62343J9619k03065k50845j09827K01201K53889J2898r9457j91275j16691
$$ y = [112128, 3661, -84065, -11187, 15024, -99018, -165118, 58657, 248232, 228195, 27662, -99835, 97677, 275824, 298081, 255233, 360785, 512204, 550642, 582393, 882462, 1219000, 909438, 386845, -74860, -77908, -78453, -59423, 163242, 405429, 349043, 3945, -243909, -368013, -451060, -385145, -360149, -338074, -230525, -94122, 130873, 157099, -4742, -144422, -110087, 42820, 226148, 242851, 192696, 206374, 408305, 489977, 328023, 49953, -223346, -352865, -454994, -451272, -361177, -380701, -387637, -365491, -187164, -70964, 12942, 70394, 161917, 201356, 171346, 55898, -272833, -567409, -532007, -85904, 444439, 662343, 681962, 478897, 228052, 118225, 319426, 573315, 586213, 486756, 295481, 178790]
11671A78790j50282m6409m4980P2556J63141j88558j34749K10724o6687j89104
11661a95558J62163L10517P9939j93600k85035j58536q8308p9851j32020k6727
11651f07016J44690O0567n5603k9448j018J12609J46284N096J6449R2842R6284
11640a8264N0220P9769l823j06067l2469o6136j46400j45356N2499J01664N3583
11629a80780J00721q8266j41043J71920L83409l297k43466q5819Q1578O9884J06675
11618A71516j5706k34143P9047J80561K5943O2698J08119K82119J51657o2355
11608G49456k03733l30274m678O8919j90608l58092k14786Q9682K12622J24110
11598e7382r3606j86370n3470P8108O8037K3765k5948l284J42847J20318j36052
$$ y = [178790, 28508, -17901, -62881, 9675, 172816, -15742, -150491, 60233, -6454, -195558, -33395, 277122, 357061, 163461, -121574, -280110, -368418, -448269, -580289, -607016, -462326, -401759, -457362, -486810, -487828, -375219, -228935, -223839, -207390, -114548, -18264, 31956, 111725, 107902, 1835, -30634, -96770, -243170, -388526, -336027, -234363, -180780, -80059, -168325, -309368, -137448, 245961, 242664, -802, -86621, -5043, 64841, 171516, 155810, -78333, 714, 181275, 207218, 269916, 378035, 660154, 811811, 749456, 545723, 215449, 210771, 279690, 89082, -269010, -483796, -394114, -181492, -57382, -150988, -337358, -390828, -312720, -244683, -220918, -246866, -250150, -107303, 13015, -123037]
11587a23037j37999N7667O2836j20976m4728J61453N1870k32506k37432J9963
11577e42889J77285l1686O6423J28522r275n0167O7842p7042k9164K11429K73184
11566A84462k2911j08792n5877p2242j70533j07888K1303l6912k776R0893r2974
11555c74247P8344J08493M8149J53026J91486J0022p9906K20324K12297L3520
11545F01508l48772k96231j3457R3464n574N8098J55325J35955j32997k12462
11535C4857l60020r9238O7581p5494l0764M5301O727K486p4834J5283J85952K65591
11523a6572L24785K05553l5142j35762k67073j61858Q7879K3197j56005j24019
11513b55017J47654J37323J98826J49173m6177O4202P7275j21734k12963J2831
$$ y = [-123037, -261036, -203369, -140533, -261509, -306237, -144784, -92914, -325420, -562852, -542889, -365604, -397290, -330867, -202345, -211620, -261787, -193945, -270987, -300151, -88722, 184462, 161551, 52759, -3118, -75360, -245893, -353781, -332478, -369390, -372166, -281273, -374247, -295903, -187410, -139261, 13765, 205251, 215273, 135367, 355691, 567988, 601508, 252736, -43495, -56952, 36512, 30938, 89036, 244361, 380316, 247319, 34857, -325163, -424401, -356820, -432314, -463078, -417777, -411050, -408564, -483398, -468115, -282163, -16572, 308213, 513766, 478624, 342862, 75789, -86069, 1810, 25007, -130998, -255017, -107363, 29960, 228786, 377959, 331782, 395984, 473259, 351525, 138562, 151393]
11503A51393j9267k21706o1978R8220J38083L8597R1105K46226J07016o6851j10314
11492C90524k8458Q8519J66515p9230l65885l46166k11510k77224q1115K66807
11482d77223J46601j7145K14640L23670J57239k07845p0423m4685r9390j97455
11472b72016r2073J89161J03367K16749L9069l1883k105m5874Q3711J46481j33742
11461B00845m20013k86945J90175J42240J01753K18738Q1205l0350J45415M3227
11451C86290k52353k86511m3957l6444L8971J10611K6362P0627J65666J98893
11441C78155j37320k83436k33058M0369J77170O9738Q3979j64204j23515m784
11431a96906R8157L34214J40515J0329K63079p9562o26567k27546M3134N4765
$$ y = [151393, 132126, -89580, -151558, -53338, 84745, 123342, 214447, 460673, 567689, 500838, 390524, 362066, 450585, 617100, 537870, 171985, -174181, -385691, -662915, -744030, -477223, -330622, -347767, -133127, 190543, 347782, 139937, 69514, 24829, -74561, -272016, -364089, -174928, -71561, 145188, 184257, 152374, 150269, 104395, 188106, 334587, 200845, -219168, -506113, -315938, -173698, -71945, 146793, 227998, 197648, 343063, 386290, 133937, -152574, -196531, -232975, -194004, -83393, -57031, 13596, 179262, 378155, 240835, -42601, -275659, -235290, -58120, 11618, 95597, -68607, -192122, -196906, -98749, 235465, 375980, 386309, 649388, 569826, -56741, -284287, -241153, -186388]
11421a86388J03368j06474j92492k4767j36139j28578O4970K24513k7349k16767
11411f26103J21255J78705m2131m8286R1488O0118P2862K11826J26436K0956j16923
11400E0203j54593k32363k08005M5807J76214K4177P5135L19700J70729J8301
11390B85305K3960o1762o4362m0598k1809l2371r6080j17718N5467K9540K7474
11379a2954j17833j92910m2417j48108J21168L78780K06572r439Q995j09264r2742
11368a0152N0647Q2888P5924j8816p6546j38394N676j1007M0519k4666J4397K5923
11356A6393J45323J49905j28123k36311l9329R177L3973N9090j02653m2691J74184
11345C8938L9804l0373J9483N9362Q2747r8293j06044j36298j38893Q1783m7221
$$ y = [-186388, -83020, -189494, -381986, -406753, -542892, -671470, -606500, -381987, -409336, -626103, -504848, -326143, -368274, -416560, -325072, -264954, -192092, 19734, 146170, 167126, 50203, -104390, -336753, -544758, -498951, -322737, -298560, -223425, 96275, 267004, 285305, 309265, 247503, 183141, 142543, 120734, 88363, -7717, -125435, -69968, -40428, -12954, -130787, -323697, -366114, -514222, -393054, -14274, 192298, 182859, 191854, 82590, -10152, 40495, 123383, 199307, 180491, 103945, -34449, -28773, -39780, 739, -23927, -9530, 16393, 161716, 311621, 183498, -52813, -92142, -82965, -48992, 10098, -92555, -135246, 38938, 78742, 48369, 67852, 127214, 209961, 111668, 5624, -130674, -269567, -187784, -235005]
11334b35005k08389P2590K79370K75288O2659l466N9390K49406Q7691r3194j92075
11323C54265j90306k52676k46943J06136K57650J05842j31270j10850l4945n5897
11313a98994K9604n5566p5341J6040J39488J76132p6083j56072j32665j35498
11303d68955j31779o6545K29689L72245J92706J92307R1626m83820l05954K723
11293c75757J12396K94601K14637L9128l57962l70381K9655J88250K75603j0565
11283C9605k42348j7178P1678m6448L3594J6600N75k32372j14644J58551O0508
11272b71879J318N089k4255K5807J02862N9735k5316j45169j00465m013N7066
11261c19220l2142o7358Q6480K19052K77673J14512k96011k14733J41914J1962
$$ y = [-235005, -443394, -370804, -91434, 183854, 246513, 243047, 302437, 551843, 639534, 546340, 354265, 163959, -88717, -335660, -229524, 28126, 133968, 2698, -108152, -143097, -198994, -169390, -224956, -300297, -284257, -144769, 31363, -44720, -200792, -333457, -468955, -600734, -667279, -437590, -65345, 127361, 319668, 411294, -72526, -378480, -375757, -263361, 31240, 245877, 285005, -72957, -443338, -413683, -225433, 50170, 39605, -202743, -219921, -148243, -194691, -161097, -144497, -143922, -376294, -490938, -332387, -271879, -270561, -265472, -289727, -263920, -161058, -101323, -126639, -271808, -372273, -376286, -319220, -351362, -418720, -332240, -113188, 164485, 278997, -17014, -231747, -89833, -77871]
11251g7871n7954o1995k04239p6241J4374j05051p2265P9825J56527R1050M4447
11240b69393m4335J0425J47395J16604O3448J99603k3092l06231n1131m091N6284
11229a04514J67008L6005o4945k87302k02518R9827J53611Q5082K33662J36952
11219B52868N3119l3435n3344k55861k11267k26831k54024m0091L19761L18427
11209a30678o545J12217r984j69068O3908K2729j71184j09261o8339P5520J70631
11198b20054K21002M4064j63961j17676l6691J38730Q0897J05234P085m8231K0658
11187C1057m9940J89018J65724p3687j98956L3760J18396O5308j27307k75270
11177a21897J92374J98489r87R0946J37040j84105m71063j88307J69912M9554
$$ y = [-77871, -135825, -197820, -402059, -478300, -463926, -568977, -641242, -561417, -404890, -313840, -269393, -313728, -303303, -155908, -39304, 24144, 223747, 200655, -105576, -156707, -160798, -104514, 62494, 98499, 33554, -253748, -456266, -356439, -202828, -117746, 115916, 252868, 305987, 272552, 219208, -36653, -247920, -474751, -728775, -768866, -449105, -130678, -137223, -25006, -34990, -204058, -140150, -117421, -288605, -397866, -466205, -390685, -220054, 948, 45012, -118949, -236625, -273316, -134586, -53689, 51545, 58630, 10399, 31057, -18883, 170135, 335859, 262172, 63216, 96976, 215372, 280680, 153373, -121897, 70477, 268966, 267979, 358925, 495965, 311860, -159203, -347510, -177598, -128044]
11167a28044M2221J35081R994J16314P3437N8048r6028O4408J4559o1373R8063
11156C26680p4120j69928n2555j76009j18341K86198K40190m1217k07752q0799
11146f7653K34583L66763J60419j29003j24269j61195j08832r8032n8847K47731
11136B61665K77923l472o2139j3344M5722r7900r802J51392J37870M9072o4934
11125F72053l53828l19793k1217K8030L6831Q3493k90309m57631j64886J57953
11115f29304M98806M81385O4992k57215j10630J6930J39893m1634P8121J6304
11105B57648n4967J53415K59100N3269j09087O2263N1779l79134k11558j06758
11095b4030j45755K13539K89174J16264l6393n3108j42524j24336q3311k01547
$$ y = [-128044, -85823, 49258, 59252, 175566, 249003, 307051, 211023, 275431, 289990, 228617, 326680, 252560, 82632, 30077, -145932, -264273, 21925, 262115, 220898, 13146, -67653, 166930, 533693, 694112, 565109, 440840, 279645, 170813, 72781, 13934, 261665, 539588, 536116, 473977, 460633, 506355, 408455, 398653, 550045, 687915, 736987, 672053, 318225, -1568, -22785, 5245, 42076, 125569, -164740, -622371, -787257, -629304, -130498, 350887, 415879, 158664, 48034, 64964, 204857, 163223, 241344, 257648, 202681, 356096, 615196, 668465, 559378, 621641, 673420, 294286, 82728, -24030, -169785, 43754, 332928, 449192, 412799, 359691, 217167, 92831, 9520, -192027]
11085a92027j92607j9879Q6792K54473K66467j7856l74450j24390P5033L2895
11075b05549Q0328J66896n5536j08746o3488K4122j22847J74576J99720N2183
11065A41659J27422K14897O7659j60652j81656j20645r8664j3557J72412J18031
11055B66906J43081q6376j79723J1953M5139j34167j86778n7234N1334L6585J08718
11044A9438K18508L33310L14621K0921k87871k91066r4526p3215p6651l9203q4622
11033d0356J7018j42486r6203L9632K3189j85792n5950J68058J69016L0466k04656
11022b78064j86256Q2826j3698K56332L81656P8621n8505r4333j16228k26209
11012a73858L3735J88695P0808n96J06975P8960k1587k0436n2700r2995j95909
$$ y = [-192027, -384634, -404513, -317721, -63248, 203219, 185363, -189087, -313477, -238444, -205549, -125221, 41675, -13861, -122607, -186095, -161973, -284820, -110244, 89476, 141659, 269081, 483978, 551637, 390985, 209329, 88684, -9980, -23537, 148875, 266906, 409987, 323611, 143888, 155841, 200980, 66813, -119965, -177199, -125865, -89280, 19438, 237946, 571256, 885877, 906798, 618927, 327861, 233335, 160120, 83469, 44266, -40356, -23338, -165824, -262027, -222395, -199206, -384998, -440948, -272890, -103874, -73408, -278064, -464320, -381494, -395192, -138860, 242796, 321417, 262912, 168579, 52351, -173858, -140123, 48572, 119380, 118784, 225759, 304719, 283132, 262696, 209996, 117001, -78908]
11001g8908j65361q6464p0843Q7828j01948k07860J1222L9558R0354L17521K56617
10990I1716J10493P6065P7662Q1059K0400j25143N7081n4903j99097k39274j75829
10979b79770k570K5854j725p5617k4397K25570Q6215P6518J65494K6241j36708
10968H5105j32068j49119M9372O4052M509l6899j760P6190J19111k4125k87080
10957b32712k14706r3326r3389N5752N6928n2335L5794R4122N6325r043l0676
10946d27266P1739K68179K45107Q6691J12926j21085l66009q8763O0918N7868
10936i9695K08149J77759L4474J43746j12869l10451k19115j48096j44959Q7616
10926c83441K20066J6284j21597p1253J49814K01668J29431Q1344p2201j26628
$$ y = [-78908, -244269, -330733, -401576, -313748, -415696, -623556, -612334, -572776, -482422, -164901, 91716, 202209, 278274, 355936, 436995, 457395, 332252, 389333, 334430, 135333, -103941, -279770, -282340, -256486, -258211, -333828, -358225, -132655, -46440, 30078, 195572, 221813, 85105, -46963, -196082, -146710, -82658, -78149, -115048, -116808, -40618, 78493, 54368, -232712, -447418, -540744, -634133, -578381, -521453, -573788, -537994, -443872, -387547, -396590, -427266, -355527, -87348, 157759, 244450, 357376, 236291, -129718, -218481, -157563, -99695, 108454, 286213, 320687, 464433, 351564, 41113, -178002, -326098, -471057, -383441, -163375, -147091, -268688, -339941, -190127, 11541, 140972, 222316, 150115, 23487]
10916B3487k01804L9121J94779K46760J26j53601k17401j22879O489L8440Q5952
10905f0531P9536P2263Q7521J37106J23119R6274j28014l13744N9194J20622n3433
10894B19913o7741r9909j23357R5501R4142N6294R5922j7626n3809K6472j5945
10883B09857j56530k39341l3733J0797j34884M9878n554r6207L32m8756k6129
10872d70270k5911L3563k5582M4088L30853O1891j48877K0743R670j10725L0640
10861b49917K12716L59631P5635j94267j97729j69191r1637j3174k5553p6986
10851c70472P5230J36905m6974J58688J85287k4053j28048j31872N2908R9614
10841G213n9967k6740J43893P1749O4882O690N792o4227k18662j48984k6336k6031
$$ y = [23487, -178317, -139196, 55583, 302343, 302469, 148868, -68533, -191412, -184923, -146483, -60531, 19005, 91268, 178789, 315895, 439014, 535288, 407274, 93530, 152724, 273346, 219913, 152172, 52263, -71094, 24407, 118549, 174843, 270765, 253139, 199330, 225802, 209857, 53327, -186014, -219747, -208950, -343834, -293956, -299510, -395717, -395385, -444141, -470270, -496181, -462618, -488200, -444112, -113259, -51368, -200245, -179502, -169832, -280557, -249917, -37201, 322430, 398065, 203798, 6069, -163122, -254759, -267933, -293486, -370472, -295242, -158337, -205311, -46623, 138664, 114611, -13437, -145309, -92401, 7213, -52754, -79494, 64399, 136148, 201030, 207720, 213512, 149285, -69377, -218361, -244697, -270728]
10829b70728P8836J72978L27344R5094p125Q4299J4798J9958r1313j18060k1351
10818B84730J8383j86107q4224O6914K6657K32613P7261j83630j19869J0110m6296
10807I6542o2976j54101j77493P3094K84827m2283l75028j03322K34302K85742
10797E9304J21952J26047L12637K414k47884n2238m5239M5172K04867J71366k38699
10786D59699l31555l55453n22391j86896J96461L27999L45319J54636R2322J00282
10776B80423m0213q3071k37338k53848m0305j79853j29330Q1353K1826q036J12124
10765d76268K15708J08308j9544P9N7653K9363K1255j07995j41457k59099j96266
10754g68263L91206M03543Q6144j13107L948L2221n6044m6662P345J85875J07908
$$ y = [-270728, -191892, -18914, 308430, 403524, 396399, 480698, 495496, 515454, 424141, 306081, 284730, 303113, 117006, 32782, 99696, 126353, 358966, 436227, 252597, 132728, 142838, 96542, 33566, -120535, -298028, -224934, 59893, 17610, -357418, -460740, -226438, 59304, 181256, 307303, 619940, 622354, 374470, 322232, 276993, 322165, 527032, 698398, 459699, 128144, -227309, -749700, -936596, -740135, -412136, -66817, 87819, 180141, 280423, 240210, 157139, -80199, -334047, -374352, -554205, -683535, -602182, -580356, -588392, -476268, -260560, -152252, -171796, -171717, -114064, -84701, -63446, -171441, -312898, -571997, -768263, -377057, 26486, 112630, -477, 3471, 35692, -20352, -67014, -59669, 126206, 234114]
10743B34114M8069J36546j48248k55735j98309p8332l7800k697J86452L19878
10733B03938K76444k1944j22046M1156J96629Q6193m339o8782o0895j18124q9189
10722C19041q6350j88170j39473o2977P6956J83469O3266k23134j04638j0200
10712a72210n0137o0489K05663k818k1272N2146n7607j96371m5261P9898K5919
10701b42539K38451J64501j53977l07506l15555N1816K99966J91176M8020j9545
10691d5192J78397O9400j44636l70293k57701j02180P9463K24944J87031P7187
10681a03580m8073n688K09709K17232j96317k37586K5348L3029l8929K7219l6670
10670a54306m8735J37745J47144L30175L34804N8973R7634o2656l01142l26781
$$ y = [234114, 282183, 418729, 270481, 14746, -183563, -261895, -299695, -302392, -115940, 203938, 480382, 458438, 336392, 377548, 574177, 660370, 656031, 587249, 526354, 408230, 319041, 232691, 44521, -94952, -157929, -80973, 102496, 165762, -57372, -162010, -172210, -222347, -282836, -77173, -79991, -101263, -49117, -106724, -303095, -348356, -268458, -242539, -4088, 160413, 6436, -301070, -616625, -564809, -264843, -73667, -25647, -45192, 133205, 202605, 57969, -312324, -570025, -672205, -592742, -367798, -180767, -103580, -151653, -157341, 52368, 269600, 73283, -164303, -138955, -105926, -144855, -117636, -154306, -203041, -65296, 81848, 412023, 746827, 805800, 903434, 840778, 539636, 212855]
10660B12855j57149J21387J58297N4481r6845N1331J72176J4829j36967n0528
10650C43867R532j38015m7356J61566K75572j71029k72998P2782J4399P0107R0347
10639D08774j49045k41834m34592k70438J06136K34011M8490N2446J42564K1062
10629h2426J95504k5794q7853R7880J29485k08712l67217j98159J3605O2145J06286
10618c65256L23351K40391M5792p8932j65861l22683j82778m2861l7829J14699
10608d71967K20697K9815k01466L9094j8769m0262N5826n0002p0815J01346J99471
10597b07032J06903J52724N5593j78767j97202J6783J86951M7782O1733P3306
10587A18774l8304n3791j54533j76375P5748J96254K9526J31563K43089K7346
$$ y = [212855, 55706, 177093, 335390, 389871, 293026, 344357, 516533, 531362, 394395, 343867, 353399, 215384, 168028, 329594, 605166, 434137, 161139, 233921, 248320, 318427, 408774, 259729, 17895, -416697, -687135, -580999, -346988, -298498, -246052, -103488, -82426, 113078, 87284, -569, 97311, 226796, 18084, -349133, -547292, -533687, -471542, -365256, -41905, 198486, 244278, 165346, -515, -323198, -505976, -548837, -586666, -471967, -251270, -221455, -422921, -383827, -402596, -442858, -387032, -437034, -507849, -406503, -207032, -100129, 52595, 108188, -70579, -267781, -250998, -64047, -16265, 45468, 118774, 80470, 26679, -127854, -304229, -228481, -32227, -2701, 128862, 371951, 399297]
10577C99297o8385k29759k67215J05091L88821K48670k05995k77753j58148K4495
10567d0881q2163k59375r7118Q3128j2444R3608K85828Q3830k21731j34591P8448
10556b23461L91544K96109J374l0059l88316j81078P6657O8683P8332N2279o2308
10545G9756j08886j57818m7925K0113J52136J02488J15594n4174o1078K78366
10535C18572J64104k87673l41277k287R6886P7567J08826l2584k52712N660N9730
10524h5188R6370N8042q382J15159Q0212N4600K12573L3652j02569O1998P3905
10513E90372J46324k33041k77261j16714j51552K0779L9466j4486l13758l90146
10503g00017j47979N8172M9733j0471M7189J9044M9272O7578J38557L25524J93359
$$ y = [399297, 330912, 101153, -166062, -60971, 327850, 576520, 370525, 92772, -65376, -40881, -123044, -382419, -479537, -396409, -408853, -315245, -29417, 54413, -167318, -301909, -223461, 168083, 464192, 465566, 435507, 47191, -133887, -57230, 11453, 89785, 142064, 79756, -29130, -186948, -234873, -214760, -62624, 39864, 155458, 101284, 40206, 318572, 482676, 195003, -146274, -148561, -51675, 25892, 134718, 102134, -150578, -144918, -85188, 11182, 69224, 60842, 176001, 256213, 310813, 523386, 557038, 454469, 516467, 590372, 736696, 503655, 226394, 109680, -41872, -21093, 18373, 3887, -309871, -700017, -847996, -789824, -740091, -750562, -703373, -684329, -635057, -567479, -428922, -103398, 89961]
10492H9961l9798q9558l8965N4480J7407r525j9008Q870r3000k5887R6415K34858
10480A86250J26327l8282j59945r504K20702J79174o3233n6248p7285K1179k2287
10469C06848O504J11468j934K621K149K2482k11234l49367P6701K06703M3525
10458B16466J33415L1587j10356j6170k44346l87642j83285J88441L25158J52816
10448A06084J5214K4716J25166L662j16948j3865Q1320J12170R5018k69186k12093
10437d8742J02619J61075k27632o9972R6255P0897K65315J80264j03412j5735
10427D10932o4950l20878k06695m8128J94903M00857J69898j06685k01597j77602
10417E0055o5459Q0885J55995M2881r7100j23112J1689j6520j00334k68546q1602
$$ y = [89961, 50163, -39395, -78360, -23880, -6473, -15998, -35006, -26136, -119136, -145023, -48608, 186250, 312577, 274295, 114350, 104846, 325548, 504722, 441489, 385241, 307956, 329135, 306848, 313352, 424820, 422886, 425507, 427656, 450138, 238904, -110463, -33762, 172941, 216466, 349881, 381468, 271112, 254942, 10596, -377046, -560331, -371890, -46732, 106084, 121298, 146014, 271180, 274842, 157894, 144029, 225349, 337519, 432537, 163351, -48742, 53877, 214952, -12680, -82652, 13603, 84500, 349815, 530079, 426667, 410932, 345982, 25104, -181591, -229719, -34816, 366041, 535939, 429254, 227657, 50055, -15404, 65481, 221476, 264357, 167257, 44145, 55834, 39314, -61020, -329566, -411168]
10406d11168r1341j08025J35024K73805J60499K73187J82486j24186l11226k18465
10396b39410m0792P6609K13323K34660j3628k11351J85986J19537j26737J2945
10386B11142L2670o7748k8140k04188k10081k8607P4558j34432l24544k6895L85818
10375c20447o0736n4668J03310J52984O8528m8448j27558l3464J04r1904j259
10364d13558J68817R3080J16949O680m6555J1371O1555l0091n9591Q1856m8888
10353e8375l3152K3948o6127J1775k1971J1743Q2010P5328o7764K0808N6457n4336
10341a9656o1039k4947j13325p5992J7154J43605J09929O377p8719j6736j10880
10330b24229j23168O2329L8576N094o6466P8479J68284p2522k54855j19839J56061
$$ y = [-411168, -502509, -610534, -475510, -201705, -41206, 231981, 414467, 290281, -20945, -239410, -280202, -203593, 9730, 244390, 230762, 19411, 205397, 324934, 198197, 211142, 243812, 176064, 147924, -56264, -266345, -294952, -220394, -354826, -679370, -706265, -320447, -381183, -435851, -332541, -179557, -111029, -159477, -287035, -320499, -320395, -412299, -413558, -244741, -151661, -34712, -28032, -74587, -63216, -1661, -31752, -91343, -9487, -58375, -91527, -67579, -133706, -121931, -143902, -132159, -50149, 25179, -42585, -21777, 34680, -19656, -80695, -105642, -218967, -294959, -277805, -134200, -24271, -17894, -96613, -113349, -224229, -347397, -285068, -246492, -241398, -307864, -229385, -61101, -133623, -388478, -508317, -352256]
10319c52256J23821p259J34559J83766O3765Q3762J49430j57117j65330R352R8963
10308A65456J35715q4313j34866j44293q3887J87106K75120R7647k29849k74289
10298i0453k3896L9933J38925L34038J35851k86396j78951m4101n535J8938r0654
10287e2301n657j69212j85998o603J14261J55036K40964J17852k44629k00095
10277b36382L7131K406n2140j3420Q8791j264k8925L6977o1546K8500N0688j5324
10265a64508N3499k34514M3811K1456m6029m3395j07748j70871J23762J65319
10255c59218j1060Q6819q8011j2831J72165r1287k29924p9817P1179K79538J86127
10244g6320j84074j83739K44019K52276n1460q6540J15433J13068k49206k67731
$$ y = [-352256, -228435, -235694, -101135, 82631, 146396, 230158, 379588, 222471, 57141, 66493, 165456, 301171, 216858, 81992, -62301, -146188, 40918, 316038, 413685, 183836, -90453, -114349, -74416, 64509, 398547, 534398, 248002, 69051, 24950, 19415, 38353, -52301, -57958, -227170, -413168, -419771, -305510, -150474, 90490, 208342, -36287, -236382, -199251, -196845, -248985, -262405, -173614, -174878, -203803, -166826, -228372, -199872, -149184, -164508, -111009, -345523, -301712, -280256, -326285, -369680, -477428, -648299, -524537, -359218, -370278, -283459, -371470, -384301, -212136, -303423, -533347, -613164, -541985, -262447, -76320, -260394, -444133, -200114, 52162, 702, -85838, 29595, 142663, -106543, -374274]
10234c74274Q2115J71455K67722K06018o7641j33562K05621K03366j80993k43984
10224A35843j09656J30666J99280k7390q480M1304j04794M6603M1029l6494j20834
10213A87077q3171J14479K7948j35900j43825J03842K87103J35870l9214k32916
10203B21293j47800J2925j53775k40224l9009J49058Q1485j50955l8353J57048
10193a48307J63504K04065K74086j07216j17117k05751k81236j59526J10207K24438
10183d2853K34946R2727J00259Q1302j06684k7432o7992k15951p9339J50256k6794
10172I2445j87680O924J95068N8450q1063L3481K22081L1157k31214K7488J79443
10161C46580R1281j56842m64777k33831J49777J70933R2462Q7010N736j5467j3366
$$ y = [-374274, -292159, -120704, 147018, 353036, 285395, 151833, 357454, 560820, 379827, 135843, 26187, 156853, 356133, 328743, 320263, 361567, 256773, 303376, 344405, 307911, 187077, 103906, 218385, 246333, 110433, -33392, 70450, 357553, 493423, 454209, 221293, 73493, 86418, -67357, -307581, -346590, -197532, -116047, -267002, -305355, -148307, 15197, 219262, 493348, 386132, 269015, 63264, -217972, -377498, -267291, -42853, 192093, 284820, 385079, 466381, 359697, 332265, 264273, 48322, -31017, 119239, 92445, -95235, -88311, 106757, 165207, 84144, 117625, 339706, 370863, 139649, 167137, 346580, 437861, 281019, -183758, -417589, -267812, -96879, -4417, 82593, 88329, 72862, 59496]
10150E9496o5671m5227L3185J6883R6168J0545o2311j73302j02487P9895P4012
10139g8814L3507J41127P9695p4195l6266J0762J1039l879k7803J87086J47796
10128C90055k1902j94074l04388k27393l61401j88368K31167J89788R6028J29712
10118b60776J43496j1776j61516j16511j24472r4414J55781J33781o6948P8673
10108c24682J23641j8786J17719J77179J85493R7106n3295j04040p0947K8895
10098A58283J54815M4994k25118k24832j13447j26024J50028J42073l411Q4164
10088D1525m5913p2182p1097j79279p8014J10676N7465J11763R8895j25677j20550
10077b72388o5139m6399m1194m6818K2133K52888J54710j4939Q8553K36876L70235
$$ y = [59496, -6175, -51402, -18217, -1334, 94834, 105379, 43068, -130234, -232721, -152826, -78814, -45307, 95820, 175515, 101320, 65054, 75816, 86855, 82976, 55173, 242259, 390055, 368153, 174079, -130309, -357702, -719103, -907471, -676304, -486516, -390488, -260776, -117280, -129056, -290572, -407083, -531555, -625969, -470188, -336407, -403355, -324682, -201041, -219827, -102108, 75071, 260564, 357670, 304375, 200335, 129388, 158283, 313098, 358092, 132974, -91858, -205305, -331329, -181301, -39228, -42639, 41525, -4388, -76570, -147667, -326946, -404960, -294284, -236819, -125056, -26161, -151838, -272388, -337527, -383926, -425120, -471938, -449805, -196917, -42207, -57146, 31407, 268283, 638518]
10066F38518J31239j08108m56003l18364j11645J06376L12319J29364k4459L0918
10056C30155l5129j56328j87703r5470k05142k05564r8772J34206K83385j6662
10046b53024j77872j58204n525O9131L35535K83929J29937L3007R491o5802k45745
10035d5142k30284o7777P6006Q8618O6107J19750J13529j48814O3214K44765J2036
10024B92008p0519J922R759p8675j25741j14061r299L21555K34342j03014l3672
10013C24605K1051j34769k3275j21106j00570O5537j60094j98471j22719J23800
10003c26011J50950R4579J46319J16421L1311m9104j48502j25616J743P2607P502
9992b7801j42077k3943Q7494J2313m2289k954k02039j73890J60371K52402K05653
$$ y = [638518, 769757, 661649, 205646, -112718, -224363, -117987, 194332, 323696, 299237, 330155, 295026, 138698, -49005, -144475, -349617, -555181, -653953, -519747, -236362, -253024, -430896, -589100, -594625, -525494, -189959, 93970, 223907, 256914, 266405, 200603, -45142, -275426, -343203, -267197, -178579, -112472, 7278, 120807, -28007, 35207, 279972, 292008, 221489, 223411, 233170, 154495, 28754, -85307, -94606, 226949, 461291, 358277, 324605, 345656, 210887, 187612, 66506, -34064, 31473, -128621, -327092, -449811, -326011, -175061, -80482, 65837, 182258, 213569, 164465, 15963, -109653, -107910, -35303, -27801, -169878, -193821, -106327, -94014, -136303, -139257, -341296, -515186, -354815, -102413, 103240]
9981A03240N6169r6013L4841j25801j9737K59031R614j05913j72317k22458p6541
9970c55885J24442R7743K61095J37964Q1291L6611m0316j38956j35956K7852r277
9959H6608r3950J9694j0123o3878Q298K18553K78806J13000j57755M697K44986
9948F48936p9040k49354j2844J6188j90246P5034J94225m0475r6176j28376r2055
9937D5817l2655j72799j94831J77705J36128Q0326P6407K8757O1551k6777n9201
9926A20428j8235j2377k7130N5338O7932N3753J0361j04329k39204j49365j00752
9915c43580K1197K00616J27050j03477j06877M7835J13671k39660j46353K70916
9905a58662Q3350j8209Q1529J97385J05373j40224l8302J74603K75839K37753
$$ y = [103240, 159409, 63396, 98237, -27564, -47301, 211730, 221344, 115431, -56886, -279344, -355885, -231443, -133700, 127395, 265359, 346650, 383261, 342945, 203989, 68033, 95885, 86608, -7342, 12352, 2229, -61649, -53351, 165202, 444008, 557008, 399253, 403950, 648936, 569896, 320542, 307698, 323886, 133640, 208674, 402899, 362424, 266248, 137872, 45817, 13162, -159637, -354468, -176763, -40635, 39691, 116098, 144855, 206406, 179629, 120428, 102193, 89816, 62686, 118024, 185956, 239709, 250070, 145741, -93463, -242828, -343580, -322383, -121767, 5283, -98194, -205071, -157236, -43565, -283225, -429578, -158662, -75312, -93521, -11992, 185393, 290766, 150542, 112240, 286843, 562682, 800435]
$$ [...]
##END NTUPLES=NMR SPECTRUM
##END=
