##TITLE=C13_SA_7.153
 DMSO, 23000 sc

 12.11.2019
##JCAMPDX= 6.0         $$ Bruker NMR JCAMP-DX V2.0
##DATA TYPE= NMR SPECTRUM
##DATA CLASS= NTUPLES
##ORIGIN= UXNMR, Bruker Analytische Messtechnik GmbH
##OWNER= root
$$ XWIN-NMR		Version 3.5
$$ Wed Nov 13 13:46:46 2019 Russian Standard Time (UT+4h)  she@DPX200
##.OBSERVE FREQUENCY= 50.327896
##.OBSERVE NUCLEUS= ^13C
##.ACQUISITION MODE= SIMULTANEOUS
##.ACQUISITION SCHEME= undefined
##.AVERAGES= 17964
##.DIGITISER RES= 17
##SPECTROMETER/DATA SYSTEM= spect
##.PULSE SEQUENCE= zgpg30
##.SOLVENT NAME= DMSO
##.SHIFT REFERENCE= (INTERNAL, DMSO, 0, 222.624)
##AUDIT TRAIL= $$ (NUMBER, WHEN, WHO, WHERE, WHAT)
$$ ##TITLE= Audit trail, XWIN-NMR		Version 3.5
$$ ##JCAMPDX= 5.01
$$ ##ORIGIN= Bruker BioSpin GmbH
$$ ##OWNER= she
$$ F:/spectra/data/she/nmr/c13/1/pdata/1/auditp.txt
$$ ##AUDIT TRAIL=  $$ (NUMBER, WHEN, WHO, WHERE, WHAT)
(   1,<2019-11-13 09:27:08.42 +0400>,<she>,<DPX200>,
      <created by zg, POWCHK disabled, PULCHK disabled
       terminated by command 'halt'
       configuration hash MD5:
       00 E9 B6 7A A2 85 ED C7 34 08 36 98 17 FE 4E 26
       data hash MD5: 32K
       0B D4 24 9C 87 DC 05 FE 50 9F 38 0D 07 86 95 AB>)
(   2,<2019-11-13 13:43:57.51 +0400>,<she>,<DPX200>,
      <Start of raw data processing
       efp BC_mod = 2 LB = 1 FT_mod = 6 PKNL = 1 PHC0 = -232.1618 PHC1 = 16.20636 SI = 32K 
       data hash MD5: 32K
       FE 69 AC 28 9E C3 90 64 D4 C3 68 B9 A7 B4 26 2C>)
(   3,<2019-11-13 13:44:24.31 +0400>,<she>,<DPX200>,
      <pk PHC0 = 1.215297 PHC1 = 6.399999 
       data hash MD5: 32K
       A6 99 7A 84 72 AA 56 95 89 AB 1C 78 BF 47 C4 C1>)
(   4,<2019-11-13 13:44:28.53 +0400>,<she>,<DPX200>,
      <abs ABSG = 5 
       data hash MD5: 32K
       B1 74 00 80 C2 42 B8 B7 C3 B0 65 31 5C D2 A9 F7>)
(   5,<2019-11-13 13:45:00.14 +0400>,<she>,<DPX200>,
      <pk PHC0 = -8.967699 PHC1 = 11.2 
       data hash MD5: 32K
       12 50 BB C0 AA AE 21 3D 10 37 57 3F 10 A4 E6 BA>)
(   6,<2019-11-13 13:45:04.09 +0400>,<she>,<DPX200>,
      <abs ABSG = 5 
       data hash MD5: 32K
       22 9B DE 0F 17 79 0C E0 75 2C E9 17 01 D6 53 6A>)
$$ ##END=
$$ 
$$ hash MD5
$$ 1F FC 09 70 A4 4B 5E A2 4D 63 E8 4C B6 7D 54 A0
##$RELAX= 
##$RELAX= 
##$RELAX= 
##$RELAX= 
##$RELAX= 
##$RELAX= 
##$RELAX= 
##$RELAX= 
$$ Bruker specific parameters
$$ --------------------------
##$DU= <F:/spectra>
##$EXPNO= 1
##$NAME= <c13>
##$PROCNO= 1
##$TYPE= <nmr>
##$USER= <she>
##$AMP= (0..31)
100 100 100 100 100 100 100 100 100 100 100 100 100 100 100 100 100 100 
100 100 100 100 100 100 100 100 100 100 100 100 100 100 
##$AQSEQ= 0
##$AQ_mod= 1
##$AUNM= <au_zg>
##$AUTOPOS= <>
##$BF1= 50.322709
##$BF2= 200.13
##$BF3= 50.322709
##$BF4= 500.13
##$BF5= 500.13
##$BF6= 500.13
##$BF7= 500.13
##$BF8= 500.13
##$BYTORDA= 1
##$CFDGTYP= 0
##$CFRGTYP= 5
##$CHEMSTR= <none>
##$CNST= (0..31)
1 1 145 1 1 1 1 1 1 1 1 1 1 1 1 1 1 1 1 1 1 1 1 1 1 1 1 1 1 1 1 1 
##$CPDPRG= <waltz16>
##$CPDPRG1= <>
##$CPDPRG2= <waltz16>
##$CPDPRG3= <>
$$ [...]
##$SUBNAM4= <"">
##$SUBNAM5= <"">
##$SUBNAM6= <"">
##$SUBNAM7= <"">
##$SUBNAM8= <"">
##$SUBNAM9= <"">
##$SW= 239.972175391363
##$SWIBOX= (0..15)
0 1 3 0 0 0 0 0 0 0 0 0 0 0 0 0 
##$SW_h= 12077.2946859903
##$TD= 32768
##$TD0= 1
##$TE= 0
##$TE2= 300
##$TE3= 300
##$TEG= 300
##$TL= (0..7)
120 120 120 120 120 120 120 120 
##$TP= (0..7)
150 150 150 150 150 150 150 150 
##$TP07= 0
##$TPNAME0= <>
##$TPNAME1= <>
##$TPNAME2= <>
##$TPNAME3= <>
##$TPNAME4= <>
##$TPNAME5= <>
##$TPNAME6= <>
##$TPNAME7= <>
##$TPOAL= (0..7)
0.5 0.5 0.5 0.5 0.5 0.5 0.5 0.5 
##$TPOFFS= (0..7)
0 0 0 0 0 0 0 0 
##$TUNHIN= 0
##$TUNHOUT= 0
##$TUNXOUT= 0
##$USERA1= <user>
##$USERA2= <user>
##$USERA3= <user>
##$USERA4= <user>
##$USERA5= <user>
##$V9= 5
##$VALIST= <valist>
##$VCLIST= <CCCCCCCCCCCCCCC>
##$VD= 0
##$VDLIST= <DDDDDDDDDDDDDDD>
##$VPLIST= <PPPPPPPPPPPPPPP>
##$VTLIST= <TTTTTTTTTTTTTTT>
##$WBST= 1024
##$WBSW= 4
##$XGAIN= (0..3)
0 0 0 0 
##$XL= 0
##$YL= 0
##$YMAX_a= 121891429
##$YMIN_a= -31647700
##$ZGOPTNS= <>
##$ZL1= 120
##$ZL2= 120
##$ZL3= 120
##$ZL4= 120
##$ABSF1= 222.624
##$ABSF2= -17.3728
##$ABSG= 5
##$ABSL= 3
##$ALPHA= 0
##$AQORDER= 0
##$ASSFAC= 0
##$ASSFACI= 0
##$ASSFACX= 0
##$ASSWID= 0
##$AUNMP= <proc_1d>
##$AZFE= 0.1
##$AZFW= 0.5
##$BCFW= 0
##$BC_mod= 2
##$BYTORDP= 0
##$COROFFS= 0
##$CY= -3
##$DATMOD= 1
##$DC= 0
##$DFILT= <>
##$DTYPP= 0
##$F1P= 0
##$F2P= 0
##$FCOR= 0.5
##$FTSIZE= 32768
##$FT_mod= 6
##$GAMMA= 0
##$GB= 0
##$INTBC= 1
##$INTSCL= 4.134877e-10
##$ISEN= 128
##$LB= 1
##$LEV0= 0
##$LPBIN= 0
##$MAXI= 10000
##$MC2= 0
##$MEAN= 0
##$ME_mod= 0
##$MI= 0.1934396
##$NCOEF= 0
##$NC_proc= 3
##$NLEV= 6
##$NOISF1= 120.0001
##$NOISF2= 80.00006
##$NSP= 0
##$NTH_PI= 0
##$NZP= 0
##$OFFSET= 222.624
##$PC= 1.4
##$PHC0= -239.9142
##$PHC1= 33.80636
##$PH_mod= 1
##$PKNL= yes
##$PPARMOD= 0
##$PSCAL= 0
##$PSIGN= 0
##$REVERSE= no
##$SF= 50.3227315989248
##$SI= 32768
##$SIGF1= 140
##$SIGF2= 120
##$SINO= 11.81781
##$SIOLD= 32768
##$SREGLST= <13C.CDCl3>
##$SSB= 0
##$STSI= 32768
##$STSR= 0
##$SW_p= 12077.2946859903
##$SYMM= 0
##$S_DEV= 0
##$TDeff= 32768
##$TDoff= 0
##$TI= <>
##$TILT= no
##$TM1= 0
##$TM2= 0
##$TOPLEV= 0
##$USERP1= <user>
##$USERP2= <user>
##$USERP3= <user>
##$USERP4= <user>
##$USERP5= <user>
##$WDW= 1
##$XDIM= 32768
##$YMAX_p= 298627014
##$YMIN_p= -1118569
$$ End of Bruker specific parameters
$$ ---------------------------------
##NTUPLES= NMR SPECTRUM
##VAR_NAME=  FREQUENCY,     SPECTRUM/REAL,   SPECTRUM/IMAG
##SYMBOL=    X,             R,               I
##VAR_TYPE=  INDEPENDENT,   DEPENDENT,       DEPENDENT
##VAR_FORM=  AFFN,          ASDF,            ASDF
##VAR_DIM=   32768,         32768,           32768
##UNITS=     HZ,            ARBITRARY UNITS, ARBITRARY UNITS
##FACTOR=    0.368581032318806, 1,           1
##FIRST=     11203.0474431902, 0,            0
##LAST=      -874.247242800138, 0,           0
##MIN=       -874.247242800138, -1118569,    0
##MAX=       11203.0474431902, 298627014,    0
$$ Real data points
##PAGE= N=1
##DATA TABLE= (X++(R..R)), XYDATA
$$ [...]
10934C80686r245M214l9598j22196M898j4983j28154k17838j47670l8588K00854
$$ 380686 371441 375655 336057 213861 218759 203776 75622 -142216 -289886 -328474 -127620
10923a27620K72299R0569J18892o3967j06928J46719O3331j58638q7192m2542
$$ -127620 144679 235248 354140 290173 183245 329964 393295 234657 147465 104923
10913A04923K01102J05607j24371j20238j19892q8511j9049K9548k1681J11119
$$ 104923 306025 411632 287261 167023 47131 -41380 -60429 -30881 -52562 58557
10903E8557J39777k6656M2245m8503r4260j85141j22976K6865j2200Q068o7712
$$ 58557 198334 171678 213923 165420 71160 -113981 -236957 -210092 -222292 -214224 -281936
10892b81936L509J97210K51589K06002J22787k04j27792k43460m00828k49362
$$ -281936 -278427 -81217 170372 376374 499161 498957 371165 127705 -273123 -522485
10882e22485K61750n558j73143J24761Q3152r1329l9274P2157K3782K374N926
$$ -522485 -260735 -266293 -439436 -314675 -231523 -322852 -362126 -289969 -266187 -263813 -257887
10871b57887K11303K32870L6732L6666J00741o2974j94928j03147n0973j4643
$$ -257887 -46584 186286 223018 259684 360425 297451 102523 -624 -51597 -66240
10861f6240j5220P5469R1302k10166k96827m648R8851K90173N6910k95369k80854
$$ -66240 -81460 -5991 85311 -124855 -421682 -426330 -327479 -37306 19604 -275765 -556619
10850e56619J3901J52991M22156J50456j10488p1296p2708J1360Q5741K0192j25291
$$ -556619 -542718 -389727 32429 182885 72397 1101 -71607 -60247 25494 45686 -79605
10839g9605p7634k0072R8645k2084K819j3989p5590Q1209J35051j57650k26516
$$ -79605 -157239 -177311 -78666 -100750 -97931 -111920 -187510 -106301 28750 -128900 -355416
10828c55416M3191J59707O6783O8512Q8709o0794j45209n0561M0549P3482Q3926
$$ -355416 -312225 -152518 -85735 -17223 71486 10692 -134517 -185078 -144529 -71047 12879
10817A2879r8397r2707K2329N4111m3660j11154q9345J43604K32133O8494o608
$$ 12879 -85518 -178225 -155896 -101785 -145445 -256599 -345944 -202340 29793 98287 91679
10806I1679j5539Q7701n659q7380j1992o5484j83576l7635Q0927K5096J61879
$$ 91679 76140 163841 158182 70802 58810 -6674 -190250 -227885 -146958 -121862 40017
10795D0017K80983L5025j85816j78827k45544m7235J27900Q7711O9079o3469j90627
$$ 40017 321000 356025 170209 -8618 -254162 -301397 -173497 -85786 -16707 -80176 -270803
10784b70803m2950J05951J62705J65424q818N080N9427j48132j78047l9961K35955
$$ -270803 -313753 -207802 -45097 120327 111509 116589 176016 27884 -150163 -190124 45831
10773D5831p119l12759k59039M4199P9434j550L038K3851l9444j48616q4565j14452
$$ 45831 38712 -274047 -533086 -488887 -409453 -411003 -407965 -384114 -423558 -572174 -656739 -771191
10761g71191m0521L17362P4301P3830J38646j15542l7077J25358J08533p8193
$$ -771191 -811712 -494350 -420049 -346219 -207573 -323115 -360192 -234834 -126301 -204494
10751b04494m6714r0491L2746J75047P5814j9723j09750k79029k62795J04283
$$ -204494 -251208 -341699 -308953 -133906 -58092 -77815 -187565 -466594 -729389 -625106
10741f25106K36722N8298J99791K71961J03001m2777j87453j94871p191Q3476
$$ -625106 -388384 -330086 -130295 141666 244667 201890 14437 -180434 -187625 -104149
10731a04149P2718J06082p4343j15556n7734M5561j05521K4660K14041J57057
$$ -104149 -31431 74651 308 -115248 -172982 -127421 -232942 -208282 5759 162816
10721A62816R0307n4523o0513n5765k58047j00999j11129q3026J18587j4649j68180
$$ 162816 253123 198600 138087 82322 -175725 -276724 -387853 -470879 -352292 -366941 -535121
10710e35121n3850n6413j3180J54295J13016K93415Q0870k49653q1764K6457j00595
$$ -535121 -588971 -645384 -658564 -504269 -391253 -97838 -16968 -266621 -348385 -321928 -422523
10699d22523J25516R1791j46349K41109J40708j70449q4731q3593j25449j59353
$$ -422523 -297007 -205216 -351565 -110456 30252 -140197 -224928 -308521 -433970 -593323
10689e93323k10007q7833J55607L08807M3903J00420P4590N2720R1593m4370j6542
$$ -593323 -803330 -891163 -735556 -426749 -382846 -282426 -207836 -155116 -63523 -107893 -124435
10678a24435j0908K7489p8656j53636N6659J4455m0097O8507O5617j06168j81465
$$ -124435 -135343 -107854 -186510 -340146 -283487 -269032 -309129 -240622 -175005 -281173 -462638
10667d62638j44789J38416K16718N693L7382R8700J02518J68975J42676m6940
$$ -462638 -607427 -469011 -252293 -246600 -209218 -110518 -8000 160975 303651 256711
10657B56711j82611j5271p0424k17078n7622k0830j36652j44710O8333K91922
$$ 256711 74100 58829 -11595 -228673 -286295 -307125 -443777 -588487 -520154 -228232
10647b28232J90992J9428o1689m8114O0491R5597J89599L1600j09114L0952J88557
$$ -228232 -37240 -17812 -79501 -127615 -67124 28473 218072 249672 140558 171510 360067
10636C60067R8066q7241j75286j04457N8630L66656J57114j69244k16721j16860
$$ 360067 458133 370892 195606 91149 149779 516435 673549 504305 287584 170724
10626A70724n0380q3268r3279j629J83969N5940o9214k4256J17094M0308j12290
$$ 170724 120344 37076 -56203 -57832 126137 182077 112863 88607 205701 246009 133719
10615A33719R2986M5929j60526l09059k24260m2220K37581J75319K12378J49615
$$ 133719 226705 272634 112108 -196951 -421211 -463431 -225850 -50531 161847 311462
10605C11462n6091k55987n5121J22397P3218L5571R2694j17670k00156k16963
$$ 311462 255371 -616 -55737 66660 139878 175449 268143 150473 -49683 -266646
10595b66646p1101J16225N6092j7353J22146J21652J45141J65315j44734l26702
$$ -266646 -337747 -221522 -165430 -182783 -60637 61015 206156 371471 226737 -99965
10585i9965J224J01794N4041M6085j42961j43474j19849j45956J23269J14627
$$ -99965 -98741 3053 57094 103179 -39782 -183256 -303105 -449061 -325792 -211165
10575b11165N8883O9698L4452J5357N3043K07034Q9468r6060n4088j6455q7819
$$ -211165 -152282 -82584 -48132 -32775 20268 227302 316770 220710 166622 150167 62348
10564F2348j12502L3989m045j69040p5339K03209J78237K5456l8042k9501r3070
$$ 62348 -50154 -16165 -20210 -189250 -264589 -61380 116857 142313 104271 74770 -18300
10553a8300p4388Q1293j3457M3273O0973l6854n0030k2691n2866j55235m5512
$$ -18300 -92688 -11395 -24852 18421 79394 42540 -7490 -30181 -83047 -238282 -283794
10542b83794n536J1284J78054J65661L3400k5132k3237j6259K1347M2277P5383
$$ -283794 -289330 -278046 -99992 65669 99069 73937 50700 34441 55788 98065 173448
10531A73448N2023R4263j3230o5510M3053m8085p1867l9502M950m9053r3589j75783
$$ 173448 225471 319734 306504 240994 284047 235962 164095 124593 129543 80490 -13099 -188882
10519a88882l5099J69245J38810j8465j8688L3864K8979J28875L7295l2307j04141
$$ -188882 -223981 -54736 84074 65609 46921 80785 109764 238639 275934 243627 139486
10508A39486j20360L7593O4641j7200j5349J6364N6294J45486O2138j16977j95904
$$ 139486 19126 56719 121360 104160 88811 105175 161469 306955 369093 252116 56212
10497E6212p8299J03736K5523j45723p0867J00165o735k06776q4632J02990P3751
$$ 56212 -22087 81649 107172 -38551 -109418 -9253 -15988 -222764 -307396 -204406 -130655
10486a30655L2188l3345j30150j79338m2073R8097K67850J82853p893k77572k42766
$$ -130655 -98467 -131812 -261962 -441300 -483373 -385276 -117426 65427 57534 -220038 -462804
10475d62804k1976N8982Q7692P0789k17326j26011L7206P4599J01925M3036J11466
$$ -462804 -484780 -425798 -338106 -267317 -484643 -610654 -573448 -498849 -396924 -353888 -242422
10464b42422O4200J9568J26971J54902P788j29011k43977j54607J41767K78391
$$ -242422 -178222 -158654 -31683 123219 131007 1996 -241981 -396588 -254821 23570
10454B3570P0963j03842o9889J14492J51790p971j69340j97425o5055n2968K6151
$$ 23570 94533 -9309 -79198 35294 187084 179113 9773 -187652 -252707 -305675 -279524
10443b79524N4449L9450m179J13227R2349m6087k3553K9471J12974j1091J0181
$$ -279524 -225075 -185625 -189804 -76577 15772 -30315 -53868 -24397 88577 77486 87667
10432H7667l9672O7753K13138K48503L5146j69406k19533j40861j23298j40509
$$ 87667 47995 115748 328886 577389 612535 443129 223596 82735 -40563 -181072
10422a81072j10411p358K30430J16320j44864J4904P5357q9867p2482l640j18685
$$ -181072 -291483 -298841 -68411 47909 -96955 -82051 -6694 -96561 -169043 -172683 -291368
10411b91368j81406n4463J3034n3850n5586k0928K02950L34196J54151k4416m5860
$$ -291368 -472774 -527237 -514203 -568053 -623639 -644567 -441617 -107421 46730 22314 -23546
10400b3546j9544P5045J23344O7418j4975J3186m4947p7249K05J87924R85k98619
$$ -23546 -43090 31955 155299 222717 207742 220928 175981 98732 98937 286861 287846 -10773
10388a0773l000J1913r3629l9005q247r185m2955P5335N1775m2788o426j1418
$$ -10773 -13773 -1860 -95489 -134494 -142741 -151926 -194881 -119546 -67771 -110559 -116985 -128403
10376a28403j24506k90000j91787k7310N2838m3457K6459Q4546K60181K24874
$$ -128403 -252909 -542909 -734696 -762006 -709168 -752625 -726166 -641620 -381439 -156565
10366a56565J25191M1399j08268Q75M3366Q0354J51216J39963L2864l4836j01412
$$ -156565 -31374 10025 -98243 -97368 -54002 26352 177568 317531 350395 315559 214147
10355B14147j63564j45492j27772k48490k1773J60083l542m9718j39410j5497
$$ 214147 50583 -94909 -222681 -471171 -492944 -332861 -336403 -386121 -525531 -541028
10345e41028J30780O1817J0224l8148m1643l09J03763K23048q3738j40262J62778
$$ -541028 -410248 -348431 -338207 -376355 -417998 -418307 -314544 -91496 -175234 -315496 -152718
10334a52718J83884J2069j27874k46366j80148J15600K34480J60883J36901o9884
$$ -152718 31166 43235 -84639 -331005 -511153 -395553 -161073 -190 136711 66827
10324F6827q4340q1733R6613J23567J09312m5858q3386q538M7868k6925k9743
$$ 66827 -17513 -99246 -2633 120934 230246 184388 101002 92464 140332 113407 83664
10313H3664j35314p6981Q4900J79350O5041j3842m7706J81290q7233j31583o666
$$ 83664 -51650 -128631 -43731 135619 200660 186818 139112 320402 233169 101586 94920
10302I4920p0768M9193J99144K96874Q4011j87846l74999l38660q5757Q5551k5502
$$ 94920 24152 73345 272489 569363 653374 465528 90529 -248131 -333888 -248337 -273839
10291b73839j10456J3684J78736L15606k3837k22061J017O341K0357N4058k3570
$$ -273839 -384295 -370611 -191875 123731 99894 -122167 -121150 -114809 -94452 -40394 -63964
10280f3964j2187k8331j67454m6449J78846J77840O4171L658p1949j56137l3534
$$ -63964 -76151 -104482 -271936 -318385 -139539 38301 102472 106130 34181 -121956 -155490
10269a55490J91771P4007k49866k52986j25807m1572Q8484R6676Q6641P2930J10423
$$ -155490 36281 110288 -139578 -392564 -518371 -559943 -471459 -374783 -288142 -215212 -104789
10258a04789J21155K26446K61972M3363q5467k56310j45633L5345j30857j89739
$$ -104789 16366 242812 504784 548147 462680 206370 60737 96082 -34775 -224514
10248b24514n0054N4509Q1063M0016K9463k5940N7538K38633P4471m5831K346
$$ -224514 -274568 -220059 -138996 -98980 -69517 -95457 -37919 200714 275185 229354 231700
10237B31700p613m8836R3833J85674l7141o2513m5919n0838j3260j01242o0565
$$ 231700 224087 175251 269084 454758 417617 355104 309185 258347 245087 143845 83280
10226H3280j48276O4675L05796K34925M2298J18248K17372j62047l72636j45476
$$ 83280 -64996 -321 305475 540400 582698 700946 918318 756271 383635 238159
10216B38159k34015k11301n6005L4648M4100J93812J62681p516n6909P037k09584
$$ 238159 4144 -207157 -263162 -228514 -184414 9398 172079 164563 107654 114691 -94893
10205i4893k1079J17299j9778P1058J32737J12062R0743r9093j90470j56187q1496
$$ -94893 -115972 1327 -18451 52607 185344 297406 388149 289056 98586 -57601 -139097
10194a39097O8171K40935K30760Q2378K10813O8933k46523k12318M7785J17256
$$ -139097 -70926 170009 400769 483147 693960 762893 516370 304052 351837 469093
10184D69093j1444k57138l81212j53508J05108R9108p3867k3801L0307P8723r0516
$$ 469093 457649 200511 -180701 -334209 -229101 -129993 -203860 -227661 -197354 -118631 -209147
10173b09147n6742K04232q7145k45253n13J61621J84808J21489m269k12413j38944
$$ -209147 -265889 -61657 -148802 -394055 -394568 -232947 -48139 73350 69081 -143332 -282276
10162b82276Q8540N2564j55629q3615p0020n5726M6095J27844K25544J39959m4887
$$ -282276 -193736 -141172 -296801 -380416 -450436 -506162 -460067 -332223 -106679 33280 -11607
10151a1607K9283m8971J48J34471J11678j2982j89967j57386J39976L1585M4895
$$ -11607 17676 -31295 -31147 103324 215002 202020 12053 -145333 -5357 26228 71123
10140G1123L767n3484j07460o840o1885k02137n6162J01127Q1983J03500K1133
$$ 71123 74890 21406 -86054 -92894 -154779 -356916 -413078 -311951 -229968 -126468 -105335
10129a05335j36892j56510k24741j11240K60272L56264K22394J44536j5633J0925
$$ -105335 -242227 -398737 -623478 -734718 -474446 -118182 104212 248748 233115 244040
10119B44040J1453p1797q8088J04233K2001M4394Q431k9308K250m0493m574K13602
$$ 244040 255493 183696 95608 199841 221842 266236 274667 245359 247609 207116 202542 416144
10107D16144j599l08264k5529J20628P0064R1371j01677j08710j00236k2649J36873
$$ 416144 414545 106281 80752 201380 271444 362815 261138 152428 52192 29543 166416
10096A66416M4004j58445j8329O9917j16255m1701l4112J01144N7540M129J89012
$$ 166416 210420 51975 33646 103563 -12692 -54393 -88505 12639 70179 74308 263320
10085B63320R1635j51699j60840j12530j30942m3711K9915J10903J98707J65084
$$ 263320 354955 203256 42416 -70114 -201056 -244767 -214852 -103949 94758 259842
10075B59842L3310j48048j76327j04263j85568r7811Q7343P270q5774J5620J17819
$$ 259842 293152 145104 -31223 -135486 -321054 -418865 -331522 -324252 -410026 -394406 -276587
10064b76587J55091K26400J56517J21741O6550j47390k89757j41059J2355J8051
$$ -276587 -121496 104904 261421 383162 449712 302322 12565 -128494 -116139 -98088
10054i8088L4088J09437J15900Q6133J5334K9618j9942r3737m3459j25348j30950
$$ -98088 -64000 45437 161337 247470 262804 292422 272480 178743 135284 9936 -121014
10043a21014j1010O6385m5920l9708J9101n5593k08543k11202k072L1161L6458
$$ -121014 -132024 -65639 -111559 -151267 -132166 -187759 -396302 -607504 -609576 -578415 -541957
10032e41957Q6120M4283R3019O339j31498j32602j40676j1065L17916J98811J00741
$$ -541957 -455837 -411554 -318535 -312196 -443694 -576296 -716972 -728037 -410121 -211310 -110569
10021a10569K29251J46323j34901k28252M292P1352K7599j11069k05147m2860
$$ -110569 118682 265005 130104 -98148 -93856 -22504 5095 -105974 -311121 -353981
10011c53981j8295J93399J30077l17o0800q3974l4233N1520K15603K55884J58261
$$ -353981 -372276 -178877 -48800 -49117 -109917 -193891 -228124 -176604 38999 294883 453144
10000D53144j09905o4212n3645j68423j25767q5917j89281j03523l7482O4952
$$ 453144 343239 279027 225382 56959 -68808 -154725 -344006 -447529 -485011 -420059
9990d20059N8679j2558J4807M4800o6942j28049P7759K20958R3268j6040J12885
$$ -420059 -361380 -373938 -359131 -314331 -381273 -509322 -431563 -210605 -117337 -133377 -20492
9979b0492R9682p1685K9720J86447N6072o1551j55149j42840j8629O5793J25753
$$ -20492 79190 7505 37225 223672 279744 218193 63044 -79796 -98425 -32632 93121
9968I3121o1094j45340J34403J15450n2071k31896L7051J21347j58435j56882
$$ 93121 32027 -113313 21090 136540 84469 -147427 -110376 10971 -147464 -304346
9958c04346j6154J50474j2532j20097o2662q9926N9870K0227K4766q00k0014J40831
$$ -304346 -320500 -170026 -182558 -302655 -365317 -455243 -395373 -375146 -350380 -351180 -371194 -230363
9946b30363K4052j06661n9470l3720J6699J3123j8291J01810J68120J04768j41621
$$ -230363 -206311 -312972 -372442 -406162 -389463 -376340 -394631 -292821 -124701 -19933 -161554
9935a61554m7607J62199P7645m1825j78904m1674L7502k28874j33825O8201J16698
$$ -161554 -209161 -46962 30683 -11142 -190046 -231720 -194218 -423092 -556917 -488716 -372018
9924c72018J99643K3246k52583j80253j3726L5260J68199O1233k43956k27677
$$ -372018 -172375 -149129 -401712 -581965 -595691 -560431 -392232 -330999 -574955 -802632
9914h02632J21885K04216K7759P7757K45368J74044k4887r9553J27666J74193
$$ -802632 -680747 -476531 -448772 -371015 -125647 48397 23510 -76043 51623 225816
9904B25816k1875j62914j14336J24088J32908q6447k8775j79254k47908Q3468
$$ 225816 203941 41027 -73309 50779 183687 97240 68465 -110789 -358697 -275229
9894b75229P8144q155R4081N0521j42485j16898J11648J16638N8057k2733N5463
$$ -275229 -197085 -205240 -111159 -60638 -203123 -320021 -208373 -91735 -33678 -56411 -948
9883i48J31837k7711l86019k55750p6826q6430J14302J49409P7663K83806J33993
$$ -948 130889 103178 -282841 -538591 -615417 -701847 -587545 -438136 -360473 -76667 57326
9872E7326O1704l0773J5701J61039k6429k32399j04445Q2664K33488J96168Q5341
$$ 57326 119030 88257 103958 264997 238568 6169 -98276 -15612 217876 414044 499385
9861D99385L24229Q5610l52824k12776j06999j55830o0544l2827K3764J26625
$$ 499385 823614 909224 556400 343624 236625 80795 20251 -12576 11188 137813
9851A37813J28122O723j09202k00427q4104R694k3143r369j2852j84260j31808
$$ 137813 265935 272658 163456 -36971 -121075 -111381 -134524 -143893 -156745 -341005 -472813
9840d72813k3585J78430K63644J15545K42293Q9282j88408k38510R17Q9q9911
$$ -472813 -496398 -317968 -54324 61221 303514 392796 204388 -34122 -33205 -33116 -123027
9829a23027R5442N7891M1593r0222j97275j28271p4334J39243K34661M3219n7513
$$ -123027 -27585 30306 71899 -18323 -215598 -343869 -418203 -278960 -44299 -1080 -58593
9818e8593j5484J19611K22103J3433j48833j41872j47478j85738j71702J76494
$$ -58593 -74077 45534 267637 281070 132237 -9635 -157113 -342851 -514553 -338059
9808c38059K10641K06080J33493L740k58920k67861J63688J95317n7739j0205
$$ -338059 -127418 78662 212155 215895 -43025 -310886 -147198 48119 -9620 -19825
9798a9825J26395k6258j20530J1460p6883k40310j50821o8814J35597J48255R068
$$ -19825 106570 80312 -40218 -28758 -105641 -345951 -496772 -565586 -429989 -281734 -272666
9787b72666q8938j04801Q161J09213O3011j62942n9126K53370J19305m8638k3137
$$ -272666 -361604 -466405 -458244 -349031 -286020 -448962 -508088 -254718 -135413 -184051 -207188
9776b07188R7573M1726m0323k1676l4209P7885J99984J66142j60038l15012R96
$$ -207188 -109615 -67889 -108212 -129888 -164097 -86212 113772 279914 119876 -195136 -194140
9765a94140n5897j35541o3359N6270J45258J96552J12354K0616J94029l5452j08324
$$ -194140 -250037 -385578 -448937 -392667 -247409 -50857 61497 82113 276142 240690 132366
9754A32366K25964N8243k04697k6157r9027m0574k241L2260K7642k1414K3861
$$ 132366 358330 416573 211876 185719 86692 46118 43877 76137 103779 82365 106226
9743A06226n0659q3455R5600K24170K3716j90001j62972k05310l7150M8035J20469
$$ 106226 55567 -27888 67712 291882 315598 125597 -37375 -242685 -279835 -231800 -111331
9732a11331J28216J35894m3565j78561k14631J38451J01875n6164j7871m9523
$$ -111331 16885 152779 109214 -69347 -283978 -145527 -43652 -99816 -117687 -167210
9722a67210r7505j47261m6436J98807K09337J53611R4569o2913k01651j30012
$$ -167210 -264715 -411976 -458412 -259605 -50268 103343 197912 134999 -66652 -196664
9712a96664j1935m5097k6612j1037N884j38142j02690J16509J94597j87208j56455
$$ -196664 -208599 -253696 -280308 -291345 -285461 -423603 -526293 -409784 -215187 -402395 -558850
9701e58850J26035J20580K6627j45607j24355J48761K63466R1732j0905o3999
$$ -558850 -432815 -312235 -285608 -431215 -555570 -406809 -143343 -51611 -62516 -126515
9691a26515N49J43387q3387j29059J52702J16692r8884j84819n1979J15494P3179
$$ -126515 -125966 17421 -65966 -195025 -42323 74369 -24515 -209334 -261313 -145819 -72640
9680g2640Q4186J3994j71516j13103j54908k32672J00858L25240J67358J0587
$$ -72640 11546 25540 -145976 -259079 -413987 -646659 -545801 -220561 -53203 -42616
9670d2616j43303j1816J3289j06734n824n1441M3747J78198k1579N8867o0560
$$ -42616 -185919 -197735 -184446 -291180 -297004 -348445 -304698 -126500 -148079 -89212 -149772
9659a49772k58976J4726J93236R4957j6229j24602j24302Q7647L06573K54185
$$ -149772 -408748 -394022 -200786 -105829 -122058 -246660 -370962 -283315 23258 277443
9649B77443K4304o3690j4954J02076k8538M3256J52000Q7542n3945q0223o1734
$$ 277443 301747 238057 223103 325179 296641 339897 491897 579439 525494 445271 383537
9638C83537p9918j41928j08767J59101J83583q934k34614j94045j25146K1192
$$ 383537 303619 161691 52924 212025 395608 386674 152060 -41985 -167131 -145939
9628a45939O1656J0814o2155q0150J71977J21206j85526m36639j61911J18306
$$ -145939 -84283 -73469 -135624 -215774 -43797 77409 -108117 -544756 -706667 -588361
9618e88361K85991J85318Q0856R3251K2137k2423r2341j02335r8552J3206o8972
$$ -588361 -302370 -117052 -36196 57055 79192 56769 -35572 -137907 -236459 -223253 -292225
9607b92225o3897m8553K355m3035K8262J9717p6632k10767L3506K98721L00018
$$ -292225 -356122 -404675 -402320 -445355 -417093 -397376 -474008 -684775 -651269 -352548 -52530
9596e2530P3179L0387n9090k03778j58079j07224M0083K36977J78948K4415N1381
$$ -52530 20649 51036 -8054 -211832 -369911 -477135 -437052 -200075 -21127 3288 54669
9585E4669M0095L4619K03496J42911r1546j7296j20452r0492n3946j8559K6292
$$ 54669 94764 129383 332879 475790 384244 366948 246496 156004 102058 83499 109791
9574A09791q3140j38264o7570J9970K20521J45076J28054K9476J08465k7497k81839
$$ 109791 26651 -111613 -179183 -159213 61308 206384 334438 363914 472379 444882 163043
9563A63043l10604j60817M7747L2052r5234M5037K34635J58558k8160q7028n4223
$$ 163043 -147561 -308378 -260631 -228579 -323813 -278776 -44141 114417 86257 -771 -54994
9552e4994L6642K43411J77262M9981r7634r6494l9122R4146J07772l9293j49745
$$ -54994 -18352 225059 402321 452302 354668 258174 219052 313198 420970 381677 231932
9541B31932R924o434m0949O2757k5771J107J16297M7080j34211j25116J6883K52003
$$ 231932 241856 235422 194473 257230 231459 232566 348863 395943 261732 136616 153499 405502
9529D05502Q7706m5456j64862J35370J09746o2112L9703j01365j57261O0240K9167
$$ 405502 493208 447752 282890 418260 528006 465894 505597 404232 246971 307211 336378
9518C36378r5503O8669J51312K6629r0288K1041M9613M658n5497j56350j90649
$$ 336378 240875 309544 460856 487485 397197 418238 467851 472509 417012 260662 70013
9507G0013j67383j8609O4914j7329L9086J07865J31827J36179K62847J32885j27267
$$ 70013 -97370 -115979 -51065 -68394 -29308 78557 210384 346563 609410 742295 615028
9496F15028o8898j78644K7774J63679k9975n0728J10143J86557L2516J19351J54207
$$ 615028 546130 367486 395260 558939 528964 478236 588379 774936 807452 926803 1081010
9485A081010r4185p8212r7575j10816l5379K7314j51832o4292p3064m7812j5157
$$ 1081010 986825 908613 811038 700222 664843 692157 540325 476033 402969 355157 340000
9474C40000j73150j05756l0583q9916j73387j32229P5446n7011j27626J45421
$$ 340000 166850 61094 30511 -59405 -232792 -365021 -289575 -346586 -474212 -328791
9464c28791L799j38227j52722J17662M005q3309J18660J75857J38080J42299j25279
$$ -328791 -324992 -463219 -615941 -498279 -494274 -577583 -458923 -283066 -144986 -2687 -127966
9453a27966j30673K74p4182l1291L4218N2047J69511O8574p2811L4764K05829
$$ -127966 -258639 -258365 -332547 -363838 -329620 -277573 -108062 -39488 -112299 -77535 128294
9442A28294P7323j50102J0012j3559o0105P9113N8846M488m940j1893P9642R2970
$$ 128294 205617 55515 65527 51968 -8137 70976 129822 134310 129370 117477 197119 290089
9430B90089O9502j33185j57770j36450j6062J53724L17710K68528n1149j13989
$$ 290089 359591 226406 68636 -67814 -83876 69848 387558 656086 604937 490948
9420D90948J564j22425j46889L1389K53506k08903l04658k3888J13861Q7105l1053
$$ 490948 492512 370087 223198 254587 508093 299190 -5468 -29356 84505 171610 140557
9409A40557r1432j15131k8318r8681J94478L18258J21637r6855j44783o4381L7132
$$ 140557 49125 -66006 -94324 -193005 1473 319731 441368 344513 199730 135349 172481
9398A72481K4099k1433q563l1036k859P8930l6329R525J76453M2338o1242j44486
$$ 172481 196580 175147 166584 135548 132689 211619 175290 184815 361268 403606 342364 197878
9386A97878k31343k30444p7183K3696J28365O3745M182K18406J35715j14832n8101
$$ 197878 -33465 -263909 -341092 -317396 -189031 -125286 -121104 97302 233017 118185 60084
9375F0084J67966J41132j08318j68064k282L6771N1167k9853j09772k48238j80389
$$ 60084 228050 369182 260864 92800 90518 127289 178456 148603 38831 -209407 -389796
9364c89796m4011J06409O8906Q6431M4199M5130o8696m2481J71098j093p1960
$$ -389796 -433807 -327398 -258492 -172061 -127862 -82732 -151428 -193909 -22811 -23904 -95864
9353i5864n7495p6573r4218k85123r4854J17461O8343Q2515J54888K38306p2884
$$ -95864 -153359 -229932 -324150 -609273 -704127 -586666 -518323 -435808 -280920 -42614 -115498
9342a15498j95264j72528J41158L06394J15812Q7103M9422q7919n0058J34480
$$ -115498 -310762 -483290 -342132 -35738 80074 167177 216599 128680 78622 213102
9332B13102K1280r8423j26313J9030K20172K86529P7842j5644j73087j04580J10360
$$ 213102 234382 135959 9646 28676 248848 535377 613219 597575 424488 319908 430268
9321D30268n2852J4624R5835q3350k37488K1589J84025j644j66839j81233k64087
$$ 430268 377416 392040 487875 404525 167037 188626 372651 371007 204168 22935 -241152
9310b41152m8873J13815j678J15292K28830k2070j25989M6941N7357O6110o7076
$$ -241152 -290025 -176210 -177888 -62596 166234 144164 18175 65116 122473 188583 121507
9299A21507J23149J0002k81488k37971p9769m2728j35058K1880J61075K13769
$$ 121507 244656 254658 -26830 -264801 -344570 -387298 -522356 -500476 -339401 -125632
9289a25632J52914o1846j47211o4732n4585m5229j38511j35228R9890K55828j5567
$$ -125632 27282 -34564 -181775 -246507 -301092 -346321 -484832 -620060 -520170 -264342 -279909
9278b79909j36366l2578j05415j44659l3934L86669M73380J59171n8376l00554
$$ -279909 -416275 -448853 -554268 -698927 -732861 -346192 127188 286359 227983 -72571
9268g2571k62250k256O5012q2582k86319p6709K20582K31350J10350J01653l6406
$$ -72571 -334821 -337077 -272065 -354647 -640966 -717675 -497093 -265743 -155393 -53740 -90146
9257i0146r306O9319P6950J34922J19572p8019M1536j12382j07470j3892j16373
$$ -90146 -99452 -30133 46817 181739 301311 223292 264828 152446 44976 31084 -85289
9246h5289j57226j84293j10019r395o9740J5533Q0960M3519J05350J12740r8569
$$ -85289 -242515 -426808 -536827 -546222 -615962 -600429 -519469 -475950 -370600 -257860 -356429
9235c56429j41502l1549K4178J01070j7554L2996j972j21057p7273N4545M7302
$$ -356429 -497931 -529480 -505302 -404232 -421786 -388790 -390762 -511819 -589092 -534547 -487245
9224d87245J57499J65893J10633k4693p2841r2523j96446M8727J71032J41650
$$ -487245 -329746 -163853 -53220 -77913 -150754 -243277 -439723 -390996 -219964 -78314
9214g8314P9824K3449j19049j05312M3771j37942R0685J84645J56502j8674j96161
$$ -78314 1510 24959 -94090 -199402 -155631 -293573 -202888 -18243 138259 119585 -76576
9203g6576j45449q6608M0133K7753L2417J22675n8099J60J52594j07072o0556
$$ -76576 -222025 -308633 -268500 -240747 -208330 -85655 -143754 -143594 9000 -98072 -158628
9192a58628J82271J24857j01092j18061M234r8738l24372j89350K27620M04845
$$ -158628 23643 148500 47408 -70653 -66419 -165157 -489529 -678879 -451259 -46414
9182d6414K15371J29048l757j89974O5342K30895Q6461o53k2287o1362k69373
$$ -46414 168957 298005 294248 104274 169616 400511 486972 486319 464032 402670 133297
9171A33297j01902J24385p5595j48885r8014k9140j8423q3182N6725J01886P391
$$ 133297 31395 155780 80185 -68700 -166714 -195854 -214277 -297459 -240734 -138848 -131457
9160a31457q8619r2150K6511N7861l7652k00381k78514M6116K54079K49876M4088
$$ -131457 -220076 -312226 -285715 -227854 -265506 -465887 -744401 -698285 -444206 -194330 -150242
9149a50242q4782k743k8444j26263P8466J03674k8181K0174J21276J04001R72
$$ -150242 -235024 -237767 -266211 -392474 -314008 -210334 -238515 -218341 -97065 6936 7908
9138G908j39930o6016N2596R5868J49698J66486R0287q6552k2050j49426k14876
$$ 7908 -132022 -198038 -145442 -49574 100124 266610 356897 270345 248295 98869 -116007
9127a16007j01433m4600J03671J52109J13093P4015J78747M3012j36013L8301
$$ -116007 -217440 -262040 -158369 -6260 106833 180848 359595 402607 266594 304895
9117C04895J3815l841J8487m5758k94331k09508j22401N5982K27978L12157P6458
$$ 304895 318710 314869 333356 287598 -6733 -216241 -338642 -282660 -54682 257475 333933
9106C33933j40988k22677j40737J17959J70792L0251l7204P0930j8285j70173
$$ 333933 192945 -29732 -170469 -52510 118282 148533 111329 182259 163974 -6199
9096f199j00301j46153J9703J52289J5516M675k7640n1960R2980J31061p9326
$$ -6199 -106500 -252653 -232950 -80661 -65145 -60470 -88110 -140070 -47090 83971 4645
9085D645k78493k54862p4225J58835K20430J38505R2591O755j47150m1516k0937
$$ 4645 -273848 -528710 -602935 -444100 -223670 -85165 7426 14181 -132969 -174485 -195422
9074a95422K3953N7447j27259n0819O0028N2537L16247K82293q0613k74865l22624
$$ -195422 -171469 -114022 -241281 -292100 -232072 -179535 136712 419005 338392 63527 -259097
9063b59097k41636k09185j59353J17880K56128J09351J08937J65966J27813q174
$$ -259097 -500733 -709918 -869271 -751391 -495263 -385912 -276975 -111009 16804 8630
9053H630j65628j99678k3588J31948l9221k03722J03188K03571L3999P2547O8064
$$ 8630 -156998 -356676 -380264 -248316 -287537 -491259 -388071 -184500 -150501 -77954 -9890
9042i890N1222j51866k18802q9718O090M4097m1299L8649K69964K62298N191j97865
$$ -9890 41332 -110534 -329336 -419054 -412964 -368867 -410166 -371517 -101553 160745 165936 -31929
9030c1929p2172k849l5033l4222n4184P0826J71702J04487j12823j00536r9154
$$ -31929 -104101 -106950 -141983 -176205 -230389 -159563 12139 116626 3803 -96733 -195887
9019a95887k3305P0275l3269K8096j19763j03196P4021J06332q0036k92798m9851
$$ -195887 -219192 -148917 -182186 -154090 -273853 -377049 -303028 -196696 -276732 -569530 -619381
9008f19381J41216K71641J43889L2631k0536O2888K37021q5898l97977k27311
$$ -619381 -478165 -206524 -62635 -30004 -50540 12348 249369 163471 -234506 -461817
8998d61817j38955o0782R5186K32277J54648J38298K67980J891k22604p1817R569
$$ -461817 -600772 -661554 -566368 -334091 -179443 -41145 226835 228726 6122 -65695 -56126
8987e6126k9183m5424j2038K9947k178N2418J4759M8040n2004n7584l0918J1159
$$ -56126 -85309 -130733 -142771 -112824 -115002 -62584 -47825 215 -51789 -109373 -140291 -129132
8975a29132Q6000J9389K5731P5971q958j41175j9564j52252j82318J8395J40087
$$ -129132 -43132 -23743 1988 77959 69001 -72174 -91738 -243990 -426308 -407913 -267826
8964b67826J05400R0172N0666r7289n2942J11615n9496r0853Q6623k0654j49054
$$ -267826 -162426 -72254 -21588 -118877 -171819 -60204 -119700 -210553 -123930 -144584 -293638
8953b93638k01068K0330J36745K34566K85824Q8826j40702j30534O4709P2898
$$ -293638 -494706 -474376 -337631 -103065 182759 271585 130883 349 65058 137956
8943A37956J56240K4535n0601j17064o1561q2263j09937R6138R3559l7831j03995
$$ 137956 294196 318731 268130 151066 89505 7242 -102695 -6557 87002 49171 -54824
8932e4824o3866q7850p3515j27750j00765J00301J68769L6205L3444j18248m8784
$$ -54824 -118690 -206540 -280055 -407805 -508570 -408269 -239500 -203295 -169851 -288099 -336883
8921c36883J98928K50667L8245Q419k03638k21614j1692J27067M3366j0597Q6450
$$ -336883 -137955 112712 150957 159376 -44262 -265876 -277568 -150501 -107135 -117732 -31282
8910c1282J1905j10033j54825o4612N2167Q0498K7797j83197j84930k9052P1888
$$ -31282 -19377 -129410 -284235 -348847 -296680 -216182 -188385 -371582 -556512 -585564 -513676
8899e13676K67501K23636M9906j64734k95948j36772p2484k05816m4724M54337
$$ -513676 -246175 -22539 27367 -137367 -433315 -570087 -642571 -848387 -893111 -438774
8889d38774K55861M4546O5310J65302J67350m9234k08203l21749j45974j3015
$$ -438774 -182913 -138367 -73057 92245 259595 210361 2158 -319591 -465565 -478580
8879d78580n5648J45330K29062Q4366Q3516J28652J10174P0850L1769j21799l0616
$$ -478580 -534228 -388898 -159836 -75470 8046 136698 246872 317722 349491 227692 197076
8868A97076J3993j5016n7588k9784n6654n7660k4820J06484n0081j14440l7288
$$ 197076 211069 196053 138465 108681 52027 -5633 -30453 76031 25950 -88490 -125778
8857a25778m6855Q214K43454K06983m8110j38746j30709j2655J5632j3839J11779
$$ -125778 -172633 -164419 79035 286018 237908 99162 -31547 -44202 -28570 -42409 69370
8846F9370K25662O0625r8297k7040r2311k00850k80924k4608K65441K00876l6518
$$ 69370 295032 355657 257360 230320 138009 -62841 -343765 -368373 -102932 97944 61426
8835F1426j15918j69447k66814n3735N5527m2427O8291m5730j19978o26P5176
$$ 61426 -54492 -223939 -490753 -544488 -488961 -531388 -463097 -508827 -628805 -629431 -554255
8824e54255J19891K1824j6481P1228J21499j26546l16869J157L77413K81220m9013
$$ -554255 -434364 -412540 -429021 -357793 -236294 -362840 -679709 -678552 -301139 -19919 -68932
8813f8932J223m5421r6838Q3155K64789J05054M2006K5269j5260j5095j29361
$$ -68932 -67709 -113130 -209968 -126813 137976 243030 285036 310305 295045 279950 150589
8802A50589L0352P0596R1213J37193l0673k23181k20535j13566l2830K35588Q6954
$$ 150589 180941 251537 342750 479943 449270 226089 5554 -108012 -140842 94746 181700
8791A81700p6551j07296q5738Q8951P8081J6219k03248k24259o3820M0142K6577
$$ 181700 105149 -2147 -87885 1066 79147 95366 -107882 -332141 -395961 -355819 -329242
8780c29242M1017J51828K7286j19690n2491j13938M130L6676k2812J1654K712
$$ -329242 -288225 -136397 -109111 -228801 -281292 -395230 -391100 -354424 -377236 -365582 -362870
8769c62870J17972l9719P8752J50525k5216J32502P6018P6765q1756j10290o326
$$ -362870 -244898 -284617 -205865 -55340 -80556 51946 127964 204729 122973 12683 6357
8758F357J43002Q295p7075j49438j34687M8743k6494o7257j06309j4263m6083
$$ 6357 149359 157654 80579 -68859 -203546 -154803 -181297 -248554 -354863 -369126 -415209
8747d15209J886L466Q3704J95216K09801R9593J40843J8065j46505j60960k39797
$$ -415209 -413323 -409857 -326153 -130937 78864 178457 319300 337365 190860 29900 -209897
8736b09897k68615r1793m4244J78532J80499m838k8069R4731J29685j6529j90574
$$ -209897 -478512 -570305 -614549 -436017 -255518 -260356 -288425 -193694 -64009 -80538 -271112
8725b71112n1511M992k0764p8841P8517J06924n30j12305o1756K67690L50082
$$ -271112 -322623 -317631 -338395 -417236 -338719 -231795 -232325 -344630 -406386 -138696 211386
8714B11386K40180J6726k52681j34508j14261j75566k29188j31597K7576R5416
$$ 211386 451566 468292 215611 81103 -33158 -208724 -437912 -569509 -541933 -446517
8704d46517K87204K12582k0507j12078p535k2270q1427K143j9054q2333Q045J14910
$$ -446517 -159313 53269 32762 -79316 -86851 -109121 -190548 -188405 -207459 -289792 -281747 -166837
8692a66837J54451L0662j68206k27343j46857l7650l618J45594L72662J96410
$$ -166837 -12386 18276 -149930 -377273 -524130 -561780 -565398 -419804 -47142 149268
8682A49268J27171J22132j8894j91020k40430k19550k34317j46707J09187L42871
$$ 149268 276439 398571 379677 188657 -51773 -271323 -505640 -652347 -543160 -200289
8672b00289J90706j61716m2504J59338J39621J48659R3590p3492m7756J00663
$$ -200289 -9583 -171299 -213803 -54465 85156 233815 327405 253913 206157 306820
8662C06820k08793k35935l7006L9575R9509M2307q0639q4950R2882J5286m6965
$$ 306820 98027 -137908 -174914 -135339 -35830 6477 -74162 -159112 -66230 -50944 -97909
8651i7909j35861J02424J848O6822P8305k5042k67119k09672r2561R6275l257
$$ -97909 -233770 -131346 -129498 -62676 15629 -9413 -276532 -486204 -578765 -482490 -485747
8640d85747Q7658K6805j8584j4341q6354j30649P775K45270J76162L17602J97556
$$ -485747 -398089 -371284 -389868 -404209 -490563 -621212 -613437 -368167 -192005 125597 323153
8629C23153j86866j47662n8154J06199J33818Q4285Q6283K06066J08730j80692
$$ 323153 136287 -11375 -69529 36670 170488 254773 341056 547122 655852 475160
8619D75160k40521j73695P6005N8388j00097j84665J688K72151J95403K07789
$$ 475160 234639 60944 136949 195337 95240 -89425 -87737 184414 379817 587606
8609E87606j6554l13344k14994r3466K792R4831q0875j19085J72466J44056r6966
$$ 587606 571052 257708 42714 -50752 -47960 46871 -34004 -153089 19377 163433 66467
8598F6467o4067l0940j03948R8200K5049p0312N6121J12846M7041r2093j90825
$$ 66467 2400 -28540 -132488 -34288 -9239 -79551 -23430 89416 136457 44364 -146461
8587a46461k40448l5840Q8889Q3468K49103L25522O3521k57526l53580j59869
$$ -146461 -386909 -422749 -333860 -250392 -1289 324233 387754 130228 -223352 -383221
8577c83221R7954K8306R663L9514L2672R1870m2718j40885J14494K29759J31431
$$ -383221 -285267 -256961 -247298 -207784 -175112 -83242 -125960 -266845 -152351 77408 208839
8566B08839P8110J63180o1514k53517r6921K8244M7012Q2839q3889q7912j15238
$$ 208839 286949 450129 388615 135098 38177 66421 113433 196272 112383 24471 -90767
8555i0767j93182l2813N6909l7476N8318J17238m0966n1695J9032J0908J16717
$$ -90767 -283949 -316762 -259853 -297329 -239011 -121773 -162739 -214434 -195402 -184494 -67777
8544f7777Q8625J4829Q240J37841Q5572P5195M5723k0579m4555q152l8307r9882
$$ -67777 20848 35677 43917 181758 267330 342525 388248 367669 323114 314962 276655 176773
8532A76773L6245J22325J24297J17529k819j80977j95495k40406j13651m8575
$$ 176773 213018 335343 459640 577169 574350 393373 197878 -42528 -156179 -204754
8522b04754k7155J11320O6211M5232J28960R8818J8631k8863l8395M1260N9434
$$ -204754 -231909 -120589 -54378 -9146 119814 218632 237263 208400 170005 211265 270699
8511B70699q2637j06617k05989j78353J5467P9578J60400L0563J47689K02918
$$ 270699 188062 81445 -124544 -302897 -287430 -207852 -47452 -16889 130800 333718
8501C33718o8839k7458J39352j17755j96008m1233p1922j9691R2666J06552m4925
$$ 333718 264879 237421 376773 259018 63010 21777 -50145 -69836 22830 129382 84457
8490H4457j23026N9122K67062Q0525O208M3286j45416j47501J25844K8803n8749
$$ 84457 -38569 20553 287615 368140 374348 417634 272218 124717 250561 279364 220615
8479B20615R5581n1367P3232Q8501k8061j97874k17778j93117p4345J54439J26648
$$ 220615 316196 264829 338061 426562 398501 200627 -17151 -210268 -284613 -130174 -3526
8468c526L8333L7288l3561M0499j7289j98791K0328J66327J20530j36639o8000
$$ -3526 34807 72095 38534 79033 61744 -137047 -116719 49608 170138 33499 -34501
8457c4501K34645K71186R0599r3603j77899j62466j14187k1490J76757J20690
$$ -34501 200144 471330 561929 468326 290427 127961 13774 -7716 169041 289731
8447B89731j6293q0585j24340o6310n5776N0336N9766o7088K773J12041j07406
$$ 289731 273438 192853 68513 2203 -53573 -3237 56529 -10559 -7786 104255 -3151
8436c151k8726J2788P8602J48553q5211k16933q1771R7957J86484J66660J69139
$$ -3151 -31877 -19089 59513 208066 122855 -94078 -175849 -77892 108592 275252 444391
8425D44391j7354j40276k05798j0061J49460p6956r8521n3302j47791p8566O7617
$$ 444391 427037 286761 80963 70902 220362 143406 44885 -8417 -156208 -234774 -167157
8414a67157J14833J05324k8909k01330p579K79471L24429J83778J25709M4946
$$ -167157 -52324 53000 24091 -177239 -184818 94653 419082 602860 728569 773515
8404G73515j24231k71088j60559j49910p0680R6579Q7957r2933m0759l5698J30924
$$ 773515 649284 378196 217637 67727 -2953 93626 181583 88650 47891 12193 143117
8393A43117J60141J05180L7900L1460J02542r4366k6469j5035j42574j53352j08407
$$ 143117 303258 408438 446338 477798 580340 485974 459505 444470 301896 148544 40137
8382D0137Q7646K7389j40544J09671l913L4482J86283L7595j16631j22284Q1734
$$ 40137 127783 155172 14628 124299 120386 154868 341151 378746 262115 139831 221565
8371B21565J14351N6228j324k9858P1727J82786J97284L9961j84986n1051L5541
$$ 221565 335916 392144 390820 360962 432689 615475 812759 852720 667734 616683 652224
8360F52224k1397J1609l8437N0114J8429j10424j54400p9311P3520J11890j33210
$$ 652224 630827 642436 603999 654113 672542 562118 407718 328407 401927 513817 380607
8349C80607j3809P605j44145r7634J16989Q1483J66909P9651j29830j7887L9318
$$ 380607 366798 374403 230258 132624 249613 331096 498005 577656 447826 429939 469257
8338D69257k353J38298M3249k29005l45855j68745P9940J91609K99491J99865
$$ 469257 466904 605202 648451 419446 73591 -95154 -15214 176395 475886 675751
8328F75751N7455J49740j39634k53706r749j7329m3788M3792M6837J57839J76520
$$ 675751 733206 882946 743312 489606 479857 462528 418740 462532 509369 667208 843728
8317H43728L1995r7308j13174j93501n9285K5496K3433k47779j18796R1604P6318
$$ 843728 875723 778415 665241 471740 412455 437951 461384 213605 94809 186413 262731
8306B62731L9585o8441L8869R3329R685P6106j3204J3727l0710m7927l9838k13592
$$ 262731 302316 233875 272744 366073 375758 451864 438660 452387 421677 373750 333912 120320
8294A20320o3211J37096J6626j7787j30142k50973n8804N2080J5856J93473K61072
$$ 120320 57109 194205 210831 193044 62902 -188071 -246875 -194795 -178939 14534 275606
8283B75606J11594j75005j25222Q0384N4545k8748k0035N0928J12605J54757J48810
$$ 275606 387200 212195 86973 167357 221902 193154 173119 224047 336652 491409 640219
8272F40219N8610j37474k17187j6278m425k6920O7313J65697O2596J2780m6844
$$ 640219 698829 561355 344168 327890 323465 296545 363858 529555 592151 604931 558087
8261E58087k45088j28490m855R4581J11227N822J38153K07420m6632k24733k48899
$$ 558087 312999 184509 179654 274235 385462 391284 529437 736857 690225 465492 216593
8250B16593p3173n5030l3999k8332p9688k6110J39080R6674J54047J70824P0520
$$ 216593 143420 88390 54391 26059 -53629 -79739 59341 156015 310062 480886 551406
8239E51406j64148p5563R9034j9816L4481m8999J07657J58589n0073j8169R9980
$$ 551406 387258 311695 410729 390913 425394 376395 484052 642641 592568 574399 674379
8228F74379J04389q8971j22571r4906o2733k0849J24354n9100j18177L5695M3698
$$ 674379 778768 689797 567226 472320 409587 388738 513092 453992 335815 371510 415208
8217D15208L7438K1895O5202K3967j32594l3114M7869Q9905J67962J56328K06121
$$ 415208 452646 474541 539743 563710 431116 398002 445871 535776 703738 860066 1066187
8206A066187Q4930j9575M7086R3832J34544j35456j70194j6120O8926p5565k03477
$$ 1066187 1151117 1131542 1178628 1272460 1407004 1271548 1101354 1085234 1154160 1078595 875118
8195H75118j76588k1443J2880L3699N3140P4469q2098j17662L1357P3443o6894
$$ 875118 698530 677087 689967 723666 776806 851275 769177 651515 682872 756315 689421
8184F89421j44778o7757L9566J37544P3083J3837j8027J3697O9924J48119j2168
$$ 689421 544643 476886 516452 653996 727079 740916 722889 736586 806510 954629 942461
8173I42461r4076l1750m7409K02490L79415N4891j89083j86979j12131R754m4892
$$ 942461 848385 816635 769226 971716 1351131 1406022 1216939 1029960 917829 927583 882691
8162H82691N738p0798j26997j9056J44485O0724o7702m6611K3580K62729K49497
$$ 882691 888429 817631 690634 671578 816063 876787 809085 762474 786054 1048783 1298280
8151A298280j88773l32085j38424M1044K11266K48977p7684l12714j17763P2710
$$ 1298280 1109507 777422 638998 680042 891308 1140285 1062601 749887 632124 704834
8141G04834R4271k9695r2125J40219J26654r3676j42345m4818J01282J59297K77427
$$ 704834 799105 769410 677285 817504 944158 850482 708137 663319 764601 923898 1201325
8130A201325K48257k010o5878R8300L121r7661Q2514N2363P6758J27945o3083
$$ 1201325 1449582 1447572 1381694 1479994 1483115 1385454 1467968 1520331 1597089 1725034 1661951
8119A661951j31047k17122m63983k36157M5083K92247J22932k04870j69230N3131
$$ 1661951 1530904 1313782 849799 613642 658725 950972 1073904 869034 699804 752935
8109G52935l791L497J26889N7190r0212k6199R7605q681K4749K27823J21811q865
$$ 752935 749144 752641 879530 936720 846508 820309 917914 909233 933982 1161805 1283616 1274751
8097A274751k11315j09086L35107K91170l7688l58283k63666O3103N4452l4961
$$ 1274751 1063436 954350 1289457 1580627 1542939 1184656 920990 984093 1038545 1003584
8087A003584n0113j5965M5097J43885J20666Q1932K6669P791J07549m226j8916
$$ 1003584 953471 937506 982603 1126488 1247154 1329086 1355755 1363546 1471095 1466869 1447953
8076A447953J77466K86117J31883k43839k13148j33875m8509J2368P3092j3264
$$ 1447953 1625419 1911536 2043419 1799580 1586432 1452557 1404048 1416416 1489508 1476244
8066A476244k00366j84587n500K50906O6436q8431q1690Q6825P8310o7064L4096
$$ 1476244 1275878 1091291 1085791 1336697 1403133 1314702 1233012 1319837 1398147 1331083 1365179
8055A365179l4539j28553Q3855J84542K11675J36199M4896J61931k7276k46331
$$ 1365179 1330640 1202087 1285942 1470484 1682159 1818358 1863254 2025185 1997909 1751578
8045A751578k66345m4973N7047l1436L6501R3520m5591L5967O2300P6731K91599
$$ 1751578 1485233 1440260 1497307 1465871 1502372 1595892 1550301 1586268 1648568 1725299 2016898
8034B016898R7406q8262l76J39228J09530l5868j63911j20076l51280j28242J94547
$$ 2016898 2114304 2026042 2025666 2164894 2274424 2238556 2074645 1954569 1603289 1475047 1669594
8023A669594L17688L40565O7041j40589J25834L98953J63234J15059R8680j32111
$$ 1669594 1987282 2327847 2394888 2254299 2380133 2779086 2942320 3057379 3156059 3023948
8013C023948P129K13583K68013J39501Q7147K28969M73591N88564O43392O81411
$$ 3023948 3031077 3244660 3512673 3652174 3739321 3968290 4441881 5030445 5673837 6355248
8003F355248J054413J465827J883253K489355L175999L989788M986944N407766
$$ 6355248 7409661 8875488 10758741 13248096 16424095 20413883 25400827 30808593
7995C0808593N126724M165047K452347K87311j776489l455121m502324m825292
$$ 30808593 35935317 40100364 42552711 42840022 41063533 37608412 33106088 28280796
7987B8280796m568447l783326k922830k294724j728123j367332j002972o50339
$$ 28280796 23712349 19929023 17006193 14711469 12983346 11616014 10613042 9962703
7979I962703o62085o05000j26556J74187J85754J82363K78043L11795K58148j10179
$$ 9962703 9300618 8695618 8569062 8743249 8929003 9111366 9389409 9701204 9959352 9849173
7969I849173o70574m76412k00320k93536n03912n61578m43781k50832o0143K4546
$$ 9849173 9178599 8702187 8501867 8208331 7704419 7142841 6699060 6448228 6388085 6412631
7959F412631N3216J05436K20428L27933N12722N06152O06415R76369J080786J052135
$$ 6412631 6465847 6571283 6791711 7119644 7632366 8138518 8744933 9721302 10802088 11854223
7949A1854223J278930J674302K577292L377219M212434N453739P223571R675951
$$ 11854223 13133153 14807455 17384747 20761966 24974400 30428139 37651710 47327661
7941D7327661J2620099J5137142J6636272J6066786J2757528P290859M97734o259335
$$ 47327661 59947760 75084902 91721174 107787960 120545488 127836347 128334081 122074746
7933A22074746j1397446j4513298j5196450j3820085j1714054r428571o997179
$$ 122074746 110677300 96164002 80967552 67147467 55433413 46004842 39007663
7926C9007663n370529m261584l285442k274108j618815j160176q57004n22462
$$ 39007663 33637134 29375550 26090108 23816000 22197185 21037009 20180005 19657543
7918A9657543r944K53280J96810J11238p5104n78362r04755j032238j272545j441518
$$ 19657543 19647599 19900879 20097689 20208927 20133823 19555461 18650706 17618468 16345923 14904405
7908A4904405j150585p80550m87057j50129q3061j11591O882L14864O95900O80714
$$ 14904405 13753820 12973270 12486213 12336084 12253023 12141432 12148314 12463178 13159078 13839792
7898A3839792O03969Q23883J130485J204035J615726K385208L196107L903586
$$ 13839792 14443761 15267644 16398129 17602164 19217890 21603098 24799205 28702791
7890B8702791M888801O531406Q514708J1211051J5131791J9596488K5034281L0149141
$$ 28702791 33591592 40122998 48637706 59848757 74980548 94577036 119611317 149760458
7882A49760458L3051083L1889641K5518159J4391706N83494j3163139k4059989
$$ 149760458 182811541 214701182 240219341 254611047 255194541 242031402 217971413
7875B17971413k9920216l0665886k7770435k3407307j8642343j4255133j0958528
$$ 217971413 188051197 157385311 129614876 106207569 87565226 73310093 62351565
7868F2351565q461854o500419m948014l765584k687009k044392j348555o81013
$$ 62351565 53889711 47389292 42441278 38675694 35988685 33944293 32595738 31914725
7860C1914725j56645q150m7768l83014j106207j524294j974908k269217k035359
$$ 31914725 31758080 31749930 31702162 31319148 30212941 28688647 26713739 24444522 22409163
7851B2409163j687480j441347j133288o35005j19573k9408m4166L2199J83778
$$ 22409163 20721683 19280336 18147048 17512043 17392470 17363062 17318896 17351095 17534873
7842A7534873L47764L93258R03102J419775J660899K021767K331909K822301M048928
$$ 17534873 17882637 18275895 19178997 20598772 22259671 24281438 26613347 29435648 33484576
7833C3484576N650698P502118J0096634J3517399J7837158K3343208K9554194
$$ 33484576 39135274 46637392 56734026 70251425 88088583 111431791 140985985
7826A40985985L5247900L8580965L7378072K9871041J6563051k0512j6380860
$$ 140985985 176233885 214814850 252192922 282063963 298627014 298606502 282225642
7819B82225642k8947595l5356236l5969942l2868061k7684275k1707620j6641452
$$ 282225642 253278047 217921811 181951869 149083808 121399533 99691913 83050461
7812H3050461j2934312j0016134p620476n962198m827656l769882k787918k349203
$$ 83050461 70116149 60100015 52479539 46517341 41689685 37919803 35131885 32782682
7804C2782682j508310p93406o88995p01778r86294j196657j463671j568234j606653
$$ 32782682 31274372 30480966 29791971 29090193 28103899 26907242 25443571 23875337 22268684
7795B2268684j525401j413554j252430r28154o62082n76377j20832P5353K2685
$$ 22268684 20743283 19329729 18077299 17149145 16487063 15910686 15789854 15865207 15887892
7786A5887892J01303L91252Q95756J041916J024339J329962J609873K049209K753407
$$ 15887892 15989195 16380447 17276203 18318119 19342458 20672420 22282293 24331502 27084909
7777B7084909L682800M982657O490236Q529733J1449932J5216728J9984329K5307702
$$ 27084909 30767709 35750366 42240602 50770335 62220267 77436995 97421324 122729026
7769A22729026K9795314L2406512L1303446K4799899J3538297n58115j4320088
$$ 122729026 152524340 184930852 216234298 241034197 254572494 254014379 239694291
7762B39694291k4819432l0466923l1143931k8209012k3419978j8403033j4116663
$$ 239694291 214874859 184407936 153264005 125054993 101635015 83231982 69115319
7755F9115319j0971040q514711o594322n102632m255653l551569k827036k087813
$$ 69115319 58144279 49629568 43035246 37932614 33676961 30125392 27298356 25210543
7747B5210543j592466j422649j125481q80438r17600j229484j185081j076266
$$ 25210543 23618077 22195428 21069947 20189509 19271909 18042425 16857344 15781078
7739A5781078j071132r03848r81157r25821n30369m68547m23457k23446j58240
$$ 15781078 14709946 13806098 12824941 11899120 11368751 10900204 10476747 10253301 10095061
7730A0095061k3388M7114Q5274M5118K59596O07576N54208O20334J095666J574089
$$ 10095061 10071673 10118787 10204061 10249179 10508775 11116351 11670559 12290893 13386559 14960648
7720A4960648J916928K405782L222793M378884N692277P507362J0048459J2620877
$$ 14960648 16877576 19283358 22506151 26885035 32577312 40084674 50133133 62754010
7712F2754010J4788098J6203835J5428356J2236000O515885p25195p497618j2715892
$$ 62754010 77542108 93745943 109174299 121410299 127926184 127200989 119703371 106987479
7704A06987479j5286423j5436686j3945202j1746812r430447p192376n442804
$$ 106987479 91701056 76264370 62319168 50572356 41141909 33949533 28506729
7697B8506729m330843l438781k705180k116472j655893j491934j418336j140282
$$ 28506729 24175886 20737105 18031925 15915453 14259560 12767626 11349290 10209008
7689A0209008p76041m64179m92731n59312m47649n22357m68284l41823k79589
$$ 10209008 9432967 8968788 8476057 7916745 7469096 6946739 6478455 6136632 5857043
7680E857043l06779m30680l14864l03733j83009J3477R2993l6044J20177L13059
$$ 5857043 5550264 5119584 4804720 4500987 4317978 4331455 4424448 4388404 4508581 4821640
7670D821640K42352K2866O2949K76658J89104K05166L82361N27299Q90268J249542
$$ 4821640 5063992 5086858 5149807 5426465 5615569 5820735 6203096 6730395 7620663 8870205
7660H870205J347897J741009K300159L059660L940904M855107N245961M846547
$$ 8870205 10218102 11959111 14259270 17318930 21259834 26114941 31360902 36207449
7652C6207449L789835K060069k23364k423313m037619m717770m980233m747756
$$ 36207449 39997284 42057353 41833989 39410676 35373057 30655287 25675054 20927298
7644B0927298l826907k911259k305718j785266j284577j044871r48607q20960
$$ 20927298 17100391 14189132 11883414 10098148 8813571 7768700 6820093 5999133
7636E999133p21699n80333n84762m45125k48312l28053k96137k74526k86462j06297
$$ 5999133 5277434 4697101 4112339 3667214 3418902 3090849 2794712 2520186 2233724 2127427
7626B127427j2594j09963j86550k16475q8349j29182o1124J14018J27649k33206
$$ 2127427 2114833 2004870 1818320 1601845 1513496 1384314 1323190 1437208 1564857 1331651
7616A331651k33220J59974J37641p4456q6885K6419N816j29837l37626K9752K92206
$$ 1331651 1098431 1258405 1396046 1321590 1234705 1261124 1266940 1137103 799477 829229 1121435
7605A121435J88437J54206P4677j61350k12261n3581J13380L4295r9451m0672
$$ 1121435 1309872 1464078 1538755 1377405 1165144 1111563 1224943 1259238 1159787 1119115
7595A119115j31546o1277J11936O3143p0827N8775P4577j46429m9960j6803j5752
$$ 1119115 987569 926292 1038228 1101371 1030544 1089319 1163896 1017467 967507 950704 934952
7584I34952j16973O488J84272J46311k6836N464j02268j52358j2160L2256l7849
$$ 934952 817979 824467 1008739 1155050 1128214 1133678 1031410 879052 866892 899148 861299
7573H61299j49138o7033o4361L7616Q8300J05724Q9213j15400k83903j71406p5639
$$ 861299 712161 645128 580767 618383 706683 812407 901620 786220 502317 330911 255272
7562B55272j19420k1761J51971m4937j49294P7838K25415o3349j12695L1194N8681
$$ 255272 135852 114091 266062 221125 71831 149669 375084 311735 199040 230234 288915
7551B88915l0940j87956j02155p470p7412K7366K50974J31560q8891K5548J2114
$$ 288915 257975 70019 -32136 -39606 -117018 -89652 161322 292882 203991 229539 241653
7540B41653j41571R2843K38605J20835J60766J58881j30099k16352m3913K6495
$$ 241653 100082 192925 431530 552365 713131 872012 741913 525561 481648 508143
7530E08143J12905L4558j04538j14742j20911K52262K40159J13598j13692r3404
$$ 508143 621048 655606 551068 436326 315415 567677 807836 921434 807742 714338
7520G14338J67037J70569j11578l46165k15723q9581j33611l994o613N5218K3719
$$ 714338 881375 1051944 940366 594201 378478 288897 155286 151292 144679 199897 223616
7509B23616j4604j6148l1610J9634J26760J97004J10583n3378k7048j1141k770
$$ 223616 209012 192864 161254 180888 307648 504652 615235 561857 534809 523668 520898
7498E20898o7847j95455l14681j47849J14144p483J42729J24263N7547l6133r8761
$$ 520898 453051 257596 -57085 -204934 -90790 -98273 44456 168719 226266 190133 91372
7487I1372J34437K41381l1659l62700j44585M5412j24l767Q1449K03510K46993
$$ 91372 225809 467190 435531 72831 -71754 -26342 -26466 -30233 51216 254726 501719
7476E01719K47763O7076K4687R9313K3432j29579j14475p8557q3626p9468M1782
$$ 501719 749482 816558 841245 940558 963990 834411 719936 641379 557753 478285 520067
7465E20067N0725j2984j26819K5961J27398M6314n0l8123j00314k04729Q4425
$$ 520067 570792 557808 430989 456950 584348 630662 630612 592489 492175 287446 371871
7454C71871J96061M3882L3105P149j39342j68688j9602L3114J2838J9207J48264
$$ 371871 567932 611814 644919 652068 512726 344038 324436 357550 370388 389595 537859
7443E37859K48745J21522j10775r2493Q0363L8042q2054k03088j26005j05898
$$ 537859 786604 908126 797351 704858 785221 823263 741209 538121 412116 306218
7433C06218n7360j36487k77223o9609K3452J32761J86561K6939m7331P3354K01025
$$ 306218 248858 112371 -164852 -234461 -211009 -78248 108313 135252 87921 161275 362300
7422C62300J55075L1325j19765p7163n7346l3242O0208m9947k2637m9951L3846
$$ 362300 517375 548700 428935 351772 294426 261184 321392 271445 248808 198857 232703
7411B32703J09827n2038j37926M2447J26189O9065k80416j25928q88p1560j59042
$$ 232703 342530 290492 152566 195013 321202 390267 109851 -16077 -16965 -88525 -247567
7400b47567p4232J12400L07236K05515o6115n5855J06182k8661n6920n4478m3713
$$ -247567 -321799 -209399 97837 303352 237237 181382 287564 258903 201983 147505 103792
7389A03792j23593j63799j82830o8367Q7764K7625J63979J18642p5935J2595J12780
$$ 103792 -19801 -183600 -366430 -434797 -347033 -319408 -155429 -36787 -112722 -100127 12653
7378A2653j5738K2655Q2742J22040K05195Q7950P589j04736j65915j14516M5309
$$ 12653 -3085 19570 102312 224352 429547 517497 525086 420350 254435 139919 185228
7367A85228m4811j90409r0250l4841l5744j20350J7706J93457J16011K7873r3145
$$ 185228 140417 -49992 -140242 -175083 -210827 -331177 -313471 -120014 -4003 23870 -69275
7356f9275J9969J45565K13280Q1928p8925Q749k0449J1413J0171L0360N4480J0802
$$ -69275 -49306 96259 309539 391467 312542 321291 300842 312255 322426 352786 407266 418068
7344D18068j009O4175P1003j38231j62092r8416o1084K2155l9708R9774O6010
$$ 418068 417059 481234 552237 414006 251914 153498 92414 114569 74861 174635 240645
7333B40645k01876j14190K11643K99920K34203J9117m5236j08237j05386j05005
$$ 240645 38769 -75421 136222 436142 670345 689462 644226 535989 430603 325598
7323C25598k2915j9599J7565R227R8885J72115j8479o8133J43247k4492q7796
$$ 325598 302683 283084 300649 309876 408761 580876 562397 494264 637511 613019 525223
7312E25223n1270j71401j41833L787m691j8755J1928J41286J23375j35033j05489
$$ 525223 473953 302552 160719 164506 159815 141060 152988 294274 417649 282616 177127
7301A77127q2056k0873J34317R3480n3906n0146j67684j15566j01862M8525P1422
$$ 177127 95071 74198 208515 301995 248089 197943 30259 -85307 -187169 -138644 -67222
7290f7222j3407l1836K7721J47267J67987L20198J13525l9236K4059k29988j75784
$$ -67222 -80629 -112465 -84744 62523 230510 550708 664233 624997 649056 419068 243284
7279B43284L1987O5018l313k22799m4317L8133k0661k7036j75P052J02691J42907
$$ 243284 275271 340289 336976 114177 69860 107993 87332 60296 60121 67173 169864 312771
7267C12771L8532N676Q7591K0863p8629p3694n1678m4402J8536Q0749M2015k5055
$$ 312771 351303 356979 444570 465433 386804 313110 261432 217030 235566 316315 358330 333275
7255C33275l1367J29808O3767m7159K2600k6936j51766J04081p3134j28664O12
$$ 333275 301908 431716 495483 448324 470924 443988 292222 396303 323169 194505 195117
7244A95117j46599k24354o6974J01808R1339J68695N6694j27142j58446R4084
$$ 195117 48518 -175836 -242810 -141002 -49663 119032 175726 48584 -109862 -15778
7234a5778J89051K4164j57872k17639k7117K52530J25218N12o9203J5405r1746
$$ -15778 173273 197437 39565 -178074 -205191 47339 172557 173069 103866 119271 27525
7223B7525m6754m7382j16479R521J14201J9909k07740k4340K42673K38365J38020
$$ 27525 -19229 -66611 -183090 -173569 -59368 -39459 -247199 -271539 -28866 209499 347519
7212C47519m1993r2325r817L1974j6796j32892L8200L07358J54187j14059p0077
$$ 347519 305526 213201 203384 235358 218562 85670 123870 431228 585415 471356 401279
7201D01279J05605q0277k26517m5532J51437k4793l26163l2458P0321M4268K61541
$$ 401279 506884 426607 200090 154558 305995 281202 -44961 -77419 -7098 37170 298711
7190B98711J12644k20187j30156K51546K16893q8966p2089j0430K5112J19631
$$ 298711 411355 191168 61012 312558 529451 440485 368396 357966 383078 502709
7180E02709P8641l9169j4765r1576j78072j67991L8891K91164J16775N9155p0795
$$ 502709 581350 542181 527416 435840 257768 89777 128668 419832 536607 595762 524967
7169E24967j03872j6702J02922P8433L4819k6205J23341J52373J62728j24764
$$ 524967 421095 404393 507315 585748 620567 594362 717703 870076 1032804 908040
7159I08040l13280k19379K40910J63849R9383j0535k60605k73908Q092K05334
$$ 908040 594760 375381 616291 780140 879523 868988 608383 334475 342567 547901
7149E47901J49301K06167L66057K74015M06794M35988M80985O12634J134624J598815
$$ 547901 697202 903369 1269426 1543441 1950235 2386223 2867208 3479842 4614466 6213281
7139F213281K440708M484550O961980L214294n137282o003641l824276k216931
$$ 6213281 8653989 13138539 20100519 23314813 18177531 12173890 8349614 6132683
7131F132683j417298j056638o70098l43907k76667j88554L5347J52176j43896
$$ 6132683 4715385 3658747 2988649 2644742 2368075 2179521 2214868 2367044 2223148
7122B223148m05291j82331r2246j72398k3910p5699m0444j33836n7584k0114K4896
$$ 2223148 1817857 1635526 1543280 1370882 1346972 1271273 1230829 1096993 1039409 1019295 1044191
7111A044191J05053Q4957J56339R8312l14746l62353j93738k5020j2933P9103
$$ 1044191 1149244 1234201 1390540 1488852 1174106 811753 618015 592995 580062 659165
7101F59165O0738R3903L38037O13921M36365r2205j39722p4610M88r9647j70413
$$ 659165 719903 813806 1151843 1765764 2202129 2109924 1970202 1895592 1896080 1796433 1626020
7090A626020k16325K809Q8609l3124k46304j15268o4563L2688o7594j24043q4934
$$ 1626020 1409695 1412504 1501113 1467989 1221685 1106417 1041854 1074542 1006948 882905 797971
7079G97971k1488n6351j8833K2373j53499p0224J51283O6862j96467k66021j29218
$$ 797971 776483 720132 701299 723672 570173 499949 651232 718094 521627 255606 126388
7068A26388J00860K22130J19005p5219r4590j11086j17688l937l8248j28788j44046
$$ 126388 227248 449378 568383 493164 398574 287488 169800 165863 127615 -1173 -145219
7057a45219J64314K08710K0900J844p848J11689Q4971O2297m9056Q0463j6284
$$ -145219 19095 227805 248705 250549 242701 354390 439361 501658 452602 533065 516781
7046E16781o9386j12217k50526l18558O3576J98122R0726M5326j47454j83487
$$ 516781 447395 335178 84652 -233906 -170330 27792 118518 163844 16390 -167097
7036a67097k7342K811O8880J39769Q7780J3739J12826N2954l0054J02958J28646
$$ -167097 -194439 -191628 -122748 17021 104801 118540 231366 284320 254266 357224 485870
7025D85870M2743j21270L6375k9132k07563j83842k30199Q893K86426J96738J60458
$$ 485870 528613 407343 443718 414586 207023 23181 -207018 -198125 88301 285039 445497
7014D45497J50864P7321r3568j17116k4529K3343J2225L3235K2568l4724j28488
$$ 445497 596361 673682 580114 462998 438469 461812 474037 507272 529840 495116 366628
7003C66628j52910k73098n6845J72041P701r6589p26M16l5679j44179p4828J2810
$$ 366628 213718 -59380 -116225 55816 63517 -33072 -33798 -33382 -69061 -213240 -288068 -275258
6991b75258j6103m456Q0358K72282J47034P093R3569l2875j51814j14769L8608
$$ -275258 -291361 -295817 -215459 56823 203857 210950 304519 271644 119830 5061 43669
6980D3669J41872J55909r7387k8907K51144J10905p2384q6525m3936j40563j91349
$$ 43669 185541 341450 244063 215156 466300 577205 504821 418296 374360 233797 42448
6969D2448K7810N7158N7688j50509q0406P2160Q9225K6520J04209O8354p2161
$$ 42448 70258 127416 185104 34595 -45811 26349 115574 142094 246303 314657 242496
6958B42496j8855L680J85596J14268J35209Q1885p0748j05249p3209r9518M4924
$$ 242496 223641 227321 412917 527185 662394 744279 673531 568282 495073 395555 440479
6947D40479j39288k29442j32043N9634O0165J06789K24493J07507j51318j75577
$$ 440479 301191 71749 -60294 -660 59505 166294 390787 498294 346976 171399
6937A71399q7396k20147o3740j7146n2048m4184J17081K42077J44808J3738R2637
$$ 171399 84003 -136144 -199884 -217030 -269078 -313262 -196181 45896 190704 204442 297079
6926B97079J34580J34508J71337J49034q4536r8294o9298r5422j61475j8299K32721
$$ 297079 431659 566167 737504 886538 802002 703708 634410 538988 377513 359214 591935
6915E91935Q4470P9970Q2805q6968k01509j73186l31683l37584j3942O0268J35804
$$ 591935 676405 756375 839180 752212 550703 377517 45834 -291750 -305692 -245424 -109620
6904a09620Q5730J03422M8010j14143n6745L6868j5672J49251L9251n1861K914
$$ -109620 -23890 79532 127542 13399 -43346 -6478 -22150 127101 166352 114491 117405
6893A17405K1881J13977o4305r261j12669l5593J78839K23675j16196j49730K756
$$ 117405 139286 253263 188958 179697 67028 31435 210274 433949 317753 168023 170779
6882A70779k63339k57128m6564J01479N2561L2338R2179J25589K1135j08858j48235
$$ 170779 -92560 -349688 -396252 -294773 -242212 -209874 -117695 7894 29029 -79829 -228064
6871b28064j39079O5456K32497K14562J71965O9647j562j01072j80912j85355
$$ -228064 -367143 -301687 -69190 145372 317337 386984 385422 284350 103438 -81917
6861h1917n6314l2443J7249P0745J14020O7666O9335j6747n3330K4097m0618j15268
$$ -81917 -138231 -170674 -153425 -82680 31340 99006 168341 151594 98264 122361 81743 -33525
6849c3525N1263R5388l5302j59419J3718K00553l6172j18396l6251M0190j58987
$$ -33525 17738 113126 77824 -81595 -67877 132676 96504 -21892 -58143 -17953 -176940
6838a76940p2496J7859R3418J06140N5822R3201j78685j61973J69811J45196j43296
$$ -176940 -249436 -231577 -138159 -32019 23803 117004 -61681 -223654 -53843 91353 -51943
6827e1943n7577J39802J38j13264M1086K6217j8641L7665M9447Q6981j7334Q865
$$ -51943 -109520 30282 30420 -82844 -41758 -15541 -34182 3483 52930 139911 122577 131442
6815A31442N9231q8078Q4506K24615J02064k30104r5365P1318l9317j46721j55412
$$ 131442 190673 102595 187101 411716 513780 283676 188311 259629 220312 73591 -81821
6804h1821m6848N1686K86159K53149L4129m4885j17161n8574j19560j07172N5777
$$ -81821 -128669 -76983 209176 462325 496454 451569 334408 275834 156274 49102 104879
6793A04879J26628p2576j71257p9303j13311N8903J81191J22893o3994k8592J07435
$$ 104879 231507 158931 -12326 -91629 -204940 -146037 35154 158047 94053 65461 172896
6782A72896k0700j76428k20542m5629o6767r2621J33558K07673J56675M278j43362
$$ 172896 152196 -24232 -244774 -290403 -357170 -449791 -316233 -108560 48115 52393 -90969
6771i0969j81171K0629K27890K38014P7887R033q0403k02329k67942j65444j12132
$$ -90969 -272140 -251511 -23621 214393 292280 301313 220910 18581 -249361 -414805 -526937
6760e26937Q1726K06590K67395J29044J7910j10918j8815k2546J38721P3779N6619
$$ -526937 -445211 -238621 28774 157818 175728 64810 45995 23449 162170 235949 292568
6749B92568O0423o4749j34002j07375J32303P2884j32215j93922j53287j16813
$$ 292568 352991 288242 154240 46865 179168 252052 119837 -74085 -227372 -344185
6739c44185Q8680J80038Q5734p4409R064J07720R7827J38096J38725l2002j03901
$$ -344185 -255505 -75467 10267 -64142 -55078 52642 150469 288565 427290 395288 291387
6728B91387o2084N7137K11479J51170k9477k02992k25099j18933j50336q6852
$$ 291387 229303 286440 497919 649089 619612 416620 191521 72588 -77748 -164600
6718a64600P3559J68112M35099L16834j5009k39153r0830M6212L1663J2096O3847
$$ -164600 -91041 77071 512170 829004 813995 574842 484012 530224 561887 573983 637830
6707F37830J37351L35445M23556K07953R2244m2851o2999l6561J14559K51696
$$ 637830 775181 1110626 1534182 1742135 1834379 1791528 1728529 1691968 1806527 2058223
6697B058223N3274N7174J36483M83346M70171L15333L21196N41082L76549L05288
$$ 2058223 2111497 2168671 2305154 2788500 3258671 3574004 3895200 4436282 4812831 5118119
6687E118119P21603J084896J135172R22550R74576J306614J629506J452970Q39724
$$ 5118119 5839722 6924618 8059790 8982340 9956916 11263530 12893036 14346006 15185730
6678A5185730K29723K62747P19743J452058K842679N045195P976277J1209458
$$ 15185730 15415453 15678200 16397943 17850001 20692680 25737875 33714152 44923610
6670D4923610J2731792Q178954k872231j0714127j1134276q871851o667735m869097
$$ 44923610 57655402 65834356 62962125 52247998 41113722 32241871 25574136 20705039
6662B0705039l861320k918856k080074j389547j018328r93726q84639p31566n83647
$$ 20705039 16843719 13924863 11844789 10455242 9436914 8443188 7558549 6826983 6243336
6653F243336n57648n14231l74758m05900m20503l74856k75859j98884l77443l50779
$$ 6243336 5685688 5171457 4796699 4390799 3970296 3595440 3319581 3120697 2743254 2392475
6643B392475j54936j49054j94768j37052r6081j75886j65695R564j17071j08837
$$ 2392475 2237539 2088485 1893717 1756665 1660584 1484698 1319003 1328567 1211496 1102659
6633A102659l5418j0922J43784J00303n4832k19953j53318L8584J51986J54032
$$ 1102659 1067241 1056319 1200103 1300406 1245574 1025621 872303 910887 1062873 1216905
6623A216905o0050k16570j6823N5068M623R1771K38460K0254j25564o3396j56455
$$ 1216905 1156855 940285 923462 978530 983153 1074924 1313384 1333638 1208074 1144678 988223
6612I88223k21551j29781j29733j74486j07378J66129J88077J83847J12645l0678
$$ 988223 766672 636891 507158 332672 225294 391423 579500 763347 875992 845314
6602H45314j78766j98773k9001n9150k16380j53129J33382J32618J32981P6054
$$ 845314 666548 467775 438774 379624 163244 10115 143497 276115 409096 485150
6592D85150r730O8730M4443j89990k69442o6014l148j08402j94368M1848K69962
$$ 485150 475420 544150 588593 398603 129161 63147 59999 -48403 -242771 -200923 69039
6581F9039L2706j11373J12256J03221j56808j06889J7167N7130n3023p5994N6609
$$ 69039 101745 -9628 102628 205849 49041 -57848 -40681 16449 -36574 -112568 -55959
6570e5959J57163J02194j12648k30407j9955J37807J8010j27183j07905j4291
$$ -55959 101204 203398 90750 -139657 -159612 -21805 -3795 -130978 -238883 -253174
6560b53174M3330J28439P4863q0530j77778p7619J51434J53557N3263J36915O2526
$$ -253174 -209844 -81405 -6542 -87072 -264850 -342469 -191035 -37478 15785 152700 215226
6549B15226q7008J15004J96959J89412J26943k32163k72668j59038r9558r852
$$ 215226 128218 243222 440181 629593 756536 524373 251705 92667 -6891 -16743
6539a6743J5157l0612j08765j67592j36461K1170J39230J00390J49571J39717
$$ -16743 -1586 -32198 -140963 -308555 -445016 -423846 -284616 -184226 -34655 105062
6529A05062P4218J34691L0736j4104J82101P0253M1882k46221j22680J38616L3381
$$ 105062 179280 313971 344707 330603 512704 582957 624839 378618 255938 394554 427935
6518D27935o3821j94568j51636l3987J20768R4168j12497p3836J36978R2484l6982
$$ 427935 364114 169546 17910 -16077 104691 198859 86362 12526 149504 241988 205006
6507B05006J0709j09545j18129k9888m0180J22735K05035k0647r5873j7251j06279
$$ 205006 215715 106170 -11959 -41847 -82027 40708 245743 225096 129223 111972 5693
6496E693j57732r6822J55881o5670K3211J09727Q7358K45223R4271K2050K4036
$$ 5693 -152039 -248861 -92980 -158650 -135439 -25712 61646 306869 401140 423190 447226
6485D47226q8800j93594j83209k62568j46982R8385K5937k5805J05466K93114
$$ 447226 358426 164832 -18377 -280945 -427927 -329542 -303605 -329410 -223944 69170
6475F9170J86219n521K1271o9995j70330m8767j74980J6599J27350m7766k07084
$$ 69170 255389 249868 271139 201144 30814 -17953 -192933 -176334 -48984 -96750 -303834
6464c03834k72486l4377K13898J23119Q7758J21398O7019K2156M8179J01374J53517
$$ -303834 -576320 -610697 -396799 -273680 -185922 -64524 2495 24651 72830 174204 327721
6453C27721o8390o7107M2552K7140k46390j66312J20463R0965j33581j97835J9243
$$ 327721 259331 192224 234776 261916 15526 -150786 -30323 60642 -72939 -270774 -251531
6442b51531J53950J05604j43802j35873P887Q0252j6128j78632j08402n1283k8325
$$ -251531 -97581 8023 -135779 -271652 -263765 -183513 -199641 -378273 -486675 -537958 -566283
6431e66283P0689J54750K27868K09307R9611l5145r6106q4248M1255L635J8421
$$ -566283 -495594 -340844 -112976 96331 195942 160797 64691 -19557 21698 25333 43754
6420D3754P0717R2623p3062q8026k7054o5216N4783k7396k13555j25880L7021
$$ 43754 114471 207094 134032 46006 18952 -46264 8519 -18877 -232432 -358312 -321291
6409c21291K5276J37414K51571o136n0491J8882J16262K29647J68483M8934m0828
$$ -321291 -296015 -158601 92970 86834 36343 55225 171487 401134 569617 618551 577723
6398E77723j02417j78119j66500J28775K14932Q3390J10112J12367k2626m3899
$$ 577723 475306 297187 130687 259462 474394 557784 667896 780263 757637 713738
6388G13738M2189j57190j60678k170J45272R1616j98239j78190j14151q9304N8724
$$ 713738 755927 598737 438059 435889 581161 672777 474538 296348 182197 92893 151617
6377A51617K8782p2757Q8227o1958l4395n3241j23606k964K00974K76035J74326
$$ 151617 180399 107642 195869 133911 99516 46275 -77331 -80295 120679 396714 571040
6366E71040k2710j83020j45331j25260k14103k00928m4582L5884J59706L11264
$$ 571040 548330 365310 219979 94719 -119384 -320312 -364894 -329010 -169304 141960
6356A41960J73678P8989j5841k07276j97939n9281K9019l1306l0127K2399q8835
$$ 141960 315638 394627 378786 171510 -26429 -85710 -56691 -87997 -118124 -95725 -184560
6345a84560Q8020K01918J37196M2793j09844r3185j441L7333k2316p9898P5267
$$ -184560 -96540 105378 242574 285367 175523 82338 80897 118230 95914 16016 91283
6334I1283J69065j00781k33257j84298j74361K1276R3020j1425q4566l1334o5416
$$ 91283 260348 159567 -73690 -257988 -432349 -411073 -318053 -329478 -414044 -445378 -510794
6323e10794K9203J15783P7994J62601J50734l2466o1398j45560j70578l7802L7720
$$ -510794 -481591 -365808 -287814 -125213 25521 -6945 -68343 -213903 -384481 -422283 -384563
6312c84563N8757J1667R41O8524J15195P1455K3306p9408j74574K4320Q8609m2081
$$ -384563 -325806 -314139 -313198 -244674 -129479 -58024 -34718 -114126 -288700 -264380 -175771 -217852
6300b17852j626K68058K94375j03068J9020o511k39545l02740k087K04786N0275
$$ -217852 -219478 48580 342955 239887 258907 252396 12851 -289889 -291976 -87190 -36915
6289c6915N5348K60013J83453M3732l4463j65973k06792m7506p0967m5193Q9123
$$ -36915 18433 278446 461899 505631 471168 305195 98403 50897 -20070 -65263 23860
6278B3860J29141k9124k2612q9976J2778J94772P2543m3108n1115O9638J27319
$$ 23860 153001 123877 101265 11289 24067 218839 291382 248274 197159 266797 394116
6267C94116p8376k24401j7594r67J39482N7395r2584K09770J14318l15229l78695
$$ 394116 315740 91339 73745 72778 212260 269655 177071 386841 501159 185930 -192765
6256a92765n7323o621O2939N2131L9725j1002J538n0649j88688k15925k06113
$$ -192765 -250088 -256709 -193770 -141639 -101914 -112916 -111378 -162027 -350715 -566640 -772753
6245g72753l123K94808L74494K29044J36208j07911j21148m6039P765M1675M9037
$$ -772753 -775876 -481068 -106574 122470 258678 150767 29619 -16420 -8655 33020 82057
6234H2057K6952k8141n2611j38891L3510K74171J75059O8106k13602k67623J10770
$$ 82057 109009 80868 28257 -110634 -77124 197047 372106 440212 226610 -41013 69757
6223F9757J27725o3492k07804k15013j40353P1600J23605Q8459K55189L29253
$$ 69757 197482 133990 -73814 -288827 -429180 -357580 -233975 -145516 109673 438926
6213D38926K57586j71164m11569j90060O3203J58305J85017J51028m7673m9548
$$ 438926 696512 525348 113779 -76281 -13078 145227 330244 481272 433599 384051
6203C84051O503K17338K18377J23705l3644k22810j31230m1144j78539k87464
$$ 384051 390554 607892 826269 949974 916330 693520 562290 521146 342607 55143
6193E5143j10578J904j36253J41580K2590q1909K8256K6407M6161o6344j64852
$$ 55143 -55435 -53531 -189784 -48204 -25614 -107523 -79267 -52860 -6699 -73043 -237895
6182b37895j13147Q1427L82926L92642J29901j1056j60898l07983l35066j85447
$$ -237895 -351042 -269615 113311 505953 635854 624798 463900 155917 -179149 -364596
6172c64596J33049K72550J75652k5139K4987K35819j13226k45399q8623O8652
$$ -364596 -231547 41003 216655 191516 216503 452322 339096 93697 5074 73726
6162G3726J33931K04989J79988J09646k6155m7740j40199j12750J74999O539M1637
$$ 73726 207657 412646 592634 702280 676125 628385 488186 375436 550435 556974 598611
6151E98611M4579n8274r1541j66736k63274p3413Q1922J0987M6513R086R3641
$$ 598611 643190 584916 493375 326639 63365 -10048 71874 82861 129374 138460 232101
6140B32101p211p8543o2123l5297K28529L54516J00618o7857k20105j64462k81800
$$ 232101 224890 146347 84224 48927 277456 631972 732590 664733 444628 280166 -1634
6129a634p2776J51769N1233M2275J32236J78615j2131q3601N1693J18551O1607
$$ -1634 -74410 77359 128592 170867 303103 481718 469587 385986 437679 556230 617837
6118F17837j14350j36525o5813p453L1001l00070k85907J58227O2637r7392Q27
$$ 617837 503487 366962 301149 293696 324697 24627 -261280 -103053 -40416 -137808 -136981
6107a36981l314J08026J60323N4080n7061l3798J50986O5569q4873n406o5135
$$ -136981 -140295 -32269 128054 182134 125073 91275 242261 307830 222957 217551 152416
6096A52416Q6686J72118N3345N9272N7122j14758k82949N5311J94304N8983k27445
$$ 152416 239102 411220 464565 523837 580959 466201 183252 238563 432867 491850 264405
6085B64405j14030P6368n2213j00746R398K9160o9426o4170j36214p6342J20075
$$ 264405 150375 226743 174530 73784 83182 112342 42916 -21254 -157468 -233810 -113735
6074a13735J51221K27672J79531j22679k88566j47051J79002L03827n6766j66000
$$ -113735 37486 265158 444689 322010 33444 -113607 65395 369222 312456 146456
6064A46456p2282l35749k07832m4309k4762J18650J18932J48477J49226Q8280
$$ 146456 74174 -261575 -469407 -513716 -538478 -419828 -300896 -152419 -3193 85087
6054H5087k7940n7012p6243j35886m2472L4060Q3033J92828J22162j30091j59613
$$ 85087 57147 135 -76108 -211994 -254466 -220406 -137373 55455 177617 47526 -112087
6043a12087P0897R6527R2254K60648J02132j26593k6985j20023j48873j68789
$$ -112087 -41190 55337 147591 408239 510371 383778 356793 236770 87897 -80892
6033h0892j3400J06135J56067J63932q9925n32n2820k47547l10967j59073K70399
$$ -80892 -94292 11843 167910 331842 241917 241385 188565 -58982 -369949 -529022 -258623
6022b58623K33632Q3522J46256O701j51425j65682q7366J00904J8565l3678o8509
$$ -258623 -24991 58531 204787 211488 60063 -105619 -192985 -92081 -73516 -107194 -175703
6011a75703j15400L374R9275R1434M6655J10376p8432k03202O4605J06228m93
$$ -175703 -291103 -287729 -188454 -97020 -50365 60011 -18421 -221623 -157018 -50790 -51283
6000e1283m7632j12289j0765q9637j32032J67398K63612J39763N5774m8019r0314
$$ -51283 -98915 -211204 -221969 -311606 -443638 -276240 -12628 127135 182909 134890 44576
5989D4576k3861r403j69366M762L55100L67903J31018j10437k94185j60130K030
$$ 44576 20715 11312 -158054 -153292 201808 569711 700729 590292 296107 135977 138007
5978A38007K2268p491k961m2048q5534L5034k1295j63571p3423K5696P2057O1685
$$ 138007 160275 152784 149823 107775 22241 57275 35980 -127591 -201014 -175318 -103261 -41576
5966d1576P9705p635J00664R2580o0054p3531L3066k638j16048j12280r6516O4974
$$ -41576 38129 30494 131158 223738 163684 90153 123219 120581 4533 -107747 -204263 -139289
5954a39289Q5902j18280q1217K42446K01508L3044l0296m9744p6182p9748r404
$$ -139289 -53387 -171667 -252884 -10438 191070 224114 193818 144074 67892 -11856 -21260
5943b1260J6211k9597Q649N3321k4800q4404k8459l5351j6277Q1428J6047R9956
$$ -21260 -5049 -34646 -25997 27324 2524 -81880 -110339 -145690 -161967 -80539 -64492 35464
5931C5464R6193l1955k99631k66543K3552J81957J2702m523N7834j28077J25251
$$ 35464 131657 99702 -199929 -466472 -442920 -260963 -248261 -252784 -194950 -323027 -197776
5920a97776J62286P8973J56288Q3899J13807J16010K42905K03514q6399k80589
$$ -197776 -35490 43483 199771 283670 397477 513487 756392 959906 873507 592918
5910E92918k93388j73929j58781j35184J5084M0522o3350o4414R01n1587J3579
$$ 592918 299530 125601 -33180 -168364 -153280 -112758 -176108 -240522 -239621 -291208 -277629
5899b77629O7939J6094R2340K40036Q0629r7791k7854p9986K2441J03913j00914
$$ -277629 -209690 -193596 -101256 138780 219409 121618 93764 13778 36219 140132 39218
5888C9218l26454m2168P7060j1960J670O2165K1083L1365J48857J08511J81357
$$ 39218 -287236 -329404 -252344 -264304 -262634 -200469 -179386 -148021 836 109347 290704
5877B90704l4396k27162j88556j46963N9930J02035N6881j4138p949M6572n1224
$$ 290704 256308 29146 -159410 -306373 -246443 -144408 -87527 -101665 -109614 -63042 -114266
5866a14266j24590R3879K66205L07490J85558O9355L4095M6721q3242k19755j76403
$$ -114266 -238856 -144977 121228 428718 614276 683631 717726 764447 681205 461450 285047
5855B85047j21804J00293J61651n6473j17993O547R2385o3407m260J43009J37981
$$ 285047 163243 263536 425187 368714 250721 257268 349653 286246 281986 424995 562976
5844E62976l1151j28262j87307k48402j90088L1384l1558p9189o0366q7417J34835
$$ 562976 531825 403563 216256 -32146 -222234 -190850 -222408 -301597 -361963 -449380 -314545
5833c14545K79589J81784J30402J42880L6601K4233j43113k54622j10989k3235
$$ -314545 -34956 146828 277230 420110 456711 480944 337831 83209 -27780 -51015
5823e1015k2730N6934n0265N5759K11281Q0999j3882j67693j45776m7909O6320
$$ -51015 -73745 -16811 -67076 -11317 199964 280963 267081 99388 -46388 -94297 -27977
5812b7977J914Q902N4892j35981k09214o55J54287J42836J16545M0537Q0971j4701
$$ -27977 -26063 -17161 37731 -98250 -307464 -308119 -153832 -10996 105549 146086 227057 212356
5800B12356j47217k41334j28726m1800q6793l4951N5023O7904J13629J86221K17012
$$ 212356 65139 -176195 -304921 -346721 -433514 -468465 -413442 -345538 -231909 -45688 171324
5789A71324O6485r1281j21335j50446k1881j37408q1461J40198Q3785J12775K28477
$$ 171324 237809 146528 25193 -125253 -147134 -284542 -366003 -225805 -142020 -29245 199232
5778A99232K38556P6931K21054J57847p2561j06725k03015o2596k21306m2191
$$ 199232 437788 514719 735773 893620 821059 714334 511319 448723 227417 185226
5768A85226J29744L6103q2670K4921J42334k54474k65476j96866q2344L40547
$$ 185226 314970 351073 268403 293324 435658 181184 -84292 -281158 -363502 -22955
5758b2955K62579p2100j20216j08917M1334J41083P1579m836k2878J36799K34456
$$ -22955 239624 167524 47308 -61609 -20275 120808 192387 187551 164673 301472 535928
5747E35928q063o3535q9310r0441J13489J42494m909o3096k17135p5781j11772
$$ 535928 527865 464330 375020 284579 398068 540562 535653 472557 255422 179641 67869
5736F7869j61042j64713m7546K50561J03390q4962k2034N4850o1634j32955J39858
$$ 67869 -93173 -257886 -305432 -54871 48519 -36443 -58477 -3627 -65261 -198216 -58358
5725e8358J20595O143P1538N6655k33469p4035Q8405J91606J2888j03694J8591
$$ -58358 62237 68380 139918 196573 -36896 -110931 -22526 169080 181968 78274 96865
5714I6865J52327J09902O0257k4987j26200j08260m894m7100Q3875p2524j50016
$$ 96865 249192 359094 419351 394364 268164 159904 155010 107910 191785 119261 -30755
5703c0755l8717j9342p7107J9550J19529P323K8649M5069R73J0523m8283K2172
$$ -30755 -69472 -88814 -165921 -146371 -26842 -19519 9130 54199 55172 65695 17412 39584
5691C9584m2975k37571j77191n8221R7681K80119J71391o0758j53112n9311L2424
$$ 39584 -3391 -240962 -418153 -476374 -378693 -98574 72817 12059 -141053 -200364 -167940
5680a67940J6474K3166L8418R0216J31798l3966n6373k1240j9981Q4475J33456
$$ -167940 -151466 -128300 -89882 334 132132 98166 41793 20553 572 85047 218503
5669B18503J04053k4746j42721M5747K8082q6786r5638M0188K0890L6033J27548
$$ 218503 322556 297810 155089 200836 228918 142132 46494 86682 107572 143605 271153
5658B71153l972M0754k8647o8308j43671n9144R3460Q4789O587M8757K6102l3171
$$ 271153 267181 307935 279288 210980 67309 8165 101625 186414 193001 241758 267860 234689
5646B34689k23882q0517o4838j14283m9856n8829o1585M8703K28615K73287O2999
$$ 234689 10807 -69710 -134548 -248831 -298687 -357516 -419101 -370398 -141783 131504 194503
5635A94503q0698j76672N0516N4022P7180j8042m04016k76560j88135K348L18107
$$ 194503 113805 -62867 -12351 41671 118851 100809 -303207 -579767 -767902 -765554 -447447
5624d47447K20779J18919l1181j73735J8628J44277J17342M0203l5611n9084l8481
$$ -447447 -226668 -107749 -138930 -312665 -294037 -149760 -32418 7785 -27826 -86910 -125391
5613a25391K06609K01796K49749O7842j69616n5462J20518o3540j16118o3023
$$ -125391 81218 283014 532763 600605 430989 375527 496045 432505 316387 253364
5603B53364j25414j97881J2936J2077j17339r9987N4472N6288J10373P8334o5748
$$ 253364 127950 -69931 -56995 -44918 -162257 -262244 -207772 -151484 -41111 37223 -28525
5592b8525R254K5555m8394m4325P9462L5768M1104J316J06626N7640k60033j84151
$$ -28525 -19271 6284 -42110 -86435 -6973 28795 69899 71215 177841 235481 -24552 -208703
5580b08703M2955K42684Q3315j86370q7937O6409P0085o7557k1559O9322j61468
$$ -208703 -165748 76936 160251 -26119 -114056 -47647 22438 -45119 -66678 2644 -158824
5569a58824j18933J01709J12390M8501j9535j21403o0374j6302J53068J21423
$$ -158824 -277757 -176048 -63658 -15157 -34692 -156095 -216469 -232771 -79703 41720
5559D1720J80801Q424k29757k98822o9805n183r6642n2823L6964Q0852J96693
$$ 41720 222521 230945 1188 -297634 -367439 -372622 -469264 -522087 -485123 -404271 -207578
5548b07578K26156j42654o7188J31597j8675o5429Q7970L5190J5572o6397l03291
$$ -207578 18578 -124076 -191264 -59667 -78342 -143771 -55801 -20611 -5039 -71436 -374727
5537c74727N916J77158J72451P6394J860q6994J6284R4417J47089l5580k18265
$$ -374727 -368811 -191653 -19202 57192 59052 -27942 -11658 82759 229848 194268 -23997
5526b3997j81646n0363L0720K9469M3325j14990j72181j18688k6226M0139J41858
$$ -23997 -205643 -256006 -225286 -195817 -152492 -267482 -439663 -558351 -584577 -544438 -402580
5515d02580K70289J20482O7822O4949o1687N7854K7440j19628k31159j31379R5940
$$ -402580 -132291 -11809 56013 120962 59275 117129 144569 24941 -206218 -337597 -241657
5504b41657J6205R8982J70740J70738J02286n8145n0968j40497q4068J04874K86032
$$ -241657 -225452 -126470 44270 215008 317294 259149 208181 67684 -16384 88490 374522
5493C74522K68349K3809k17725m8582J12297j50839j25592J77286p1840k28924
$$ 374522 642871 666680 448955 400373 512670 361831 236239 413525 341685 112761
5483A12761n5070J9074p0448l6624k5585p3646K662M5879l2742P7160o1104R4324
$$ 112761 57691 76765 6317 -30307 -55892 -129538 -126876 -80997 -113739 -36579 -97683 -3359
5471c359m719j18962p885j39510j09279J21253J87033J68382J73477M5950j81574
$$ -3359 -8078 -127040 -134925 -274435 -383714 -262461 -75428 92954 266431 312381 130807
5460A30807n9171J48598Q4028j47371k12088j41368k5837q8786j0200K03849K80712
$$ 130807 71636 220234 304262 156891 -55197 -196565 -222402 -311188 -321388 -117539 163173
5449A63173J83614K471O9930K9465k89191l27222o1009k0752l7949J15394J94434
$$ 163173 346787 349258 419188 448653 159462 -167760 -228769 -249521 -287470 -172076 22358
5438B2358J38544j05087j66811J85434K91685J02416k83199l08114k23141O824
$$ 22358 160902 55815 -110996 74438 366123 468539 185340 -122774 -345915 -339091
5428c39091K84891K51499K6965j394Q8140L5k12556j49111J19868P8966j719K4786
$$ -339091 -54200 197299 224264 222870 311010 311045 98489 -50622 69246 148212 146493 171279
5416A71279l4307k03952j22832Q8452J79172L6212N3432J17713J00808j26219
$$ 171279 136972 -66980 -189812 -101360 77812 114024 167456 285169 385977 259758
5406B59758k16408j48036j07871k7845j08039k31196q7279m1866J45135K05542
$$ 259758 43350 -104686 -212557 -240402 -348441 -579637 -666916 -708782 -563647 -358105
5396c58105L8244n8570o2042J10814K14881Q33j40575k5482R1405N2458k6815
$$ -358105 -319861 -378431 -440473 -329659 -114778 -113945 -254520 -280002 -188597 -136139 -162954
5385a62954L421J04160M9121j391o1419j7653M7903J00961K33432O6149q2053
$$ -162954 -159533 -55373 -6252 -7643 -69062 -86715 -38812 62149 295581 361730 279677
5374B79677j82279q9018J00104J72497J94503J18604l0005j38156j37857k73500
$$ 279677 97398 8380 108484 280981 475484 594088 564083 425927 288070 14570
5364A4570j30221p7588j68147j46188k5240j7119J87281K33340J17166J0600j29843
$$ 14570 -115651 -193239 -361386 -507574 -532814 -549933 -362652 -129312 -12146 -1546 -131389
5353a31389j15705j21628R7448J55733P9159M4046P434k8823m9520q4694p5600
$$ -131389 -247094 -368722 -271274 -115541 -36382 7664 15098 -13725 -63245 -147939 -223539
5342b23539k302N9198m6101p3888N0365k879Q126J03025J29372k0551o6573P6139
$$ -223539 -225841 -166643 -212744 -286632 -236267 -239146 -231020 -127995 1377 -19174 -85747 -9608
5330i608J37158k0964p5087k5178m9357m5278j14197j30093Q0288K16098J0323
$$ -9608 127550 106586 31499 6321 -43036 -88314 -202511 -332604 -252316 -36218 -25895
5319b5895j81400j46314j20132J002N5618j10527l7121J95733J99158Q6650Q9087
$$ -25895 -207295 -353609 -473741 -472739 -417121 -527648 -564769 -369036 -169878 -83228 5859
5308E859M8325J48319O0606l9542J63476L9499j81378k81492j28091K8387P3560
$$ 5859 54184 202503 263109 223567 387043 426542 245164 -36328 -164419 -136032 -62472
5297f2472Q8417p7900p5221r3083k9305K19842J02980j14248j48941K3952J23395
$$ -62472 25945 -51955 -127176 -220259 -249564 -29722 73258 -40990 -189931 -165979 -42584
5286d2584K3960N8095K74016J36119k0574j56599j14816n7994J89022R0612l27798
$$ -42584 -18624 39471 313487 449606 429032 272433 157617 99623 288645 379257 51459
5275E1459q3828P9180j1178k8060J9421l2889j34437p6890J69467J68178L1264
$$ 51459 -32369 46811 35633 7573 26994 -5895 -140332 -217222 -47755 120423 151687
5264A51687J667m3619o222M9487j9609j71704p0218K9726l2714j57774K4478J98177
$$ 151687 153354 109735 103513 153000 133391 -38313 -108531 -78805 -111519 -269293 -244815 -46638
5252d6638j6699q9570o9017j0650L9747J08908P6390n8777o3287k1659J08021
$$ -46638 -63337 -152907 -221924 -232574 -192827 -83919 -7529 -66306 -129593 -151252 -43231
5241d3231R7266j56367q1957o6126Q605K2786k9743j5332j56543k19105n7413
$$ -43231 54035 -102332 -184289 -250415 -241810 -219024 -248767 -264099 -420642 -639747 -697160
5230f97160J88189K69173M01391J79016K1281j30202j31655N3035J5725j5117
$$ -697160 -508971 -239798 161593 340609 361890 231688 100033 153068 168793 153676
5220A53676o9785j97196j14074J08685j05115j53711L6046R3273J2683o0793q2756
$$ 153676 83891 -113305 -227379 -118694 -223809 -377520 -341474 -248201 -235518 -296311 -379067
5209c79067n870J68177K39822N0126j01271j26933j2873O2558j77248l42430o3059
$$ -379067 -384937 -216760 23062 73188 -28083 -155016 -167889 -105331 -282579 -625009 -688068
5198f88068k2995J22011L39522K00967N8533k5605L7070j6372j72835j89271k26690
$$ -688068 -711063 -589052 -249530 -48563 9970 -15635 21435 5063 -167772 -357043 -583733
5187e83733l4499Q5176J56877J74681R6708L874K8581R6480j7707j11710K5755
$$ -583733 -618232 -533056 -376179 -201498 -104790 -100916 -72335 24145 6438 -105272 -79517
5176g9517j79663K517J15225L5365N2655R6735K17682N4436p3450J09878J41715
$$ -79517 -259180 -256663 -141438 -106073 -53418 43317 260999 315435 241985 351863 493578
5165D93578j70617k28442p4500N2648J94729J51884L4743j91019q2984P5787l8026
$$ 493578 322961 94519 20019 72667 267396 419280 454023 263004 180020 255807 217781
5154B17781k5305j05775k29761n2887o757j9952J57636L1294j48480k92410O4343
$$ 217781 192476 86701 -143060 -195947 -202704 -222656 -65020 -33726 -182206 -474616 -410273
5143d10273L78207J97857J14788N0045J32475J05128q627k60741l07361j09322
$$ -410273 -32066 165791 280579 330624 463099 568227 559600 298859 -8502 -117824
5133a17824J05083K47202Q0862L6751l668Q6310J89006j47487l08988m01065n0422
$$ -117824 -12741 234461 315323 352074 348406 434716 623722 476235 167247 -233818 -284240
5122b84240J21597l5689l4440P9961K16964K38268L40017K66268j74213k83342
$$ -284240 -162643 -198332 -232772 -152811 64153 302421 642438 908706 734493 451151
5112D51151j45729r8413j43115L5761J25741L1587j30178q6539r3394j19984J50962
$$ 451151 305422 207009 63894 99655 225396 256983 126805 40266 -53128 -173112 -22150
5101b2150J48170Q4726j36808j25425Q512K93211L27468J8209l06694k64841o7504
$$ -22150 126020 210746 73938 -51487 -42975 250236 577704 595913 289219 24378 -43126
5090d3126Q3716J49868m1132j58028q1355j27905j75227m9185Q3122J90909J45261
$$ -43126 40590 190458 149326 -8702 -90057 -217962 -393189 -442374 -359252 -168343 -23082
5079b3082p7920j89774l17367j86312Q7035K46952J47786J18240L304k78849k06974
$$ -23082 -101002 -290776 -608143 -794455 -707420 -460468 -312682 -194442 -191138 -469987 -676961
5068f76961J64377K72898K30941P5927j04320j57637l23214l7381J74845J08330
$$ -676961 -512584 -239686 -8745 67182 -37138 -194775 -517989 -555370 -380525 -272195
5058b72195J29248J46022l0369k00192j5840J08267R1976N6580K0529n8475P185
$$ -272195 -142947 3075 -27294 -227486 -243326 -135059 -43083 13497 34026 -24449 -17264
5047a7264r7598j53987l0437K4300J5673R3177Q7687q8458l7286K5930J8074k6781
$$ -17264 -114862 -268849 -299286 -274986 -259313 -166136 -78449 -166907 -204193 -178263 -160189 -186970
5035a86970J37524J41138p6335j20706M81J06588Q3887L975k1697j94634k66309
$$ -186970 -49446 91692 15357 -105349 -104868 1720 85607 89582 67885 -126749 -393058
5024c93058n1848O1488J94275j0832j23459K8723O0977o5205j78812j73147o3066
$$ -393058 -444906 -383418 -189143 -199975 -323434 -294711 -233734 -298939 -477751 -650898 -713964
5013g13964P4952J27371J60562Q6998j06521k9157J99667P2168J25021N639j03620
$$ -713964 -639012 -511641 -351079 -264081 -370602 -399759 -200092 -127924 -2903 2736 -100884
5002a00884J8644J331k52797j67210K0542J55248Q6966j9996n0458J67720L12295
$$ -100884 -82240 -80909 -333706 -500916 -480374 -325126 -238160 -258156 -308614 -140894 171401
4991A71401J8324j35153l2649L1140r707M4592p525K7884j17335j24081l378J93759
$$ 171401 189725 54572 21923 53063 43356 87948 80423 108307 -9028 -133109 -136487 57272
4979E7272K03081p19l9151J0176K7507p4814o0253n9918p6096j86958P8393J62155
$$ 57272 260353 259634 220483 230659 258166 183352 123099 63181 -12915 -199873 -121480 40675
4967D0675m3956n9708j2828M8872n0220q8285j60820q2574J59064K69367K16693
$$ 40675 -3281 -62989 -75817 -26945 -77165 -165450 -326270 -408844 -249780 19587 236280
4956B36280j24642k73578k5650Q8839J77826N9557o5721j25155J69969J66129
$$ 236280 111638 -161940 -187590 -98751 79075 138632 72911 -52244 117725 283854
4946B83854j07596l74126k34053N7746Q0269J83916K54938J42611R6934J70456
$$ 283854 176258 -197868 -431921 -374175 -293906 -109990 144948 287559 384493 554949
4936E54949l8355j06011j48784j91599j24267j3034k4554k8283m829J1992M7242
$$ 554949 516594 410583 261799 70200 -54067 -67101 -91655 -119938 -124767 -112775 -65533
4925f5533J98353K18144n1860L1413l7404k28411o293K19117J84039K9068j10413
$$ -65533 132820 350964 299104 330517 293113 64702 58409 277526 461565 490633 380220
4914C80220l25777j49578l6888M843O8920R4680K30908J28851k5596p0922j23068
$$ 380220 54443 -95135 -132023 -127180 -58260 36420 267328 396179 370583 299661 176593
4903A76593R3435N2425j90885q8019p2932n8795j18025K0465J04011J11839P0418
$$ 176593 270028 322453 131568 43549 -29383 -88178 -206203 -185738 -81727 30112 100530
4892A00530O7541n6793j0382j43658q8160J09134J9405q4661j23938L8720K30944
$$ 100530 168071 111278 100896 -42762 -130922 -21788 -2383 -87044 -210982 -172262 58682
4881E8682J36835j81141j55901P9441K62126J45480k10251m20624k15914K54622
$$ 58682 195517 14376 -141525 -62084 200042 345522 135271 -285353 -501267 -246645
4871b46645L13577j867j83861N8417J63721l8635j19839K5998k6374o3567m0656
$$ -246645 66932 65065 -118796 -60379 103342 64707 -55132 -29134 -55508 -119075 -159731
4860a59731r6434j053R0515J81812J37067p1217n1900R4065J16201p9275j44363
$$ -159731 -256165 -257218 -166703 15109 152176 80959 29059 123124 239325 160050 15687
4849A5687j05689m7623O8288J40789J28054L7149l4963r3552j65923k5379J59455
$$ 15687 -90002 -137625 -69337 71452 199506 236655 201692 108140 -57783 -83162 76293
4838G6293P7682j29943q6286L0578q7142j15366p8214K1574J47654J05381p6896
$$ 76293 153975 24032 -62254 -31676 -118818 -234184 -312398 -290824 -143170 -37789 -114685
4827a14685j50995O5129K71817K58795N4252l2289p9883k56437k33182r0151J10532
$$ -114685 -265680 -200551 71266 330061 384313 352024 272141 15704 -217478 -307629 -197097
4816a97097J69477N7339K3534p6669p8536r932k1019R4104K16545R2247j56492
$$ -197097 -27620 29719 53253 -23416 -101952 -111884 -132903 -38799 177746 269993 113501
4805A13501l8328J34066k698j99232j84384k41398n4835J22586J05306J57525
$$ 113501 75173 209239 206541 7309 -177075 -418473 -473308 -350722 -245416 -87891
4795h7891J57961o3180o3214j8580j04899j26865o7410J93788K09716j71811j31440
$$ -87891 70070 6890 -56324 -74904 -179803 -306668 -374078 -180290 29426 -142385 -273825
4784b73825J63463J11062J16276J20781J38320j15591p6784P9358M6375M6066
$$ -273825 -110362 700 116976 237757 376077 260486 183702 263060 309435 355501
4774C55501j84757j83717p4674k1464L2623K94761Q2468k5170m5491K042j13402
$$ 355501 170744 -12973 -87647 -109111 -76488 218273 300741 275571 230080 232122 118720
4763A18720j39048M0190M965N6565l3733j77771j01656L6842J60519J76411J4578
$$ 118720 -20328 19862 24827 81392 47659 -130112 -231768 -194926 -34407 142004 156582
4752A56582j50434j7309K02505K56368M0933j23311K0476m3149o7159j10011j48137
$$ 156582 6148 -11161 191344 447712 488645 365334 385810 342661 275502 165491 17354
4741A7354k07639m1155q4937J9990M3029M6906Q2675L5850j3584l0163O6863M6950
$$ 17354 -190285 -231440 -316377 -296387 -253358 -206452 -123777 -87927 -101511 -131674 -64811 -17861
4729a7861n9796j61912r3444K29362J79608q7159j66751j13216m534j13575l4126
$$ -17861 -77657 -239569 -333013 -103651 75957 -11202 -177953 -291169 -295703 -409278 -443404
4718d43404o2153q4937M4988J39663J58144J63136K49203J06432o8296k0606j04680
$$ -443404 -505557 -590494 -545506 -405843 -247699 -84563 164640 271072 202776 182170 77490
4707G7490j8314l3311J8747j37143j24511k21j02354K02849K12337n3059j65290
$$ 77490 59176 25865 44612 -92531 -217042 -217263 -319617 -116768 95569 42510 -122780
4696a22780J72266K85391m6612j33075j5876p6820k0610j40537k6861Q2553l6745
$$ -122780 49486 334877 288265 155190 139314 62494 41884 -98653 -125514 -42961 -79706
4685g9706K082R1425J7186q3643Q7831N0697J31297N7438j0166R0019K220j8849
$$ -79706 -77624 13801 30987 -52656 35175 85872 217169 274607 264441 354460 356680 337831
$$ [...]
##END NTUPLES=NMR SPECTRUM
##END=
