##TITLE=1H_AT-48
 THF-d8
 8 sc, 
 29.08.2022
##JCAMPDX= 6.0         $$ Bruker NMR JCAMP-DX V2.0
##DATA TYPE= NMR FID
##DATA CLASS= NTUPLES
##ORIGIN= UXNMR, Bruker Analytische Messtechnik GmbH
##OWNER= root
$$ XWIN-NMR		Version 3.5
$$ Mon Aug 29 13:10:36 2022 Russian Standard Time (UT+4h)  she@DPX200
##.OBSERVE FREQUENCY= 200.1313499994
##.OBSERVE NUCLEUS= ^1H
##.DELAY= (6, 6)
##.ACQUISITION MODE= SIMULTANEOUS
##.ACQUISITION SCHEME= undefined
##.AVERAGES= 8
##.DIGITISER RES= 18
##SPECTROMETER/DATA SYSTEM= spect
##.PULSE SEQUENCE= zg30
##.SOLVENT NAME= THF
##.SHIFT REFERENCE= (INTERNAL, THF, 0, 15.7039)
##AUDIT TRAIL= $$ (NUMBER, WHEN, WHO, WHERE, WHAT)
$$ ##TITLE= Audit trail, XWIN-NMR		Version 3.5
$$ ##JCAMPDX= 5.01
$$ ##ORIGIN= Bruker BioSpin GmbH
$$ ##OWNER= she
$$ F:/spectra/data/she/nmr/H-F/1/audita.txt
$$ ##AUDIT TRAIL=  $$ (NUMBER, WHEN, WHO, WHERE, WHAT)
(   1,<2022-08-29 13:08:16.45 +0400>,<she>,<DPX200>,
      <created by zg, POWCHK disabled, PULCHK disabled
       configuration hash MD5:
       00 E9 B6 7A A2 85 ED C7 34 08 36 98 17 FE 4E 26
       data hash MD5: 16K
       09 0A 0C 3C D3 BB 8E EA 56 D6 30 03 A1 A1 11 98>)
$$ ##END=
$$ 
$$ hash MD5
$$ 7C 15 C2 E7 3E AF 02 C2 F6 AB 29 55 EE 5B 17 A5
##$RELAX= 
##$RELAX= 
##$RELAX= 
##$RELAX= 
##$RELAX= 
##$RELAX= 
$$ Bruker specific parameters
$$ --------------------------
##$DU= <F:/spectra>
##$EXPNO= 1
##$NAME= <H-F>
##$PROCNO= 1
##$TYPE= <nmr>
##$USER= <she>
##$AMP= (0..31)
100 100 100 100 100 100 100 100 100 100 100 100 100 100 100 100 100 100 
100 100 100 100 100 100 100 100 100 100 100 100 100 100 
##$AQSEQ= 0
##$AQ_mod= 1
##$AUNM= <au_zg>
##$AUTOPOS= <>
##$BF1= 200.13
##$BF2= 200.13
##$BF3= 200.13
##$BF4= 200.13
##$BF5= 200.13
##$BF6= 200.13
##$BF7= 200.13
##$BF8= 200.13
##$BYTORDA= 1
##$CFDGTYP= 0
##$CFRGTYP= 5
##$CHEMSTR= <none>
##$CNST= (0..31)
1 1 145 1 1 1 1 1 1 1 1 1 1 1 1 1 1 1 1 1 1 1 1 1 1 1 1 1 1 1 1 1 
##$CPDPRG= <>
##$CPDPRG1= <>
##$CPDPRG2= <>
##$CPDPRG3= <>
##$CPDPRG4= <mlev>
##$CPDPRG5= <mlev>
##$CPDPRG6= <mlev>
##$CPDPRG7= <mlev>
##$CPDPRG8= <mlev>
##$CPDPRGB= <>
##$CPDPRGT= <>
##$D= (0..31)
0 1.2 0 0 0 0 0 0 0 0.06 0 0.03 0 0 0 0 0.0002 0 0 0 0 0 0 0 0 0 0 0 0 
0 0 0 
##$DATE= 1661764095
##$DBL= (0..7)
120 120 120 120 120 120 120 120 
##$DBP= (0..7)
150 150 150 150 150 150 150 150 
##$DBP07= 0
##$DBPNAM0= <>
##$DBPNAM1= <>
##$DBPNAM2= <>
##$DBPNAM3= <>
##$DBPNAM4= <>
##$DBPNAM5= <>
##$DBPNAM6= <>
##$DBPNAM7= <>
##$DBPOAL= (0..7)
0.5 0.5 0.5 0.5 0.5 0.5 0.5 0.5 
##$DBPOFFS= (0..7)
0 0 0 0 0 0 0 0 
##$DE= 6
##$DECBNUC= <off>
##$DECIM= 32
##$DECNUC= <off>
##$DECSTAT= 4
##$DIGMOD= 1
##$DIGTYP= 9
##$DL= (0..7)
0 120 120 120 120 120 120 120 
##$DP= (0..7)
150 150 150 150 150 150 150 150 
##$DP07= 0
##$DPNAME0= <>
##$DPNAME1= <>
##$DPNAME2= <>
##$DPNAME3= <>
##$DPNAME4= <>
##$DPNAME5= <>
##$DPNAME6= <>
##$DPNAME7= <>
##$DPOAL= (0..7)
0.5 0.5 0.5 0.5 0.5 0.5 0.5 0.5 
##$DPOFFS= (0..7)
0 0 0 0 0 0 0 0 
##$DQDMODE= 0
##$DR= 18
##$DS= 0
##$DSLIST= <SSSSSSSSSSSSSSS>
$$ [...]
##$SUBNAM2= <"">
##$SUBNAM3= <"">
##$SUBNAM4= <"">
##$SUBNAM5= <"">
##$SUBNAM6= <"">
##$SUBNAM7= <"">
##$SUBNAM8= <"">
##$SUBNAM9= <"">
##$SW= 18.0517283424941
##$SWIBOX= (0..15)
0 0 2 0 0 0 0 0 0 0 0 0 0 0 0 0 
##$SW_h= 3612.71676300578
##$TD= 16384
##$TD0= 1
##$TE= 0
##$TE2= 300
##$TE3= 300
##$TEG= 300
##$TL= (0..7)
0 120 120 120 120 120 120 120 
##$TP= (0..7)
150 150 150 150 150 150 150 150 
##$TP07= 0
##$TPNAME0= <>
##$TPNAME1= <>
##$TPNAME2= <>
##$TPNAME3= <>
##$TPNAME4= <>
##$TPNAME5= <>
##$TPNAME6= <>
##$TPNAME7= <>
##$TPOAL= (0..7)
0.5 0.5 0.5 0.5 0.5 0.5 0.5 0.5 
##$TPOFFS= (0..7)
0 0 0 0 0 0 0 0 
##$TUNHIN= 0
##$TUNHOUT= 0
##$TUNXOUT= 0
##$USERA1= <user>
##$USERA2= <user>
##$USERA3= <user>
##$USERA4= <user>
##$USERA5= <user>
##$V9= 5
##$VALIST= <valist>
##$VCLIST= <CCCCCCCCCCCCCCC>
##$VD= 0
##$VDLIST= <DDDDDDDDDDDDDDD>
##$VPLIST= <PPPPPPPPPPPPPPP>
##$VTLIST= <TTTTTTTTTTTTTTT>
##$WBST= 1024
##$WBSW= 4
##$XGAIN= (0..3)
0 0 0 0 
##$XL= 0
##$YL= 0
##$YMAX_a= 134405
##$YMIN_a= -193764
##$ZGOPTNS= <>
##$ZL1= 120
##$ZL2= 120
##$ZL3= 120
##$ZL4= 120
##$ABSF1= 10
##$ABSF2= 0
##$ABSG= 5
##$ABSL= 3
##$ALPHA= 0
##$AQORDER= 0
##$ASSFAC= 0
##$ASSFACI= 0
##$ASSFACX= 0
##$ASSWID= 0
##$AUNMP= <proc_1d>
##$AZFE= 0.1
##$AZFW= 0.1
##$BCFW= 1
##$BC_mod= 2
##$BYTORDP= 1
##$COROFFS= 0
##$CY= 11.3945322036743
##$DATMOD= 1
##$DC= 2
##$DFILT= <>
##$DTYPP= 0
##$F1P= 2.36226072786647
##$F2P= -0.459571619588291
##$FCOR= 0.5
##$FTSIZE= 0
##$FT_mod= 4
##$GAMMA= 1
##$GB= 0.15
##$INTBC= 1
##$INTSCL= 1
##$ISEN= 128
##$LB= 0.24
##$LEV0= 0
##$LPBIN= 0
##$MAXI= 10000
##$MC2= 0
##$MEAN= 0
##$ME_mod= 0
##$MI= 1.114404
##$NCOEF= 0
##$NC_proc= 0
##$NLEV= 6
##$NOISF1= 3.799351
##$NOISF2= 2.8
##$NSP= 1
##$NTH_PI= 0
##$NZP= 0
##$OFFSET= 15.70392
##$PC= 1
##$PHC0= -18040.25
##$PHC1= 10.80069
##$PH_mod= 1
##$PKNL= yes
##$PPARMOD= 0
##$PSCAL= 0
##$PSIGN= 0
##$REVERSE= no
##$SF= 200.130013532006
##$SI= 16384
##$SIGF1= 3
##$SIGF2= 2
##$SINO= 400
##$SIOLD= 16384
##$SREGLST= <1H.CDCl3>
##$SSB= 0
##$STSI= 0
##$STSR= 0
##$SW_p= 3612.71676300578
##$SYMM= 0
##$S_DEV= 0
##$TDeff= 0
##$TDoff= 0
##$TI= <>
##$TILT= no
##$TM1= 0
##$TM2= 0
##$TOPLEV= 0
##$USERP1= <user>
##$USERP2= <user>
##$USERP3= <user>
##$USERP4= <user>
##$USERP5= <user>
##$WDW= 1
##$XDIM= 8192
##$YMAX_p= 0
##$YMIN_p= 0
$$ End of Bruker specific parameters
$$ ---------------------------------
##NTUPLES= NMR FID
##VAR_NAME=  TIME,          FID/REAL,        FID/IMAG
##SYMBOL=    X,             R,               I
##VAR_TYPE=  INDEPENDENT,   DEPENDENT,       DEPENDENT
##VAR_FORM=  AFFN,          ASDF,            ASDF
##VAR_DIM=   8192,          8192,            8192
##UNITS=     SECONDS,       ARBITRARY UNITS, ARBITRARY UNITS
##FACTOR=    0.0002768,     1,               1
##FIRST=     0,             0,               0
##LAST=      2.2672688,     0,               0
##MIN=       0,             -193764,         0
##MAX=       2.2672688,     134405,          0
$$ Real data points
##PAGE= N=1
##DATA TABLE= (X++(R..R)), XYDATA
$$ [...]
1720A46j01P6j05p3J49rP3Q2k05p2K0K7q4J62k15J59k0j16J42j18Q9Rj35K58O
1745A45l53L94l78J41P2J72m05J68p5j32L37j1O6k41K26l01L84j10k68nO7K33
1767A26j37J25j70J52J58m87K3mJ83o0j26M25o3l12L46r6r3p1j46L62R5k24M4
1790E0j5k16k0K38l56K24J8k9j08K1J40l7Q3P1o3P7j50J94j19K10k54L3j0n2J0
1815f0L48n67K27PK97k59j47MK63O2l16j00J67J18j26K87k81k8O9n9j05L62j85
1838b2j92M97r7k19R6J1j86P2J17j66J73k12Q5L1J52j87KL43m28J30j81M19j66
1861G2j04l0J85j0k05J26K5Pj82O2K55k74N9l6N2j24J92j90K52k23p2L76k49l
1885c9K89k26m51N08L1m0L2Q1l20Q8J80j39j17J26J22j66K28l79K10l1j35L24
$$ y = [146, 45, 121, 16, -57, 92, 83, 156, 238, 33, -39, -19, 8, -76, 86, -129, 30, 10, -106, 36, -82, 7, 16, -119, 139, 145, -208, 186, -192, -51, 21, 193, -212, -44, -119, -251, 86, 75, 141, -100, 126, -175, 209, 99, -169, -174, -107, 126, -11, 114, -56, 96, 254, -233, -210, -214, -31, -91, -217, 208, 145, -167, 179, 83, -10, -81, -227, 135, 230, 6, 50, 35, -181, -201, 37, -319, -95, -77, -106, -214, -193, -53, -90, -7, 64, 1, 78, -72, 122, 3, 213, -41, -8, -18, -70, -60, 288, -279, -52, -45, 252, -7, -154, -150, 113, 175, -141, -241, -74, 44, -82, 205, -76, -104, -35, -94, -199, 163, -22, -214, 283, 186, -33, 63, 74, -112, -40, 77, -89, 84, -128, -43, -12, 140, -47, -45, 298, -130, 0, -181, 238, 72, -32, -62, 123, 113, -92, 34, 59, 66, -116, -54, 201, -73, -14, -50, 2, -122, 70, -120, 132, -91, -163, 213, -36, -39, 250, 24, -427, 81, 112, 72, 104, 185, -135, -47, 133, -6, -123, 3, 125, -41, 187, -192, 18, -13, -148, 176]
1907A76l57L45j1j77J05j22J59k70j66J73K96Q2n8r3j63P5p9k3O2K69l07l3K05
1930H8O4k45J81k28j69M4J0R7K04j19N0J08l3n6M8N8j39J55l68Q5K6j79L23K00
1954B05k39J79k02M9r2K76o7n7K78k73j47N3M7J4K2j17P0j91L55r4j35K09J10
1977B53k16K5j24L2kN9J66rj35k54J01J42P8m6j53M4O9J55r8l33K02O0J33p5k44
2002a70K67J63l72J06J40k4Q4j33j06M0K45k95L29m07J71n0j0J0J05o3n2O5Q5
2025A28L3k20M4J38k20R9kj05J32J25j33J83J1k54K9K12k8k13K08j69j57L14k00
2048d5J41mj26KL5J23R2J46k96r7m5K23j74O8l9J09j37J96k20J59j88M9p7J34
2072B9J45k81L8PK2q7R7j76J25O7O3j8K41o0q4l2j78O3J2k1k2R8l0r3K8m1K51
$$ y = [176, -181, 164, 153, -24, 81, -41, 118, -152, -318, -145, 151, 233, 175, 82, -81, -6, -85, -108, -46, 223, -84, -117, 88, 152, -93, 88, -140, -309, -265, -255, -158, 46, -73, -23, 85, 52, -4, 44, 102, -37, 118, -250, -165, -139, -318, 5, 205, -34, 145, -57, -8, -100, 176, 109, 52, 330, 57, -90, -37, 10, 24, 46, -71, -1, -192, 163, 69, -66, 143, 253, 37, 62, -62, -30, -32, 27, 193, 184, 49, -205, -104, 38, 116, 70, -83, -39, 30, 185, 87, -246, -44, 16, 149, 74, -170, 97, 260, -112, -6, 134, 110, 194, 61, -45, -5, 240, -55, 274, -133, 38, -12, -22, -12, 93, 30, -22, 43, 128, 161, -59, -15, 123, -97, 2, 0, -105, 27, 152, 19, 202, 213, -41, -12, 200, 172, -41, 167, -2, -159, 155, -45, 96, 92, -34, -32, 3, 126, 218, 364, 68, -29, -74, 149, -25, 43, 4, 113, -24, 172, -48, 111, -77, -28, -105, 29, 174, -107, -69, -62, -40, -127, -30, -206, -81, -14, 49, 31, 272, 212, 128, 96, -82, -19, -7, -28, -50, 48, 18, -75, -47, -88, 163]
2099A63l04P7M3p0k56M66j56n9K01kk32M1K34m15J70K90r8Q4j58K1P3J16j93J4
2123E0j04m9O2n1P5j75K88qM2m7J93m72J85mj7KR7j95J71Q4r2M7j71o9J3L02l27
2150a70J38R9l13L71k43J87j38j8J56r0mm3J33K7m5kL7L0j77J44k52J6j28K88
2174CK36k5l4r6J97k34r1m0J3P9L8J12j54M9o3l39K45P7J38j43P5L4k71J80J1
2199cM8q1L35j61m01L15jm8k43PL02m8j41J52P6r9o8J20q0l3k0Lj10L42j02J4
2225G5L45l16j10p6J1J60q3P6n8j28N2kq4J25R1j17K32R8l93p8L54l04M7O4K7
2250HJ43j33m4k8M4J12M8j89K8J02j8j7j64q7K75k24K04K3o1j13pL2J6J98j42
2275Fn3oN7j75J71J6j1j94J77J55l4r3J10r6p8l4J0K4J53J18l03J16K0q1j95J41
$$ y = [163, -141, -64, -21, -91, -347, 119, -37, -96, 105, 103, -129, -88, 146, -269, -99, 191, 93, 177, 19, 40, 113, 229, 36, 50, -54, -103, -41, -92, -17, -192, 96, 88, 130, 83, 276, -196, -11, -15, -32, -30, 67, -128, 43, 127, 35, 82, -89, -158, -145, 157, -170, -32, 67, -246, 125, -118, 69, -69, -87, 69, -21, -25, -68, 65, 92, 47, 45, 82, 112, -65, 79, -173, -157, -285, 3, 239, 214, 180, 84, 281, 47, -44, -84, -71, 8, 46, 158, 4, 53, -10, -349, -104, -27, 111, -32, 43, 77, -194, -14, -3, 45, -36, 299, 138, -263, 52, 51, 3, -240, -233, 69, 21, -120, 32, 108, 9, -59, 61, -19, -52, -72, -69, -179, 163, 61, 75, 420, 104, -6, -82, -71, 89, 6, 82, 24, -104, -52, -54, -138, -13, 78, -39, 193, 291, -102, -180, 174, -130, -83, -19, 8, 151, 18, -26, -54, -10, 102, 150, -39, -11, 91, 73, 56, -108, -195, 80, -144, 60, 83, 22, -91, -98, -66, -50, 148, 6, -47, -53, 4, -171, 0, 16, 5, -189, -12, 143, 109, 16, 126, 30, -48, -82, -72, -48, 105, 223, -80, 36, 56, -25, -220, -79]
2301g9L46n21L24l8R8n6oN4J22k18k56K11k76M31J12l29O3J46k49J45o2k7L3R7
2325F5nK85m74M0J51J77k30J58n3k76K28j35J10rL78m12L33j92l78L61Q7k39Q
2348b2J0K33k36k15K32P6j96L12j39l4N5l23P6K96j32J23k62J05p9L1J54p2k03
2371b10n1J98j85L12K3j65M6J59j94M0j41K93j59J88m7p5m26K12K27j46p9K01
2393B1O6J25l9k33j48j01K01N1K36n33M84J43o8q6K2j79o6K1K20k09l9K00J18
2416B07k9q2N9j93O7o5J23j0j9p4J51k92J47n9MK07J58m24r3K74j52j02J44j05
2440a58R7j36J63J40k55L04j64l3j91L33k17J04n7JJ72p2rq2n9m9N5j30J19P1
2464e3K55k72l5J74k77K28j95j65K45J09j35k01M53j52k02J95j6J05j30K6J69
$$ y = [-79, 267, -254, 70, 32, 130, 74, 68, 122, 244, 26, -230, -19, -295, 136, 248, -81, -18, 128, -121, 24, -38, -65, -32, 65, 60, 345, -129, -89, 62, 239, 9, 167, 114, -162, 66, -69, 41, 32, 410, -2, 331, 139, -239, 122, 209, -30, -22, -12, 221, -15, -230, 2, 78, -118, 194, 55, 21, 76, -247, -171, 125, -7, 116, -146, -41, -120, -89, 65, -7, -210, -261, -63, -248, 64, 87, -78, -32, 127, -67, -27, -168, 125, -34, 154, 107, 32, -394, -182, 45, -101, -180, 21, 87, 212, 173, -60, -208, -309, -108, -57, 179, -354, 130, 273, 205, 119, 141, -38, -104, -83, 137, -72, -111, 89, 207, 178, 96, 155, -38, 29, -36, 87, 77, 58, -16, 135, -157, -10, -69, -65, 142, 300, -124, -217, 57, -95, -197, -53, -158, -61, -197, -34, 106, -149, 155, -9, -42, -233, 100, -117, -13, -70, -69, 103, 31, 22, -60, -119, -168, -113, -243, -124, -53, 202, -70, -105, 69, -208, 20, -175, -340, -95, 14, -121, -322, 131, -21, -223, -28, -44, 61, -69, -43, 126]
2485A26J01k85q2J04n7k36J10M3oK09j56J06l7q9J93j70K50n8l7l2K01N5k46M5
2509E2j28N2Oj0K79j83O9j78J77k08j03K57N2j31j13j64J04J91k3P0Q7m2j91L2
2533d6L93l63K4j28K00j78M6M9J7k55J76J41q4J82q6J18l56K47k46J95l29M04
2555A21M3l07J28j2n0L0j33O4j8K10PQ4l72KK39k7J46j77k36K54r8M50k84o6j34
2580a36J18O3k61J10j48K07l3j31K12K61j28k0j91K39P5k71J0Q3l1p6J07j42J00
2603A7P4j92K84n09K63N2j10L7K90l04J22M6j98K51p8NL7j24r9K10l39L92j55
2626b8N0O1l2l0J46k81K2J33R1k52J24k20j07K80J1K4j03n4J87m1M6n8P3m9Rp8
2652g6J12M8k42J98O8L3j63o1L26k61M2J39k82m5L12q6Q6k7l8J1K3Q8k75M9j00
$$ y = [126, 227, -58, -140, -36, -93, -329, -219, -176, -182, 27, -129, -23, -60, -149, 44, -126, 124, 66, 29, -3, 198, 253, 7, 52, -76, -24, -18, -28, 251, 68, 137, -41, 136, -72, -175, 82, 134, 3, -110, -274, -170, 21, -2, 68, 155, 113, -78, -46, 347, -16, 8, -120, 80, -98, -52, -3, 14, -241, -65, 76, -8, 174, 88, 206, -150, 97, -149, 46, -283, 121, 164, -143, -15, -27, -77, -47, -180, -116, -134, 76, 83, 167, -205, -203, 36, 9, 155, -22, -258, -4, -102, 348, 64, -2, -136, -18, 45, -216, -106, -254, -47, -80, -211, 1, 262, 134, 114, -77, 162, 237, -34, -24, 59, 28, -48, 59, -83, 17, 91, -101, 183, -326, -63, -11, -121, -84, 206, -98, 24, 70, -128, 123, 45, 50, 87, -37, -136, 74, -265, 127, -28, 22, 83, 51, 21, 167, -114, -92, 41, 132, -120, 4, -216, -323, -43, -32, -8, -111, -165, 22, -19, 27, -31, 42, -7, 2, -76, 36, 84, -158, 40, 108, 141, -22, -83, 243, -18, 24, 163, -119, -164, 148, 62, 148, 121, 83, 94, 117, 205, -70, -21, -121]
2677a21k0R3R3L0l0m1O2J06r2j67j22K72J02k46J96o3j45J10L5J10k28K06k21
2700h1J17k00M24l30M3J7Q0N5k82PJ29M9L41l32p3J27o7j98p7L85j04Q2j02K8
2724C8r0R8J9l0r2P5j84N7J8k7L4K38l97J92m8J83q0JN2Qk13P9j47J24J01j8q7
2751i6l6L75k58J17j29J79j18P8j38m8K98k51l0J79k09K9j02RK04j76J70q0n1
2774h4J61j44p7J2J28%k37J75o6n8L00j00k8K55k58n3J17m4j42J69o8N0J02p8
2798C2M8j25J07n4k21L05o5o4P8j39K05j41J56q7j93J16J37m12K16Q8m4P5j03
2821h5J35O9k08K20o9j3k09J05J29j15o7r2L74k81J7NJ08l4r8K7K9K08j40j90
2845a75J31P5N8k51M57m5j28J24m74LP7k10M05L7K5j36j43J00j46K68M5r2P6p5
$$ y = [-121, -141, -48, 45, 75, 45, 4, 66, 172, 80, -87, -209, 63, 165, -81, 115, 52, -93, 17, 52, 162, -66, 140, -81, 36, -164, 260, -70, -27, -10, 70, 125, -157, -150, -21, 28, 369, 37, -36, 91, 24, -174, -251, 134, 30, 112, 10, 38, -52, 46, 65, 35, -57, 18, -166, -109, -91, -118, -84, 154, -243, -51, -99, 84, 4, 5, 57, 65, -148, -69, -216, -92, 9, -9, -96, -132, 243, -15, 102, -27, 152, 34, 112, -26, -74, 224, -27, -57, 122, -87, -58, -160, -151, 53, -123, 47, -33, -84, 77, -67, -144, -132, -4, -4, -241, -66, -132, -190, 110, 10, -18, 237, -21, -74, 43, -1, -143, 26, -42, 8, 110, 32, 80, -45, 62, 8, -213, 92, 27, -37, 41, -98, 107, -34, 122, 35, -158, -42, 95, -317, -101, -13, -57, 18, -85, 50, 119, -89, 131, 62, 49, -160, -55, 74, -41, -108, -200, 174, -107, -90, -85, 23, -11, -109, -82, -53, 155, 15, -175, -44, 31, 89, -162, 295, 250, 122, 246, -228, -225, -148, -358, 47, 84, 109, -27, -170, -70, -216, 52, 97, 5, 81, 6]
2869Fo7n3J27Mj54K04k58M04k70J7J03K8j1o4j43J15j27J21k4L3K0l7p7J1L5l
2895f0L12l53J44l9%q5r5J24R3r0J34N6k24q6J03m0N3n2K04o8K8J76k72j68J03
2920a02O9J53k65L66j91N1O7j25Rr1k2J82k54L04q1J5nj67k7q7K36r5K9j90J99
2945b2No2K00L0k11j19O19n25m5n3O8Q4j88J03J96j26J12j41n1Q8O2j46J18J80
2969A76j56j12n7O4K77l14J94m4j42J33N6P3Jj4j81K44j79J67j46j33L0l5K58
2992A60o8P6k91J94k0J13j75l69M06l3R1j7l0k15L46l21L80K3l37L70k34j53K04
3015A00j80J56k42K22r1j13j2J33j75j3K71o7q3p3K59l20J46J72nj99J64J96l12
3038f6J61j49J97q1L05n92K47j70J21J66j59j52J95r8r5J83n8l0l8K81k46P3j70
$$ y = [6, -61, -114, 13, 17, -137, 67, -191, 213, -57, -40, 63, 91, 80, 16, -127, -12, -139, -18, -42, -9, 11, -26, -103, -92, -57, -60, 252, -101, 43, 4, 4, -81, -176, -52, 41, -49, 85, 141, -83, -169, -66, -106, -53, -105, 99, 31, 59, 235, -37, -205, -102, -33, 120, -145, 221, 30, 81, 148, 23, 32, -59, -81, 101, -153, 151, 70, 85, 80, -87, -114, -201, 35, -60, -31, -221, -22, -17, -79, 121, 151, -60, -179, 440, -85, -130, -183, -115, -31, -219, -116, 80, -46, 66, -75, -126, -38, 24, -122, -4, 176, 20, -92, -149, -85, 192, -122, 72, 28, -114, 19, 75, 148, 149, 135, -46, 198, 19, 186, 40, -93, -63, -98, 160, 92, 168, -123, 71, 51, 164, -11, -380, 26, -7, 84, 67, 37, -178, 168, -153, 227, 250, -87, 283, 49, -104, 100, -80, 76, -166, 56, -35, -148, -160, -27, -202, -215, 56, -11, -94, -167, 92, -228, -82, 90, 85, -114, 50, 246, -66, 95, -54, 143, 62, 367, -225, 22, -148, -27, 139, -20, -172, 23, -75, -170, 13, -45, -75, -113, 168, -78, -5, -175]
3061a75K35k2J86l07J77j47J13j02k4K78l06L49l90j9J84J53j44n7K17j78q1O6
3083Fm4K88l10J35k23J8l5j4M56k03k61M71l42R9K11n90M12p8k3l7J04Q2k14L0
3107f2j33K65O9l61J2L04j54J39j22L5k18L53j19J44k56J68k29Q6J47l26K43o8
3129h3J63J00o5j2Q9k32n9n3rM02j21j88J23K0j7j38J28R1q6J28j84Q5l01M32
3153B13k71J53L6r6j91K65j76j39O2J86k26J14oj0J97rjj81J7j18L04k36J58K41
3177B86k91Jm3j14L2mQ3j59K77Q6o5Jj26J91m32L34j56J16m6j4r3K61K6l73K75
3202E3J56l08M1J95o5k30M07j26k72K9J39P0k02j53J75q9K32j02m0k48M38j29
3224b9j10R7Q0j75K8J59l50J18J62n4MK96j32p1k1k36K34m5p%j0J38j41K56j48
$$ y = [-175, 60, 38, 224, -83, 94, -53, 60, -42, -66, 212, -94, 255, -135, -154, 30, 183, 39, -18, 199, 21, -60, 6, -38, 250, -60, 75, -148, -130, -165, -179, 277, 74, -187, 284, -58, 41, 252, -338, 74, -4, -27, -64, 40, 122, -92, -62, -195, 70, 139, -222, -210, 94, -60, 79, -43, -8, -226, 127, 8, 152, -104, 64, -165, -79, 68, -258, -15, -83, 80, 180, 115, 103, 192, -40, -99, -152, -161, 241, 120, -68, 55, 75, 58, -80, 48, 139, 53, 181, -3, 82, -219, 213, -58, 95, 131, 35, -156, 109, -67, -206, -144, 42, -184, -70, -76, -86, 111, 102, 101, -80, -63, -181, 123, -113, 45, 286, -5, -4, -47, -161, -129, -133, -50, -209, 68, 154, 89, 90, -36, 155, -277, 57, -99, 17, -29, -43, -136, 125, 151, -222, 53, 209, -99, -58, 137, 72, -158, 249, 123, -149, -120, 19, 89, -113, -266, -91, -180, 52, -50, -90, -338, 100, -29, -139, -42, 38, -137, -109, 50, -300, -182, -20, -74, -70, 226, 94, 23, 2, -234, 0, -45, -52, -52, -62, 76, -65, 191, 43]
3249D3l17J51m3K09j9J81l74M30m19Q4P0J55j40j66L16k56K61k05K51l07p5m5
3271b15J87J76n3j08K36k89L4N5k6J07k71L83k7m73J01K94m5j0Q1k44P0j44N8
3294a23M31k74L1R5k05J63m1k6J76l88k9M55k05l00K70K5j46J4K6j5n3J62J7J15
3318A75m07L27k83J25j6J81K3n1r7J97k51Q6L3jj9o0J95k7M4j18j67MJ97J61m88
3343b37J89J34j11l0r5J99L4J18o7j62L1P0J32m04o7J48Q6o0K37r2j49K32j37
3366aK88j51k54R8R8n7J28k33j32j61L22m6r2N50m67Q4r8K16ok46J31N4j70L5
3390a10L25k81N0l8J22M0N8j30J61o8L6l54M53k23r0O4K4j84M3R8k69L86r0N3
3414G6j10QQ5k38nK86J03M3n37K51Q8J11l48J28Q9k48K68j02M8k1M8k47J76K22
$$ y = [43, -274, -123, -166, 43, 24, 205, -169, 261, -158, -74, -4, 151, 11, -155, 161, -95, 166, -39, 212, -95, -170, -215, -28, 148, 95, -13, 223, -66, -32, 23, -3, 104, -167, 216, 189, -284, -183, 111, 66, 56, 137, -107, -37, -181, -123, 308, 34, 65, 160, -45, 118, 77, 51, 227, -161, -190, 265, 60, -240, 30, 55, -91, -77, -51, -66, -119, 43, 60, 175, -232, 95, -188, -63, -79, 102, 125, 74, -23, 174, -77, 9, 42, 41, 22, -38, 157, 130, 174, 56, -111, -107, 90, 251, -237, -48, 86, -25, -55, -150, 49, 83, 201, 134, -28, 3, 73, 205, -199, -266, -118, -32, -92, 145, 53, -96, 136, -1, 287, 136, -118, -20, 78, 21, 149, -84, -216, -377, -55, -101, -193, 357, -110, -26, -124, 92, 86, -160, -29, 25, -145, -110, 215, -66, -16, -54, 68, 108, 166, 36, 197, 129, 165, -189, 264, 41, -49, 15, 39, -145, -102, -4, -273, 113, 23, 76, -34, -26, 59, -179, -184, 102, 205, 248, -289, -38, 50, 161, -187, -59, 30, -218, 50, -52, -4, -25, 23, -224, -48, 174]
3438A74j83K61j80k7j66J7O5j36J69j88N18k13l04K51J27j77k94K55q2J60k17
3459a70K68J79m11J48N0j76L36k88J71k74R5R0j62K43n6j58o7K42K20k02J40j66
3481E2o2j7QJ11l0r6k5M6r5J04j43J31j99K88j92J7K6PJ41k5o4Q0j8j61K25k92
3507a83K00m5J36l41K96L9J2n9M1j73Q7k17J72K8M0l0PR2j1L3p3n5J28J66k09
3532H1J00l34K74Q5k79K32J10k46Q9j67J00N9K5o3j61K36J23j94J10j33j81K5
3554a09J85j52j53L31k89L7N5R7J41k14J82j95n5K25r5K96k00o8K5j16n1k8M5
3577a06J59K7J12k67m0N7R8J01l87J54Q6k51L86L1l88K97J25n9j92j33K34L5j70
3600i1j58K03M3j21R4j05J38l70O75k84q5j83J17M4q0J62k50J84L28j29k63N3
$$ y = [174, -9, 252, 72, 45, -121, -104, -39, -175, -6, -194, 324, 111, -193, 58, 185, 8, -286, -31, -113, 47, -170, 98, 277, -134, 14, 64, -112, 224, -64, 107, -167, -72, 18, -144, 99, 43, -115, -182, 60, 280, 78, 218, 52, -10, -27, -19, 92, 62, -34, -59, -13, -108, -4, -147, -16, -215, 73, -119, -102, -76, -69, 72, 47, -17, 63, 45, -116, 109, -183, 17, -28, 108, -233, 63, 102, 114, 55, 96, -77, 10, -207, -35, -7, 33, 3, 10, 102, 91, 124, 51, -4, 124, 290, 81, 181, -153, 121, 206, -73, 159, 269, 23, 112, -55, 45, 104, 129, 66, -95, 141, 264, 70, 180, 47, -134, -109, 76, -76, -229, 102, -187, -150, -95, 2, 143, -71, 111, -84, -139, 86, -9, 287, 87, 19, 44, -72, -123, -151, -106, 53, 80, 192, -75, -115, -58, 40, 141, -246, -92, -6, -257, 129, 160, -228, 69, 194, 135, -57, -190, 44, 79, -91, -249, -46, -3, -124, -30, -135, 3, -367, 308, 24, -61, -244, -127, -83, -163, -1, -251, -67, 261, 132, -131, -78]
3622g8J64k05J8K10K7j82J37r6K97l75K09m13J53K22p6J40j1j71K45k80nj48J37
3645h1M3J07j94j18K48m4n1mJK28j76k0K9L4j07P7j3J00k21K98k63L84k62k19
3669b24K96p9K68J7r3n3n2N6r9J2r0L13%j81j2k97J17P2J07p0J81l33No6L00j08
3695a3J5k1J85k91J51r7J42p4J10k88K28k4j52J65j09L29k37O9j36q7L16k91j26
3718b36K7L57l83J40j4j1l3J81p2J4J5l89N42L6j82j19J29J12k85K89n4k33L41
3741A72k77mM7j1K29j64Jj95K90J06j82J74k97L1M9l5K3q3K20n1K48l58O1j58
3765a64M99j37k46J52r4J14l20L00r0J24l2k47L30k1k16R5J46mj37j14k0K49k10
3788d3Q6J07k88K44j39K83k40l0L14m79J89mq6n5k23K17J08j41L16p1J5p4k53
$$ y = [-78, 86, -119, -101, 109, 136, -46, 91, -5, 292, -83, 126, -287, -134, 88, 12, 152, 141, -30, 215, -65, -70, -218, -81, -38, 69, -125, -243, 5, -39, -90, -94, -93, 135, -41, -61, -32, 2, -105, -28, -41, 59, -162, 136, -127, 257, -5, -224, 72, -7, 261, 278, 185, 132, 80, 136, 37, 49, -41, 272, 272, 91, 79, -218, -101, -29, 78, 8, 189, -144, -139, -205, 95, -13, 2, -19, 166, -125, 26, -71, 71, -3, 107, -181, 47, 23, -129, 36, -73, 256, 19, 88, -48, -135, 181, -110, -236, -209, 148, -235, -95, -109, -120, -153, 28, -44, -30, -15, -404, 138, 174, -8, -127, 2, 114, -171, 118, 64, -169, 172, -105, -109, -62, -73, 156, -8, -7, -202, 88, 194, 12, 186, -111, -80, -31, -66, -43, -126, 94, 43, 291, -67, -6, -164, 335, 198, -48, 104, 10, 124, -196, 104, 14, 138, 106, -141, 189, 168, -48, 47, 193, 189, 52, -62, -82, 167, -43, 43, 150, -138, 106, -33, 250, 10, -20, 294, -185, 4, 0, -86, -141, -364, -147, -39, -180, 136, 65, 80, 6, -247]
3811b47K72K3j97J53k0J51l82L38r4Q2j56Pn8M6J54j5q2Q0l5l48N78j09j57Q0
3835F4l7J2j90L35j93m3J6j07M0J54N7j89l01N02N4n52L59j39n4K35j05J49o4
3858Cl8n2j85K0K48j35L60k7l85Q8L3J52k23K38l38K94j66J71o6q1J54J58n7j20
3882D6j90K19k02j2J09l7K13k83J12J04q5r2J53n1J06J2j60j14L95k55L8j70N04
3905C60k07l61J15J19k2j00J74m58M79j50p0J82m4j44J82J8kj19k08K73j52K16
3927H1j86L5n3K38p2j37J42K10l76K33j04j01K3O6n2j92K00M0n4J59m4k63L31
3950A24k87R4J63l3J20k50J81r7L8k31J15j77K34K32j0q4j41J75j48nP1k20K5
3973a11J65j45J32J6j35j39L16J12k81J6J8K86l01J78m2r7K93j60j95K36r0k04
$$ y = [-247, 25, 48, -149, 4, -16, 135, -247, 91, -3, 79, -77, -70, -128, -82, 72, 57, -25, 55, 20, -328, 250, 141, -16, 64, 27, 39, -151, 184, -9, -52, -36, -143, -103, 51, 108, -81, -382, 120, 174, -378, -19, -158, -212, 23, -82, 67, 3, -35, -87, -272, -252, -4, -139, 221, 194, -191, -103, -70, 82, -141, 97, -241, 53, -113, 58, -8, -89, 65, 223, 166, 46, -144, 75, -127, -139, -30, -67, 146, -137, -25, 79, -6, -98, 55, 4, 110, 122, -38, -152, 243, -12, 26, -144, 360, 153, -208, -93, 26, 4, -96, 78, -380, 99, -51, -121, 61, 17, -127, 55, 73, 71, -48, -256, 17, -135, 81, -105, -70, -123, 115, 43, -94, 48, 258, -118, 115, 11, -90, -67, -1, -53, -245, -45, -5, -59, 100, 56, -207, 124, -163, -69, 94, 61, 181, -69, 112, 15, 53, -178, -63, -240, -6, 226, 216, 132, -9, 166, 18, 13, 84, -136, -111, 54, -91, 41, 57, -78, -217, 99, 211, -70, -54, -36, 250, -51, 127, 85, -12, 281, 121, -74, 162, 72, -132]
3995a32K39j20M35n08j1R8k9Q8k56l3L27m61K54K06q1j07PL71k89J62j49j71J32
4018b8J55m8k48J60l0Q2j46L25l44N4k99K04Q0J37M4p3p9m8P3j47J30L4k23JK04
4043c0j77j1M32k68oj66L26J17j70j96J95J70r7j57o8J35j44nJ31P9j84K30Q7
4066B23k38k5Q6J27k31L1J13j32jJ47L6l36L90k01j0J12r6p1j93K39J37l50K04
4089c9J89j50N3k70L17j94M0lj16m9K04J19j50N3J00k27J34K66j68k67j96M26
4111G2m3K9PO7j90Q4p2K1m5L21l29J05r8j05K83j15M9k81m4M00K5k25J36j74N5
4136f7l9K7mq8R2k6K58j86l5L16j85m8k9k95L66k80K49J02k89L21k81J20J0K6
4160C5k04M45k71M3Lj56j08L03R1Jl33L64kk85j02J71n7J11j60J18NR2m4J3n4
$$ y = [-132, 107, -13, 422, -86, -97, 1, -28, 60, -196, -229, 98, -363, -109, 97, 16, -91, -84, 287, -2, 160, 11, -160, -28, 127, 79, -169, -9, -39, 43, -103, 222, -122, -68, -367, -163, -83, 54, 98, 25, -54, -102, -29, -176, -46, -12, -235, -234, -30, -207, -218, 214, -54, -60, -226, 100, 217, 47, -149, 46, 216, 119, -38, -106, 29, -115, -120, 11, 90, -94, 136, 223, -15, -40, 46, 173, -58, -27, 86, -46, -47, 100, 136, -200, 190, -11, -21, 91, -5, -76, -269, -30, 107, -243, -39, 150, 0, 53, -217, 100, -94, -54, -57, -173, -222, -18, 101, -49, 4, 104, -123, 11, 277, 109, -158, -354, 72, 29, 58, 65, 132, -58, 26, -46, -25, -70, 251, -78, 27, -71, -176, 107, -8, 41, -240, -284, 116, 141, -84, 52, -122, -67, -106, -79, -83, -171, -79, -105, 153, -33, -68, 248, 63, 15, -14, -309, 57, -223, 26, 128, -161, 160, -121, -1, 9, 35, -169, 276, 5, 48, 51, -105, -213, 90, 181, 182, -151, 213, 211, -74, -176, -5, -62, 49, -111, 7, 12, 104, 60, 73, 19]
4185A9q2J35k9p6m1j60J33L09j46L9j19J40j13q1N3J68j81K90m0m9k08n8q8J64
4209b1j3k03L00q8Nl31L20LJ29k36Q6lO4k3rJ04l91K12J31k01K49m1M00j19o03
4234b79P7L5K95j43k84K61O7R5j64J78r9J73k37j13O1J4J36q1J77l11J77k08M70
4257B97j74j78j48J49k46K54n0o0K50j9J52m25K53o9j41K45k2K13j6m58O1Q0O4
4280A2Q9l13K62J48j92K07k35j38J26K5p1N0J61j50j97L68k4n0r4j57L27r3j52
4303i1o4l3J68M9p8J82j81K7P8j07r2K55k15M9l7K40j61J90q4J72n2l29j11J28
4327i7K63k97L84k51n0j26M4R3P1Pj18oJ08k10L37n7J53j45k34J41Rq4q0QN2J11
4353B6J0j9j18K17k88L23k42J50Q8k55LK76j53J59k34n6lJ12J65L0l26J54k09
$$ y = [19, -63, 72, 43, -33, -74, -234, -101, 208, 62, 101, -18, 122, 9, -72, -19, 149, -32, 258, 218, 169, -39, -97, -185, -21, -34, -237, 63, -25, -20, -351, -31, -28, 101, -135, -49, -52, 12, -11, -20, 84, -307, -95, 36, -165, 84, 43, 443, 324, -279, -202, -167, 128, -15, -299, -38, 29, 124, -40, 138, 39, 212, -25, -138, -77, -63, 73, -8, 169, -142, 35, -173, 297, 123, -55, -203, -54, -300, -46, -96, -156, 94, 75, 227, -198, 55, -14, -155, 90, 68, 281, 265, -193, -132, -52, 12, 101, -212, 50, 198, 6, 213, -22, -160, -34, -9, -80, -30, 131, -19, -216, 152, 128, 78, -16, -173, 154, 61, -91, -155, -188, -20, 29, -49, 133, -48, -21, 57, -50, -142, 113, -102, -53, -90, 150, -11, 179, 95, 267, 215, -114, -225, -97, 166, -131, 253, 2, -48, -174, -130, -37, 34, 41, -77, -83, 25, -185, 152, 95, 248, 103, -131, 10, 19, -65, -145, -137, -85, 26, 36, 17, -101, 116, -172, 151, -91, 59, 147, -108, -105, 171, 18, 177, -57, -113, -116, -4, 161, 191, -135, 19, -190]
4376a90R7J8l6J55k04K09r3j12O8P3K20L0j90l70K33K46k82J62k5n2L6k0Qk1Q2
4401D2KN0r8j33J29j31J28J06J29l99L6K38k44K47k11Q3k8o7L30k93r1p4M51j3
4425A89j45j13L5K82k06r2K72j59j48L60l22K1j06j20K38j42R4K52m61L27l21
4446b65K55K6M9k09J17J36l39Q7J89jl6J09n15L23k6K54l00J79r5J09k5L7j36
4469g7K0J23l70K50K6J99j54L2l2j57K37j20K2k7J0J93l83J79o3J46J07m37L21
4492D5n1j54L75k77Q5J17k32P5J55l17J60r4L23k11oJ46R1j40Q0q6P9M6p4l15
4516a80J80J12l44J40K98k46J05k76K51j37K54M0k02%L22k91l18N42j94O8k88
4537a64K51k1j20J55J4j61J6N4k52J90p3M9J61j1J1jj80J52p4J39k67J91r3q4
$$ y = [-190, -93, -75, -111, 44, -160, 49, -44, -156, -88, -15, 205, 235, 45, -325, -92, 154, -128, 34, 9, -43, -7, -27, -19, -40, 42, 44, 94, -4, -137, -8, -139, -11, 95, 224, -175, -139, 99, -145, 102, -109, -26, -54, -121, 209, -84, -175, -249, 202, 189, 44, -69, -34, 248, 42, -50, 222, 63, -85, 275, -47, -26, -132, -252, -14, -156, -62, 190, -271, 56, -265, -10, 16, 65, -144, -27, 109, -230, -143, 46, 45, 9, 118, -397, -74, -100, 154, -146, 33, -62, 47, 22, 59, -77, -57, 66, -304, -54, -28, 171, 17, 49, 17, -140, 97, -23, -1, -28, -18, 175, -208, -29, -92, 54, 161, -276, 45, -6, -160, 215, -62, 23, 140, -92, -17, 138, -179, -19, -113, 210, -1, -7, 139, 230, 90, 170, 84, 163, 209, 135, -180, 0, 112, -232, -92, 206, -40, 65, -211, 40, -97, 157, 197, -5, -5, 317, 26, -292, 250, 56, 124, -164, 87, 66, -54, 101, 115, -46, -30, 24, -228, -38, -111, -62, 99, 88, 99, 98, -82, 70, -4, 135, -132, 59, -34, -118]
4561a18J20j48J76R4k29N8K0n0l6J12L4K3j42M0j39K79j10K78k90m5M9m5J69k27
4585a27R7n2N3q6J57n5O2OM1n9J79qn94M77n0j62o1K19Q4j95%j1J59mj95R0n7
4612i2M0llK2J3J00P1l1k4k05N7K05l59K52L5k27J36K53k10R1j46Q0J70l39q3
4637a97M6K83p4j05M1R3p2Q5o3R7J62l38p2p9J06J27q5R2j68q2K82m9J6j23K66
4662A89m5k38N5QJ8J63j71r4o2K25l58L21L0q5K6Q1N0r8q9k5j90K53L30l12L28
4687C10K9l22j3K7m6o3j18K53j03l89M27J27k42N9R0m6J20n5k57L77j22j74J86
4710E5r9J56K9k63K34p8k6J53j84N5j40J23NJ14n4J1N8j40L24m89J84rn1j9J13
4735F2m20M27J05k89o8P4J09j85Q5j93K96J05k07J48L9j70J34K51m43J13R0M0
$$ y = [-118, 2, -146, 30, 124, -105, -47, -27, -77, -113, -1, 33, 56, -86, -46, -185, 94, -16, 262, -28, -73, -24, -69, 100, -127, -30, -82, -29, -115, 42, -13, 49, 55, 96, 37, 216, 208, -386, 91, 41, -121, -182, 37, 121, -74, -74, -85, 74, 70, -125, -35, -92, -52, -55, -58, -36, -23, 77, 148, 117, 93, -112, -55, 150, -209, 43, 78, -149, -13, 240, 30, 121, -25, 55, 225, -114, -197, -151, 132, 58, -47, -6, 87, 15, 100, 37, 134, 296, -42, -114, -193, -87, 40, -45, 47, -121, -203, 79, 30, 46, -77, 189, 144, -94, -39, -31, -13, 150, -21, -115, -177, 48, -310, 11, 41, -44, -18, 63, 113, 15, -74, -99, -289, -36, 294, -18, 310, 339, 17, 4, 31, -15, -78, -196, 57, -46, -435, -8, 119, -123, -64, 26, -20, 100, 45, -212, 165, 43, -131, 55, -44, 112, 141, -122, 112, 34, 8, 161, -23, 32, -108, 15, 20, 134, 80, 91, 149, 9, 333, -156, 28, 19, -32, -51, 62, -358, 69, 174, -115, -183, -109, 0, -185, -100, -293, 3, 108, -99, 49, 88, -82, 52, 303, -140, -27, 63, 103]
4757A03P9n2j90p1N2j24K48N2r5J92j93q8n9K57J2m20L15P9k4m5J58m21K71J05
4781A41l1J56l47oJ24J35l22pj63L19q3J36k30J44K40m35L12j37Q0J72q9k82k7
4804b00n8K15j16L27l9j49l1l6j57J80K40O9j89j10k50N19r3k49J97j11L6rk4
4827c8p1R8J59r8m6l6j32L07j79o7j24L82j39k47K35k17L19L4k31k0o2K64q5M8
4851E4N3L5j30j14K93l33K04K6K35j67k66J29J76k17O7N6k44P9J32j41R1L21j90
4874A49j1Pm2J7k63lK91K1p4l4k0P6j13O9L7n0j18Q5K8j32N1p4K76mk06j87j10
4901c34O16k87O5l96K13Q3K53m93K65n1N0K32k68O2L6j78J69p5K7o4r3K92O5k88
4925i9J05o0O6J30m7Qk02J3J96kk61K71j67K93l93K74o0n6Rj20k29K44k1r9M7
$$ y = [103, 182, 130, -60, -131, -79, -203, 45, 97, 2, 194, 1, -87, -146, 111, 123, -297, 18, 97, 73, 28, 186, -235, 36, 141, 110, 266, -81, -87, 37, 172, -150, -157, -320, -1, -84, 52, -178, -34, 206, -229, 83, -54, 26, 198, 109, -173, -200, -258, -43, -159, 168, 129, -20, -51, -87, -244, -64, 176, 245, 56, -54, -304, 215, 122, -127, 70, -41, -5, -14, -38, -109, -11, 148, 50, 4, -32, -164, 143, -36, -103, -227, 155, 16, -231, 4, -213, 106, 140, -91, -111, -173, 91, 6, 54, 107, 142, 12, -102, 191, -142, 62, 88, 323, 156, -110, 19, 195, -22, 45, 101, -143, -64, 68, -73, 18, 339, 149, 138, 145, 103, 120, -143, -146, 145, 166, 92, 58, 38, 114, 1, 70, 107, 57, -61, 24, 52, -80, -29, -103, 173, 169, -37, -224, -334, 282, -5, 60, -336, -123, -40, 213, -280, -15, -66, -16, 216, -52, 10, 46, -132, 37, -38, -11, -75, -168, 124, 189, -99, 6, -54, 12, 142, 95, 103, -99, -86, 110, 108, -153, 118, -49, 244, -149, 125, 65, 9, 18, -102, -331, -87, -108, -207, -160]
4950a60L52m3m0q2p9o9q3K09n8M3q6L38k48J4n1L4o3O8j61K14k7J39j82j46K39
4975G2j72j95K71R1r4j92M55k94J60P3j83O6k27J37J68k36L31j23j02J27k12K24
4997A45j57N2j84J14o5%L72j00k12l1J07j38Q0nJ48j97J91j01j10K59j07p3M4
5020C2j35R3n2Q9p9O6m5k81L56p6J43J30k89J08j3J09l45R3K42P0L6j07j81M3
5044GJ05j27J83o7j29n1J21K9j1J30J27j95j14P4j8j27J39l5l43J63K4k0K82r9
5068D8j06K23j02l56O0J39J08j38J19J20k43Q3k6j70J79R9m1j12j99N5L07q3N5
5091A9j04J10j40J47K30k70O5%l16J22R5K01j73L3oL5k54M9O2K1L5J56j57K0J2
5116hJ05m1O1k6j66R4R2j29J23j64J25M4j68J58j44p5M4q8J1K97j3j34Lj07J79
$$ y = [-160, 192, 149, 109, 27, -52, -121, -204, 5, -53, -10, -96, 242, -6, 8, -43, -9, -72, -4, -165, 49, 22, 161, -21, -167, 72, -100, -295, -24, 67, -27, -219, 236, -58, 102, 175, -8, 58, -169, -32, 136, -100, 231, 108, 6, 133, -79, 145, -12, 40, -144, -30, -95, -95, 277, 177, -35, -66, 41, -97, -17, -22, 126, -71, 120, 19, -91, 168, 61, -12, 32, -103, -10, -62, 27, -52, 14, -31, -312, 44, -32, 111, 241, -48, 60, 47, 156, -189, -96, 146, 216, 252, 145, -36, 7, 112, -15, 168, 101, -28, -79, 42, 71, 60, 190, 317, 122, 8, 82, 64, -63, 76, 41, -302, -139, -115, -135, 147, 48, -58, 165, 63, -293, -233, -94, 14, -124, -5, 115, -128, -45, -71, -241, -62, 37, -4, -116, -315, -260, 47, -36, 19, -85, 25, -115, 32, 262, -8, 57, 57, -259, -137, -42, 159, -14, 19, 13, 48, -206, -157, -95, -74, -39, 117, -40, -20, -8, 97, 56, 117, 91, -75, 19, 111, -18, 105, -59, 66, 110, -58, 100, -44, -119, -75, -163, -152, 145, 132, -2, 1, -106, 73]
5141G3l3O9j45L9m7K23m5j98J32M2Ml51M11j58j1J35m03L41j48J47k06J95k59
5164a93K13j85J84k70K91m1np5q9N7J10j19K30p7j23J82r7j9P3L5l08J95K84m86
5188b33J48J30j97K06K3o0kk28L73l94J55K27l96J04j0K42K29m34J76j49k83K95
5210g8O0J25r5j0N3p6p4R7J6M6l5O6p2J57o7k08J63r2k92K48J20j44r6M99k64
5235D7j57r2O6O4o5K33j55L9j63L06m8qk1l5j60K0J21P9q9k40J63N0M2k2J87j78
5261a6K1P6J40l38P3o0M9R1O2l97J80K21j63K7R7j01Q7J01j11j11J37J31k00J87
5285A83k12N9J50j34l13J01oJ6K17k44J31K39m5l8r9J49k6q6r6P2n0K76j25j81
5309f2K38l08n0K29P3J5K3k91K02Q3o8l6N1j26J0k8m8K4K35l97J03M31m41O8O8
$$ y = [73, 40, 109, -36, 3, -44, 179, 134, -64, 68, 110, 114, -237, 174, 16, 5, 140, -263, 78, -70, 77, -129, 66, -193, 20, -165, 19, -251, 40, -1, -6, -81, -170, -113, -3, -122, 108, 31, -92, 90, -7, -26, 47, 82, -226, -31, 253, -233, -85, 45, -152, 54, 77, 17, 15, -213, 160, -234, -79, 148, -248, -144, -154, 88, 317, -117, 59, -90, -373, -78, -18, 107, 12, 2, 55, -21, -95, 2, 18, 64, 29, 95, 23, 180, 113, -95, 68, -24, -316, -68, 52, -92, -188, 311, 47, -110, -202, -136, -72, -137, 96, -59, -20, -183, 123, 75, 67, 46, 11, -149, -129, -8, 71, -18, -258, -95, -45, -3, -25, 162, -16, 5, 81, 221, -117, -44, -104, -55, 36, 98, -299, -119, 102, -61, -34, 63, -38, 49, 150, 39, -72, 65, 196, -4, 183, -29, 30, 180, 46, -267, -166, -172, -156, 61, -183, -52, 187, 142, 104, 5, 154, 128, 42, -54, 18, -32, 244, 119, -62, 176, -132, -182, 47, 120, 135, 158, -133, 69, 152, 84, 48, 99, -27, -17, -45, -93, -69, 166, -231, -128, 303, -138, -70, -2]
5334bm3j78L10j05J74j94j86L28j8l9P7k93M20j65j32J72p8j40Q8M6j19K0J37
5357H0j1j88K43J07k58lR3j37j77M42k29l0k58K37J54j17k86L50J22k34K86m2
5379A44j05l02L06k23J39j14K24%K2N0j19jq1N7k4j41J67k8R9j95N3P2J63K6l51
5404a62J74L5N2k30J30L14l29J67p6m0J14j43m9R6q7j53j12K26L49k09j54L53
5426B66j05j75r2o6Q6J19R3j02jK9r1L3R1k52J90K15l21K78l60j28K97p8J45l0
5450D1j08j9N6J27j64J5q0J23j21j00K72j24J9r3K79k57J81k00M0P8R9qK3j28
5474d9l7j6K04P7k16J16j93J53j08J50q8J85k66J60J06j26j42K08l5j12l3r9K00
5497C9J22q4k27K25l23O3q2K09o7K03k53J98pj07J50J00k20L0JL8K16r0O7j59
$$ y = [-2, -45, -223, 87, -18, 156, -38, -224, 104, 86, 47, 124, -169, 251, 86, -46, 126, 48, -92, -4, 42, -77, -57, 80, 69, -119, 124, 231, -27, -30, 63, -74, -251, 191, -38, -68, -326, -89, 65, -52, -338, 12, 134, -100, 186, 144, 39, -263, 43, -180, -41, -155, 69, 69, 91, 141, 22, 21, -60, -3, -27, -168, -1, -29, 70, -125, -72, 0, 163, 189, -162, 12, 47, 99, -131, -1, 313, -16, 151, 75, 35, 149, 6, -43, 53, -34, -187, -299, -73, 276, 67, -87, 266, 161, -14, -106, -172, -86, 33, 126, 24, 23, 52, -39, -6, 85, -167, 23, 238, -83, 195, -165, -293, 4, -74, 71, 41, -67, -86, -30, 97, -67, -52, -132, -9, -130, -230, 42, -82, -63, -156, 123, -134, 47, -153, -113, -35, 64, 56, 79, -49, -86, -102, 102, 179, -37, 79, -114, 39, -69, 81, -7, 178, -88, 72, 178, 52, -90, 118, 83, -29, -62, -161, 39, 161, 77, -150, 75, -248, -185, -267, -58, -125, 78, -175, 23, 16, -91, 59, 159, -61, -31, -30, 8, 224, 134, 201, 42]
5521D2q3Q7l01L38q1r9j55n7M58l00J88K18k42j13k9J41O0q8q1L17k95N1O2jN4
5546I1k05K53j21L7L8l1PJ07j3k37k5J88j49J82m8K0m6j21K50j52R4pM8J3l19
5571a46K53j40l2j57K09M5j34l8P4J5J70r0r4q5K53k33K91l24J48j07j16K29p1
5594h0o7m1K32l2p8J64k93R7K8P4r7n6J64P0J39k16j83K62l44J48Q9J6j8K78j35
5619A21k32O2J08Q5k21n4J22j64J61n4K8J41j6j10n7Q9J61j88J59k26K01J30l78
5642a32K75M0k71P0K3J73j39k2j83L08j94n4J7N9k03L23K15k07jN2k7Mj51Q4r0
5667c1P6Jo4l3j34L35k16J72r7k3o0K3Q0Q3j52J32l63m2K25J90L9p9j5O8Q5k49
5693d9J48j99k3Q3l67K70K91k63J95l30Q2K42k69J54l03L85j6J52J6j81N3k66
$$ y = [42, -41, 46, -255, 83, 2, -97, -252, -309, 149, -151, 37, 255, 13, -100, -129, 12, 72, -16, -97, 220, -75, -24, 38, 37, 91, -114, 139, 18, 55, 93, 62, 69, 176, 163, -74, -99, 89, -60, 122, 74, 94, 48, -73, 177, 25, 119, 112, 160, 173, -146, 107, -33, -65, -222, -13, 32, -102, -140, -66, -51, 119, 29, -65, -150, 103, -130, 161, -163, -15, -122, -238, -9, -80, -147, -188, 44, 12, -66, 98, -195, -98, -70, 4, -93, -149, 15, 85, 224, 8, -175, 87, -257, -109, -20, -4, -22, 256, 121, -111, -49, 59, 144, -77, -131, -9, -173, -12, -66, -38, 103, 87, -23, -80, 9, 170, -18, 141, -85, 116, 246, -132, 143, 183, -88, -18, 5, 178, 39, 17, -166, 142, -52, -106, -89, -30, -233, 90, 305, 98, 97, 149, 122, 126, -25, 59, -31, 45, 46, -18, -51, -185, 150, -66, 106, 9, -14, -74, -51, 29, 112, -40, 92, -271, -313, -88, 102, 141, 62, 47, 115, 200, -49, 99, -100, -123, -40, -407, -137, 154, -109, 86, -244, -162, 80, -189, -35, -338, 47, 31, 183, 199, 18, 71, -195]
5715a95J88j86J49K16j80L05p0l32J57k9j17J24n2j43L61l65JM02l69J21Q5k20
5737a49L24j88l9J6Q5o6l0j15L34j01j80N4Q0p8K83l09L92j72k98M17k64p8l2
5760a14m4K93J19l69J03J38l8k2k60J11r0R8O0K76l87k6J90j50J16j91J47k08
5782b48J89j4J88r8j65L13K4j70kk45J46O8J2J3M0Q0j29j45K08M8j87R2j74J65
5806Iq7J32o7l0J95m2n7P4L2p2r8J48Jkk55J8K30O1j58q6j21J36P9J3j70j67M94
5833B10l11k7K11j05J60k9N2k28M4K00Q4m09J56lj57K07l12n9M49j90l9K90j42
5856E2r2K67j75m1j28L38l98J69j03J66J10j5j93k4Q8P0k74M8J5Jl9k5J28J35
5880H0M2j44J04k05J77l00J84j01J16R0r8L1j80L87l28L32k94P2K9k31L04j71
$$ y = [-195, -7, -193, -44, 172, -8, 297, 227, -105, 52, 23, -94, 30, -22, -165, 196, -169, -168, 234, -135, -14, 71, -149, 175, -13, -52, -36, 49, -17, -47, -162, 172, 71, -109, -55, 25, -53, 230, -79, 313, 141, -157, 260, -4, -82, -114, -158, 135, 254, -115, -12, 126, 88, 66, -194, -83, -173, -75, -15, 261, -126, -152, 38, -112, 4, -187, -40, -248, -59, -73, 115, 17, -148, 165, 189, 19, 17, -228, -82, -14, -2, 11, 51, 131, 2, -143, 65, 113, -74, 18, -156, 9, -78, 54, -13, -43, 152, 110, 53, 127, 159, 87, -11, 137, 138, 136, -119, -101, 129, 190, 32, -54, -175, -39, 40, 53, -117, -284, 210, -101, -128, 83, -22, 138, 109, 161, -67, -23, 177, 261, -148, 8, 5, -152, 55, -257, -316, 133, -57, -96, 194, 52, -40, 227, 52, 11, -117, 221, -177, -8, -111, 55, 165, 150, -43, -67, 21, 91, -183, -135, -120, -119, -158, -183, -55, 80, 122, -22, 82, -123, 54, -246, -62, -163, -47, 43, -55, -24, -204, 183, -145, 187, -107, -35, -6, -237, 67, -104]
5902a04K50m7k04j4J20O2j5k8m6J12j99J97l6M3j3l27L67K2j16m5j77K76J38j55
5926F1J44l03O3N6J46j16j13o8L75l47L1k1K24k54L11o0J2j16j22o0M7j12K33
5949A1m6J5R1j7k53L9J33j24J93j83R1J75l08J13j08PK65R5j25K2K5j15N4j75
5973a25P7P5k15J01K4R3J99l80m7L37p0k69L29k01P1K28o0q6k69J44M6pJ81k02
5997b6j17L14j20k10J11J43j61J9j11N6p2J26J02j78N2n0j20M4J8K46k48J60k6
6020d8J65J3l44n2K94k6k35L27j40L49m71J24O3k1r3N6M2m5J7n7j08K21j4j03
6044h6j7K51j57j15J73O6K5k60kJ12J19j77J70Kj30k04L24j29j26N8L02l93Q1
6067a13K1J45m8Q1r5J29rj34k2r6K18k41M9P3o3J31j47J31J24r0q7R9j51K66l57
$$ y = [-104, 146, 99, -105, -119, 1, 63, 48, 20, -26, 86, -113, 84, 48, 91, 78, -249, 118, 140, 24, -21, -198, 78, 216, 61, 205, -98, -35, 21, 167, 51, -62, -130, 245, -102, -71, -92, 132, -122, 189, 129, 141, 25, -97, -157, -110, -222, 11, -35, -20, 71, 54, -199, -160, -27, -151, 42, -141, -50, 125, -183, -70, -178, -171, 94, 189, 64, 86, 111, -4, 50, -125, -48, 27, -188, -87, -63, 30, 229, -151, -198, 139, 69, -200, 129, -72, -1, 227, 167, 81, -188, -44, 2, -5, 176, -26, -143, 171, 51, -159, -48, 95, -66, -47, -158, -102, -174, -48, 54, -124, -72, -122, -242, -198, -180, 66, -182, -22, -48, 117, 130, -214, -266, 28, 2, -233, 94, -46, 303, -168, -44, 19, -2, -95, -39, 3, -42, -25, -82, -190, 31, 17, -86, -103, 148, -9, -124, 49, 115, 140, -120, -122, -10, 109, -68, 102, 104, -26, -230, 94, -35, -161, -103, 199, -194, -113, -92, 53, 5, 86, -9, 120, 111, -23, -45, -141, 77, -164, -115, -42, -105, 26, -121, 10, 134, 44, -43, 56, -95, 171, -186]
6092a86K60p8K1N9J25l75K19K2J12l36O3J57l29L57J08k66N2R7k05O5%K75l55
6115a38J64j03j61M39q6k56j3K44m9j91J78j40J02J74l52J26o4K1O4OK3r7J77
6138F8j42J83j09P0j20M9M5j22j17J31P5q2K12k20J05P1j19N1j8J20l09K21j30
6161h7J72j11M3j10J12O9k38O2N9R9j70j2R9j49J80K71l66N3j2o3J08K12l21n9
6185a59j8Q2lK7J93O6n1j20J64j91L7L1o9k07K02K37l97Q5j16O3J43k0L09m01
6209a13q3om0J32q5J84k03K27L9P4j03k9J41j59j07K00j01r7P6o7J88q8N8k26
6233a88J56K7q5K60j17K5q3M6j2l30J83l4PR9l3L1o0l7J89J3O8j15Q7j77R6K05
6259B21l14M6Rm9L6L4J49MM2j51qj8K5%m3Q9j92J16q5K1J01j67J53Q5k03J9K58
$$ y = [-186, 74, -4, 17, 76, 201, -174, 45, 67, 179, -157, -94, 63, -266, 91, 199, -67, -15, 82, -123, -58, -58, 217, -138, 26, -77, -238, 201, 115, -141, -154, 90, 41, -150, 28, -112, -10, 164, -188, -62, -126, -105, -41, -35, -12, -109, 68, -74, 109, 0, 70, -50, -1, 44, -78, -195, -64, 11, -71, 141, -79, 26, 97, -22, 29, 11, 131, -178, 43, -87, 85, -26, 17, -93, 19, 88, -150, -88, -29, 70, -100, -112, -13, -162, 18, 289, -77, -24, -36, -99, 9, 221, -100, -159, -177, -95, -98, -71, 122, 188, 137, 17, 181, -10, 27, 58, -11, -218, -16, 221, -176, -91, -207, -144, -1, -21, 288, -113, -196, -202, -242, -110, -195, -11, -214, 13, 52, 126, 23, -6, 135, -24, -131, 69, -32, -129, -53, -120, 68, -20, 38, -188, -32, -5, -90, 170, 53, 78, -5, 41, 29, -301, -118, -152, -145, -46, -79, -48, -108, -145, 44, 57, 125, 10, 97, -80, 16, 221, -93, -47, -38, -87, -51, -17, 132, 136, 178, 27, 19, 1, 26, 26, -17, 72, -120, -4, -89, -68, 33, -134, 19, 104, -99, -80, 178]
6286A78k43k03K86k43L00q8j60Q0J44p2L4J44j60N1p6M5j66J31K1N7o5M71n81
6309a15l7%K12j51K20N0m01J60p2O2J14n0r5J73r6J08j05j57m2J90%m5j35K31
6333A9m4j39J14o0K17j97J25j33n1K25n4q1J9K19o6k59L2K01p1j40K54k33K19
6356A16j33K25k39R5N0p4Q7o5j81K46O1q6l9R6j6l21J29j31J17J61K7j10m1kj52
6381a80K55l8k33J25P1n7J18L7r6j45Q4M6j5k7J32k0J9k21J72OM2k34J63o2J61
6406A03k78K98j4k10q9L12K7m36L20j96K74k51J17j5k1J97j74J09K7nk24K72j11
6429C2k08R6K10k11N2K6n7n0O3r4L80j72Jn6K62m29J03J66k46J66k04K9J92k48
6453a97O8j31j4K55K57m33K73l42J19K78k33L01k50r3J58J72Rk46qL27n16J80
$$ y = [178, -65, -268, 18, -225, 75, -13, -173, -93, 51, -21, 13, 157, -3, 48, -28, 17, -149, -18, 3, 60, -5, 466, -115, -152, -152, 60, -91, 129, 179, -222, -62, -134, -72, 42, -8, -103, 70, -26, 82, -23, -180, -222, -32, -32, -77, -212, 19, -25, -164, -50, -110, 107, -90, 35, -98, -149, 76, 22, -59, -40, 179, 113, -146, -114, 87, 16, -124, 130, -103, 116, -17, 208, -31, 64, 114, 40, 127, 62, -119, 127, 188, 102, 63, 159, 143, -178, -49, -180, -63, 98, 125, 15, -26, -28, -180, 75, 37, -196, -71, 0, -57, 61, 98, 2, -143, -59, -13, -28, -55, 77, 57, 76, -145, 27, 33, 75, -159, 4, -58, 103, -175, 123, 109, -101, -190, 122, 149, -287, 33, -163, 111, -140, -23, -38, -59, 138, -36, 73, 100, 95, -129, 143, 32, -176, -80, 130, -81, -29, -3, -60, -110, -47, -141, 239, 67, 68, 12, 274, -155, -52, 114, -132, 34, -170, -141, 51, -197, -129, -260, -274, -19, 238, -195, 78, -264, -145, 133, -100, 201, -49, -142, 16, 188, 197, -49, -57, 270, -246, -66]
6475f6R0p9nK2k0R9R7k02QK44k24j57P0K31k01J4Q2%K20k01J08k60L08m53M29
6500A54O6k11K30Ln12M01m3j43j01J13N9p9J10R5j91K20j05j78J08Q7l25J39P0
6523c3J31J47j55j35Q4n4O5N2O5p6J3j60l9Q5j10j4Q6J45l26J24L99j53k85J52
6547Hj52K64M2j7j79o8j3J12K69k50r3J77j62%J85j13m6J31k78L40j62k19R3m8
6571a79M2O3J27k73L63j63J13q5r6R7k19K96k3j06Jn3J26M0l32N58m09Q7L04j33
6595A46j41P9Pl21K77j80J3J92l1l0J35j86r5K70j83M6j3j37J59j90K98j12M6
6618D9n8pl09K70j2q1P8N6O5j57n3R7j17K03J93k83j96K63lj72J45K30j68q3j77
6643b27K12n5N3Q6j01P0k21L13j71J38j10KJ13j79J56j49N0P9L0o7P8m0j5M9l91
$$ y = [-66, 24, -55, -60, -38, -58, 41, 138, -64, -56, 188, -36, -193, -123, 108, -93, -79, 3, 3, 223, 22, 130, -130, 178, -275, 154, 220, 9, 239, 242, -270, 131, 88, -55, -156, -43, 16, -63, 47, 142, -49, 171, 66, -112, -4, 83, -242, -103, -33, 98, 245, 90, -45, 39, -15, 50, 102, 167, 91, 104, -56, -95, -10, -120, -134, -48, 97, -229, -105, 294, 141, -144, 8, -144, 120, 162, 145, -34, -102, -115, -3, 266, 16, -77, 100, -62, -62, 123, 10, -36, 95, -183, 157, -5, -224, -131, -179, -137, -74, 53, -220, 143, -20, 93, 8, -88, 9, -210, 86, 63, -43, -42, -95, 31, 71, -261, 297, -112, -25, 279, 146, 5, 84, 91, -230, 47, -133, -120, 72, 41, 11, 146, -40, -135, 135, -48, -2, -15, -152, 7, -183, 115, 3, 49, -9, -16, -325, -55, -67, -148, -70, -14, 51, -106, -159, -62, -179, 24, 217, -66, -262, 1, -2, -174, -29, 201, 33, -50, -227, -15, -70, -17, 69, -32, 38, -183, 130, -41, 97, -13, -11, 102, -77, 79, -70, -20, 59, 89, 22, 100, 60, 45, 94, -297]
6668b97K88J80n4j5j58J9K70m7k16j06J28l7J44L8l01J16%R2o6p7j04J61l9P0
6692a1K65l74m2K35ol35M80j33q9J79R6J2l00J37j06M1j28J59o1j2j53J40J55
6715A49J05k98J34j27j23M54l83m8M2K22l27P4N1q1K92j76J09k65R8K51n2Q1k52
6738g0O4J3l2J86j68r6r3J80K12j72m6L5j47J65k72K12J07j24LK23k54P2J58k35
6762g9J29o7N8j35q0J49O7K80k84p8L3k1J1Q8j18j46K10J73m38L58j21pk67K33
6786e2j03J1J45K06j26rj28K1Q6J5m65L41O4k20J78j52K72N6l09J80O9j83j72
6809b75K44K28N9j63j19r2r9Q7J75L30n41J87O0j59j24L98k99J12q4j7J66j41
6831f7j9K02%q5qj31J97m4J18k63M2j19J50j42K90p1k68O3LQ1J18J12l23K07j8
$$ y = [-297, -9, 171, 117, 102, -56, -37, 233, 186, -30, -136, -8, -45, 99, 137, -164, -48, -48, 44, -22, -99, -203, -42, -81, -11, 254, -120, -162, 73, 67, -268, 212, 79, -10, 169, 265, 277, -23, 114, 8, 49, -79, 80, 19, 7, -146, -6, 149, 254, -44, 90, -37, -160, 294, -89, -137, -95, 127, -200, -126, -75, -156, 136, -40, 69, -196, -98, 153, 101, 182, -70, -6, 7, -25, 161, -7, -103, -196, -16, 196, 24, -22, 13, -134, 31, -241, -29, 78, -46, -43, 180, -74, -2, 156, -79, 50, -17, 41, -94, -174, -25, 42, 322, 38, -40, -7, -28, -17, 71, -47, -193, 17, 190, -248, 110, -11, -18, -285, -52, -155, -144, 1, 207, 81, 72, -56, -35, 51, 66, -399, -58, 6, -214, -36, -188, 84, 140, -169, 11, 80, -103, -275, -31, 197, 256, 93, -26, -118, -217, -130, 45, 375, -166, 21, 81, -78, -202, 196, -103, 9, -75, -92, 74, -67, -86, 116, 116, 31, 23, -108, 89, 45, 163, -100, -58, -177, -27, -169, 121, 50, -218, -155, -152, -71, 47, 159, -164, 43, 25]
6856B5j09M47m16P3l8l1J57k47j09M21k64J5K4L04k42J88k87L04n9j83K59k75
6878d3P6o2Lr8Q1J42M1l08l0M45l32J21k49L56l11jK16j07k69N53k31j5J23j89
6902h8J14j0j2j27J40L7l2J09K1l45N21l3m23K26mJ8o1j64RJ59pl48L51j31J87
6927A07m15N01l11L5rK0l6O4l7J8o1m5J7N2j9K85m54K72k6q4K75k70Q9p0J76r6
6953b2J79j19k8r5M7N9j80K13o7j04K73o6k20Q7l5o2J51o3J4O6kj84K36j45q6
6978a53J79O1r1m8O5o0j9k7M55l32k15J99j77K40R7O7j28Pj94J04j30J71k83L64
7002A52j00o0j88Q5L51j62p0L3k25K94J64m32K88Q2Nn40M11r4jk08J50K46l82
7025b01J80J64k02J77l28K15j26k85N72k08k2J60k79J50l6K6o9j0L04j48L3k6
$$ y = [25, -84, 363, -53, 20, -18, -49, 108, -139, -248, 173, -91, -76, -52, 252, 10, 198, -89, 215, 156, -27, 232, -43, 33, -29, -26, -124, -43, 99, 140, -168, -198, 247, -85, 36, -213, 143, -168, -169, 47, -60, -329, 224, -7, -22, 101, -88, 26, 16, 4, -123, 17, 54, 22, 131, 152, -193, 328, 295, -128, 98, 94, 112, 51, -113, -104, 55, 48, -300, 51, -80, 107, -308, 193, -118, -83, -92, -72, -108, -44, -81, -63, -124, -169, -152, -100, -119, 166, -288, -16, -42, -126, 149, -121, -32, -102, 74, -22, 157, 38, 10, -85, -38, 21, -159, 54, -13, -117, 156, 90, -130, -43, -78, -140, 11, -52, -38, 28, 26, -158, 78, -67, -153, 26, 87, -4, -52, 13, -47, -66, -93, 362, 30, -185, 14, -163, 77, 174, 241, 113, 120, -74, 30, -100, 71, -212, 152, 52, -8, -196, -111, 240, 78, 8, 41, -184, 110, 274, -158, 130, 212, 217, -323, 88, -6, -7, -215, -65, 181, -201, -21, 143, -59, 118, -210, 5, -121, -406, 166, -42, -64, 96, -183, -33, -69, -43, -112, -122, 182, 34, 67, 41]
7047D1n7o1m2K07n7k41K67O2k54j1N3K09k02K00O6j49J53l53J05K19j46j1k3j56
7071a81K5J27k8k2m1M0k1J58j85J54p3mQ7J0m2M4j1j74M22l19J6k93K88J49j76
7096e0O3j5k16K43j2j79K18R6k84JJ15j73M38j89j55K04J3k16K08k30J87J01k50
7119h2J86j15R2j86p3J17o1J32j35P6K30k70r7K75l4l56M39M8N8n1p0l7l74J21
7143a67K31l5Kj80L9Q7P9J33l42NJ45j24K25j52j67L72j29j05j0J58k56j06K22
7166g5P2l9K29k34K25j66p2J00o6o0J20R5J8o8k62K35J22k54L25l40J7K70j85
7189Gk8J01j17L09m12j5K38k08J34J61o9j59P0q8%J32l4j37k9j24J92J9P5P1K2
7214A11j09J95l18r0J79N0m8L6n6m5O7N6J15J6P0k20J9J22j61r4PRl08N70j69
$$ y = [41, -16, -77, -119, 88, 31, -210, 57, 119, -135, -146, -93, 116, -86, 114, 180, 31, 184, -169, -64, 155, 9, -2, -25, -181, -156, -29, -57, -79, -120, -80, -101, 57, -128, 26, -47, -51, 36, 46, 4, 48, 37, -137, 285, -34, -18, -311, -23, 126, -50, 13, -2, -218, 25, 13, -166, 52, 148, -136, -135, -20, -193, 245, 56, -99, 105, 118, -98, 110, -120, 67, 168, -82, 104, -11, 81, -105, -178, -61, -122, 10, -125, -49, 181, -89, -186, 89, 55, -301, 138, 186, 244, 193, 123, 86, -288, -167, 64, 29, 31, -149, -110, -23, 56, 189, -153, -148, -3, -127, 98, -54, -221, 151, 22, -83, -93, 65, -191, -297, -75, -3, -42, 187, -47, 178, 12, -60, 40, -26, -86, 34, 129, 147, 79, -183, 52, 174, -80, 245, -95, -78, 192, 7, -21, 80, -37, 272, -140, -155, 83, -125, 9, 170, 101, -58, 12, -76, -76, 56, 22, -115, -144, -268, -76, -57, 18, 89, 111, 2, 197, -121, -211, -32, 18, -30, 6, -50, -95, -28, 28, 143, 159, 229, 9, 28, 150, -11, -105, -98, -89, -397, 173, 4]
7239Dj05J63m9q0K0K81k37j45K87m14l8P5N16k13N5r2j05k7l4J58p2R3j66J38
7263A3K22l71K90k05N1K6j9r4m6p4n4J86J90j76J06m8J85j71J1j13q2K58j15M2
7287A2lK84m31J44j45J26P4J1j1R0k64O4j1j4K69m9j45o9J54k14J2K41j69L6L5
7312B7l58J93K73p3J6k27K20j5L6k41M12m26L08j89j12J28J11j2j55K28j63Q4
7334F5lq8NJ81k10r6L55j69k8M6j5Nl8o4q5k32M34J08m20K45L3n9L11l39n3q5
7360a96L14j5q5K02k06J11n7k8q0K33j26pk48K08rP0j61k4J72n3p9K18k01J48
7384A01J27j01k17J73J65l41K28l19N0K38j42K32q0j66j85J80J65l25K96k39O9
7405i1K5K87k35j32K06O6K7p2O4l32J40K00j94n8PK46k71J21R2j07R8j41m9k7
$$ y = [4, -101, 62, 13, -67, -47, 234, -3, -148, 139, -275, -313, -238, 278, 65, 120, 28, -77, -104, -138, 20, -52, 41, -125, 13, 235, -136, 154, -51, 0, 26, 7, -87, -133, -207, -261, -75, 115, -61, 45, -3, 182, 11, 22, -91, -173, 85, -30, 12, 9, 293, -138, 6, -139, -13, 61, 72, 61, 151, -113, -49, -60, -74, 195, 146, 1, -68, 86, -128, -116, 125, -44, -8, 27, -331, -138, 135, 62, 78, -149, 71, 56, 92, -149, 263, -163, 145, -44, -156, -28, 83, 71, -84, 144, -19, 65, 62, -26, -21, 160, -50, -146, 209, 40, 12, 58, 43, 48, 10, -54, -139, -371, 63, 171, -249, -4, 29, -30, 281, -58, -111, -196, 118, 103, 18, 220, 14, 125, 68, 40, -40, 193, 67, 60, -188, 20, 11, 81, -80, -104, 68, 15, -64, 154, -47, 101, 228, 127, -90, 83, 248, -93, 135, -184, -134, 104, -38, 194, 114, -52, -237, -57, 108, -217, 79, -160, -91, -66, 221, -14, -146, 60, 126, 153, 81, 145, -187, -47, 153, -41, -99, -92, 154, -117, 4, 96, -11, 87, -54, -103, -130]
7429a30L80k05K79k24k19K74j55l1l4K37j29o7K61n88M02L4l03K36k53M74k85
7450d6Q6jo8q3K7K51j52m6J25n38K49K13J08N2O4j82k02K20l46K59M6L8Q6k70
7474a10L08k30P9k00K10j88K01j11K18r7l22K50j06J99j63P8j67J06j1mj06K70
7496A04l3j07J60k48J46q2P1k6P3m0J4N1J09j5r9j93J58k94L89k9k19K70m88K50
7520g8N9Q4Jm6j88J35n8J95J33l53p8O9Q9p4k9O7J9K98j68l9l02N45m08J07rJ39
7546A10k00L04l6q9p7L5K01j49R3jj87O0j8j73K23k34J89k90M53k00K10m36K10
7569bj20j0R1K40k71rK83k23j20J45l5K00j76r2K08j32r6K80j65J21l37J41K91
7592B12l02J52n0K64j0l24j4M1lJ29k65N24m01n8J0J18Q9j67j73J61o3J52J61
$$ y = [-130, 250, 45, 324, 100, -119, 155, 0, -31, -65, 172, 43, -24, 237, -351, 51, 85, -218, 18, -235, 239, -46, 40, 39, -29, -112, -85, 166, 14, -32, 93, -445, -196, 17, 125, 177, 241, 59, -143, 77, -269, -10, 36, 74, 160, -110, 198, -32, 47, -153, 57, -131, 70, -41, 177, 80, -242, 8, -98, 101, -62, 16, -151, -45, -56, -60, -166, 104, 71, -36, 124, -124, 22, -60, 11, -15, 58, 18, 32, 83, 192, 177, 78, -115, 43, -251, 138, 109, -110, 160, -328, -78, -19, 65, 66, 20, -168, -33, -91, 104, 237, -116, -194, -125, -36, -110, -139, -72, -53, 245, 77, 38, -264, 281, -127, -20, -29, 110, -90, 214, 178, 89, 12, 47, 248, 99, 192, 191, 4, 64, 46, -127, 96, -138, 51, -239, 214, 14, 224, -212, -2, -122, -132, -41, 199, -72, -81, 202, -21, -141, 4, -31, 169, -7, -99, 109, -23, -119, 161, -4, 117, -220, -79, 212, -90, 62, 12, 276, 266, -58, -72, -31, -34, 95, -170, 354, -47, -105, -95, 23, 112, -55, -228, -67, -130, 22, 183]
7615A83mk32j4K47M9l09j36l6M65l01k74J40M82k56J0j1%l3o1J68N8k96J89j7
7639A1n5J80k13J32J53k95J11J23m2k6j79P2m0LmJ88M5k95M9L19l90K69k32J50
7663C4M0j13M7j11J91j7l06K26k93K04L04k52Q0j74n2Q4M23q9M8k70K54j33j64
7686c9J2j0l7l6R9Q1k22N7r9O1L21k64K69r0j96k8K11m5j91J07j54P9M3K34j86
7711b3P0j89J50J57l28L20k23K79m92K73n6m5k1J15J28k05J91l13L29j20K94k39
7733E2j74J2K09k40L9K55j44r3M2L6K52j89k41K71p0j04P4P4j35J5J31j27p1J84
7757E8j57J16N0j62K7m7m6Q7J37j74K07R3l0j67Rk20J74Q1l5k5j1K7j40J78j86
7782a56J61j91L74l11Mj1K26P4k21MJ34r3L83l94l37N06l2j55J75j09J0J01j85
$$ y = [183, 179, -53, -67, 180, 229, -80, -216, -252, 213, -88, -362, -222, 260, 4, 14, 3, 3, -30, -91, 77, 135, -161, 28, 11, -44, 136, -77, 55, 208, -87, 24, 147, 105, 79, -100, -28, -68, -65, -69, 119, 164, -131, -82, 237, -153, 116, -116, 34, 74, -39, 8, -103, 88, 71, -235, -9, -302, -98, 206, -46, 34, -140, -192, -108, 315, 226, 274, 4, 258, 125, -39, -27, -37, -74, -110, -11, 70, -152, -95, -194, -133, 188, -76, 193, 103, -93, -121, 90, 45, -146, -39, -193, -114, -71, 163, -23, 47, -142, 8, 165, -163, 157, -66, 213, -279, -6, -62, -107, -128, -13, 115, -90, 101, -212, 117, -3, 291, 52, -122, -110, 99, -141, -102, 153, 9, -84, -42, -6, 246, 57, -184, 87, 17, -87, -13, 61, -74, -59, 72, -55, -126, 58, -99, 17, 67, -95, -68, -115, -161, -74, 63, -111, 96, 189, 159, -8, 1, -219, -45, 36, 1, -24, -35, -8, -148, 30, -156, 5, -186, 188, -123, -119, -130, 96, 170, -51, -47, 87, -6, 377, -17, -354, 152, 120, -35, 140, 31, 41, 142, -43]
7805d3j24M10l10l8O2n2l7J68J75k19k07K10k1P9J1%l7k30K61K6R2j94J90O4l98
7830a62R8m9J66J98l30Q4j33O2kK53J16k40m03K50K12R7k06j03J49j7J3R5M2m01
7854b11K52K9k5r6K89j99r6J18o1j81R6K09k78J73R0j60L09p2l03N3J10j8k3q0
7878g5R0m5P0Q3j36P0P8m47L02M4J43j53P6j86J94J82k23Qj82M34l79q1L63l21
7902i1O1J2J1Q1J6k10J82j56J14m0J29r8q3j04K17j62M9O6k28L15J32j06m5j67
7926a05K34p4l1O6Mn1J22k14q3K52j84J09k44K87r9L5J13j61j4J66n9o7j5j24
7950a37K37j32J44p4J31k85Q8M9L0j39j2k01L25r2K17j29j45L7n1J90o0p5m2N3
7974g3K16r4j70nK12j30K54j71k12K41k39J79k45J50M8j28J04R2k5k93K20M6j12
$$ y = [-43, -167, 243, -67, -105, -43, -95, -132, 36, 211, -8, -215, -5, -26, 53, 64, 64, 27, -203, 58, 84, 176, -18, 172, 236, -162, -64, -113, 53, 251, -79, 5, -128, -66, -68, 185, 301, 61, -342, -92, 120, 217, 11, -92, 57, 40, 53, 148, 190, -211, 41, 70, 45, -51, 238, 39, -57, 61, 0, -181, -85, 124, -154, 19, 109, -51, 258, 186, -117, -64, 46, 28, 5, -75, 15, -30, 40, 123, -13, 57, 135, -312, -10, 34, 177, 24, 100, -86, 108, 290, 67, 75, -107, 327, -52, -133, 230, -91, -30, -18, -7, 74, 90, -120, 62, -94, 20, -20, 109, 11, -72, -176, 41, -121, -72, -6, -234, 81, 213, 107, 62, -105, 129, 55, 24, 90, 94, 43, 165, -49, -132, 120, -64, 45, -199, 88, -11, 24, 137, -24, -38, 128, 69, 2, -13, -137, 100, -32, 112, 38, 169, -116, -28, 21, 51, -88, -100, -301, 24, -68, 149, 20, -125, -88, -139, 51, -9, -84, -126, -73, 143, 49, -121, -126, 86, -44, 210, 39, -173, 68, -171, 8, -237, -87, -39, -167, -63, 29, 4, -289, -69, -23, -135]
7997a35J19n4m6N4J51j25O3P9Q2o6k06J8O0qP4pk30R9j00J81j3k38J86K54r7k19
8023a24j11P8J43q6K59k36J56n8N3j08j78J54L35l42K8j48L33Q1j95j50J31j48
8045a33J26k8K2J64j32J10l49N36j63l88K36P1K81j94J15l90J57J0K32m91J41
8066f7L2j01J98j09J61k03K20o1j46K36j33m2q0J05j43O1R4j1K81l76N1k2M12
8089C57m15R8l9j48K63q9k19K76k32K98m14L88j75K08j67J22r7o3Jm5K29k60Q1
8112d2j15L67j68k18K86k9J02k62K44J40l15o9j28K06j35J00J10J81l79j10k42
8133d76N07j39J82m0Kj48Q8l12M87l26J6K76q1O0j32J80j58l53L25M1n1K33r5
8156H6r4K1n1O2k31J93J17q1K33k59k16K71j74K08j6k6J66k28J7L5K35m76K08
$$ y = [-135, -16, -70, -116, -62, 89, -36, 27, 106, 188, 122, -84, -66, -6, -14, 60, 53, -177, -78, -178, 3, -10, -248, -62, 192, 95, -124, -235, -157, -14, -100, 159, -77, 79, 21, 74, -34, -212, -58, 277, -65, -37, -185, 148, 229, 34, -116, 15, -133, -7, -35, -13, 151, 19, 129, -220, 316, 153, -235, 1, 72, 353, 159, 274, -116, 41, 51, 283, -208, -67, -35, -136, 62, -47, 114, -89, 131, 70, -76, 160, 27, -15, -95, 10, -133, -72, 22, 11, 292, -84, -33, -55, 357, -58, 40, 1, -147, 116, 27, -192, 84, -148, 150, -264, 124, -51, 157, -10, 112, 15, -48, -47, -92, 137, -123, -42, -157, 210, 42, -176, 110, 81, 183, -79, 165, 305, -10, -79, -207, -1, -136, -36, 74, 255, -124, -234, -476, 31, -108, 74, 34, 36, -112, -24, -336, 151, -175, -159, 117, 36, 96, -36, 144, -14, -367, -42, -1, -52, 181, 86, -8, 13, -38, 24, -207, -14, 103, 22, 255, -4, -220, 51, -123, 85, 69, 43, 209, -19, -2, 33, 268, -208, 0]
8179@k9j67J11J83k00n9K32k18j%L69k72
$$ y = [0, -29, -196, -85, 98, -102, -161, 71, -147, -148, -148, 221, -51]
8191e1
$$ Imaginary data points
##PAGE= N=2
##DATA TABLE= (X++(I..I)), XYDATA
0@%%%%%%%%%%%%%%Qj6J6j6J7k5L2l5M3n0N8p2Q2r1J06j22J40j62J84k08K34k62
36a39K94l30L70m12M59n10N65o24O90p62Q39r26J020j123J238j365J504j659J834
55I63k031K256k515K816l172L601m129M799n676O876q629J1428j6576K8993j09981
70i0977j02787K98441k9801j63864J15288Q2118j81229j4189J70483j5762j31183
81f3462M0032O6921n1643k9142P1692O006q3459j233Q5876o163o0508J6006K6320
94A7243l7163n25N5096k394n7522q580L8183J7575j8055o133J2954k1278k6354
107c6953M9455L8664o0085l2220N0844J746l1482L7346J4830o1190p539N6164
119A9580O124k8606l371K196o175M034J9616J0693k7202l0670K5558L4355j8105
$$ y = [0, 0, 0, 0, 0, 0, 0, 0, 0, 0, 0, 0, 0, 0, 0, 8, -8, 8, -8, 9, -16, 16, -19, 24, -26, 32, -40, 42, -49, 57, -65, 75, -87, 97, -111, 123, -139, 155, -175, 195, -217, 242, -268, 297, -327, 363, -399, 440, -486, 534, -589, 649, -716, 788, -871, 963, -1068, 1188, -1327, 1489, -1683, 1918, -2211, 2588, -3088, 3788, -4841, 6587, -9989, 19004, -90977, -193764, 104677, 74876, -88988, 26300, 108418, -72811, -87000, 83483, 67721, -63462, -23430, 43491, -8152, -37294, 34398, 40404, -43055, -44288, 41588, 35425, -25083, -9077, 17243, -19920, -20445, 34651, 32257, -25265, -33845, 4338, 21913, 3858, -2275, 10679, -10599, -36953, 12502, 51166, -8919, -41139, 9705, 11451, -20031, 17315, 32145, -29045, -36584, 19580, 25704, -2902, -6273, -4077, -10252, -6218, 13398, 24091, -3111, -33781, -8223, 26132, 8027]
132H027j5423J4045j3353j8791L2219K8009l1067l1640J7236K2618q171m271J5806
145A5244j4134l5628K6176M8137k8937l9110K8388Q939l0329K5824L3715m5056
157f771l2205M0892K0409k2869K21Q121j9230q108K6101K0307k0164k9423R948
170a2771K3772o849m799J5176j4891k9143K3338L6108j9422k7706J1907Q189j1805
183h896J0279K1718j8170l3616J5576L5413j1371k1646J4597n89k6198J9934L5310
196C2341k5996l3046K1245J6057j3551O203J2377k1346j7073K0499K1570q398
208A0882j9399j198R062j488K631J5399q322k9681P040L1956l836j9956O253K005
222A348j5846R726K7240j0425l1547N621K4007m632q665J2598m762k6389J0773
$$ y = [8027, -7396, 6649, -6704, -25495, 6724, 34733, 3666, -27974, -10738, 11880, 3709, -562, 15244, 1110, -34518, -8342, 39795, 10858, -28252, 136, 9075, -21254, 4570, 38285, -6771, -38976, 1916, 22325, -544, -323, 7798, -11432, -19540, 6561, 26868, 6704, -22719, -12771, 11001, 4152, -647, 14529, -362, -29505, -6167, 29941, 10519, -17187, -5280, 2909, -8896, 1383, 23101, 4931, -28685, -13109, 22304, 10933, -10713, 3884, 3295, -22903, -2969, 32341, 6345, -26701, -5456, 10601, -2950, 3253, 15630, -5716, -22789, -2290, 19280, 10882, -8517, -9715, -653, -2141, 490, 15889, 7567, -22114, -15074, 16882, 13046, -6910, -657, 1348, -14498, -4772, 22468, 12043, -19504, -13883, 10124, 5492, -3173, 9425, 4663, -21726, -10953]
235a0953L4088j0312k7716R201R618j1843Q071J9273j5996k3252J1225J9697k106
248H995r732p79j123n902N405J7428j687k5071l557K1920K920j1008O946Q8k0004
263a5161L125K8608j107k5555J7J3412n297q50J6332m920k5595K926K6472p10
277A1697j6487L929K709j3189O587K1682p074k2604K293J4401L49k534L336m589
291E06j1701L139J7668L966j7304p574J0889K396l747R374J383j9967m039K2890
305G879N780j6479j487O300q247k54J8613N9k2289l034J7113K568o832M242n98
320C334j4357J869J9769J125j6333l185P112j19J079P624k649j4126j910J4611
334C844O806q941o219K893j458j153J0991M893j6725q418J4590O960p975Q40K730
$$ y = [-10953, 23135, 12823, -14893, -5692, 3926, -7917, 154, 19427, 3431, -19821, -8596, 11101, 8995, -737, -1516, -2639, -8541, -3136, 14292, 12605, -12466, -16023, 5897, 8817, -2191, 4755, 4843, -15161, -12036, 16572, 15465, -10090, -10073, 3339, -1958, -2808, 13524, 8604, -16991, -14065, 12407, 11697, -4790, -861, 1848, -11341, -4754, 16928, 9854, -12750, -10457, 3944, 4293, 1759, 5095, 506, -11195, -8056, 9612, 13578, -3726, -11300, -411, 1985, -1762, 7612, 8995, -10972, -15011, 7879, 13659, -2820, -4307, 1993, -6254, -6508, 12105, 12164, -10125, -13159, 3954, 6522, -310, 3932, 3334, -11023, -9154, 10615, 11740, -4593, -7778, -666, -785, 294, 7918, 5269, -8857, -10767, 3844, 10650, 1709, -4510, -1617, -3075, -4228, 6763, 11656, -5069, -13487, 1103, 8063, 88, 928, 3658]
349C658j0622k944J7183N492j5846n678Q612P49j902P781l7j4288k622J4344N215
364I095q215l797J274k387J305R424J597j1766o089Q071P662k873k856l1m677
379d263k839J0257P818j0335r756O456N357l307L358L680j1159o353J3156P769
393I839r054m538L685l054j021R829K612j1672n040P633N123k105o45j175n320
408d903m66Q541M924p076p264K864M298P13J148N69o050m801O633Q476l858p596
424c848J384J568j277M145N194p555q862P063P885l607k589K200m941k845Q708
439B623N266p536n468L042K250O34K821n82o060k995N505N994k249n006j012R37
455a836P09L574K540m969n998K942O449l9k829p97j976j722M252N995l666p913
$$ y = [3658, -6964, -9908, 7275, 12767, -3079, -8757, -145, 604, -1298, 6483, 6446, -7842, -10464, 3880, 9095, 880, -2917, -1643, -4030, -2725, 6699, 8296, -3470, -9559, -1488, 6174, 3301, 445, 414, -4263, -7102, 3155, 10973, 638, -9118, -2662, 2695, -612, 2746, 6426, -4733, -11086, 2070, 9839, 785, -3753, -68, -3122, -4143, 5686, 8298, -3374, -8414, -781, 4342, 2237, 1592, 417, -4903, -5369, 3172, 8096, 1020, -6244, -3380, 918, 1631, 2779, 3348, -2702, -7503, -870, 7606, 3748, -3848, -2464, -896, -2173, 1972, 7166, -389, -9251, -2188, 5697, 2090, -499, 1701, -3240, -6085, 2623, 7889, 353, -5115, -2073, 177, 811, 3632, 3050, -3010, -6005, -500, 5494, 3245, -1761, -2773, -1836, -1127, 2447, 4987, 18, -5980, -3038, 3411, 3372, 543, -254, -2230, -3952, 300, 6295, 2629, -5284]
471e284J635N285o34K40K017m759n069O080N819l100l614n9n11N61M234J389m580
488c50l923J701M459J392k273j855j045p95L305M045k257n804r0L841J369j09
504A611J91k766l322K595N462k29m853j271J887q2J641L283l221n942K545M966
520B495k84j468k59k834q40M228K934k832l002p55J333L087L71j717j413j677
536b633L58M891R27m434j697J672N76J448J862k134l799P05L642J315j839j641
552g81m31m68J343L502p11m931j19L003M59L08P22k764k621L163K572m27j461
569C58j832q81K381J604j37j228j782j045K851K462j784k083J76m21R30L024n02
586B091l556q13K068J432j47j91j263j830O59L291L52k298j024M21M58J107J479
$$ y = [-5284, -3649, 1636, 1002, 1242, 3259, -1500, -6569, -489, 5330, 2230, -1384, -1443, -1954, -1393, 2841, 4230, -350, -4273, -2572, 1887, 3279, 1006, -849, -1894, -2689, 616, 4661, 2404, -3400, -3490, 351, 1720, 1611, 1802, -964, -4286, -1691, 3771, 3542, -1311, -2582, -695, -777, 864, 4147, 926, -5016, -2471, 2495, 2211, 743, 484, -2350, -3190, 1038, 3972, 1140, -1862, -2617, -1284, 1803, 2174, 457, -956, -2633, -2275, 2616, 3543, -891, -2588, -916, -340, 1108, 2970, 836, -2963, -2258, 1384, 2699, 860, -781, -1212, -1680, -337, 3165, 2454, -2477, -2596, 407, 866, 1174, 1896, -868, -3489, -326, 2246, 1819, 358, -1474, -2355, 26, 1630, 1493, 265, -1517, -2562, 289, 2751, 967, -1116, -940, -1361, -431, 2593, 2091, -1465, -2278, -210, 1222, 1075, 884, -379, -2209, -1550, 1741, 2093, -205, -1229, -808, -350, 757, 2236]
603B236k088k386Q54K120L52l8p80j798J73K055M45O5j472j859J023K297O25j695
621A29n71n98k09K189J335k085j880R33N13P14Q31o73k254J9J950J588j336r30
639c35n00k88R53J936n24j874q33P56J131P59l13j538q11R94J293L80o87j354
657h55m38R16J669k37o80r74l92J029J271m48j354n29M32N07Q43K62j448j012
675a438J107P30N65l53o05j140L37J612L96j146p86J67M2J053P38j014j284M13
693f06M84P04N53j168q68J90Q74L05J70q48p22J08J123M02j39q34o76Q2J094Q44
713A072p39r88j94O49P55M21o74j061j44J179J78J15l20q55k68R31R26q46l23
732a86l61k37N05J227k30j007l19L05N57N25k52j211j49Q03P18k37M5q14m69N69
$$ y = [2236, 148, -2238, -1384, 736, 1088, 1050, 270, -1528, -1355, 700, 1145, 1210, -262, -2121, -1098, 1199, 1824, 129, -442, -1040, -1249, 940, 2275, 190, -1690, -757, -244, 470, 1301, 628, -1626, -1607, 343, 1931, 595, -335, -835, -1123, -170, 1766, 1242, -632, -1465, -709, 422, 1181, 868, -670, -1481, -487, 806, 1186, 499, -855, -1293, -377, 1292, 1055, 375, -599, -991, 38, 1309, 861, -493, -1022, -590, -83, 760, 1022, -426, -1438, -331, 399, 964, 611, 6, -1134, -797, 815, 1211, 65, -721, -554, -512, 541, 1279, 265, -1019, -606, -122, 582, 1135, -33, -901, -711, 163, 468, 638, -210, -932, -824, 299, 701, 562, -272, -948, -866, 228, 1072, 333, -655, -849, -200, 555, 976, 302, -759, -903, 276, 454, 569, 249, -606, -874, 57, 983, 137, -186, -547, -784, -279, 948, 718, -289, -608, -303, 254, 779, 527, -684, -833, -30, 688, 451, 496, -318, -787, -218]
752b18R10m10l91j71l09K12P18Q0l67o72N43P8N07Q0o71m96L04O85j34j5m96m59
774f92K85R19L57j125n8J19k4N97L26p03n44K95L59M13j32j91o39L52L36J64j94
795B20k24k98j22N31M32n23l33L32k10J66J97J10p15J29N81K3m6l4m15j50N04
816A55K93m75q7M9o17O67L14j34m52J64q8K18L38j69n75J39R5L39o3Q7l27j1O2
839g8L23j6o1p4k28l1L40p0J21l77Q4J55o2j0l06Q0J77K00K2j20Oj91K5J43L53
864D05k51k87k00J87J14M61m16l66L45l91O29K95m23l37L4P3K83r4o7n5M5K34
886B18k20j56L34l29J1K97O8N1m17j28K24lK14J39n85p9M33J7m8J03k08j08l3
909b05M31k34j66J71k96L69q1J36j50j52K32j58J41Q0l93J82N8K00k37J83K8j62
$$ y = [-218, 692, 282, -109, -280, -589, -377, 341, 421, 54, -618, -75, 3, 510, 590, -81, -577, -273, 412, 278, 263, -233, -692, -407, 512, 869, -256, -314, -195, -219, 378, 704, 1, -543, -248, 111, 524, 392, 201, -438, -86, 250, 414, 220, -4, -302, -424, 107, 539, 16, -317, 15, -195, -29, 168, 278, -437, -308, 273, 296, 250, 216, -199, -349, 155, 448, -27, -114, -65, -682, -15, 299, 165, -287, -123, -211, 7, 345, 176, -399, -260, -165, 174, 111, 198, -129, -140, -78, 245, 229, 168, 94, -134, -165, 175, 105, 226, -151, -67, 88, 26, 16, -290, -210, -33, 167, 189, 69, 75, -116, -91, 52, 405, 154, -133, -333, -146, -32, 429, 13, -353, -8, -399, 230, 525, 102, -235, -201, -128, 155, 61, -6, -61, -16, 218, -2, -158, 176, -153, -142, 155, 223, 274, -143, -271, -47, -50, 164, 303, -282, -361, 72, 89, 41, 144, -64, -172, -205, 226, -8, -174, -3, -299, 70, -11, 125, -25, -177, 55, -103, 38, 118, -275, -93, -35, 165, -72, 111, 139, -23]
931b3j00L12l13M9N5K15l08J74K29m03j45J85J43j97J65j8k16j0L23k7N1Ro7j14
955c1rJ48l56N9J24J22l37J71J15k4j03K06n6j96L76j89k02P1J47k90J05L33q6
978I8k50Q9P1j51K46K25m12J04R0M1l12R6J83l44M8L07m48J76O1J12l9jJ02l97
1002c05L87kj72o3K86j37P7j99M43o07K64l6R9m5K56r0j67o6j24K36P%j60JK38
1027A21K45m83K43k16J77J18j55j63J49j0J62k49J18j77J95j96L24j6m43M59q2
1048A21m78N37l12J97L8r2j02l1J65j26j79M51j74J38j57j40J50j21P2K41k53
1069e5N7K38l31O6O9k27J61MJ02m7j30k2L67j89lKL7r1P9m7n9M7k67O9L05l35
1095b00pJ73k4J12K42k63q5N5J7j19L15j80Q5P0k01j89J48l4J04j07J6J19j84
$$ y = [-23, -123, 189, -124, -75, -20, 195, -113, 61, 290, -113, -258, -73, 70, -127, 38, 20, -196, -206, 117, 90, 141, 150, 83, -31, -40, 108, -248, -189, -65, 57, -280, -109, 6, -18, -121, 85, 29, -167, 209, 20, -182, -111, 36, -254, -149, 184, 98, -152, -63, 8, -143, 103, 328, -84, 20, 110, 151, -161, -65, 118, -226, -178, 129, -319, -143, -82, 30, -9, -10, 92, -305, 82, 80, -92, -155, 131, -6, 71, -128, 315, -292, -28, -64, 35, -10, 246, 156, -11, -77, -201, 35, 42, 42, -118, -117, 121, 366, -117, 126, -90, 87, 205, 50, -113, 36, 26, 188, -61, 57, -120, 75, -121, 203, 187, -256, 203, 121, -357, 180, -132, 65, 103, 11, -91, -122, 43, -83, -262, 189, 15, 153, -4, -144, 6, -115, -43, 198, -55, 2, 240, -91, -25, 44, -183, -22, -18, 84, 37, -93, -115, 252, 63, 60, 62, 99, 8, 87, 40, -19, 28, -239, -170, 135, -200, -207, -34, -58, 54, 296, 33, -52, 3, 20, -99, 216, 36, 121, 191, -10, -199, -51, -85, 19, -88, -72, 47, -137]
1118a37p7K63j10P2q6r6J39K3j22K99l73K53K12j90j54L95k51j14J96q8J7j14
1140d3R7j06P1l1m10L17o8J8M4K26k93L49J13n12J31J12mj24M31m46N5K30p9j25
1164d7Q4k29J92M5J13P2j82j28Q3L4m5j17J77N8l85L56pk67Q6M25l43j03K82j99
1188d5r8L62k37J69N3k63Q6j32Q6j34P9%k2J80j12M1R9Q1l41K18j19k20K15L51
1212B97o20L72O5l80K80J30l31o7J05J79o7J25p2k95M12q1k04K63j32J09J0j73
1234g5N4K7N1r1J21j10jO8q3K45j58L09o55K66L34j63l26M00j92m5J36j51nK69
1258B25j44k90K97J6j79J47Q3L4k90L06l50K86n6n9k74K27l0m35O74j69J50q6
1280H3k80kL11q2J47P5j81l53K53J37k65J92J04n8p1K78r4q8n4M3l9K77n17L2
$$ y = [-137, -214, 49, -61, 11, -75, -171, -32, -9, -131, 168, -205, 48, 260, 70, -84, 311, 60, -54, 142, 54, 71, -43, 54, -52, 19, -12, -422, -105, -173, -155, -111, 115, -178, 171, 284, -228, -97, 15, 11, -113, 318, -128, -73, 157, 78, -47, 37, -192, 0, 45, 158, 230, 48, -80, 3, 37, -8, -125, 52, 110, -275, 81, 74, -193, -107, 318, -25, -128, 154, -45, -143, 219, -18, 151, 204, -59, 27, -105, -19, -153, -74, -74, -96, 84, -28, 13, 112, 193, -148, 70, -49, -269, -54, 297, -323, 49, 114, -266, 14, 144, -187, -254, -149, 30, -37, 88, 16, -279, 133, 52, -152, 111, -21, 88, 98, -75, -21, 6, 57, -34, 87, -23, -24, 44, -39, 206, 48, 357, -298, -32, 302, 139, -187, 213, 21, -24, 112, -39, -44, 225, 81, -209, 88, 104, -75, 72, 155, 189, -101, 205, -145, 141, 85, 26, -248, -21, -51, -486, 188, 19, 169, 83, -197, -199, 112, 30, 177, 252, 71, -282, -29, 108, -157, 35, 139, 81, 10, 288, 194, 106, 52, 95, 56, 333, -184, -152]
1304a52L6J00N9L78o40J3L96j96k26J65O1j42k0J42K1j0K37l37j09J25j34K51
1326A8K31k60K45j64m62K57M60p06O09p7l58M3J27N5j16K70J30k80N9j49l07N66
1348A91k5l88M80l86r9M33Nm38J47L55k89j07J58r2k5K62n11L80N0k12r2L71j08
1371F0oq9L16l08k0j36J10J10L4k38M04K1k81J45j15Q1q9m4j97q8N24m04K2K63
1395G5k50KK15l5j31J68j03j28K89n5o3J23j93J58Q0q5j0j8p1K14o13O07k56M1
1419c9K35j29j5J52j93j73J82j3j0K49k96r4K31j7R5N8k6K7n14O08m47L3m3J14
1443b5m6l6K36k37J97k34M6J13p1j02J01J16j28q4J52J82p0m1j25K72j81l05L83
1466A13J1J10k19K47m18j57L80l12J96J08j99J34M9J69k35O9l20LL46O8j85J75
$$ y = [-152, -116, -16, 43, 421, -219, -206, 190, -6, -232, -67, -6, -148, -168, -26, -5, -15, 222, -115, -224, -99, -233, 18, 249, -11, 234, 70, -392, -135, 325, -381, 228, 151, -207, -164, -37, 18, -98, 172, 302, 22, 81, -68, -375, 191, 166, -222, 258, -128, -227, 206, 211, -227, -80, 275, -14, -121, 37, -55, -80, 182, -329, 51, 101, -111, -203, 168, 60, 54, -35, 281, -27, -47, -183, -73, 37, 71, -167, 237, 258, -23, 122, 7, 88, -1, -45, -242, -330, 194, -210, -188, 75, -175, -173, 42, 7, -124, 44, -59, -187, 102, 47, -16, 107, -86, 72, 152, 67, 57, 39, -32, 182, -431, 176, -80, -39, 196, 67, 52, 204, 11, -162, 20, 7, -3, 246, -50, -144, 87, 70, 165, 223, 197, 224, -290, 318, -129, -96, -139, -25, -71, -107, 129, -108, 89, -145, -99, 14, -57, -159, -58, 58, -70, -154, -2, 180, 110, 69, -56, 216, 35, -270, 113, 124, 234, 15, 262, -156, -313, 67, -245, -49, 59, -140, -6, 43, 212, -23, 46, -274, -271, 75, 143, -42, 133]
1488A33Mq7l4q3J29q8M9l0L82m40j92K51m4L49k73OO7j05Q2l8j68N1J39l1P7r0
1514A6L9k58L62k17J10J21n9N9k38lK4J04p1M9j81K33j12j63J57j22JL28l83L09
1538A05r8m7J25KJ7j68K29k33JNJ63j95N5q5O1J84l3n4K3q9p0K48M9N5j87j06
1564d3K35j54j29RK00K6l77L54Nj83J79J0O3l49M43k35k28M03k22r2L9q6K36l2
1588G2p5J32j50K23k20R3k4J7q1j58K46j16N5k32L09j1l31R7J37j77J87K24l73
1611a56M7K8K48m4j75K7j86M09p7j89j39J37L94m53R9j54J89J21l16K2J41k57
1633b84K17JM8j40J53J37q6L4k00J54L6Q0m24K46o7o8J64J74k96M6J91m65L17
1656c2J44k9j82k8j29L74N2l07J07J72l84J70K05l8l9O3m0k95K55k37m8K32k3
$$ y = [133, 137, 50, 16, -67, 62, -26, 23, -7, 375, -65, -257, -6, -50, 299, 26, 32, 99, -6, 76, 38, -130, -79, 60, 29, 106, 16, 55, -203, 159, -58, 52, 173, 114, 173, -65, -68, -44, 60, -11, 38, -143, 90, -22, -185, -28, -150, -149, 179, -204, 105, 7, -40, 85, 87, 104, -64, 165, -68, -67, -62, 101, -94, -39, -124, -63, 121, 88, 34, 57, -32, -102, 146, 195, 250, 63, -43, 192, 38, -91, -82, 118, 144, -233, 121, 126, -57, 122, 132, 195, -154, 289, 54, -174, 229, 7, -85, -46, -132, 104, 72, -3, 129, -21, 202, -18, 75, 51, 68, -13, -171, 75, -41, 14, -218, 91, 80, -251, -154, -17, -194, -7, 217, -156, -109, -81, 167, 123, -52, -25, -211, 198, 121, -68, -207, -70, 324, -129, -30, -184, 5, 126, -190, -168, -27, -284, -67, -66, -18, -158, -5, 132, 46, 80, -120, 34, 70, 150, -274, -28, -95, -163, 1, 175, -121, -75, 116, -349, -32, 112, 83, -99, -127, -256, 118, 170, -137, -30, 142, -242, -72, 133, 95, 56, 119, 79, -216, 39, -198, -246, -14, -37]
1679c7P9j44J61l14K26j84K44r2L2M0j07K41l22J14K79k92j25R9m7J89J67l83
1701a76N3M00j25N9r3q9m7J02j46j24O3K39j16o9L16l26o4L79k91Q9J9o0N7j01
1725e1J02j65O3p6J02J41J29m50K26k4m8K67n07K32K04k35r9K87R4k69J89J85
1747B97l33j3M99k96J22k09j08J14R6j63%K04k70r4J80o0j33L26l54J8J02K27
1769A52l00L00j08p6J44p8J48r3M8k25R5j83J27J96k15M1P8k06p8J13L67k73M8
1792B2R7k33O9J07K2l00N33j53k27K49l64J85k25L62j73P7q4j54K81P1k22J07
1814D7J48m99L89OJ19k90O6n05M99J29k09L24j85k3k91L27P3j38j8N2j67O5L25
1837B44l21p1J84r1P8J00k76J34J30rk65J47k45K23M6j0Q8J14k66k2Q9J98j65
$$ y = [-37, 42, -102, 59, -255, -29, -213, 31, -61, -29, 11, -96, 145, -177, -63, 216, -76, -201, -102, -149, 40, 207, -176, -123, 277, 152, 211, 118, 29, -18, 84, -62, -186, -123, 116, 0, -69, 247, -79, -143, 236, -55, 34, 53, -7, 50, -51, 51, -114, -51, -127, -25, 116, 245, -205, 21, -3, -51, 216, -291, -59, 145, -90, -189, 98, 192, -77, 112, 297, -36, -49, 450, 154, 276, 67, -41, 73, 169, 6, 6, 210, -60, -154, 26, -34, -167, 159, -195, -177, -75, 152, -148, 152, 44, -32, 112, 34, 182, 89, 137, -88, 7, -176, -49, 147, -68, -27, 51, -155, -233, -120, 247, -26, 22, 119, -114, -45, 62, 84, -216, 317, 164, -63, 186, -178, 7, -218, 144, -29, 48, -36, -190, 91, 162, -60, 47, 195, -304, 85, 91, 210, -80, -14, -519, -20, 109, -100, 224, 39, 16, -275, 52, 125, -13, -31, 21, -146, -81, 244, -77, -148, 36, -55, 23, 123, -153, -19, 111, 102, -163, -16, -261, -38, 8, -2, 86, 200, -66, -88, 1, 199, 34]
1860C4QQ2J11l55K22j98m1J99j94k7L33l52J27K63j45j21J45j05j18J85j70K22
1882A05j35J21k78J98j20Q7n6K90k01j79K1O8oP7kn4J58k37m5K72k67L91J44l13
1906C9L3k5p4L62m34nm6r1K70m0l0J02j56K86k72j5K47o7k85L49j6l87K5L40j51
1931d1m0J42l08J77L47k06M2J09m4l92J29k68K80Lj57K70j81M6j74L38On0j22
1954i4N7j69K49J61k78j78L00j2N5l8j41J25K9m0KP5j69J63j44J68j90J33n2j99
1978a87K87j54Q7r1k7J64J72k74N5no9J56j17p6O2n3o9k04M88p8q1QM9j9j31k3
2004a30o8K89j14N9j06J05Q7j24j81P5M9M6p8M2J92j24j00m2k5J20J52j62oj3
2028e7K73n09K51K44n20K27Q2%m6J14k18M3J78k59K18J53k90K68j97J69j01J54
$$ y = [34, 42, 124, 235, -120, 102, -96, -137, 62, -132, -159, 174, -178, -51, 212, 67, -54, 91, -14, -132, 53, -117, 105, -30, 91, -187, 11, -109, -22, -78, 212, 11, -168, -147, -79, -85, -8, -10, -64, 94, -143, -188, 84, -183, 208, 352, 39, 72, 47, -27, 335, -99, -104, -150, -241, 29, -11, -41, 61, -95, 191, -81, -96, 151, 84, -201, 148, 132, -255, -230, 110, -41, -81, 61, -247, -70, 277, 71, 113, 222, 178, -214, -85, -353, -73, -70, -227, 43, -138, -92, -266, 72, 78, 28, -94, -37, -206, 43, 204, -74, -252, 48, 36, 91, 53, -88, 37, 66, 26, 28, 103, -66, 97, -47, 121, -69, 64, 12, -187, 100, -54, 33, -58, -85, 79, 251, -23, 32, 27, -42, 114, -3, -79, -17, -70, -139, -343, 145, 67, -14, -6, 43, 24, -107, -130, -198, 91, -23, 36, -70, 35, 122, -2, -183, -108, -59, -13, -91, -49, 143, 19, -81, -123, -148, -28, 124, -38, -44, -57, 216, -293, -42, 202, -318, -91, -9, -9, -55, 59, -159, -116, 62, -197, 21, 174, -116, 152, -45, 124, 23, 177]
2050A77ql87J12J72q0J20o4j1l4n5L4q8K77k66L38k66N3q4K48p5p8O1j42J93k00
2075e3k1k33O58l62k5m9j02J98M1j63J72j01j37K20p6J33j21R5k12K3K26j07j84
2098a80K93r9K17m09j4M67l8k36o6M5o4J42L2k15J40Jm8j32J61P5j13j27O3Q5
2122b0J19j59n7q7K12Q3j82R1J43j66j51K34j44O3K4J90j16k8j47K53j71j5J75
2145A44R8l20K66k02J36j04q3M09n64M62j23k12N6J15j39O7K23j81j65J24q4k37
2167c14K69j39J66N3J67l1j97J21k42J10m3P1J39j86j21M71j86j00P3q3j84N9
2189a27m7QL59l57L55O5l67j74K18mJ78L8k16K12j82J37J27k15P9k6rP1k34L9
2213g2k10J65Q5J25P3j6l42J70q8K23k48J00l55L66n7K45k18J73rQ2l35J23J7
$$ y = [177, 169, -218, -106, 66, -14, 106, 42, 31, -3, -58, -24, -112, 165, -101, 237, -29, 24, -60, 188, 113, 35, 96, -46, 147, -53, -74, -307, 351, -11, -36, -85, -187, 11, 52, -111, 61, -40, -177, 43, -33, 100, -21, 74, -138, -115, 111, 4, -180, 113, 14, 231, -178, -192, 275, 237, 1, -65, -20, -84, 58, 90, -125, 15, 16, -32, -164, -3, 72, -41, -168, -105, -20, 99, -60, -117, -204, 8, 91, -91, 0, 143, -23, -174, 60, -84, -21, 3, 193, 77, 49, -98, 155, -16, -31, 144, 242, -78, 188, -14, 122, 18, -65, 344, -220, 242, 119, -93, -37, 78, -61, 6, 229, 48, -117, 7, -77, -314, -45, -184, -18, 35, 202, 171, -26, 95, -147, -37, -80, -9, 130, -56, -177, 294, 108, 8, 81, -2, -186, -127, -174, -166, 193, -164, 191, 256, -111, -285, -67, -71, 107, 145, -71, 141, -41, 96, 223, 8, 87, 61, 52, 123, -111, -72, -282, -117, -32, 93, 166, 150, -192, -22, -110, 113, -135, -35, -390, -24, -81, 164, -54, 119, 110, 192, -143, -20, -3]
2236cj68K65k91RK61j4M8j04K16m0k97J17q2P7lJ28l15J57l9J04Mj48K00n4L3
2261F1k39L21j49K3J18q7j40J78K86j53l57K22J33j38L5k01K64k39j20L49N4k14
2283Gq9R9k8J63k44j97L07Nn3l8r6K91k93R8m9Q2J54J55l72n8L3K16j38J62J77
2308B94l11M8L8j09j6K73l25J57j99J9J63j20J28j47qJ94j8r2k19K48oJ58l22
2331a72Q9k5L10j83l4p7j11M3J27L1O0k0K41M0m41L15p3j30j30J25j62L63k13
2354b7j00M38m01J49q1j54K64j69o4K07O6%j83J46k21N9J83l12Q6K0K04j34mL6
2378Hr7J44j03J88j72M12k97j56j34L56j02j37J49Qj03N3r5K31j95j45J46J9K10
2401A88k39j88J08K13k2k6j92J07QK01K0j50J74n8o3j86MJ25n6p1J98m15K26J77
$$ y = [-3, -171, 94, -197, -188, 73, 59, 107, 3, 219, 179, -118, -1, -83, -6, -9, 119, -196, -39, -78, 26, 30, -118, 82, 28, 61, -178, 143, -6, 17, 135, 48, -92, 86, 372, 219, -138, 84, 217, 79, 114, -87, 177, -62, -182, 167, 221, 7, -82, 17, -11, 152, -92, -289, 18, 23, -30, -68, -164, 127, -166, -68, -117, -35, 119, 274, -98, -156, -123, 93, -45, 117, 294, -17, 31, 69, -40, -56, 217, -108, 49, -150, -131, 32, -88, 40, -107, -115, 79, 61, -31, -250, -2, -8, 150, -172, -83, -108, 202, 19, -15, -92, -203, -160, -33, -2, 58, 38, 279, 319, -122, 193, 120, -10, -140, -15, -177, 186, -27, -127, 311, -90, 59, -22, -176, 88, -81, -145, 62, 128, 128, -55, 91, -130, -71, 112, -200, -114, -94, 110, -24, -28, 8, -89, 55, -48, 140, -32, 380, 83, -73, -207, 149, 47, -90, 59, 67, -36, 17, -78, 153, -42, -187, -41, -22, 188, -51, -239, -131, 82, 60, 34, -158, -51, -43, 158, 178, 28, 202, 144, 81, -105, -101, 24, -32, -103, 95, -320, -94, 83]
2425H3N5r1q2o7Q5K1J49k14R3N1M4k32O4K31l49Q5O1k5J61j39o5j08L15l02K43
2450F7J19m9k56k8K00l54L06rJ42k10K29j67j76K71q1J19k67L9R4J62k75P1OJ6
2474c1j37L42j63j4J59k00O7N1Lk61L29%r9%j28M8J51j62K71k49J46j21J96l51
2498a53O8M2k5Q2j43J66o7j72J51r4k7MK69k25O9J58l20J36K43K2J0l04l8L60
2522B12J02j60K0q0j63j0J64P5r2l5N3m4p6P9j62p2J36K10j54q4O1J09J16m68
2546b63M69j15k12J45J52k33P7K9N3j00P8k23R6K58k62%K14l30K91k29K68j26
2568C7j72J87j51L8N0K4L3j64K14n4j36J03k13J33j19J58K36o9m94J21m6L35j84
2591a33J10K03n13M09j24K08j27O9n8k22J99K4j40j83K27j36L93r2J37k97L7R1
$$ y = [83, 138, 47, -35, -102, -17, 4, 153, -61, 32, 83, 127, -105, -41, 190, -159, -74, -13, -38, 123, -16, -81, -189, 126, -176, 67, 186, 137, -119, -147, 53, -301, 5, -4, 138, -72, 157, -10, -186, 85, 4, 123, -144, -105, -11, 151, -124, -53, -47, -31, -168, 174, 11, -3, 156, -44, 23, 74, 77, -184, 145, 145, 46, 46, -82, -34, 117, -45, 226, -23, 123, 2, 198, -153, -85, -43, -68, 14, -129, 37, -30, -202, -51, -145, -172, -168, 101, -124, -55, 103, -217, -81, 162, 184, 194, -110, -148, 212, 314, 154, 174, 94, -69, -79, 85, 160, 68, 33, 86, 42, -34, 45, -117, -189, -53, 157, 3, -81, -20, 89, 205, -263, 206, 91, -121, 24, 176, -57, 20, 49, 102, 2, 80, -143, -47, 211, -51, -51, 163, -167, 124, -105, 163, 37, -135, 52, -99, -61, -11, 13, 46, -118, 96, 42, -94, 9, -204, -71, -190, -32, 204, 135, -359, -238, -284, 51, -133, -23, 180, -333, 76, -48, 160, 33, 102, 44, -178, 21, 45, -95, -278, -51, -187, 206, 114, 251, -46, -9, 82]
2613H2j6q6J23k10Qj14NL88k67j81J60J61j95M7J56q5K15j80J94j38J38j31k40
2636a66J40n6J38q0K45m13J91m3J53L0k1j94J83L4j89m3q6J98l7M2J81k22L32
2659C17m55J28j07MmJ98O5j02j15J7J89o6j71K0J80j95p1J07J78j46r3J73k24
2682a73K64P4k37j51J87P8K49m94K73j60M4J04j45J88l4r2J03j44J39j18J05R5
2704A55M1m1j64m4J14k4j31J35P9%L3j34j21K20j95L31k39k5p2K35l31K13K64
2727B99j80R0k20k68R7K21L1k66J55P3O9n6k12KnK78m99L30k33K41j44L75j52
2750B6j90L23k91K48m9q7Q3p1R7Jj96J31k05O9k42N69jN1n7j69j28q1K16o6j29
2775a48L20k58K16Q6k43J68qk6j03j21K86j86L32k64Q8l11J77k6J01j9j22J67
$$ y = [82, 66, -20, 103, -107, -99, -213, -208, 180, -87, -268, -108, 53, -142, -95, 61, -24, 191, 11, 205, 67, 205, 74, -166, -26, -82, 56, -24, 221, -192, -1, -44, 109, 139, 118, -76, 107, 141, -48, -91, -177, 21, -16, 26, 207, -15, 317, -138, -10, -117, -113, -117, 81, 146, 44, -71, -54, 135, 69, -102, -82, 98, -97, -168, -61, 117, -29, -122, 51, -173, 91, 165, -72, -223, -36, 42, 291, -203, 70, -90, -46, 58, -87, 101, 67, -25, 78, -66, 73, -45, 60, 155, 196, 155, -9, -53, 61, 37, -94, 41, 120, 120, 153, 19, -102, 118, -77, 254, 15, -10, -82, 153, -178, 35, 299, 119, 209, -11, -279, -182, 39, 70, -196, -41, 32, 101, 45, -167, -165, -170, 108, -391, -61, -294, -53, -197, 178, 26, -164, 159, -132, 116, 67, -20, 63, -8, 89, 90, -106, 25, -180, -111, -353, 216, 215, 266, 209, 40, -88, -169, 47, -19, -148, 172, -86, 130, 216, -27, 141, 133, 107, 4, -117, 169, -17, 315, 51, 139, -172, 5, -21, 80, 61, -61, 106]
2797A06k21k1j30K11K18k55O5R2j9j19R8O9j4r6k2q3l9J85r4K04r0k44L97j46
2821E2J7J81k53k56J75O4Q5k71K77J30rk08j45j1K68j25J27r4N3r7R9K99n24K44
2845G8jJ44k41J21j55K51j22L5j19M0k5m7K3L69l42n5J32j56J02l6nM1j51K75
2869A56J3k1k89j0J44j4J32l27J20J10p9K83k44j76K09k12oL27q1l14L62k15j10
2892b42K52O4j97R3o1J2Q1K4J11o8m3O0j48j8q3K86O4Lj71k6o0l6J73q0J26m12
2918b96L11j10J64L2j50Q1j37J07mP3j21N4J73j40K00j97m2M0M4l71J99O0j3K80
2942B37p4l01J10o8N1j81N51j53k36J52k53K17j67R4P6q2o4P2L7o4j28n8J42J78
2966H8O3l59J99j67R9K95r7j63L93l62j33j4K0P8m7P1O2J72l08Q5J39l7n0n7o7
$$ y = [106, -115, -136, -266, -55, 163, -92, -27, 65, 46, -73, 25, 94, 80, -16, -38, -121, -160, 25, -69, 135, 45, -199, 198, 52, 69, 250, -3, -259, -84, -20, 65, -206, 71, 201, 192, -16, -161, -172, 96, -29, 98, 4, 57, -40, 59, 358, -166, 78, 77, 221, -20, 101, -54, 197, 75, 110, -9, 31, 6, -41, -18, 351, 9, -46, 86, -70, 32, -4, -9, 32, -119, 156, 169, 148, -141, -151, -7, -21, 111, -216, -96, 14, -65, 218, -26, -202, 7, -205, -211, 116, 35, -279, 83, -132, -242, 10, 74, -123, -30, -91, -79, 2, 26, 137, 69, 26, 86, -62, -80, -163, 123, 187, 190, 19, -7, -67, -103, 70, -10, 116, -296, 15, -95, 69, 101, -49, 32, -105, 2, -2, 71, -50, 4, 177, 37, 237, 40, -2, 38, 82, -289, -90, -30, -43, 237, 163, -138, -28, -96, -45, -226, 325, 172, -64, 88, -165, 52, -115, -21, 55, -27, -91, -19, 18, -46, -174, -232, -90, 88, 151, -208, -9, -176, -77, 218, 121, -42, 351, -11, -144, -158, -138, -60, -107, -36, 26, 198, -110, -25, 114, 77, 27, -30, -97]
2991i7j3p9L57J64k17n8k4PL6J03q9k53R2k04J19Q7j9J47M5J59m22r1L89l64M10
3016A85qm62N24k99M6j93K40J61j29nj79J29K73k16m3j46N05k56k91K58j92J0
3038h8p8K3K68j72J31k4J2j17L5L5pR6l50M96j79j63J33r8RR6J16m9m23M05k98
3063a91J78O2J25k26r3L38j66p5K21j14j91K34k11n2L73Mj54j91R3J26j59L72
3085C03l19o2n7J22J17k50Q5j3K5K08j02m3N9r3J64J47k58l33M46k46J59q6j8
3108d5K06n7k23l2J87L5q6N3j56J51nj26K90j99Q2j43J17l2o1J5qn9R0P2j64p2
3134a70m7On9K0K67k45K29p9J81M7j85R1r4Q2k34J10J68M7n6p8K8r5O8m1J7J00
3160G8k09J17j23J65M1K8j78o0J89J38j66R8k63K23J17r7J6j21j21L09L8r4j48
$$ y = [-97, -110, -189, 168, 332, 115, 57, 33, 40, 76, 179, 90, -163, -71, -275, -156, -69, -88, 59, 104, 263, -159, -250, 139, -225, 185, 177, -285, 239, -60, -14, -207, 33, 194, 65, 60, -119, 10, 283, 67, 24, -122, 383, 127, -164, 94, -98, -88, -166, -143, 125, -47, 84, 60, 72, -45, -10, 25, 18, 114, -236, 260, 81, -82, 51, -47, -38, 58, 174, 125, -298, 107, -191, -13, 49, 174, -52, -145, 193, 27, -48, 173, 59, -132, 102, -109, -161, 212, 216, 62, -129, -36, 90, -69, 303, -16, -78, -135, -13, 104, -146, -61, -74, -49, 159, 57, 14, 73, -20, 144, 291, 33, -300, 146, -100, 59, -27, -45, 161, 104, -119, -151, 36, 71, -15, 38, -118, 33, 28, -98, 192, -7, 75, -68, 49, 17, -44, -29, -37, -96, -6, 66, -98, -170, -217, -211, -270, -250, 17, -228, 1, -78, 103, 150, -35, 56, -38, 44, -190, -80, 88, 135, 79, 1, 29, -66, 2, -39, -22, 78, -131, -14, -137, 28, 69, 97, -81, -141, 48, 186, 20, 118, -145, 78, 195, 98, 114, -7, -128, 181, 219, 125, -23]
3183b3L04j69M4k59J64j4Pkj4q3J3p2L64n5k99J07j23R8j35J04J1k42K44j01J93
3208F2j6j6k39L48l20J40m2O3N1k2J37j14l3P0j24K13l07L21l35N3J20oj80K73
3232I7P5j46r4J39j87M1L3N3j33K82j70N6j91J67P5M8k27J72K1j09J39J20k32
3255B9J06j72r3L3O5K15k43K01k53o6P8n6l2K19J08j10k2k6j48J04m4J16pM2K34
3280B78l29j47Q9K34r5l06K83k06R2J56l9J9O6p8Q6R2pl44K08j49K54m5k54J43
3304AO4l0J26j03n9K24k14P6K6k27P9J21o2O7m28K47n0K89k40K37j84O2k10J7
3328a71K65k48M26j73j73J85k26j29L84k37J30K52j1q3j21nJ0M3O7j86j3k74L52
3351F4Q7r1m0o5j21L46j92p8Q5J56k80k0K86k38O9J78j7j16j85L54j67n6K43j67
$$ y = [-23, 281, 112, 156, -103, 61, 47, 54, 52, 38, -45, -32, -104, 260, 205, -94, 13, -110, -12, -147, -43, -32, -274, -30, -131, 62, 46, 30, -209, 139, -181, -41, -83, -20, 31, 9, 146, 32, -1, 69, -55, 158, -149, 172, -163, -110, 10, 4, -176, 97, 172, 26, -68, 71, -116, -75, -42, 11, -122, 160, -10, 46, -145, 22, 97, 145, -82, 90, 111, 2, 141, 261, 29, 135, -37, -130, -97, -32, 183, -60, 141, -112, -178, -100, -156, -188, 31, 139, 29, 7, -19, -167, -63, -107, 9, 2, 44, 278, -51, -198, -109, 125, 30, -276, 7, -199, -107, 49, 10, 29, 95, 17, 103, 195, 188, -156, 52, -97, 157, 112, -142, 1, 65, 35, 161, 58, -1, 223, 9, 85, 111, -116, -37, 84, 22, 89, -339, -92, -142, 147, -93, 144, -40, 22, -188, -171, 94, -154, 272, 99, -74, 111, -115, -244, 140, -97, 33, 285, 274, 191, 70, 65, 75, 118, 185, -1, -14, -288, 64, 151, 60, 20, -45, -166, 180, -12, -90, -5, 151, -129, -149, 137, -101, -32, 146, 129, 13, -172, 182, 15, -41, 202, 35]
3375C5L2j98K82m7j01J1J3m0qK35k07k0k18J56P1M7j13J61m0k19O7M8J0J8nJ19
3401H9Q9k0j0m21L00o7R2p7j25L28P5j60J15j13m7j43O7M9j4J40j13p9j40J61
3425b4K55k21M9j67n8L64l51K6M9l54L96L0j33Q1J40qj49P3J84k31K0M2J01l18
3449b04J63j50ON1Q7l0m0L22k31M6j25q7K75p5k04K5P3P0r1K70j09M6r7p6J68
3474H3R0j27j0K2O1j30J56j50or0O8n9O8N3j99K3J56j24L27j59K49l22N9r3M3
3499a1R3j98Q5J44k44L93l50m2J6P3j1r5J59O8k0l08K37j14M10k40J08q9l7K43
3523B70l51n6K22j18j95L8K83N0l4j35K25j94L9j69K82k64K08l1j23p1K1K60J26
3546B83l40K10j15pl6j52L29k84j80K26R5L5k4J03J6k00R7nQ9J40k63l5j26M8
$$ y = [35, 67, -131, 151, 104, 3, 14, 27, -13, -21, 214, 7, -13, -231, -75, -4, 43, -70, 91, 51, -168, -101, -53, -43, -25, -30, 89, 178, 158, 148, -273, 27, -40, 52, -25, -150, 178, 253, 93, 208, 95, 48, -95, -28, 21, 7, 147, 34, -45, -185, -24, 231, 10, 59, -108, -166, 198, -153, -127, -78, -432, -36, -6, -139, -58, 82, 74, -75, -2, 182, -49, -29, 13, 114, -204, -41, -191, -185, -134, -47, -77, -117, 205, -26, 20, -105, -192, 83, 8, -196, -171, -98, -28, -119, 151, 42, 88, -9, -85, 83, 173, 46, 36, 58, 119, -11, 145, -5, -11, -101, -33, -92, -24, 29, -170, -147, 9, -115, 212, 53, 302, -20, 39, -54, -11, 82, -116, -31, 113, -131, 262, -88, -130, -114, -41, -52, -147, 12, 80, 60, -248, -11, -125, 285, 45, 153, 64, 27, 270, -81, -137, 85, -33, -228, -190, 93, 143, 109, -26, 199, 5, 44, -125, 157, -107, 101, 70, -53, -124, -103, 157, 283, -57, 153, 38, 31, -5, -157, 172, -112, -292, -66, 29, 64, 40, 143, 159, -41, 56, 51, 140, 280, 17, -18, -144, -96]
3570i6L8J74k16J70l9m9J31l0k61N4J30NJ53j71j83J03J36j43K07l8j42M1P1k0
3594B5L9K3k73M58j54J13j72l00K47k15K95q1p8Qj1K98k97J07k58J54J64j89K74
3617A77k79p2K99k2Q8jl40N8K30j07p6K49j64p4n5N4K06l00K79j51J59k92K6J13
3641EM4r7k90L88p9K94k83j9O5M2L3j68n8M37m91K61p7j12K31l7k31J89r0n7K66
3666A66j39k2J49k21r3M52p3k41j13R9M7k22L62j49J5o7j6K66k37o4n9j33J90
3689a03j03K52r9J58J9k82J78P0k21K47k40J13J25k45J8J77k20K90P4r2q2K10
3711B44j70j11J06j73J51j99K16q4K17j28J3l1j87J04L6j75O6j08L92k01j57K89
3733A10m17K62J32r7O6M3k23j20K96n0O9k14L91ol41N1r4K41%k33J42J51j26o1
$$ y = [-96, -58, 116, -100, 70, 31, -18, 113, 83, -178, -124, 6, 11, 164, -7, -190, -87, 49, -94, 113, 75, -67, -26, 45, 25, 64, 87, -186, 272, 118, 231, 59, -241, 6, -209, 86, 5, -73, -65, -76, 222, -75, 32, -226, -72, 92, -97, 177, -102, -174, 125, 103, 191, 190, -150, -92, 138, 31, -45, 204, 40, -34, -89, -35, 171, -129, 150, -1, 158, -134, -108, 5, 49, -48, -338, 50, -29, 265, -18, -37, 28, 70, 103, -65, -123, 314, -177, 84, 7, -105, 126, 89, -142, 47, -43, -100, 166, 27, 5, 154, -67, -160, 292, 219, -22, -135, -36, 11, -211, 151, 2, 17, -50, -66, 200, -37, -101, -160, -293, -103, -206, 46, -53, 105, 124, -158, 20, 90, -131, 116, -124, -11, 114, -131, -113, 64, -156, 134, 208, 116, 34, 244, 74, -37, 69, -104, 47, -152, 64, -20, 197, 69, 82, 51, -136, -32, 4, -171, -105, -213, 179, -22, -179, 110, -307, -45, 87, -10, 56, 99, -124, -244, 52, 2, 71, -143, 248, 242, -99, -48, -142, 99, 99, -134, 8, 159, 33, -28]
3757b8J27k33J78L6j97K50q5j60P3p8J1K09r2J78p8QJ4k10j03k5L14j40j39J55
3781a5J25j02J0m1J60l76L81l44R4nK5J39L9L7O4M5j92k89L81q6j6j75P8J04j35
3806i4k52L72l6j8M9O8N3j93j01K37n0k89L79k5jl3k81L86l17K05k41J85j51P4
3830g4j12J92J09L9k45K16J77l10J98k39p1P2P9Qp1k29M95k93N8k1l5k53L68o
3854E2O7l4k00m4J97j84K17m7P0j39K04j88l2J11O5q3r8K16j92R4P5j80q4K87
3878A50j92J49n8J24j73R2n8K15j29l57R8K68J42k44L4J20L4k49J52k88K34J1
3900G5k35m5L38N7j0j65O0O7r2%j94J01J20J53j92j56l6p2K43O1j90m7J33N2j21
3925i5J88m55N16k74N7j80K44j17j40K96P9j57J6K97j8j27r4loJ04j60M4j46J51
$$ y = [-28, 99, -134, 44, 80, -117, 133, 48, -112, -39, -117, -106, 103, 11, 189, 111, 119, 133, -77, -180, -205, 109, -31, -170, -15, 110, 8, 18, -23, 137, -239, 142, -202, -108, -113, -88, 51, 90, 127, 191, 236, 44, -245, 136, 50, 34, -141, -63, 41, -94, -346, 26, -10, -28, 21, 89, 142, -51, -152, 85, 35, -254, 125, 100, 99, 66, -215, 171, -146, 59, -182, 3, -148, -74, -186, 6, 115, 154, -91, 125, 302, -8, 190, -49, -120, -48, 31, 39, -32, -261, 234, -59, -1, -22, -57, -310, 58, 52, 119, 85, -115, -159, 38, -146, 71, 24, 94, -45, 159, -29, -61, 50, 115, 32, -66, 150, -42, 52, 127, -53, -137, 150, -42, 107, 49, 173, 0, 92, 34, 249, 120, -237, -139, 129, 271, 27, 61, 181, 215, -34, 118, -170, 64, 75, -160, -205, 133, 190, 180, 15, 75, 142, 50, 50, -144, -43, 77, 230, 38, -118, -154, -226, 17, 78, -112, -159, -26, 26, -95, 93, -362, 154, -120, -63, -243, 1, -116, -256, 40, 119, -38, -22, 275, 257, 130, 36, 33, 27, 131, -29, 15, -131, 20]
3949B0R9k75O7J76k43K23j85J07rL6j31O3K83Qj67J12k25j3r7K06k3k56K32N1
3973E9j71K07k52K05J06l11p3L03j23L6pj35J48K0j24O2KJ69k88M1L78m23J74
3996CQ9k13R9J54j31k92L19k28J74N7j13j3Q3o9K42l8Lr9jO6j22J44n5n9Q7j74
4022h7J90j96j31L29r5M4j84K62k40N0k8R8p4P0j09L13l17K22K01k26N9l91K85
4045D5k85L5L19J01k17k2j8J15o8p3J12o0O4j68L34k89j28J80r1N4J96L2j97J10
4069H1j05J35m0m9m4O3qk77K13l7J34k15k09M98J98k19j12j25j7J28J3k09L35
4092A32k76K33m7j93J54q9M5m7N8j54Q1r4K91j63L32m4k05k0lN4j59p7J22r5K45
4117H1K8rj84j45P8K75j54R1k12o0j3K29m9Q8j6j59j55M38k51K38j90r5j58L17
$$ y = [20, 119, -156, -89, 87, -156, 67, -118, -11, -20, 16, -115, -52, 231, 239, 72, 184, -41, -54, -151, 55, 32, -224, 8, 59, -112, 95, -157, 48, 154, -157, -230, 73, -50, -14, -21, -156, -8, 12, -112, -50, -48, 121, -167, -126, 252, -171, 3, 92, -121, -22, 132, 1, -291, 28, -200, -26, 31, -82, -95, -12, -81, 161, 123, 126, 27, 26, 92, -30, 114, 59, 0, 87, -87, 103, -93, -224, 105, 10, 54, -130, 132, -108, -58, -86, 12, -62, 8, -101, 212, -105, 117, 318, 92, 151, -240, 45, -240, -205, 114, 215, -2, -24, -42, 73, 5, -68, 44, -16, 48, -120, 214, -75, -203, -23, -114, -60, 136, 168, -29, 81, -24, 111, 71, 22, -22, 41, 33, -244, -31, -68, 66, -149, -358, 140, 338, 119, 7, -118, -135, -7, 6, -203, 132, -144, 89, 42, -151, 3, -86, -41, -88, -30, -184, -103, -197, 94, -69, 263, 219, 14, -6, -9, 45, -114, -191, -69, -164, 81, 109, 100, -84, -229, -151, 124, -30, 61, -151, -211, -224, 5, -44, 44, 28, -131, -286, 152, -99, 139, -51, -146, -304, 13]
4141A3J43k10N2N5O9l29K55j33J23L7r5R5k6jll48K38J09nj99K13j30K77k62o3
4166a25N9j05K27O2l33K73m6J85k29L59j79j86Q8R1j32j57L54l79L87k65J25Q2
4188A56r8k5J78m76nL64k10L22k55k10K83J4j14J41k9j49M1k3L58n65L76j30N7
4211AJ52j80n0K36j77M1O7r0j1J48m26L44K08k70j33m8K38p4J82k08Q1n9M5o2
4235d5K09j33J8j41L1k7j4K5Q2o3J5j29oo2J56K29qj91r4N2J03J54l27J08R7p6
4261c7P3r3q7K55M1j53K80l56q4J77R2j59R2o1j67M49r3j71J52j01j10K61l16
4284a16o3O9J41j33K21m0r7j44j0K24Ml13J27L7J02K42k72j1k14K65n1o9J64O7
4308A30j9j11Q1M5o7K2j90L24j82J84Ml19k0J71o4K8Oq9lJ21j80j48L34j43J0
$$ y = [13, 156, -54, -2, 53, 122, -207, 48, -85, 38, 75, -20, 75, 49, 48, 45, -303, -65, 44, 39, -160, 53, -77, 200, -62, -125, -66, -171, 56, 118, -215, 58, 12, 197, -32, 327, 148, -38, 50, 141, 9, -148, 206, -173, 214, -51, 74, 156, 58, 33, 211, -265, -270, 94, -116, 206, -49, -259, 24, 38, -76, 65, 36, -113, -72, -95, 263, -302, 74, -56, 1, 153, -27, -77, 159, -18, 23, 90, 0, -11, 137, -289, 55, 263, -7, -140, -188, 50, -24, 158, -50, 31, -28, 17, -45, 164, 31, 49, -92, -61, -88, -102, -77, 5, -58, -43, -172, -178, -240, -84, 145, 137, -54, -148, -96, 7, 161, -166, -58, 39, -37, 36, -57, -144, 111, 152, -1, 279, -77, -161, 16, 108, -51, 41, -20, -187, 262, 169, -2, 150, 49, -61, 200, -116, -179, -110, 31, -102, 119, 79, -18, -162, -172, 52, 56, -257, -130, -93, 9, 251, -21, -32, -246, 19, -32, -101, 63, 130, 111, 0, 81, 126, 59, 81, -109, 215, 33, 217, 221, -98, -118, 53, -11, 17, 23, -66, -69, 52, -128, -276, 58, -85, -75]
4333g5J9J93k54Q2j29P5j02K8K65P1l63O3K29j58j03J28J7K2p8l0R0m3J1rj1O5
4359Cl7K16k35O0p3j86M58j99k14Q7JJ96r2J42pK6q2l4J21k51K17k32j5J41j49
4384a38M09l96l5L53o2j73M0K84k12l1N5k93K85j91J9R0L1j25R6J41r0j13J5J77
4408A36j1R0k43k18L35PP2k61J50J55l51J82K9p2N0pno9J64j18O4l28J72O2j02
4433a17J25K35L6j29l45J2J99r7J3J47q8N2P4j72n3k6M5M9l8J35k1N3q2J45r1
4458F1r9J13J13Jj16p8j34J48n8n4n1K54p4J45k03L15l19q0K19o5j53O2M2P5N1
4483A15k86K29P6n4r4J40k58J01K65m44K14k39J57J1n7J15R8l4j64M4J23n9Q9
4506H8q1j79J89q7L20l13J97k1j00j76K89K6J83m05l0K32m4j73J87J9J1j90J2
$$ y = [-75, -56, 137, -117, -35, -164, -89, -191, -163, 102, 173, -190, -127, 102, -56, -159, -31, -14, 8, -70, -100, -10, -53, -42, -51, -62, 3, -34, 182, -53, 7, -66, -252, 206, 7, -207, -120, -119, 77, -15, 127, 120, 146, 64, 30, 151, -100, 117, -115, -130, 11, -138, 271, -125, -160, 193, 131, -42, -2, 282, 70, 39, 94, -199, 86, -105, -86, 4, 35, -90, 6, 147, 57, -56, -41, 136, 125, 215, -28, -246, 89, 96, 168, -93, 57, 212, -139, 43, 72, 0, 50, 43, 38, -31, 133, 15, 79, -249, -77, -15, -117, 8, 243, 279, 150, -195, -183, 16, -81, -68, 79, -9, 43, 117, -55, -108, -134, -89, -40, -78, 57, 36, 89, 7, 152, 61, -38, 75, 188, 189, 73, -5, -139, 9, -49, -103, -154, 100, 26, 171, -32, 283, -36, -116, 103, 38, -115, -53, -11, 64, 115, -171, 58, 134, 80, -14, 126, -132, -31, 234, -210, 4, -235, -78, -67, -124, -9, 89, 55, -109, -65, 58, -1, 88, 7, -172, 17, -70, 250, -63, 134, 113, 13, -163, 126, 152, 335, -70, -100, 132, 88, -85, 102, 121, 132, -58, -46]
4529d6R6j10K5K02l32L15o3j67k48L14k6j30L13k16K5K53j22j27r1J4J6P1j26
4552a60P6J51j35O4j80J79O5K99n62J74P1l55M15J72l65K15K0P8l22j20J44K15
4574A39j20P7k97q7J82j26M95n7l88JJ88J40q8k70N2J29J38n0J7k12K32j00Q9
4597H4R1k07r4K35j78j54J73P6j66J24J34J0j09K2Lj18k1K50j94K25o12M46J36
4620A56j86N1k54J68Q1M9k93J57K46J8j47l21L56K2j62%K08j43J94l94J20M3j4
4643d5J25n9j30J13O6O8Q4l51q2j1J5L01o9j17K02r1N0j1J9j67J08k66J95J31
4667G8l34J95O4K93n55J31J96P6j72J26P4j41L6n0j60Q5L04j96nj24L6L1j94K44
4691C8p8J50j63P1j62N3R7P6Jq6j82j8m0L06j03J80j3k64K03j79K65N4j46k90
$$ y = [-46, 50, -60, -35, 167, -165, 150, 87, -80, -328, -14, -40, -170, 143, -73, -48, 205, 83, -44, -135, -121, -105, -34, -160, -84, 67, -68, -4, -184, -5, 60, 359, -203, -29, 42, -313, 102, 274, -91, 124, 144, 222, -100, -220, -76, 139, 19, 96, -201, -288, -106, -232, 263, 206, -182, -181, 7, 147, 59, -211, -159, -30, 108, 58, 75, -137, 95, -5, 84, 175, -32, -126, 109, -69, -223, -50, 26, -140, -16, 118, 128, 19, 41, 44, -74, -95, 155, -39, 186, -426, 20, 156, -30, 21, -233, -65, 16, 65, -228, -71, 175, 193, 46, -275, 81, 103, -59, -59, 149, 6, 200, -194, -74, -31, -45, 80, 21, -109, 4, 70, 138, 222, -129, -211, -222, -207, 94, 25, -92, 110, 19, 69, 58, 77, -90, 18, -248, -53, 78, -256, -61, 3, 296, -259, -128, 68, 144, -28, 98, 172, 31, 67, 17, -143, -58, 246, 50, 45, -79, -43, -12, -206, 38, -40, 110, -53, 18, -144, -91, 6, 82, 83, -3, -185, -203, -243, 63, -40, 140, 127, -137, 66, -113, 152, 206, 60, -230]
4715b30J78K10k01M7j3J78q3j25M8J29k10J02l0ol0K10l45R6O4J43o4k51R8q1
4739a66M46j74k2l6Rk4o9P7O1K86l38j17Om6J89o9K1n1J92j25l19L64l46M26k34
4764e9M8K28k79K04l32J93Ok80L18q2j6M9r4J22J13j2m83M57N5j17M0n0j66K34
4788I7k42J04l9J45k13K12K3N5m7l3Qm29K75l3J75k0rk5o4M4j20L38j35j05K63
4813B25k72J74j35J47j67p0J13O9K56k10k33K15Jk97J87j49J76k2Q7n5n5K1J97
4836B03m2m0Oj82Q7K02m52M19k94K09J51k09J9k07M8m7K91l8k59L53k24p5J75
4859I4k68J99M8j16k71K42J54j8j47K5j05M16m09j41K55L8M8O4J69j01K25k16
4881A85k18mlM0j40k9R7J15l9J25m0r1K66k73J56l63J42K80j02j68L0j9k2J21
$$ y = [-230, -52, 158, -43, 4, -9, 169, 86, -39, 9, 138, -72, 30, 0, -6, -36, 174, -171, -75, -11, 132, 68, -183, -85, -166, 280, 106, 84, 48, 57, 33, -36, 41, 102, 388, 50, -67, -61, -107, 82, 13, 34, -17, 175, 50, -269, 95, -251, 175, -59, -11, 217, -62, 142, -190, 3, 9, -271, 47, -35, -51, -2, -96, 26, 139, 127, -356, 101, 156, 39, 79, 29, -137, 97, -145, -41, -80, 65, -148, 64, 87, 142, 95, 62, 70, -359, -84, -117, 58, 38, 29, 4, -60, -16, -136, 202, 67, -38, 225, -47, 127, -8, 139, -28, -98, 15, 84, 340, 130, -103, 112, 113, -184, 3, -146, 30, 8, 95, 40, -15, 6, 203, 161, 121, 127, -55, 32, 234, -218, 201, -93, 116, 267, 58, 77, -130, -82, -129, 162, 124, -135, 218, -6, -81, 94, -174, 25, 73, -43, -314, -72, 82, 64, -83, -58, -163, 253, -156, -297, -42, -4, 44, 108, 277, 176, 401, 185, -33, -37, -40, 0, -140, -169, -72, 43, 4, 129, 89, -2, 264, -9, 147, -216, -74, 206, 104, -64, -34, -53, -75, 46]
4905D6K50k36j54K04J7j38l2J71l85M52l5j54J17k57J43k5R3j3J1k55K27P7k83
4928a59j92L14J03K22k71n5j62M7O6K6j06K14j51K80j24Ll28K88l32J07L16K4
4950A30m08L68r7j44j22K71Q2k84J51j28K13k6J64p9l7k8j2j85J0l7l9L18n6n
4974B0K2m5P7j69N3K1q5j40J82J53M9j80NJ70Jn1m7J47N0k21J60k52J79M5k92
4999a48J74J53j41p6L9N7m16L56Q0j75%J01j33R0J8J28Nn0K76k68j39K67k53j02
5023a57L02K17j85l48l2M36k38L6j94K6J52j36M6J56rk12K45k44K27O7m1j61j43
5046a90lJ06L16l89K22j63j0J66l0J3j69M12j91J09k07O7o5j99K07j56J87j77
5068a44J29J23k1L7n8j50l0K70j89M9K3OJ22j93j71K86o7k18J77k2M6q4PJ43j53
$$ y = [46, 296, 60, -94, 110, 127, -11, -43, 128, -257, 195, 160, 6, 123, -134, 9, -16, 77, 64, 75, -180, 47, 124, -159, -351, -37, 66, 288, 17, -38, -200, -153, -87, -61, -167, 47, -104, 176, 52, 55, -273, 15, -317, -210, 106, 130, -278, 90, -7, -151, -273, -2, 80, -204, -53, -181, 32, 6, 170, 91, 54, 26, 14, -171, -161, -198, -237, 81, 25, 20, 42, -3, 74, -95, -42, -21, -106, -246, -64, 89, 138, -42, -37, 133, 134, 83, 36, 183, 233, 12, 172, -80, 99, 144, -148, 26, 179, 38, -38, 1, 58, -358, -2, 78, -97, -97, 4, -129, -39, -21, 107, 112, 62, 338, 70, -69, 198, -55, -157, 145, 362, 177, -171, -203, 233, -5, 31, -163, -137, 15, -121, -75, 81, 72, -140, 105, -139, 88, 155, 114, -47, -190, -193, -87, 229, -160, 62, -101, -111, 55, 25, 38, -131, 281, 90, 199, -8, 59, -6, -205, 2, -154, 33, -144, -15, 108, 87, 124, 66, -84, -114, 156, -33, 16, 39, 45, 167, -26, -197, 89, 22, -196, -19, -41, 5, -79, -72, 71, -82]
5093h2J93o9j15J91j47j4K47j88l2J00j28j04P5K7K40l56L31k28J26j57K59k28
5115e9J47o8n0O0j49J70l7jK80k22Nj19nO2l28L08oJ18r5J00k4%k1JK27j58j49
5142a3O0j26K59j86R8k33n4R2J79lj63K48j60m6P3j67K17O7L5Nq7K34n59L63q8
5167D5j30J92J55r5k40J1r5K32Q1k41J30J32k21K26r9r0O2k6j81J85P2j40k2r2
5191a49RK44k32M8L00j17l12N4K01J65J3n27K90J89k88Q9J65ll48K2O3O0J12j1
5215C7L9k10O0j76J85pq2n7K41j26j55K66k12J47%L1J49j50QP7j64r1K23R0k64
5240a41M8R5K1P3o9k9P7j96N4J37r2L4m7PK42L9m56J80O7J72l31K04Jo1j36n6
5266a63J18K04k26j49K30N7j43J65j82R2Q9L0n5o1N9M4m7J8l5j65J93j40L2p1
$$ y = [-82, 111, 42, -73, 118, -29, -43, 204, 16, -16, 84, -44, -148, -73, -46, 194, -162, 169, -59, 67, -90, 169, -59, 88, 20, -30, 30, -119, 51, 14, 13, 293, 71, 76, -43, -48, 14, -314, -6, -12, 106, 11, 111, 87, 87, 66, 67, 294, 136, -13, 47, -79, 180, -6, 92, -141, -195, -103, 76, 73, -90, 158, -2, -48, 25, -142, 75, 142, 177, 182, 95, 329, -230, 133, 45, -85, 107, 262, 167, -73, -62, -157, 75, 156, -85, 45, 177, -44, 182, 83, -7, 55, 29, -152, 33, 105, -35, -57, -149, -140, 104, -128, -80, 220, 103, -209, -155, 46, 211, 224, -303, -13, 176, -112, -23, 142, 139, -209, -187, -124, -64, 48, 37, 76, -134, -74, -250, -65, -72, -154, -211, 30, -96, -251, 15, -197, -50, -50, -19, 130, -20, -12, 65, -99, -190, 33, 123, -141, -93, 2, 23, 96, 27, -2, 75, -121, -67, 70, -22, 12, -35, -28, 214, 253, -203, -23, 44, 216, -115, 89, 90, 29, -107, -163, -45, 159, -67, -216, 14, 71, -72, 93, -89, 3, 92, 122, 67, 6, 65, 109, 62, 80, 45, -120, 73, -67, -35, -106]
5290a06J35O2j67m3J73k40J47R9m9J09Q0l06J98q5J10j57k0K07k07J33l49L87
5312A11o9k09K1L12m08L56j62%k3j49J47Q1J28m5O6j0n38L38J07l2j21N9J32j53
5336f1J62K6j83L1M0J64n1l13J92j10K50k11k05M76j95j27K91k86K32l67K39p9
5358h5J16L3o9j1J10K4l50L77M0l06N4K99r2L1l76L20j24k00n4J75M9K4J1J69
5382A65l95M01j39j98J88O7j29j76K01j17M42l38K6Q0j77J43n8l4k33K85J8n9
5404c7M0P9k67L87j1J1k13J5J88l41K25m6l19L44J60rj61j15K06k43j18p3L17
5427A9j63J32j51J32J75k93K5K18J5m6k94L40o1k66Q0K39l49K96J13k04Jo9R6
5450a5r7M1m6j47K79J8m2q2k72L53L9l6N0k19p8K66J28j91P2L5K25j19m35J86
$$ y = [-106, 29, 91, -76, -119, 54, -186, -39, 60, 11, 120, 200, -106, 92, 7, 117, -40, -60, 147, -60, 73, -276, 111, 42, -167, -146, 166, -242, 114, -48, -48, -71, -220, -73, 8, 136, 91, 157, 147, -391, -53, 54, 22, -99, -40, 92, -61, 101, 127, -56, -25, 15, 179, 128, -185, 7, -103, 147, -64, -269, 207, 12, -115, 176, -110, 122, -245, -6, -85, 31, 64, -5, -16, 94, 118, -232, 145, 185, -121, -67, 232, 140, 171, -205, 115, -9, -209, -263, -88, -39, -15, -4, 165, -230, 171, 32, -166, 22, 89, -40, -216, -15, -132, 310, -28, -2, 78, -99, 44, -14, -48, -281, 4, 22, -37, 3, 82, -185, 202, 191, 202, -11, 4, 192, -149, 76, 30, -289, 55, 215, 206, 45, -70, 136, -107, -225, -298, 19, -144, -12, -163, -31, 144, -149, -124, 94, 109, 63, -231, 109, 48, -218, -138, 101, -248, 48, 161, -43, -42, -111, -15, -112, -71, -117, -264, 15, 33, -9, -91, -363, -10, 29, -7, 43, -176, -254, 12, 140, -51, 21, 56, 281, 162, -273, -87]
5474h7J34l46M03j35K2J34O1j56j16m1J93m4L3j36K43m58R5K32O2k9k34K12n8
5497a6j83J98r7N2k0J63k4N0l08N43l55N0o9J74k98K20Q1k81N2q5Q0R0j7k36O7
5522a69l14M41m6j0r7K01j73L88j52O6P3k53j70J70J58Jo3N6j79K99q6k86J21
5545b4j38K00j51J72k82L37k35p9Q0K67k96J07L9J82k47j33J31L5l2R9m8q7k0
5568a23R6O4j76J05Q7k99K17Q2j23j0Q7p3k16M82j13J30L2k61O8l1p1J87l45J54
5592e0N4J04p1p6J7j9K86j58o8l4n4J11p2J77M4j49k29J33M7P6o1j34N6K63k32
5617c9K1j56J95l4J81k10m3J09K32l05J50j06Q6j01Q2j86K32l9m01J96J42K55
5639B61k05Kq9J81j04k30k5L28l63K83j39j69M3K37n8M7L3j92J17j62M77j95J03
$$ y = [-87, 47, -299, 104, -31, -9, 125, 186, 30, -86, -127, 66, 22, 55, -81, 162, -296, -201, 31, 93, 64, -170, 42, -16, -199, -1, -98, -46, -66, 97, 73, 123, -185, 358, 3, 53, -16, 158, -140, 80, 161, -120, -68, -153, -73, 17, 0, -236, -169, -483, -42, -88, -98, -195, 6, -167, 221, 69, 135, 208, -45, -215, -45, 113, 114, 51, 107, -72, 227, 141, -145, -24, -162, 38, -113, 59, -223, 114, -121, -200, -120, 147, -149, -42, -3, 179, -68, -201, -70, -35, -67, 32, -16, -103, -123, -27, 37, -139, -34, 53, -246, -29, 53, -70, -80, 7, -66, -282, 200, 87, 217, 249, -12, 56, 25, -46, 141, -204, -50, 4, 108, 37, -39, -22, -41, 245, 87, 19, -15, -69, 42, -30, 147, 191, 42, -187, -54, -7, 69, 8, -126, -70, 193, -39, -18, -174, 21, -13, 168, -42, -85, 24, 256, -49, 101, -5, 81, -20, 62, -124, 108, 69, -332, -136, 6, 261, 56, 58, -31, 150, 46, -184, -209, 119, -244, 39, -100, -269, -226, 11, -47, 0, 33, -159, -42, -204, 273, 78, 181]
5662A81k14L6J38j32j75J41k1J57k15O1J44k9J25k98P6k09K27j8k7oK54o1p4l77
5686c16N16m54K05j44K43J08j87L7k8K76Jj76ok07M5L9K8L51l48J17j04J80l24
5709a48J24J43j51j37K38q5j69L44k67K44j20J99q5Oj99J11j51L15n8k44K15j31
5731fJM9R0k60K69j18K34m93K13O6k65N7K44r6R2J56k04j8k65L59M0q9K32k42
5755D6r1J26q0m1J73q9q5K11k57K17j22K40l82P9Q1k3K05l40k76J75L23L6p2o7
5779a3J64m14M29l32M4PM0j45J28k6m5J83q8k5q5L62J78k47k30M03l30r3K8K55
5803A48j28o0j04J29J79j03R9q9j50M3q3J56j61J4K47l01K29q7N8O4j84Q1lK55
5827B49l27Q7J59k09r1J54o2K80m07j29K64J93r1N7q2j71N5N1j62K76j81J83j22
$$ y = [181, -33, 3, 141, 9, -166, -25, -46, 111, -104, -43, 101, 72, 197, -101, -25, -234, -7, -25, -52, -58, 196, 135, 61, -316, 200, -254, -49, -193, 50, 158, -29, 8, -20, 256, 257, 81, 75, -132, -87, -48, -20, 331, -17, 100, -4, 176, -148, -24, 119, -32, -169, 69, -16, -185, 159, -108, 136, 16, 215, 130, 136, -63, 48, -103, 212, 154, -90, 125, -6, -5, 44, 134, -126, 143, 25, 259, -234, -21, 45, -220, -163, 81, -15, 77, 233, 29, 11, -254, 105, 145, 56, 288, 46, -45, 81, 1, -40, 133, 44, -41, 170, -87, 130, 8, 248, -134, -55, 26, 3, 208, -132, -408, -233, 90, 126, 54, -13, 151, -263, 166, -166, -122, -115, -75, -220, -92, -118, -163, 20, -68, -93, -178, 184, 362, 115, -115, 288, -42, -135, -107, 148, 20, -40, -144, -15, 164, 61, 160, 71, -79, -36, -119, 37, -124, -110, 137, -164, 65, -22, 36, 100, -84, -3, -6, 249, -78, 9, 168, -41, -132, 22, -40, 240, -167, -296, -32, 161, 70, 127, 45, -126, -71, -20, -182, 94, -87, 96, -26]
5850b6r7K99k0j10j69K20l15j3K69k97k7J10J73J20j83J1M2j73M84k94k2j53N9
5873a12L7L8j44J30j68L18j01P9J87n61L52J01k08J35r3J00nj10o9J78o3K24k67
5896b2k78K14J21j9l3K15j40j72j05J54J0J94j94k6Q2L7K96j88j25j78M50pk35
5919E1j0k14K00j50O1r8J69k19K65k5J48k15J53j94L5O5J5N0L7j06j48J86Kj37
5943g9p3L7J73j6l57M56j18MPK9r8k7O0KM4o1j19K81k09K4J03J45q4k18J11j13
5969i6o5J50Kq8R5o7J73RrQ6j95Q0k65J75L3j6k7j33J34J09l71L10J03j10k9J53
5995A41n7ro7l33J69kK38N1j07p5L02N7k70j24j1N3J96j63j38L07j76J1PK36l15
6020g9j7j4j75K40J42l07R4j58M54l74J95j81J76pJ53J68k06j60j04K26j53j21
$$ y = [-26, -123, 176, 156, 46, -123, 97, -218, -231, 38, -259, -286, -176, -3, 117, -66, -55, -13, -186, 298, 4, -18, -171, -112, -75, -37, -181, -51, -219, 99, -2, 77, 264, -297, 55, 156, -52, 83, -10, 90, 85, -25, -94, 84, 21, 245, -22, -300, -86, 35, 16, -17, 198, 58, -114, -219, -65, -55, 139, -55, -81, 1, 38, 334, 146, 21, -157, 293, 286, 51, 41, -173, 27, -123, -62, -160, 9, -210, 55, 30, 178, -37, 116, -78, -43, 22, 37, 87, 124, 18, -130, 56, 58, -79, -152, -115, 58, 42, -315, 141, 23, 27, 34, 63, -35, -62, -2, 0, 44, -17, -136, 145, -64, -40, 63, 208, 124, -94, 17, -96, -161, -11, -9, -97, -2, -69, 104, 113, 104, 190, -5, 75, -190, -15, 18, 2, -25, -158, -24, 85, -286, 24, 127, 17, -12, 141, 84, 75, 8, -325, -156, -158, 80, 131, 24, -51, 251, 308, 38, -86, -97, -44, 152, -11, -149, 158, -18, -7, 0, 236, -79, -96, -110, -285, -45, 97, -210, -116, -274, 180, -194, 1, -180, -4, -11, 142, 310, 104, -56, -160, 66, -87, -208]
6042b08K59L2j78K34l70K36q0N8J08Ml60L69j13n5N1M4M5r1k25J43J21l47J93
6065a30K62r6p9J22j0l32K02o0J35n0n5kL6P8k6K0j20R1J16N6k17J18J85j66p
6090G1j39p8L37l09K02j1j97L78k58K44L2k31k10j0L31j46j57K46J4m12K52N1
6112@J62q7K44m62LK95j61K09j58R1nJ03j38m20L34l5j33K15o5M6j08K66l86J08
6136h2k34N34m3j24O9j6J52m57Q2K81k95K07O4k67L46l08L8J64j7L1r4M8o2n1
6160c4K18l86O3K13Q6r2N6lj56m8q7J8J76M1l02J30L24j42J43k35J82r2k64J10
6184h1K59j21j90L13l92K32mJ50l64j1JJ16K9R5j41r3J73J38o9j04k2K18q4k00
6208a52J51J67J08m2nL4j73Lp8p4L49n17N8J52l9j36K40l8j68K26j02J03k53K62
$$ y = [-208, 51, 83, -95, 139, -231, 5, -75, -17, 91, 95, -265, 104, -9, -64, -13, 31, 76, -15, -240, -97, 24, -323, -130, 132, 36, -43, 79, 69, -263, -61, -121, 14, -36, -91, -93, -57, 21, -5, 15, -105, -14, 102, 158, -59, 59, 244, 78, 71, -68, -146, 191, -118, 84, 73, -124, 254, -4, 240, 272, 41, -169, -179, 152, 6, -151, 95, 109, -303, -51, 0, 162, 75, 319, -143, -140, 155, -6, 203, 45, 136, 131, 234, 96, -324, 10, -25, -158, 57, -8, 38, -70, 196, -190, -82, -316, 218, 175, 51, 120, 104, 256, -201, -119, 162, -133, 74, 138, -129, 217, -91, -53, 111, 94, 125, 31, 79, 17, -34, 184, -202, -139, 74, 160, 68, 124, 121, -35, -83, -170, -152, 24, 65, -237, -107, 217, 75, 218, -17, 165, 73, -191, -81, 178, 57, -133, 180, -212, 20, 16, 166, -198, -209, -208, -92, -63, 32, -109, -202, -29, 109, 40, -64, -86, 132, 48, -152, -1, 166, 274, 232, 227, 261, 88, 91, 13, -61, 288, -229, -171, -19, -58, -194, 46, 8, -160, 66, -36, 67, -186, 76]
6232G6p0j45L35k56j81L46m03K14L79k82l59L16j9K1J22kk9n1l37O83n28%K02
6255C2K9j44j25M01J14m13Q0k29K13J90l7k15K32j00j68J62O7j51m9M5k33M32
6277A33j81R8j57pq3n0N13q2k24k0j6J61J51j5k53K5o0q9O5J74k16J70l25K80
6301h%L3R7J88m76J79R6J66o15N29l55R8j07j18J83j80N18l96K69j39L5l6j8J5
6325d2L8j89K46M7j41M79o24J21j3N8RJ73k34j58K30j49L46k4j43rk4J15q5k13
$$ y = [76, 6, -139, 196, -60, -241, 105, -298, -84, 295, 13, -346, -30, -49, -28, 94, 92, 63, 12, -325, 358, -170, -170, 32, 61, -83, -208, 193, 307, -106, -26, -255, -42, 148, 111, -104, 128, 28, -140, 22, 89, -62, -111, -66, -299, 133, -48, 50, -107, -114, -197, -247, 266, 184, -40, -60, -76, 85, 236, 221, -32, -7, -67, -156, -91, 83, -133, 37, -288, -8, -8, 25, 122, 310, -166, 13, 109, 275, -340, 189, -166, -68, -175, -293, -110, -290, 228, -168, 101, -38, -3, -39, -57, -42, -4, -193, 53, 100, -41, 438, -186, -65, -78, -20, -11, 162, -72, -230, 0, -149, 197, 173, 30, 21, -3, 112, 27, -186]
$$ [...]
8191g7
##END NTUPLES=NMR FID
##END=
