##TITLE=31Pdec_SR28_AcCl2
 , 24 sc
 24.12.2020
##JCAMPDX= 6.0         $$ Bruker NMR JCAMP-DX V2.0
##DATA TYPE= NMR SPECTRUM
##DATA CLASS= NTUPLES
##ORIGIN= UXNMR, Bruker Analytische Messtechnik GmbH
##OWNER= root
$$ XWIN-NMR		Version 3.5
$$ Thu Dec 24 12:47:35 2020 Russian Standard Time (UT+4h)  she@DPX200
##.OBSERVE FREQUENCY= 81.013821
##.OBSERVE NUCLEUS= ^31P
##.ACQUISITION MODE= SIMULTANEOUS
##.ACQUISITION SCHEME= undefined
##.AVERAGES= 24
##.DIGITISER RES= 16
##SPECTROMETER/DATA SYSTEM= spect
##.PULSE SEQUENCE= zgpg30
##.SOLVENT NAME= DMSO
##.SHIFT REFERENCE= (INTERNAL, DMSO, 0, 238.294)
##AUDIT TRAIL= $$ (NUMBER, WHEN, WHO, WHERE, WHAT)
$$ ##TITLE= Audit trail, XWIN-NMR		Version 3.5
$$ ##JCAMPDX= 5.01
$$ ##ORIGIN= Bruker BioSpin GmbH
$$ ##OWNER= she
$$ F:/spectra/data/she/nmr/P31/1/pdata/1/auditp.txt
$$ ##AUDIT TRAIL=  $$ (NUMBER, WHEN, WHO, WHERE, WHAT)
(   1,<2020-12-24 12:44:51.25 +0400>,<she>,<DPX200>,
      <created by zg, POWCHK disabled, PULCHK disabled
       configuration hash MD5:
       00 E9 B6 7A A2 85 ED C7 34 08 36 98 17 FE 4E 26
       data hash MD5: 32K
       76 05 F8 64 EC BF D9 DF 84 23 1B 51 33 98 72 F1>)
(   2,<2020-12-24 12:44:53.68 +0400>,<she>,<DPX200>,
      <Start of raw data processing
       efp BC_mod = 2 LB = 1 FT_mod = 6 PKNL = 1 PHC0 = -2510.311 PHC1 = 1128.801 SI = 64K 
       data hash MD5: 64K
       A5 8B A2 71 FA C6 6D 0B EC 29 C5 7F 66 6D 73 30>)
(   3,<2020-12-24 12:45:27.21 +0400>,<she>,<DPX200>,
      <pk PHC0 = 120.5932 PHC1 = 227.6 
       data hash MD5: 64K
       2F B3 39 9A D3 78 B8 63 20 3D FE 1C 74 FF 25 60>)
(   4,<2020-12-24 12:45:29.96 +0400>,<she>,<DPX200>,
      <abs ABSG = 5 
       data hash MD5: 64K
       03 09 DF 55 38 32 32 33 75 60 2C 1E 29 E4 6E 99>)
(   5,<2020-12-24 12:47:01.84 +0400>,<she>,<DPX200>,
      <pk PHC0 = 1.33113 PHC1 = -18.4 
       data hash MD5: 64K
       CB F1 BC 20 F7 74 E9 F6 15 24 6F 4E 06 C5 A5 45>)
(   6,<2020-12-24 12:47:05.39 +0400>,<she>,<DPX200>,
      <abs ABSG = 5 
       data hash MD5: 64K
       15 87 E1 2F 4A B9 4D 82 18 2A 00 60 91 26 A9 EF>)
$$ ##END=
$$ 
$$ hash MD5
$$ D0 A9 E9 59 63 E9 01 C4 9A 88 B1 24 25 CD E7 A7
##$RELAX= 
##$RELAX= 
##$RELAX= 
##$RELAX= 
##$RELAX= 
##$RELAX= 
##$RELAX= 
##$RELAX= 
$$ Bruker specific parameters
$$ --------------------------
##$DU= <F:/spectra>
##$EXPNO= 1
##$NAME= <P31>
##$PROCNO= 1
##$TYPE= <nmr>
##$USER= <she>
##$AMP= (0..31)
100 100 100 100 100 100 100 100 100 100 100 100 100 100 100 100 100 100 
100 100 100 100 100 100 100 100 100 100 100 100 100 100 
##$AQSEQ= 0
##$AQ_mod= 1
##$AUNM= <au_zg>
##$AUTOPOS= <>
##$BF1= 81.014009
##$BF2= 200.13
##$BF3= 200.13
##$BF4= 200.13
##$BF5= 200.13
##$BF6= 200.13
##$BF7= 200.13
##$BF8= 200.13
##$BYTORDA= 1
##$CFDGTYP= 0
##$CFRGTYP= 5
##$CHEMSTR= <none>
##$CNST= (0..31)
1 1 145 1 1 1 1 1 1 1 1 1 1 1 1 1 1 1 1 1 1 1 1 1 1 1 1 1 1 1 1 1 
##$CPDPRG= <waltz16>
##$CPDPRG1= <>
##$CPDPRG2= <waltz16>
##$CPDPRG3= <>
##$CPDPRG4= <mlev>
##$CPDPRG5= <mlev>
##$CPDPRG6= <mlev>
$$ [...]
##$SUBNAM3= <"">
##$SUBNAM4= <"">
##$SUBNAM5= <"">
##$SUBNAM6= <"">
##$SUBNAM7= <"">
##$SUBNAM8= <"">
##$SUBNAM9= <"">
##$SW= 481.230909671925
##$SWIBOX= (0..15)
0 1 3 0 0 0 0 0 0 0 0 0 0 0 0 0 
##$SW_h= 38986.3547758285
##$TD= 32768
##$TD0= 1
##$TE= 0
##$TE2= 300
##$TE3= 300
##$TEG= 300
##$TL= (0..7)
0 120 53 12 22 120 120 120 
##$TP= (0..7)
150 150 150 150 150 150 150 150 
##$TP07= 0
##$TPNAME0= <>
##$TPNAME1= <>
##$TPNAME2= <>
##$TPNAME3= <>
##$TPNAME4= <>
##$TPNAME5= <>
##$TPNAME6= <>
##$TPNAME7= <>
##$TPOAL= (0..7)
0.5 0.5 0.5 0.5 0.5 0.5 0.5 0.5 
##$TPOFFS= (0..7)
0 0 0 0 0 0 0 0 
##$TUNHIN= 0
##$TUNHOUT= 0
##$TUNXOUT= 0
##$USERA1= <user>
##$USERA2= <user>
##$USERA3= <user>
##$USERA4= <user>
##$USERA5= <user>
##$V9= 5
##$VALIST= <valist>
##$VCLIST= <CCCCCCCCCCCCCCC>
##$VD= 0
##$VDLIST= <DDDDDDDDDDDDDDD>
##$VPLIST= <PPPPPPPPPPPPPPP>
##$VTLIST= <TTTTTTTTTTTTTTT>
##$WBST= 1024
##$WBSW= 4
##$XGAIN= (0..3)
0 0 0 0 
##$XL= 0
##$YL= 0
##$YMAX_a= 9466
##$YMIN_a= -15028
##$ZGOPTNS= <>
##$ZL1= 120
##$ZL2= 120
##$ZL3= 120
##$ZL4= 120
##$ABSF1= 238.2943
##$ABSF2= -242.9355
##$ABSG= 5
##$ABSL= 3
##$ALPHA= 0
##$AQORDER= 0
##$ASSFAC= 0
##$ASSFACI= 0
##$ASSFACX= 0
##$ASSWID= 0
##$AUNMP= <proc_1d>
##$AZFE= 0.1
##$AZFW= 0.5
##$BCFW= 0
##$BC_mod= 2
##$BYTORDP= 0
##$COROFFS= 0
##$CY= -3
##$DATMOD= 1
##$DC= 0
##$DFILT= <>
##$DTYPP= 0
##$F1P= 0
##$F2P= 0
##$FCOR= 1
##$FTSIZE= 65536
##$FT_mod= 6
##$GAMMA= 0
##$GB= 0
##$INTBC= 1
##$INTSCL= 5.30512e-09
##$ISEN= 30
##$LB= 1
##$LEV0= 0
##$LPBIN= 0
##$MAXI= 10000
##$MC2= 0
##$MEAN= 0
##$ME_mod= 0
##$MI= 50
##$NCOEF= 0
##$NC_proc= -5
##$NLEV= 6
##$NOISF1= 182.463
##$NOISF2= 159.3651
##$NSP= 0
##$NTH_PI= 0
##$NZP= 0
##$OFFSET= 238.2943
##$PC= 4
##$PHC0= -2388.387
##$PHC1= 1338.001
##$PH_mod= 1
##$PKNL= yes
##$PPARMOD= 0
##$PSCAL= 0
##$PSIGN= 0
##$REVERSE= no
##$SF= 81.014009
##$SI= 65536
##$SIGF1= 159.3651
##$SIGF2= -187.1042
##$SINO= 113.3802
##$SIOLD= 16384
##$SREGLST= <1H.CDCl3>
##$SSB= 0
##$STSI= 65536
##$STSR= 0
##$SW_p= 38986.3547758285
##$SYMM= 0
##$S_DEV= 0
##$TDeff= 32768
##$TDoff= 0
##$TI= <>
##$TILT= no
##$TM1= 0
##$TM2= 0
##$TOPLEV= 0
##$USERP1= <user>
##$USERP2= <user>
##$USERP3= <user>
##$USERP4= <user>
##$USERP5= <user>
##$WDW= 1
##$XDIM= 65536
##$YMAX_p= 510127172
##$YMIN_p= -13724330
$$ End of Bruker specific parameters
$$ ---------------------------------
##NTUPLES= NMR SPECTRUM
##VAR_NAME=  FREQUENCY,     SPECTRUM/REAL,   SPECTRUM/IMAG
##SYMBOL=    X,             R,               I
##VAR_TYPE=  INDEPENDENT,   DEPENDENT,       DEPENDENT
##VAR_FORM=  AFFN,          ASDF,            ASDF
##VAR_DIM=   65536,         65536,           65536
##UNITS=     HZ,            ARBITRARY UNITS, ARBITRARY UNITS
##FACTOR=    0.594893641196742, 1,           1
##FIRST=     19305.1762622329, 0,            0
##LAST=      -19681.1785135956, 0,           0
##MIN=       -19681.1785135956, -13724330,   0
##MAX=       19305.1762622329, 510127172,    0
$$ Real data points
##PAGE= N=1
##DATA TABLE= (X++(R..R)), XYDATA
$$ [...]
62171c375866J445744J331274P29557P39091R56519M55297l77320o10741m91975
62162H01580p52377r68855l40787N14143L43060n56708p19485J29323Q25531Q03144
62152G8569O78282P22284M02365l13940p12249o72941q15120j024165l71116J035257
62142i92774J645410O49523p44369j033334l13248L70916N70246M57276J37573
62133G47219k14620k00005J18937M8690n84832r05623l52427K43637j02062q97564
62123b098650q95499rP00656O13727K55494J74530K59756K96596L39104K50316
62113a03979l34092j175001j278388j88489J073824J119667Q597q31388n22695
62104b231944K18275K80191k93746n74446j42477N11020Q14460O71208K42574
$$ plain form
62171 -3375866 -1930122 -598848 130709 869800 1826319 2281616 1904296 1293555 801580
62162 801580 49203 -919652 -1260439 -746296 -403236 -959944 -1679429 -1550106 -724575 78569
62152 78569 756851 1479135 1881500 1567560 855311 182370 -632750 -1656915 -2028031 -992774
62142 -992774 652636 1302159 557790 -475544 -788792 -417876 152370 609646 747219
62133 747219 532599 332594 451531 500221 -84611 -990234 -1342661 -1099024 -1201086 -2098650
62123 -2098650 -2994149 -2994158 -2293502 -1679775 -1424281 -1249751 -989995 -693399 -354295 -103979
62113 -103979 -438071 -1613072 -2891460 -3079949 -2006125 -886458 -877861 -1709249 -2231944
62104 -2231944 -2013669 -1733478 -2027224 -2601670 -2744147 -2233127 -1418667 -747459 -504885
62095e04885j88523j88680L05417N06739l13748j405471j121639P17284K159840
62086c3666J525062m38515j627173j101011L13107J325751J233478J56339r75273
62077C78099j086402k31138L53892O030m17635r2719L40064K5290m36219m3014
62067a203752O61020L80334o66955r99678j86482P15486R59754Q06261M33842
62058H99830l20044j039237r70888l12294K9834n1002P8569L59839J79822j80739
62048a326310R0243N86169J49321q37758o74975P91868J634301Q15055l29430
62039H98484m51246j17604k94672o19891l94484J09541M06501N88856N50507j43618
62029E32374q91674k92934J369815J840198K56891j245520q34795K08450k9911
$$ plain form
62095 -504885 -693408 -882088 -576671 -69932 -383680 -1789151 -2910790 -2193506 -33666
62086 -33666 1491396 1052881 -574292 -1675303 -1362196 -36445 1197033 1353372 378099
62077 378099 -708303 -939441 -585549 -579519 -997154 -1089873 -749809 -724519 -1160738 -1203752
62067 -1203752 -542732 -162398 -829353 -1829031 -2015513 -1300027 -340273 465988 899830
62058 899830 579786 -459451 -1430339 -1742633 -1712799 -1763801 -1685232 -1325393 -1145571 -1326310
62048 -1326310 -1236067 -649898 -500577 -1338335 -2013310 -1221442 412859 1227914 898484
62039 898484 447238 329634 34962 -584929 -979413 -869872 -463371 125485 675992 532374
62029 532374 -359300 -652234 717581 2557779 2814670 1569150 734355 942805 912894
62020I12894p65789k02249R67015O71456p62073r73775M44151J213492J25554
62011A630676j002050k43477J433472J579057k94953k094924j820157J06379J574142
62002H68165J432488O18106L69842L15903m88398j362907p83481P53252R38853
61993B661823p48245k015622j333536j45645n3670k01720N46494J077378J49918
61984f2825q93915l38145O40164L688j200911l84580J928045K594533P81583j057822
61974B009815j276897q27336n91749r8568M98989J68199o07654j32780J153457
61965B95476Q27184j145938j688812L00808J735997L62254j411969n96038J379758
61956E8720J251217o12294j143914K57268J264307Q24579K89517K72329l39778
$$ plain form
62020 912894 147105 -55144 911871 1583327 821254 -152521 291630 1505122 1630676
62011 1630676 628626 385149 1818621 3397678 3102725 1007801 -812356 -705977 868165
62002 868165 2300653 2918759 3288601 3604504 3116106 1753199 969718 1722970 2661823
61993 2661823 1913578 -102044 -1435580 -1581225 -1634895 -1836615 -1290121 -212743 -62825
61984 -62825 -956740 -1294885 -654721 -651033 -1851944 -2236524 -308479 2286054 3067637 2009815
61974 2009815 732918 -94418 -686167 -784735 -285746 -117547 -725201 -857981 295476
61965 295476 1122660 -23278 -1712090 -1411282 324715 686969 -725000 -1321038 58720
61956 58720 1309937 697643 -446271 -189003 1075304 1899883 2189400 2461729 2121951
61947B121951j604061j657157K38857K081448J878319K78007q25327r06500p06925
61938H98612n64449j94234L92506P77185O67024j5722j095967j778246j112416
61929b025707N12397J230372P7246j287153o73016J296558J788717j21060j929907
61920a131553j276698P35682J458094O43580K40369Q22186P93374n22211j443736
61911C19087o50044O75620Q66936L17169L10388N98389N3693j093388j551786
61902a53936j014030k46450L96994R44988Q19420l55866j374534p71375P21304
61893a033485J003737j92221r72913k94567P20804Q64230L55456k14963p39185
61884e03107q94938k11283P39718P81869M3974k26326J19524L9414m45285j87668
$$ plain form
61947 2121951 517890 -1139267 -900410 1181038 3059357 3337364 2512037 1605537 898612
61938 898612 334163 139929 532435 1309620 1976644 1960922 864955 -913291 -2025707
61929 -2025707 -1513310 -282938 -205692 -1492845 -2165861 -869303 919414 798354 -1131553
61920 -1131553 -2408251 -1672569 -214475 429105 669474 1491660 2285034 1762823 319087
61911 319087 -330957 344663 1211599 1528768 1839156 2437545 2491238 1397850 -153936
61902 -153936 -1167966 -1414416 -1017422 -72434 746986 391120 -983414 -1754789 -1033485
61893 -1033485 -29748 -221969 -1194882 -1489449 -768645 95585 451041 236078 -503107
61884 -503107 -1398045 -1609328 -869610 -87741 -43767 -270093 -150569 -111155 -556440 -744108
61874g44108N81379K62996j001461j053269M73177J065838m53159j662421n25623
61865c056651J230718J240300L78669N82448J082879J61342j148075o94875P45919
61856E22674P07920n70142o58404O29011J002999j17740p57255p4947M36832L4870
61846A155818j60466J52313k31873j165841p66173R58836J305196o95665k140940
61837a588795o77137J717292J923502L33839n45184l13898m00176p70427j14014
61828d34998J179986J205817k37754j194124o67378Q7440m5037m19583k32738
61819g58369J1981k91437n44455j6800P28199O36482k01226p47121n14682J2509
61809a684919L04325L71109M08244M25202L50619J62019j48316m84879n61894
$$ plain form
61874 -744108 -162729 100267 -901194 -1954463 -1481286 -415448 -868607 -2531028 -3056651
61865 -3056651 -1825933 -585633 -206964 375484 1458363 1619705 471630 -223245 522674
61856 522674 1230594 660452 2048 631059 1634058 1516318 759063 684116 1120948 1155818
61846 1155818 995352 1147665 915792 -250049 -1016222 -57386 1247810 552145 -1588795
61837 -1588795 -2265932 -548640 1374862 1708701 1163517 849619 449443 -320984 -434998
61828 -434998 744988 1950805 1713051 518927 -148451 -61011 -106048 -525631 -758369
61819 -758369 -746388 -1037825 -1582280 -1599080 -870881 -234399 -435625 -1182746 -1697428 -1684919
61809 -1684919 -1380594 -1009485 -601241 -176039 174580 336599 188283 -296596 -858490
61800h58490k07377K71495L87928J62244O3313J41807j82877j044753j441694
61791b708404m73065J037332J268013j16047j339443q92386N10644J195343Q79815
61782f38198N95756P92023Q53509M20244m4921k12244m01445q22081j105762r37012
61772a500131n13513j19152J86215K83963K0860l13835j64244M35594P59845L28928
61762e95470n62741j306984j399578m92981J152478K289878J751056N8125j026555
61753a32772p76178k19930k69620m22082j719N38449N33051L14663M19442M18049
61743D01353k81818j122502j112757l88764J21772J99369K91321L11044j83856
61734a764838p48781l83575P51293J264248N39552l64995l47186K62657N38187
$$ plain form
61800 -858490 -1065867 -794372 -406444 -244200 -180887 -39080 -221957 -1266710 -2708404
61791 -2708404 -3181469 -2144137 -876124 -992171 -2331614 -3224000 -2713356 -1518013 -638198
61782 -638198 -42442 749581 1603090 2023334 1978413 1766169 1364724 542643 -563119 -1500131
61772 -1500131 -2013644 -2132796 -1946581 -1662618 -1641758 -1955593 -2119837 -1684243 -924398 -595470
61762 -595470 -1158211 -2465195 -3864773 -4357754 -3205276 -915398 835658 893783 -132772
61753 -132772 -908950 -1128880 -1398500 -1820582 -1822301 -1283852 -750801 -436138 -16696 401353
61743 401353 119535 -1002967 -2115724 -2504488 -2382716 -2183347 -1892026 -1580982 -1764838
61734 -1764838 -2513619 -2897194 -2145901 -881653 -342101 -707096 -1054282 -791625 -253438
61725b53438L90757L14096L06521j1327m80368m98634o7515L190p46065j541477
61715b584260j179727L55990J600981J250272k04618j022469l51469Q35397J167500
61706a32403N54401p5570j43943J88220O22159R21176P18119q9116q53279q44385
61696H65379l22757j67336n02392n88999j36263K39341R1744k20349k87922j96683
61686a226237p503M21577P55588L28842n63946o44263L92305J084147L70949o16476
61676B94983l24242O52878N54846n73699r31791O6075Q97442M51752m14059o35940
61666C8245o06070r63765j099868k48238R03615J137870O06470M14160P16114
61657H98533O28612j00423o46938m64933J219J89231J31171P6510J22568L38365
$$ plain form
61725 -253438 137319 451415 757936 746609 266241 -232393 -299908 -296718 -1042783 -2584260
61715 -2584260 -3763987 -3407997 -1807016 -556744 -761362 -1783831 -2135300 -1299903 -132403
61706 -132403 421998 346428 202485 390705 1012864 1934040 2652159 2563043 1709764 865379
61696 865379 542622 375286 -127106 -716105 -852368 -613027 -521283 -741632 -1029554 -1226237
61686 -1226237 -1233740 -812163 -56575 272267 -291679 -935942 -543637 540510 911459 294983
61676 294983 -29259 623619 1178465 604766 -327025 -260950 636492 1088244 674185 38245
61666 38245 -567825 -1531590 -2631458 -2879696 -1976081 -838211 -231741 182419 898533
61657 898533 1527145 1426722 779784 314851 316070 505301 636472 712982 835550 1173915
61647A173915N91973L13232p28160j501177p32444R78090J419710j97901j762438
61638d45200r78064J340456K240018O19863j373532j389663K9130M97098p38211
61629a98105j808730r66851R15752J602951O06411l73098j58320L03099j71490
61620b48381q79393m33212P93018J174948M36207j15980J4130j75300r92397j107196
61610a533556K04840J532454J346770K22389l60743k90108l70895n80273m22071
61601b51193k48771n32715n17174N49793J449420M42357j595996j906809O5534
61592b545554J744021J251440j67844o59569m89799o80871p92713m5311P18011
61583a668189L12046m99785j61635Q77347Q14935l20885n66745O21042J311268
$$ plain form
61647 1173915 1765888 2079120 1350960 -150217 -882661 95429 1515139 1317238 -445200
61638 -445200 -1423264 -82808 2157210 2777073 1403541 13878 43008 540106 -198105
61629 -198105 -2006835 -2973686 -2057934 -454983 151428 -221670 -379990 -76891 -248381
61620 -248381 -1127774 -1560986 -767968 406980 843187 727207 741337 566037 -426360 -1533556
61610 -1533556 -1328716 203738 1550508 1772897 1412154 1122046 751151 170878 -251193
61601 -251193 -499964 -1032679 -1549853 -1000060 449360 891717 -704279 -2611088 -2545554
61592 -2545554 -801533 449907 282063 -377506 -867305 -1548176 -2340889 -2386200 -1668189
61583 -1668189 -1356143 -1855928 -2017563 -1140216 -325281 -646166 -1212911 -591869 719399
61574G19399L00147p87256r9060J398539J411105j39111j161465o87350m6009
61565I08939l82654q25838j35330J101734J276897J47309r13254r19240l50822
61556i2259k9270O1638L18294O17852N53131J74970j14919k03008k64647k55944
61546G65838P1703O24901Q49429L06157p88652j628194j419194j55130J122135
61537b51007J215793J77195o18460j90062P33849P36130l34679j249843j106171
61528h87255l12061K23917J78387j29870k57486k7971K67508R8922n32872q28174
61518b206955k41539N65060O40010K58114L92878Q74929N23663o98794j232304
61509a124938k64784Q92611P57369j84173m81124N7525M69460L72750K77753M56161
$$ plain form
61574 719399 1019546 232290 133230 1531769 2942874 2803763 1642298 954948 908939
61565 908939 526285 -299553 -434883 666851 1943748 2091057 1177803 258563 -92259
61556 -92259 -121529 -59891 258403 876255 1429386 1604356 1489437 1286429 1021782 765838
61546 765838 837541 1462442 2311871 2618028 1829376 201182 -1218012 -1373142 -251007
61537 -251007 964786 1141981 523521 333459 1067308 1803438 1468759 218916 -887255
61528 -887255 -1199316 -975399 -797012 -926882 -1184368 -1212339 -944831 -845909 -1378781 -2206955
61518 -2206955 -2448494 -1883434 -1243424 -985310 -592432 282497 806160 107366 -1124938
61509 -1124938 -1389722 -497111 260258 76085 -405039 -347514 121946 494696 772449 1228610
61499A228610O17426N48403K01916n51671j419898j415894j41687J116141Q44782
61490A028128m46440q70705L1010P14444J42621p04325n48165K64699N64974J79624
61480C55865j27955r753J73341J89288K38499M05731L79609j33962r56563j479593
61470i65493j188161k55238N10609N68562K89786K87322M18871J67239k56248
61461d22751k09963N0434l92173j323001j267451J95094J407608R88936o2816
61452a036083n9062O36195L98938p19230r62724J85811J096730O16384k20141
61443f3182j04284M30267J75552n37692l99097O11943J107028M75593j79770K26961
61433A743319J078553Q72122o74995k077626j794855j19618J069693N28738q53748
$$ plain form
61499 1228610 1846036 2394439 2596355 2044684 624786 -791108 -932795 183346 1028128
61490 1028128 581688 -289017 -258007 456437 599058 -105267 -653432 -388733 176241 355865
61480 355865 227910 218157 391498 580786 819285 1225016 1604625 1470663 514100 -965493
61470 -965493 -2153654 -2408892 -1898283 -1329721 -1039935 -752613 -333742 -166503 -422751
61461 -422751 -632714 -582280 -974453 -2297454 -3564905 -3369811 -1962203 -973267 -1036083
61452 -1036083 -1095145 -458950 -60012 -779242 -1741966 -1556155 -459425 156959 -63182
61443 -63182 -167466 262801 438353 -99339 -498436 113507 1220535 1696128 1516358 1743319
61433 1743319 2821872 3693994 3018999 941373 -853482 -973100 96593 625331 -228417
61424b28417j304740n64213l3186m63105q00124n5356Q89790O68859k11080j04854
61414b206426R93029J309305K09598o21491J90013J473410J279278j87078r99875
61405A439763l92143L80555J21225o66544p02864K71257J172758Q36605o24573
61396A836039j757239j289523K55729J048229L11331o30329l20121O90526Q06193
61387I50835j24195p22939k89370L77692M95728K75407O1416k44377m67020o1677
61377B51500P39986Q45999j6430o92307l97813O1672j89800n31623l4097P59407
61367G96494O89984n1971l25813L0958J77579q4703j52848j1164k56282o71305
61357A40929l35720N84186P58452q1024m57586M42592J207285L36502j257238
$$ plain form
61424 -228417 -1533157 -2097370 -2130556 -2593661 -3393785 -3449141 -2559351 -1890492 -2101572 -2206426
61414 -2206426 -1213397 95908 305506 -315985 -125972 1347438 2626716 2439638 1439763
61405 1439763 1047620 1428175 1549400 882856 179992 451249 1624007 2460612 1836039
61396 1836039 78800 -1210723 -954994 93235 404566 -225763 -545884 144642 950835
61387 950835 826640 103701 -185669 192023 687751 963158 1024574 780197 313177 251500
61377 251500 991486 1837485 1821055 1128748 730935 792607 602807 71184 37087 796494
61367 796494 1486478 1434507 1108694 1139652 1317231 1232528 1079680 1068516 812234 140929
61357 140929 -194791 389395 1147847 1066823 609237 1051829 2259114 2595616 1338378
61348A338378j499261j95025Q73559O52981k4954j81350r0954l21402n24574j10697
61338h3299N39449N05529k61810q02500n13257j4278k87271j247451j657587o17534
61328d440009J140491J879012Q73403o32857q91026K50896J353620J373524P59109
61319A666163L05026r9748p77738j083692j87859J211224J383400N6112r59055
61310A513833l45940P50799N21165o94122r93639Q0760R20979M45881l88846m21020
61300A389850j56340n88438j183304o21835Q32899J314524l0363j676842j659999
61291b379848p1637J242950J129794L51036K03366O66105O12949l59912j186593
61282B08210p86177L88137R71626M98340k73375o98739r07648j001595o44712
$$ plain form
61348 1338378 -160883 -355908 517651 1170632 1145678 964328 873374 551972 27398 -83299
61338 -83299 456150 961679 699869 -102631 -615888 -630166 -917437 -2164888 -3822475 -4440009
61328 -4440009 -3299518 -1420506 -547103 -1179960 -2070986 -1820090 -466470 907054 1666163
61319 1666163 1971189 1871441 1093703 10011 -177848 1033376 2416776 2472888 1513833
61310 1513833 1167893 1918692 2439857 1745735 752096 832856 1753835 2199716 1810870 1389850
61300 1389850 1233510 645072 -538232 -1160067 -327168 987356 956993 -719849 -2379848
61291 -2379848 -2451485 -1208535 -78741 272295 475661 1141766 1754715 1394803 208210
61282 208210 -577967 -189830 781796 1280136 1006761 308022 -599626 -1601221 -2245933
61273b245933J05959N01561K40527Q0739O14326J208292R94475K19095l19137
61264A399904n36755p34393o02704J94354Q76631L99248p25257r15872R1435Q07238
61254B53829K68277o42581p50831k39917N1365K0396J19515M49100P75739R37854
61244A242746O99850j70606j164994j143053J28467J286226J059999n247m84035
61235A449353j53196L8715k37599k57429K99382O68827K52657l61440k93668K67005
61225A672607L07634n73435j535269j413165l6650J490465J819125O78706q40015
61216A570003j377380o57059L28816M69262k42495p44368k02246Q72690J127328
61207A144551Q8011j068661r28608K97504J056299N38208l74960n10256O6839
$$ plain form
61273 -2245933 -2139974 -1638413 -1397886 -1317147 -702821 505471 1499946 1719041 1399904
61264 1399904 863149 128756 -473948 -279594 597037 996285 271028 -644844 -553409 253829
61254 253829 522106 -120475 -871306 -1111223 -1059858 -1039462 -919947 -470847 304892 1242746
61244 1242746 1942596 1771990 606996 -536057 -407590 878636 1938635 1933388 1449353
61235 1449353 1296157 1334872 1097273 839844 1139226 1808053 2060710 1699270 1405602 1672607
61225 1672607 1980241 1406806 -128463 -1541628 -1578278 -87813 1731312 2410018 1570003
61216 1570003 192623 -464436 -135620 333642 91147 -653221 -855467 17223 1144551
61207 1144551 1232562 163901 -764707 -467203 589096 1127304 752344 242088 308927
61198C08927M74731L46395L7827j21287j09189L9798J89464N013n37651p68911
61188a34883j03913R38641J217202M60464m45809p67771p55584q63877q66532
61179a322062l30669M86590Q87412P01568M07743L13209J73142k23091n59182
61170E34660m05702J44788N85472N82832J61501n29658j228116j423748p60865
61161b338836K93608P14613J53213n49153m65597K38613P47296Q07958Q13017
61152D14732R12213Q23187M83810J75174l6515l21909n56973m83284l78545p04505
61142C27385j031933l81274J047834J622928M27011j299967j742276p93732J88576
61133a635448L47762J0550k65069l08221o1447M95369J089939J364901J280579
$$ plain form
61198 308927 783658 1130053 1167880 1046593 937404 977202 1166666 1171679 634028 -134883
61188 -134883 -238796 699845 1917047 2377511 1931702 1163931 408347 -455530 -1322062
61179 -1322062 -1652731 -1166141 -278729 422839 830582 1143791 1316933 1093842 534660
61170 534660 128958 273746 859218 1442050 1603551 1073893 -154223 -1577971 -2338836
61161 -2338836 -2045228 -1330615 -1177402 -1726555 -2192152 -1953539 -1206243 -398285 414732
61152 414732 1326945 2150132 2633942 2809116 2772601 2450692 1893719 1410435 1031890 327385
61142 327385 -704548 -1085822 -37988 1584940 2011951 711984 -1030292 -1824024 -1635448
61133 -1635448 -1287686 -1277136 -1542205 -1850426 -1911873 -1416504 -326565 1038336 2318915
61124B318915R18213J82819p93369j348467j066944n11558m24137n22066J55R66163
61114b80276J258175M63974m59815m96568J67044N80225K58528l95061o77103
61105D19123l76020J490j19388n19530m01269L76394R38299O97113K54141K84983
61095A555336L20215l03893r52637n36258N19032O80372l18721j025939m83718
61086e46211M78054O72975J30192l66887m14063j22985J64917j9003p32765j081426
61076a837202j67597J299839J535459J36675j230171j117427o2025O03661N74722
61067b64066L80230K77619J61540o4083n29019j142200j148978m37J265188J029007
61057c5199k80631m97229P74814J282325p9263j109693Q5488J657654R13845j139750
$$ plain form
61124 2318915 3237128 3419947 2626578 1278111 211167 -300391 -724528 -1246594 -1246439 -280276
61114 -280276 977899 1441873 982058 485490 652534 1232759 1491287 1096226 419123
61105 419123 43103 44593 -74795 -594325 -995594 -619200 319099 1016212 1270353 1555336
61095 1555336 1875551 1571658 619021 82763 601795 1282167 963446 -62493 -546211
61086 -546211 -68157 604818 735010 368123 -45940 -168925 -4008 -23011 -755776 -1837202
61076 -1837202 -2004799 -704960 830499 967174 -262997 -1380424 -1442449 -838788 -264066
61067 -264066 116164 393783 555323 491240 -37779 -1179979 -2328957 -2329394 -1064206 -35199
61057 -35199 -315830 -813059 -38245 1244080 1164817 55124 140612 1798266 2712111 1572361
61047A572361j384668L60510J309867L61096o04484l23009J06472j92231l57908
61038H48006J03152J58389o23016r44814l4383Q96928O95253K8231j10898j3674
61028A003174j52109n8683M44569M43991l77601q02660j35730M19549j05877o15651
61018F2972K1353P42662J55992p92455l55634R05926J059749J05363k34863L50819
61008B021884M21907m14867q29173k44780K27540j04059m38178j61716J53150
60999F31708J06138K00358N45270M01670k54651k78424O62488J138077P0706j458389
60989A764951j696657n44323P12886J172875P67994l16409j564282j962016r43270
60980b608251P12440J636408J314285L13266n54176q40429o18447m13260o36309
$$ plain form
61047 1572361 187693 548203 1858070 2219166 1614682 1291673 1398145 1205914 848006
61038 848006 951158 1109547 486531 -458283 -492666 404262 1099515 1127746 1016848 1003174
61028 1003174 851065 792382 1236951 1680942 1303341 500681 364951 784500 678623 62972
61018 62972 84325 826987 982979 190524 -165110 740816 1800565 1905928 1671065 2021884
61008 2021884 2443791 2028924 1199751 954971 1182511 1078452 640274 478558 631708
60999 631708 737846 938204 1483474 1885144 1630493 1352069 2014557 3152634 3223340 1764951
60989 1764951 68294 -476029 236857 1409732 2177726 1861317 297035 -1664981 -2608251
60980 -2608251 -1895811 -259403 1054882 1368148 813972 -26457 -644904 -1058164 -1694473
60971a694473r33384o26597J52680N88123N41874P33001J258139J165019J07423
60962A291805p74217m72465M31721Q36583O46899K79229l14486r88794q02600
60953A33675N15901J376800K60926j727981k047188k74667J295950Q51883p23069
60944c37770j398515n65753O76107J091096N39499q7303O7506P39542Q12398n6027
60934A480780p37935k53844O54396O68586r438j60473K00902j83513j428418j857719
60924a626676m42239J491017J942863P23690o70111j076686p29516n31805q43387
60915a762850j060660m02766Q36201J308878L87997p20869n82650L59661O18386
60906a018672J17185O0088N24671K78586o99257p49253O00431J489917P19445
$$ plain form
60971 -1694473 -2627857 -3254454 -3101774 -2513651 -1971777 -1238776 19363 1184382 1291805
60962 1291805 517588 45123 476844 1313427 1960326 2239555 1925069 936275 133675
60953 133675 649576 2026376 2287302 559321 -1487867 -1762534 -466584 385299 -337770
60944 -337770 -1736285 -2302038 -1625931 -534835 4664 -82639 -15133 724409 1536807 1480780
60934 1480780 742845 489001 1143397 1811983 1802545 1642072 1842974 1659461 231043 -1626676
60924 -1626676 -2068915 -577898 1364965 2088655 1418544 341858 -387658 -919463 -1762850
60915 -1762850 -2823510 -3226276 -2390075 -1081197 -693200 -1414069 -1996719 -1637058 -1018672
60906 -1018672 -901487 -841399 -316728 -38142 -737399 -1486652 -886221 603696 1323141
60897A323141k10606K23887P92324l03203j972225j721725K33671J253287M83086
60888A01637j09624O30881J153559J08358j175069q32727N40158R42339L1527
60879A391039p22262n04926q4164k39715o33730n77165L618O93998J044861P26340
60869A097894j53629p50224j99652J095930J608723N79471q52214j082034j29523
60860A214742N78900K71154l68312n51962m45279l90780q9542O06812Q81346J8262
60850A725341j213351j413511n06448L53738O30697P96138Q99473L19827p14391
60841H77513r40777n4409N93879J16839n58838m77108k60050n81007n31609P00609
60831a114958J791126J054884o45500j090921j85855K64064q5700K13951J216218
$$ plain form
60897 1323141 1112535 1336422 2128746 1825543 -146682 -1868407 -1634736 -381449 101637
60888 101637 -7987 622894 1776453 1884811 709742 -122985 417173 1359512 1391039
60879 1391039 668777 163851 79687 -160028 -793758 -1370923 -1367305 -673307 371554 1097894
60869 1097894 944265 194041 -5611 1090319 2699042 3278513 2426299 1344265 1214742
60860 1214742 1793642 2064796 1696484 1144522 699243 308463 218921 825733 1707079 1725341
60850 1725341 511990 -901521 -1407969 -1054231 -423534 372604 1272077 1591904 877513
60841 877513 -63264 -117673 476206 593045 34207 -442901 -702951 -1283958 -1815567 -1114958
60831 -1114958 676168 1731052 1085552 -5369 -191224 72840 -12860 201091 1417309
60822A417309J042541o28243j407676J7672J511230Q14562r16577j190277j03442
60813E57099L39003l01959o66440k27893K12607L66653O50850P39748k1047r02846
60803G45775n72942M77486M60670o68471j022611K6402Q99472P13753O06356J083593
60793B749483O33323j343842k603896j306095P54171P82271o30997p22781P56165
60784i32198J299117j9553j110671m44345O55414M73405m73369o74324N6802Q07065
60774c62657R75317M49204n91044j282946o70347O23941P19836o99764j530762
60765b369222l95716J077720Q23389l76080l73421O98799Q31208l14781r02032
60756a300136j05191O39181K23457l82954P644Q23012Q04433k9761n89109k51986
$$ plain form
60822 1417309 2459850 1831607 423931 441603 1952833 2767395 1850818 660541 557099
60813 557099 896102 594143 -72297 -300190 -87583 279070 929920 1669668 1648621 745775
60803 745775 172833 650319 1110989 442518 -580093 -553691 345781 1059534 1665890 2749483
60793 2749483 3382806 2038964 -564932 -1871027 -1116856 -334585 -965582 -1688363 -932198
60784 -932198 366919 347366 -763305 -1207650 -552236 -78831 -552200 -1226524 -1169722 -362657
60774 -362657 612660 1061864 470820 -812126 -1482473 -858532 -138696 -838460 -2369222
60765 -2369222 -2764938 -1687218 -863829 -1239909 -1613330 -914531 -83323 -398104 -1300136
60756 -1300136 -1405327 -766146 -542689 -925643 -917999 -94987 709446 679685 90576 -161410
60746a61410N40082Q17265o5735j585167k132995q18476R93162J194100j10138
60737a329312p75008Q9192R27088M91951k14246K9749M69428j35405j156204j070358
60727b673125N7322Q20286O71960L06898J94009J36450N8523N2542p3524l04192
60717g52851n361R43172J351442L61035r16597r98097m85966r31431j795937j012688
60707d243279J336441K484950R61618j127426j140068N09133J425372P37741k16982
60698G27500k19872L65161N55157J54808j98122j5603L43509J15745p39505j301061
60688b12283r22192j48330K40326M48365R37487J151845L81594o02517n22622
60679G51673P9595m42954j770510j666187L20305J730911R84694j52351L24997
$$ plain form
60746 -161410 378672 1195937 1130202 -454965 -2587960 -3406436 -2413274 -1219174 -1329312
60737 -1329312 -2104320 -2015128 -1088040 -596089 -810335 -780586 -311158 -446563 -1602767 -2673125
60727 -2673125 -2615803 -1795517 -1123557 -816659 -622650 -486200 -427677 -375135 -448659 -752851
60717 -752851 -758212 184960 1536402 1897437 980840 -17257 -503223 -1434654 -3230591 -4243279
60707 -4243279 -2906838 -421888 539730 -587696 -1727764 -1218631 206741 944482 727500
60698 727500 507628 872789 1427946 1582754 1384632 1369029 1712538 1828283 1088778 -212283
60688 -212283 -1134475 -1282805 -1042479 -594114 343373 1495218 1876812 1274295 751673
60679 751673 831268 388314 -1382196 -3048383 -2728078 -997167 -12473 -164824 160173
60670A60173J279558N56810j175357j511793k61486N55724K61846K25116Q83842
60661I74433Q31810l95010j077592p2850J174766Q63308m51491r97647n35624
60652C14103k23481l73601j29792O83721R90467J83427p61347o10907M12096J022030
60642A506716N94268k71019p79721p59201l27542M38600J066590O90363o99351
60633A459703j602917p50371Q39774R86789m20278j042748L92308J949303J260577
60624C072140r04803j773480n64325P57756O90874J22309M06286J121115Q44597
60615C772469o86886k184625k271116q11568R97105J657410P73833n51412j046253
60606c51043p29428m38693l04307K23197R67127R90658K22902j95507K89958P43519
$$ plain form
60670 160173 1439731 1996541 821184 -690609 -952095 -396371 -134525 90591 974433
60661 974433 1806243 1411233 333641 260791 1435557 2298865 1847374 849727 314103
60652 314103 90622 -282979 -412771 270950 1261417 1444844 683497 72590 484686 1506716
60642 1506716 2100984 1829965 1050244 291043 -36499 402101 1468691 2159054 1459703
60633 1459703 -143214 -893585 -53811 932978 512700 -530048 -137740 1811563 3072140
60624 3072140 2167337 393857 -170468 587288 1278162 1400471 1806757 2927872 3772469
60615 3772469 3085583 900958 -1370158 -2181726 -1184621 472789 1246622 695210 -351043
60606 -351043 -1080471 -1519164 -1823471 -1600274 -633147 357511 580413 384906 674864 1418383
60596A418383L49168k44190j25291L54936L73657J08964J82834K87761k64120
60587B442102j025485q76704J09124O43068J87517l52836k47686k9739l37834
60578E11527o61919j28839J005591J508140O78333q46703j792613j479707m03505
60569a609695L03974R2841l86630j55640P43626J296927R01355L5025o09047r27622
60559c14886j005061o53002O5948M70367J42592k74212N1281Q02029R13774J53828
60549C52658n73420n13528J34696P85256J089279Q63694J25265o06805p05161
60540I51934k95870n2755o3271J97287N95183K22931r15032j348654k38296J065178
60530A18635Q61446l36017o60965J77506O21754j00258q73502o93937j64601j78323
$$ plain form
60596 1418383 1767551 1523361 1398070 1753006 2126663 2235627 2418461 2706222 2442102
60587 2442102 1416617 539913 649037 1292105 1479622 1126786 879100 849361 511527
60578 511527 -150392 -279231 726360 2234500 2912833 2066130 273517 -1206190 -1609695
60569 -1609695 -1305721 -1212880 -1599510 -1755150 -1011524 285403 1186758 1221783 612736 -314886
60559 -314886 -1319947 -1972949 -1907001 -1436634 -1294042 -1568254 -1516973 -714944 198830 352658
60549 352658 -220762 -734290 -599594 185662 1274941 2138635 2263900 1657095 951934
60540 951934 656064 603309 540038 737325 1332508 1555439 640407 -708247 -946543 118635
60530 118635 980081 644064 -16901 160605 782359 682101 -191401 -885338 -1049939 -1228262
60520a228262m16519j94671J94596J21481j09409J99491P71252O95389m3457m74203
60510d84312j35304L16927K67552P7699L52058Q36552P34349l1593n39750j15793
60500A278385N99314M16064o70958j285730n39561O50632Q36941L6775n74219
60491G47643n65603n32608n79481p2923P76261P14128m25434r67441P4078J176227
60481C44847O10957o54764m32850J040328J341367k57136j548107p73366Q20144
60472D91420J078823K6917p45348p47074q31479j145941o36546J005939K264191
60463G60902J569249m81037j633644o68485J165117J738654O04523o64983o41758
60454A748538J91823L02522p28527j654022j206483L10699J399309J052927k59200
$$ plain form
60520 -1228262 -1644781 -1839452 -1644856 -1523375 -1632784 -1433293 -662041 33348 -10109 -484312
60510 -484312 -619616 -302689 -35137 42562 394620 1231172 1965521 1933928 1394178 1278385
60500 1278385 1877699 2293763 1622805 337075 -202486 448146 1285087 1321862 747643
60491 747643 182040 -350568 -930049 -1002972 -226711 487417 61983 -905458 -831380 344847
60481 344847 955804 301040 -131810 908518 2249885 1992749 444642 -328724 491420
60472 491420 1570243 1597160 851812 104738 -726741 -1872682 -2509228 -1503289 760902
60463 760902 2330151 1849114 215470 -453015 712102 2450756 3055279 2390296 1748538
60454 1748538 1940361 2242883 1514356 -139666 -1346149 -1035450 363859 1416786 1157586
60445A157586j258048j258388p05701l35656j67299K77202R70705J268134Q82007
60436H30542K83152j29340n37431r68499q35204Q7567Q89035O33737j98757l56392
60426c01590L59797Q88707M65429m84329j063350q43613q0172M93982K57211m33087
60416g41015l92636P38051J653938J161134N3337j74670J57674m30825j678516
60407C46472j581042L02563J766793J160243k78486o11047l6754J00508k16375
60398I52875j07589J94213k50923j097104j010052Q2120P20383J31829p25312
60389a109560p44482j03641M11774N74464N97629M85389P9067n16910q61654m72060
60379a659984O54882J599596J083933q92325k444754j803113L47605J671788J237295
$$ plain form
60445 1157586 -100462 -1358850 -2064551 -2400207 -2567506 -2290304 -1319599 -51465 830542
60436 830542 1113694 984354 446923 -521576 -1356780 -1269213 -380178 253559 54802 -301590
60426 -301590 58207 946914 1412343 928014 -135336 -978949 -1059121 -565139 -307928 -741015
60416 -741015 -1133651 -395600 1258338 2419472 2472809 2298139 2455813 2024988 346472
60407 346472 -1234570 -932007 834786 1995029 1716543 1105496 1068742 1169250 952875
60398 952875 845286 1039499 788576 -308528 -1318580 -1236460 -516077 -384248 -1109560
60389 -1109560 -1854042 -1957683 -1545909 -971445 -373816 111573 190640 -326270 -1187924 -1659984
60379 -1659984 -1005102 594494 1678427 786102 -1658652 -3461765 -3114160 -1442372 -205077
60370b05077L83370K99463L37646l73224j043836m59555P21964O69497p76545
60361d46297j652925o70702R90107J491228P89749J60755P2053p4686m02520k33914
60351B2848M92187P71577M1590q87068j044660n52416L4187O90850J311850J067075
60341A948020l40992j486044q32899Q64735J474819O22201o503L18297K09261
60332B770895j136783k155244j341483J79149M13925l23987j68684J008691J403152
60323F49631M01566l45421L35231J214950O54515q48521j540880j035009n31085
60314a045023o80252p01503M2819P84391M73028n16227q01766O5617J069580J288244
60304b1092J000476P40750K46612o87595j121099j49453J230455J109953m46978
$$ plain form
60370 -205077 178293 477756 815402 442178 -601658 -1061213 -339249 330248 -446297
60361 -446297 -2099222 -2769924 -1779817 -288589 501160 661915 733968 659282 256762 22848
60351 22848 515035 1286612 1328202 441134 -603526 -1155942 -1121755 -430905 880945 1948020
60341 1948020 1607028 120984 -711915 152820 1627639 2249840 2243337 2561634 2770895
60332 2770895 1634112 -521132 -1862615 -1683466 -1269541 -1593528 -1762212 -753521 649631
60323 649631 1051197 705776 1041007 2255957 2910472 2061951 521071 -513938 -1045023
60314 -1045023 -1725275 -2426778 -2383959 -1599568 -1126540 -1642767 -2444533 -2378916 -1309336 -21092
60304 -21092 979384 1720134 1966746 1279151 158052 8599 1239054 2349007 1902029
60295A902029j302514m71483M44862J3984o96122j20690R81743P79352n02512
60286A028649r47712q7085N08213j23303j038953j136402n25015L09154J195990
60277h16464J643645R63354l91589r81195m55107p6357n40958q27432j44292N22930
60267a103465R6385o79150n02023L51509P36561O25518P04851O68633k35596j329144
60257f65921j097254L40092J183459O26433j71507k29034j23143m53036n34577
60248a124488K28726R45614N47785l92226n14802K53639Q09987O82044M17054
60239A853333L02734l8044o38141q51895l57157K99307M63250Q7747m74093q18506
60229a71465n74508K07399P01276R8437j123634j542383o12751P01822J394117
$$ plain form
60295 1902029 599515 128032 572894 586878 -109244 -229934 751809 1531161 1028649
60286 1028649 80937 -6148 502065 378762 -660191 -1796593 -2321608 -2012454 -816464
60277 -816464 827181 1790535 1398946 417751 -37356 -113713 -654671 -1482103 -1626395 -1103465
60267 -1103465 -1007080 -1686230 -2188253 -1836744 -1100183 -474665 230186 898819 663223 -665921
60257 -665921 -1763175 -1423083 -239624 386809 215302 -13732 -136875 -589911 -1124488
60248 -1124488 -895762 49852 597637 205411 -309391 -55752 754235 1436279 1853333
60239 1853333 2156067 2118023 1479882 627987 270830 570137 1033387 1121134 647041 -171465
60229 -171465 -745973 -538574 162702 261139 -862495 -2404878 -3017629 -2315807 -921690
60220i21690J541859J508924J049026j344r59095j133691q10899n59810k32229
60211e18949L82151O05223j73013j087541p76302M53774R12631J6762r58267q78284
60201b021815j27178M56028P29287P55011L42728k28322j23424O61363Q97644
60192A341322k7252r29502n80100L33744L44001m26788n77628K32263Q38902N16453
60182A065415q3820k77414l54260o57040p16715j27929M67981K31972m50277m01717
60172a303804N34578J100426M06586p02644q19889k382M19990m2053l79045N1933
60162g36304L33155l19567q14304K53957J975155K036094J85417j270838q96089
60153G46676l3204l09562j046127o54222O87973J446062J054968K95856j87611
$$ plain form
60220 -921690 620169 2129093 3178119 3176775 2217680 1083989 273090 -286720 -518949
60211 -518949 -136798 468425 295412 -792129 -1568431 -1114657 -202026 -185264 -1143531 -2021815
60201 -2021815 -2148993 -1692965 -963678 -208667 134061 -94261 -217685 443678 1341322
60192 1341322 1314070 384568 -195532 138212 482213 55425 -522203 -289940 548962 1065415
60182 1065415 981595 704181 349921 -307119 -1023834 -1151763 -683782 -451810 -902087 -1303804
60172 -1303804 -769226 331200 737786 35142 -784747 -787129 -367139 -409192 -788237 -736304
60162 -736304 -403149 -722716 -1537020 -1283063 692092 2728186 2913603 1642765 746676
60153 746676 713472 403910 -642217 -1296439 -608466 837596 1892564 2188420 2000809
60144B000809m17087m54284l85060o06156j144595j148726q9872J047412R48981
60135b48578q4627o10271j38057M93919O31451M55523J98152j62253m29848l82038
60125b76627l37905o33064p55719r384J173254J621609R89905j5528p38866r64010
60115E3665n44003L24117P98733L92965j67091j05128Q8766k35835l69621M66187
60105G02755J170089K62635j268054j139797M43244R55688k85680j046495m7781
60096b53396R54138L26868p62584o24545J30754P5609m09053j09421O52172O79507
60086F60049O6272j87055p2435l44361q54036p37039j9406L64794M5014m34578
60076a512781o23925n73285l29012K04915R51335J645780J943053J419917O0297
$$ plain form
60144 2000809 1583722 1129438 744378 138222 -1006373 -2155099 -2244971 -1197559 -248578
60135 -248578 -333205 -943476 -1081533 -587614 43837 499360 697512 535259 105411 -276627
60125 -276627 -614532 -1247596 -2003315 -2012699 -839445 782164 1772069 1756541 1017675 53665
60115 53665 -490338 -166221 632512 1025477 858386 753258 842024 606189 236568 702755
60105 702755 1872844 2135479 867425 -272372 170872 1126560 840880 -205615 -253396
60096 -253396 700742 1027610 265026 -359519 -228765 -153156 -562209 -671630 -19458 660049
60086 660049 726321 539266 466831 122470 -731566 -1468605 -1488011 -1123217 -1078203 -1512781
60076 -1512781 -2136706 -2709991 -3039003 -2834088 -1882753 -236973 1706080 3125997 3186294
60067C186294j180879j214331l83830p1214n38423o04282J54479O20697K60015
60058B28526J39466P65196Q58971k49135r31231J39343J414424P61389j035551
60049B091398j544909m84896L09680J10232o9338J87859J49961k31208j09480
60040D09299M84717O15856K73600L18277N65702k1651j072647r28168N08287J205088
60030B358360J00543j217108j046149r8853r7965j043842j375255l17118J126747
60021a610640J489623N51481l80956N3154J440630J793693J11427k020378k412079
60012i84045j125368O7308M70958Q78131J414894J064280k64758j056973l63963
60003A00464P55430P88042k78542j223057j049383J93361J406426J272529j73306
$$ plain form
60067 3186294 2005415 791084 407254 336040 -202383 -806665 -652186 -31489 228526
60058 228526 367992 1133188 1992159 1743024 811793 951136 2365560 3126949 2091398
60049 2091398 546489 61593 371273 481505 412167 600026 749987 518779 409299
60040 409299 894016 1509872 1783472 2101749 2667451 2645800 1573153 644985 1153272 2358360
60030 2358360 2458903 1241795 195646 96793 -1172 -1045014 -2420269 -2737387 -1610640
60021 -1610640 -121017 430464 49508 102662 1543292 3336985 3448412 1428034 -984045
60012 -984045 -2109413 -2042105 -1571147 -693016 721878 1786158 1521400 464427 100464
60003 100464 855894 1643936 1365394 142337 -907046 -713685 692741 1965270 1791964
59994A791964j186931n46278N33286K20062r37646r25614L11982Q80070K80723
59985D21618L29M41109J92335q84705q60049P39812J572705L29493r01323k29194
59975H22130P62940n0765j470581j089678M88826P99408l09983q55393l27056
59966a230152l6546k65169j2689N69547L14856l93222K8753J277593J250103l07565
59956A195509j049189J86106J473368R52186m55347j019965q96568j046181j049216
59947a709297Q531J443570J678086O09980k85340r4938N22315N37063j28115o94910
59937A886945n19985J54709M44343l6760n41787k59107L14414O9559q05117r63044
59927b55830j27863L55204k24098o98063l5713Q23341N23358m41579o07287R7180
$$ plain form
59994 1791964 605033 58755 592041 812103 -125543 -1051157 -739175 140895 421618
59985 421618 421947 863056 1055391 170686 -689363 50449 1623154 1952647 1051324 822130
59975 822130 1585070 1534305 63724 -1025954 -537128 262280 -47703 -903096 -1230152
59966 -1230152 -1266698 -1531867 -1544556 -975009 -660153 -1053375 -1024622 252971 1503074 1195509
59956 1195509 146320 332426 1805794 2757980 2302633 1282668 386100 -660081 -1709297
59947 -1709297 -1700766 -257196 1420890 2030870 1745530 1650592 2172907 2709970 2581855 1886945
59937 1886945 1366960 1521669 1966012 1929252 1387465 1128358 1442772 1512331 707214 -255830
59927 -255830 -383693 -28489 -252587 -950650 -986363 -163022 360336 -81243 -688530 -591350
59917e91350N32823L94242L56729M18125j46072j070462j036486K43378J346191
59908D47118J142072K10142l92995n72619o32889m14308O3885R9927n08581p05364
59898a263612K05294J048585L73527j081450j258653J37171J260501R58481J66155
59889E45999m717J76715K06786M22079Q52530M96293q95109j631935l74179J415060
59879A209522J244839p72783k091873j352659J41857P53126M83332J29760J2563
59870b42316J87609P02904J096840P12381j26660l90664n7696k17652j114174
59861E50572j576397r65084j66768Q0761L27100R81584J265149O66133J6671l3430
59851A146291j81266q64435j032503l8145P84690K52689m27369K84464J286379
$$ plain form
59917 -591350 -58527 335715 692444 1110569 964497 -105965 -1142451 -899073 447118
59908 447118 1589190 1799332 1406337 833718 200829 -213479 -149594 -49667 -558248 -1263612
59898 -1263612 -1058318 -9733 363794 -717656 -1976309 -1839138 -578637 379844 545999
59889 545999 541282 717997 924783 1346862 2199392 2695685 1800576 168641 -205538 1209522
59879 1209522 2454361 1681578 -410295 -1762954 -1621097 -867971 -384639 -254879 -242316
59870 -242316 -54707 648197 1745037 2457418 2330758 1940094 1882398 1664746 550572
59861 550572 -1025825 -1990909 -2157677 -2076916 -1749816 -768232 496917 1163050 1179721 1146291
59851 1146291 965025 100590 -931913 -970058 -185368 67321 -360048 -75584 1210795
59842A210795N13679j330924j627276o2311R38767J72195p83587n77440k8153
59833a574255n5125K2219Q15888J371150P24572m56733r97893p90583k92303L37034
59823h96029P41986K88444o77918q14475J27047O53080m0896n91769K44017J334817
59813C68304R08834n93040j213867l02197J008383J596134J179210r3666j481875
59804A376220j653884k55157J098582Q12405l68019o25706K6889P8190o60419
59795a70899p73816J48761Q00274N04047K39211N70966M69844o84685j556919
59786d53216p58374Q48539J268533J22014j096316j135018j64979R80267J677196
59777A288646J588480P23875l69393j002375j054345r30690q36264n23818J43659
$$ plain form
59842 1210795 1724474 393550 -1233726 -1296037 -357270 -185075 -968662 -1546102 -1574255
59833 -1574255 -1629380 -1607161 -791273 579877 1304449 847716 -150177 -940760 -1233063 -896029
59823 -896029 -154043 134401 -543517 -1357992 -1230945 -577865 -618761 -1210530 -966513 368304
59813 368304 1277138 684098 -529769 -831966 176417 1772551 2951761 2858095 1376220
59804 1376220 -277664 -532821 565761 1378166 1010147 384441 411330 489520 -170899
59795 -170899 -944715 -795954 4320 508367 747578 1318544 1788388 1103703 -453216
59786 -453216 -1211590 -363051 905482 1027496 -68820 -1203838 -1368817 -388550 1288646
59777 1288646 2877126 3601001 3231608 2229233 1174888 244198 -592066 -1115884 -972225
59768i72225P53848P34461Q9743m81341l50538K38838M34460p6327n94948m04562
59758f28591K04254M54738K53559P0819r3362o42501j292207j117705J1901J018416
59748a760679J080326O32620L82623K25536j44473l64459p2811J64164l74749
59739b31902j245477j319043l99435N95166R89652R61178P65918K96149l53248
59730E8958o67890m16860J5J75983J40426k4470l89365o89977k86724Q61392J695470
59719D56958J216951j06788p98942k20394O79049O73554j65043o48845o6832Q71591
59709A891259Q89598k76627j487251j464847k08810J063998J255405L90581o65762
59700A387544j146165q84789j82528M77755O32572J22511o32326q64001k66911
$$ plain form
59768 -972225 -218377 516084 605827 124486 -226052 12786 447246 370919 -224029 -628591
59758 -628591 -424337 30401 283960 354779 261417 -381084 -1673291 -2790996 -2779095 -1760679
59748 -1760679 -680353 -47733 334890 560426 415953 51494 -21317 142847 -231902
59739 -231902 -1477379 -2796422 -3195857 -2600691 -1611039 -649861 116057 412206 58958
59730 58958 -608932 -1025792 -1025777 -849794 -709368 -733838 -1123203 -1813180 -2099904 -1238512 456958
59719 456958 1673909 1567121 768179 547785 1226834 1900388 1735345 1086500 1019668 1891259
59709 1891259 2780857 2504230 1016979 -447868 -656678 407320 1662725 2053306 1387544
59700 1387544 241379 -643410 -825938 -348183 284389 406900 -225426 -1089427 -1356338
59691a356338N09531N44079j64829o70457m26748n1922k28046m59631J17939J075198
59681a111224J135801L00077J4051P34934R40506l61125j640061j055017M66627
59672e75431N44328q02082j110648N11831J854489J052211o12057q95372Q0784
59663D8053N38208n0032o83524q11831p36712l66699O66895J709616J546019L11478
59653B171471n49392m53133l16321o71148p15749L2165N68975k4047r13179o55180
59643a525538O54842J572722J289754L75064k99204m50911k26438P6024L6969
59634A503284n30318j155149j101843k66424O76546J051720Q03127L46052P2237
59625A399232Q869j57509n84176p67233k167J373947J837367M86443j451309j903754
$$ plain form
59691 -1356338 -846807 -302728 -467557 -1138014 -1564762 -1616684 -1844730 -2304361 -2186422 -1111224
59681 -1111224 24577 324654 338705 1073639 2014145 1653020 12959 -1042058 -575431
59672 -575431 -31103 -833185 -1943833 -1432002 422487 1474698 862641 -32731 48053
59663 48053 586261 536229 -147295 -959126 -1695838 -2062537 -1395642 313974 1859993 2171471
59653 2171471 1622079 1168946 852625 181477 -534272 -502107 66868 42821 -870358 -1525538
59643 -1525538 -870696 702026 1991780 2366844 2067640 1616729 1390291 1466315 1503284
59634 1503284 972966 -182183 -1284026 -1550450 -873904 177816 980943 1326995 1399232
59625 1399232 1408101 1250592 666416 -100817 -102984 1270963 3108330 3594773 2143464 239710
59615B39710o11650N91818L49986n12223m84586L95446Q58387M28619p7552n3538
59605A124417K3312l97516r19367q07232p9798O35953R93475J064762Q51480L13582
59595B803068k25129l23222n4833J45190J87277K58187J65806m12691j015733
59586A527920p40828K53871O87709Q1544m14333R8856P16894K26528q29607j059195
59576E49359m99798l27010o74278n28796K59929O75307M57858N49298J143003
59567A604872J064215j23420j056057o79674L1660k68640j127192j143475p6048
59558a773759J197654K019990K041755Q65393j030770j865337o26392J118668
59550A947202J182229o1060m03692O00396J016861j96875j468149j075634L56664
$$ plain form
59615 239710 -371940 219878 569864 57641 -426945 -31499 826888 1255507 1177955 1124417
59605 1124417 1147729 750213 -169154 -976386 -1056184 -420231 573244 1638006 2489486 2803068
59595 2803068 2577939 2254717 2199884 2345074 2532351 2790538 2956344 2543653 1527920
59586 1527920 787092 1040963 1728672 1810216 1395883 1494739 2211633 2438161 1608554 549359
59576 549359 49561 -277449 -951727 -1480523 -1220594 -545287 -87429 461869 1604872
59567 1604872 2669087 2545667 1489610 809936 841596 572956 -554236 -1697711 -1773759
59558 -1773759 -576105 1443885 3485640 4351033 3320263 1454926 828534 1947202
59550 1947202 3129431 3068371 2664679 3265075 4281936 4085061 2616912 1541278 1897942
59541A897942J028884M50072m48862q97578q61538m94302M1163M03782L71579
59532A491142J64673Q5846Q7065O119o3875N4650L25645N68191N91513K24480
59522C535449m40460q57931n65214R2805L18943n0243m23766m24741k64288r2601
59512H27953K09174M26177N8815p45527j152016q62134n10842m57066j53654O82601
59502a676519J242699Q12567j568j88757J54816K42308J6808M3365L01933K61977
59492A209629O2225M09613J125003R78446m54932j718170j154483P97298J954813
59483C209442J056200p35816j363227l35704R78608J265493O27517j16231o11842
59474C974440q51993n82768K29903P36663R7825j068262j264846k58388N39637
$$ plain form
59541 1897942 2926826 3376898 2928036 2030458 1168920 674618 715781 1119563 1491142
59532 1491142 1655815 1741661 1828726 1834845 1770970 1825620 2151265 2719456 3310969 3535449
59522 3535449 3094989 2237058 1671844 1764649 2083592 2033349 1609583 1184842 920554 827953
59512 827953 1037127 1463304 1522119 776592 -375424 -1237558 -1748400 -2205466 -2359120 -1676519
59502 -1676519 -433820 378747 377179 188422 343238 585546 602354 645719 947652 1209629
59492 1209629 1271854 1681467 2806470 3784916 3329984 1611814 457331 1254629 3209442
59483 3209442 4265642 3529826 2166599 1830895 2809503 4074996 4702513 4586282 3974440
59474 3974440 3122447 2539679 2769582 3506245 3604070 2535808 1270962 1012574 1552211
59465A552211J96607m24591j58358O92278J026018O35049J85177k3182k48158
59456C433051m88357m00453j8413J63632j02092n00214n50045l8336P83950J234707
59446C517430P99859n7587k40333M61623Q96224K07595p66618o71532L56677R78249
59436E481587O73401L29497P61895J608905J918225J202516j51045j021117l17637
59427A0486227J694995L095974K238029j36389j685447j366607m78233o04622
59419A3243927j593204k093177j328471K29441J466852J518764M55827o88379
59411A1211580r33909m05072J02643L92871Q67957J369248J148341K10366m52084
59402A3511941l68424j94193k73072J44770J362662K113006J261330k28375n02049
$$ plain form
59465 1552211 1748818 1324227 1165869 1858147 2884165 3519214 3704391 3681209 3433051
59456 3433051 2944694 2544241 2525828 2689460 2587368 2087154 1537109 1498773 2282723 3517430
59446 3517430 4317289 4259702 4019369 4480992 5377216 5584811 4818193 4146661 4503338 5481587
59436 5481587 6154988 6484485 7246380 8855285 10773510 11976026 11824981 10803864 10486227
59427 10486227 12181222 15277196 17515225 17378836 15693389 14326782 13848549 13243927
59419 13243927 11650723 9557546 8229075 8458516 9925368 11444132 11899959 11211580
59411 11211580 10277671 9872599 9975242 10368113 11236070 12605318 13753659 13964025 13511941
59402 13511941 13143517 12949324 12676252 12821022 14183684 16296690 17558020 17329645 16827596
59393A6827596N42119J370436J341238J463764K405831L297812L235553K818621
59385C3302970L263537M725315O434248Q030704R784837J1652515J3139752J4440912
59377A04774790J6934328K1812121K8571968L5847184M3753180N3716383O4194988
59370C69604942O7333713N3213527J9974990k1096570n2927365o5780752o2606649
59363C07715836n2690321m2781006l4729209k8306756k3155989j8697630j4578120
59356I2776805j1470152j0082690r563444q341808o410525n157602m896027m353705
59348C2500852l016494k113576k391768k620289j616143l56043m62138j583581
59340A8340820k032023j421406r22230j145237j435355j287024r71985o16530
$$ plain form
59393 16827596 17369715 18740151 20081389 21545153 23950984 27248796 30484349 33302970
59385 33302970 36566507 41291822 47726070 55756774 65541611 77194126 90333878 104774790
59377 104774790 121709118 143521239 172093207 207940391 251693571 305409954 369604942
59370 369604942 436938655 490152182 510127172 489030602 436103237 370322485 307715836
59363 307715836 255025515 212244509 177515300 149208544 126052555 107354925 92776805
59356 92776805 81306653 71223963 61660519 53318711 46908186 41750584 36854557 32500852
59348 32500852 29484358 27370782 24979014 22358725 20742582 20386539 19924401 18340820
59340 18340820 16308797 14887391 13965161 12819924 11384569 10097545 9125560 8509030
59332H509030m033N30269L06620m03222n78374j36440l1514m29907l78699K41007
59322G624737J78025r29340j495674m45754Q25299N41681o82384j011159l75061
59313D230370k27975q25920q76539Q2024Q71124O01810j52257n48314n14394k06633
59303B433296L22639N41835k14137j395547j538057m37505L51293o7031m46496
59294d49710N03801J782632J442706m43473j847530j603656n94253L5930L84360
59285g89193R02458J157707M93189o23575r36609p0863R11318Q87785O6074m62080
59275A536211k36563J34665N4668k31962k37067r4201k22532m80554l91733o6632
59265b35700r0661m24910k56372P17623J578568J321091K28640n01623k80050
$$ plain form
59332 8509030 8504997 9035266 9341886 8938664 8360290 8223850 8192336 7762429 7383730 7624737
59322 7624737 7802762 6873422 5377748 4931994 5757293 6298974 5616590 4605431 4230370
59313 4230370 4002395 3176475 2299936 2381960 3253084 3854894 3702637 3154323 2639929 2433296
59303 2433296 2755935 3297770 3083633 1688086 150029 -287476 63817 -3214 -449710
59294 -449710 54091 1836723 3279429 2835956 988426 -615230 -1209483 -1173553 -789193
59285 -789193 113265 1270972 1764161 1140586 203977 133114 1044432 1932217 1998291 1536211
59275 1536211 1299648 1434313 1488981 1257019 1019952 925751 703219 222665 -169068 -235700
59265 -235700 -326361 -751271 -1007643 -290020 1288548 2609639 2838279 2336656 2056606
59256B056606K96159L57091j89003o65799n06249M1330J95847l14808p43559k38259
59246B89356Q55843J214339K34267j066708j281055l31572N90091N97742K1690
59237A123993k96985q3696K97778N24783O13635N73779K40534k90618m54706M4665
59227B293162N19353M5961j081355j546510r17478l08052n01020n37501O30547
59218a402893J975917J567709m38750j785826j225697P6937P06030Q56639J178343
59209A508409J263716N24373m74972p89164m45231K5719O13090J265569J104092
59200D595601m57061k335684k859319j852683m45552P25887J731087K175296J479763
59191B757335K54985k36183o1792m09737j249178j133477J23624O43661n31392
$$ plain form
59256 2056606 2352765 2709856 2520853 1855054 1348805 1390135 1585982 1271174 527615 289356
59246 289356 1145199 2359538 2593805 1527097 246042 -85530 504561 1102303 1123993
59237 1123993 827008 743312 1041090 1565873 2179508 2753287 2993821 2703203 2248497 2293162
59227 2293162 2812515 2858476 1777121 230611 -686867 -994919 -1495939 -2033440 -1402893
59218 -1402893 573024 2140733 1701983 -83843 -1309540 -1232603 -526573 330066 1508409
59209 1508409 2772125 3296498 2821526 2032362 1587131 1612850 2225940 3491509 4595601
59200 4595601 4138540 1802856 -1056463 -2909146 -3354698 -2628811 -897724 1277572 2757335
59191 2757335 3012320 2776137 2714345 2304608 1055430 -78047 45577 689238 157846
59182A57846j570591o21677J133427J290071M382m52257N34739J141435L30134
59173A947509n81043m44519k22371r73970j640244p32756R00685J157141N5457
59164e34111j84270J340521K666706J814672m05860j714210j428552p76137o88286
59155I0473p82845n59935l23558m45628n50185l2557R97855J736178J488997K89377
59145A908172j082439j601205q36101N08778J131520M51583p25372j055518j18267
59136a418849J140430J471739O95429k14999m42588l08038n31108r01476n60203
59127a069663M32251R16801M00037j47334M1788K54176k30644n84288Q3169P22440
59117H18733p4049j205364l99392J719929J932311n20351k310621j051330J010048
$$ plain form
59182 157846 -1412745 -2034422 -900995 389076 393458 -58799 475940 1617375 1947509
59173 1947509 1366466 921947 699576 -274394 -1914638 -2647394 -1746709 -589568 -534111
59164 -534111 -718381 622140 3288846 5103518 4697658 2983448 1554896 778759 90473
59155 90473 -692372 -1252307 -1575865 -2021493 -2571678 -2604235 -1606380 129798 1618795 1908172
59145 1908172 825733 -775472 -1611573 -1102795 28725 480308 -245064 -1300582 -1418849
59136 -1418849 -278419 1193320 1888749 1673750 1231162 923124 392016 -509460 -1069663
59127 -1069663 -637412 279389 679426 532092 573880 828056 597412 13124 96293 818733
59117 818733 744684 -460680 -860072 859857 2792168 2271817 -38804 -1090134 -80086
59108h0086Q02309n67302K6465K181993K480634J00953j912923j536171m49652
59099A046220n98007j085148l57936Q78314J073012M51537J12747j58034j039978
59090C22727j680136p95496Q36641J199033J10516o03623m4159O73024N82640
59081F01167K31564K49225K15426k32026n65918m89840n87448r68716o21936P45651
59071a422851J543993N07968r98053p56696Q71953J400803j7245j438927j233617
59062a542672l28909k94120p89351m18634Q48094J651382J234509J92602n93714
59053d0813p45260k38272N87235R35382L27654n46638n32372M40970J240302R67589
59043B395777j40604j190254j358631l34819J191550J724983O02682q10020p50183
$$ plain form
59108 -80086 722223 154921 181386 2363379 4844013 4944966 3032043 1495872 1046220
59099 1046220 448213 -636935 -994871 -116557 956455 1407992 1520739 1362705 322727
59090 322727 -1357409 -2152905 -1316264 -117231 -6715 -610338 -654497 18527 601167
59081 601167 832731 1081956 1297382 1065356 499438 9598 -577850 -1546566 -2168502 -1422851
59071 -1422851 121142 629110 -368943 -1125639 -253686 1147117 1129872 -309055 -1542672
59062 -1542672 -1871581 -2165701 -2955052 -3373686 -2525592 -874210 360299 552901 -40813
59053 -40813 -786073 -1024345 -437110 498272 825926 279288 -253084 187886 1428188 2395777
59043 2395777 2255173 1064919 -293712 -628531 563019 2288002 2890684 2080664 1330481
59034A330481L34666L92663r34468j570270k91104J188675Q18893o77654j136885
59025e45003l02979K34052j06901k55917K87088N73497J3032n75507m05033Q5628
59015i98043K12775J53494L15514M87143L65225J97500K00744J8606n28617p94879
59005c70538k12613O58744Q23296K22284m03195p24729r86793j066598l78679
58996b438821J000382J915989J416380M0848p67388m34240J22566j33962q00867
58987g9113m74614J206640K668337K146820m7438j844706j947930j123601o79988
58978a75593o35612j99058N79556P48299m1351r40567j066987n43958K95M07356
58968a867620R13229J386048J251902K78233r39563j509396j142275l32043L24103
$$ plain form
59034 1330481 1665147 2057810 1123342 -446928 -738032 450643 1269536 591882 -545003
59025 -545003 -847982 -613930 -720831 -976748 -689660 -116163 -103131 -678638 -1083671 -998043
59015 -998043 -785268 -631774 -316260 170883 536108 733608 934352 952958 424341 -370538
59005 -370538 -583151 75593 898889 1121173 717978 -6751 -993544 -2060142 -2438821
58996 -2438821 -1438439 477550 1893930 1934778 1167390 733150 855716 721754 -79113
58987 -79113 -553727 652913 3321250 5468070 5420632 3575926 1627996 504395 -175593
58978 -175593 -811205 -1010263 -430707 317592 276241 -664326 -1731313 -2275271 -2274976 -1867620
58968 -1867620 -954391 431657 1683559 1961792 1022229 -487167 -1629442 -1961485 -1637382
58959a637382P10198R14775O53062m52513j895042k262132q18591J255525K038280
58950a493820J210262L03612M15462P56915J88324p72261p33874K59187O97664
58941H31471n7688q82760q07247m28576n28707n28422L54503J320047J017379
58932B90000q9619k13924Q51430J202764j73937j587317j035232Q17509J588777
58923A650451M81345r08062r90201m2505O55710N46798R6003q0352J31440L70785
58913A911412K16102l35494p44365m71464L01930P24992K08209q06084j213683
58904b08445m86954N88333P15861l00565j170996o97183O65338J434092R98612
58895A538093P6222n92397r84359j091746n69838M38537J055278Q34274L82293
$$ plain form
58959 -1637382 -927184 -12409 640653 188140 -1706902 -3969034 -4787625 -3532100 -1493820
58950 -1493820 -283558 20054 435516 1192431 1380755 608494 -125380 133807 831471
58941 831471 773783 -108977 -916224 -1344800 -1873507 -2401929 -2047426 -727379 290000
58932 290000 200381 -13543 837887 2040651 1866714 279397 -755835 61674 1650451
58923 1650451 2131796 1223734 233533 191028 846738 1393536 1489539 1409187 1540627 1911412
58913 1911412 2127514 1792020 1047655 576191 878121 1603113 1811322 1005238 -208445
58904 -208445 -695399 -107066 608795 308230 -862766 -1559949 -894611 539481 1538093
58895 1538093 1614315 1021918 37559 -1054187 -1624025 -1185488 -130210 704064 1086357
58886A086357K58338J35507k46966k49780N56269J239428O57983p58216j576349
58877A102571j364127r29053p55371m30487K92714R18689R52498M94831o0087
58868B22178l77548k56576J53644L76720K97638M25110R14667R71861R2907p72975
58858B047626m84299M03164M11014n30583j076795o91991k35948j58518K11210
58849a05120J060844J342784M52596o14945p56052m01522o10404j222330j050878
58840a905027K87676J642313J629115K84224q77451n83942N91272R29529m3360
58831A954349q65989m21473L06975k3476p46264l57302P17730P11070m32522r12474
58821f9376j12418N37066K06280q5247L59870O26627O5572m74299l56474k74345
$$ plain form
58886 1086357 1344695 1480202 1233236 983456 1539725 2779153 3437136 2678920 1102571
58877 1102571 -261556 -1190609 -1945980 -2376467 -2083753 -1165064 -212566 282265 222178
58868 222178 -155370 -411946 -258302 118418 416056 841166 1755833 2727694 2820601 2047626
58858 2047626 1563327 1966491 2377505 1846922 770127 78136 -157812 -316330 -105120
58849 -105120 955724 2298508 2751104 2136159 1380107 978585 368181 -854149 -1905027
58840 -1905027 -1617351 24962 1654077 1938301 1060850 476908 1068180 1997709 1954349
58831 1954349 1088360 666887 973862 950386 204122 -153180 564550 1275620 843098 -69376
58821 -69376 -181794 355272 561552 476305 836175 1462802 1528374 1054075 697601 423256
58811D23256n88111m03319N27249Q90762J17220l54725L81297Q96405k9622j026246
58801H34166m64462N91416K34850r40328j010270j02953J50127k74624l3052P49429
58791b65701O72037j42447j73246N76198M62133p45647j277521l30553P58067
58782d66680R12277O66542M74182j22409q49864m11788J155162J853164O13754
58773C824340j006097j237694m92873j5522K22780P05755Q13604j61369j344091
58764A308833j283772r1083Q33420Q05979L66809Q0813o1466j71350k44587l39913
58754A203683m12883j96717K99497N45339K22947j84539m0273N35131Q46945M82087
58744C301217l13545r00152p91595k02317Q2124k23014l56780K37134O76744j12619
$$ plain form
58811 423256 -164855 -568174 -40925 849837 967057 612332 993629 1890034 1860412 834166
58801 834166 369704 961120 1195970 255642 -754628 -857581 -707454 -982078 -1015130 -265701
58791 -265701 406336 263889 90643 666841 1128974 383327 -894194 -1224747 -466680
58782 -466680 445597 1112139 1586321 1463912 614048 202260 1357422 3210586 3824340
58773 3824340 2818243 1580549 1087676 1072154 1294934 2000689 2814293 2652924 1308833
58764 1308833 25061 -66022 767398 1573377 1940186 2020999 1959533 1788183 1543596 1203683
58754 1203683 790800 594083 893580 1438919 1661866 1477327 1437054 1972185 2819130 3301217
58744 3301217 2987672 2087520 1295925 1093608 1175732 952718 595938 833072 1509816 1397197
58734A397197j357830j311048k7440O93140L32526L57250J213293J108238p64659
58725A640667k121092q66861J338105J404785n06674j475323m20555O96277M10703
58716A00032k25980N1660O61498N79049R8306p1475j89588p21317j162046q40865
58706a720726j98606j00976l60520p6709P96631J300850R15215K40231P031J05434
58696I07855j6355m27104o38957l17510K75534N98596M28926N0442j34564r4696
58686F32167j54914m65694o65338l02512M58669Q90095N83734n3108m55190o75705
58676b07796r80353r78380m2249J352535J721707N08413r22193r76576J17290
58667d07602Q18168L56503o18489j162198q90326N8751J041940J135057K23259
$$ plain form
58734 1397197 39367 -1271681 -1299121 -605981 -273455 83795 1297088 2405326 1640667
58725 1640667 -480425 -1347286 -9181 1395604 888930 -586393 -1006948 -310671 100032
58716 100032 -125948 -74288 587210 1166259 1264565 1193090 1003502 282185 -879861 -1720726
58706 -1720726 -1919332 -2020308 -2380828 -2457537 -1660906 -360056 555159 795390 802421 907855
58696 907855 891500 464396 -174561 -492071 -216537 382059 810985 861427 726863 632167
58686 632167 477253 11559 -653779 -956291 -497622 392473 976207 923099 467909 -207796
58676 -207796 -1188149 -2166529 -2208778 -856243 865464 1373877 451684 -524892 -407602
58667 -407602 410566 767069 148580 -1013618 -1903944 -1845193 -803253 331804 555063
58658E55063m61168R7660J020503P39132m56184p58497K69085J032538N64963
58649B603095n3222K02718N33438j02471j081059j236936p82768o12154n63959
58640a093318P8127R85297J198399P27950L30911L3136o84121j421941j106635
58631i52195J74636R62453M53311l83901k88137N32671Q18740J9625j000285j045717
58621g08799n7123P98607N85673k40613o29968n15331o08031p63585m219J440647
58611g02742J749803J82316j329547p44315J067887J640085M69343o87432p09622
58602I35776k92809j52454N3960N05629M89561l60252j211604j110818j34904
58593a277915R52956J474498J041236j62704j071669o21076P56051J408651N99439
$$ plain form
58658 555063 93895 191555 1212058 1951190 1495006 736509 1005594 2038132 2603095
58649 2603095 2549873 2752591 3286029 3183558 2102499 865563 82795 -529359 -1093318
58640 -1093318 -1015191 -29894 1168505 1896455 2227366 2260502 1576381 154440 -952195
58631 -952195 -777559 184894 638205 254304 -33833 498838 1317578 1337203 336918 -708799
58621 -708799 -765922 32685 618358 377745 -252223 -767554 -1375585 -2139170 -2143389 -702742
58611 -702742 1047061 1229377 -100170 -844485 223402 1863487 2332830 1645398 935776
58602 935776 642967 490513 544473 1050102 1539663 1179411 -32193 -1143011 -1277915
58593 -1277915 -324959 1149539 2190775 2028071 956402 335326 1091377 2500028 3099467
58584C099467n42169o74365K417L27765p8905m49373q4411O31340O41731m25436
58574B448061j564255j484750l69868K74680j51070l65144O75908J813990J323262
58565B600814l03547j048503m57326j5553m15521n45576K80556J013289O57099
58556A765732k14050o67515p51734o93488r9350R76466J372376L98790r03753
58547A183474j195315o39246k22685j63113r8402n0443p8871K69317J066790J351618
58537A423124N26410m02124k77899L10622R4437o04981m18548O37573J107978
58528B396592M34545m03842p39334r78988j164725n13323Q89948J515143N28226
58519A964242p71626q27276q1166Q863n58822m61142N63824J082517J45748j137634
$$ plain form
58584 3099467 2557298 1882933 1885350 2213115 2134210 1684837 1600426 2231766 2873497 2448061
58574 2448061 883806 -600944 -970812 -696132 -847202 -1212346 -536438 1277552 2600814
58565 2600814 2297267 1248764 791438 775885 360364 -185212 95344 1108633 1765732
58556 1765732 1551682 884167 132433 -561055 -660405 316061 1688437 2087227 1183474
58547 1183474 -11841 -651087 -873772 -1036885 -1135287 -1185730 -1264601 -995284 71506 1423124
58537 1423124 1949534 1547410 1269511 1580133 1674570 1069589 651041 1288614 2396592
58528 2396592 2831137 2427295 1687961 708973 -455752 -969075 -79127 1436016 1964242
58519 1964242 1192616 365340 284174 293037 -265785 -726927 -163103 919414 1065162 -72472
58509g2472j057377L37025J285611O08775q55495j400344n31986O40369R62322
58500h3572N41726J95458J00702k78792r87318j141965j73461J074886J256821
58491E04485L23031m36297k35310K34664J27711j61865J35007N30739j15382j439127
58481e32344j546083K63291K045263J575112o77972k182502j533914J91343J149579
58472a248227P19019l17721p45104K6870J263413J420566L3418j314675r24360
58463a086801N33314R04787k11351q95910L2071J205792R26546l37793r89506
58454H1149o96509k81457j2518M42971P83376L11746o49381r06228j27237O60687
58444c93401N85593L8352r1310M15904J085200J374003R80226m8797j139765j413846
$$ plain form
58509 -72472 -1129849 -792824 492787 1101562 246067 -1154277 -1686263 -1045894 -83572
58500 -83572 458154 653612 754314 475522 -511796 -1653761 -1827222 -752336 504485
58491 504485 827516 391219 155909 390573 518284 356419 491426 1022165 906783 -532344
58481 -532344 -2078427 -1815136 230127 1805239 1127267 -1055235 -2589149 -2397806 -1248227
58472 -1248227 -529208 -846929 -1592033 -1565163 -301750 1118816 1152234 -162441 -1086801
58463 -1086801 -553487 351300 139949 -755961 -723890 481902 1408448 1070655 81149
58454 81149 -615360 -896817 -909335 -466364 317012 628758 -20623 -926851 -1054088 -393401
58444 -393401 192192 230544 139234 555138 1640338 3014341 3994567 3945770 2806005 1392159
58434A392159n16859P92225J213413K63504j076594j386802n05609K59258r7570
58425C37125q63298o65352M63838J125860O25066j28124j12052M06486N38611
58416A728160R7635l61845l66615M6726L94656J27915o00887p37017L02886J352665
58406A984279Q68350n84956r35333J46549O76058l07120j102457l42076N88815
58397I92109K4827j004306o48154M11541J98920r46406q87273N89982J395724
58388A26964N54566n69712p99225n53282k95472K16068N97848q5902j284123j116281
58378c208551O52730J880306J223230q6k31408P6539J0531O7012P61889J021682
58368B253874r8803j379732j133039L9602K47548o01188q34525J14070R17412
$$ plain form
58434 1392159 875300 1667525 2880938 3144442 2067848 681046 175437 434695 337125
58425 337125 -526173 -1191525 -727687 398173 1023239 895115 783063 1189549 1728160
58416 1728160 1825795 1463950 1097335 1144061 1538717 1666632 1065745 328728 631614 1984279
58406 1984279 2852629 2267673 1332340 1478889 2154947 1847827 745370 403294 992109
58397 992109 1016936 12630 -635524 -223983 -25063 -971469 -1858742 -1268760 126964
58388 126964 681530 111818 -687407 -1240689 -1536161 -1320093 -722245 -808147 -2092270 -3208551
58378 -3208551 -2555821 -675515 547715 547629 316221 392760 403291 470303 1232192 2253874
58368 2253874 2155071 775339 -357700 -318098 -70550 -671738 -1506263 -1392193 -474781
58359d74781O45100Q0737J84650N81054L54120m62190r41225n03279L78909P30589
58349E73684K23267l83482k22695L97606L36272o80441j542321j293591l43387
58340b935088L82516O77887P99053P51130N58929N36379N88976O6086r17283j013850
58330e05265L97997J759115J292108l16570r01692n1733N51525K6965m58786P3191
58320A866855O79646R9461j110541j342333k41160R17421R81447J63663n31218
58311A483241n00561K8357M22586K76960k89843q39943j034215q23935l44081
58302a621434K18576O45698P06167K76257m57744r25861n79382L83841R83920
58293c69962O15063j2810K00211J014651J054194o0797r13321k92725R38608R75917
$$ plain form
58359 -474781 170319 251056 435706 1016760 1370880 908690 -32535 -535814 -156905 573684
58349 573684 796951 413469 190774 588380 924652 244211 -1298110 -2591701 -2935088
58340 -2935088 -2552572 -1874685 -1075632 -324502 234427 770806 1359782 1425868 508585 -505265
58330 -505265 -107268 1651847 2943955 2627385 1725693 1673960 2225485 2252450 1793664 1866855
58320 1866855 2546501 2645962 1535421 193088 -48072 869349 1850796 2014459 1483241
58311 1483241 982680 1011037 1433623 1710583 1420740 580797 -453418 -1277353 -1621434
58302 -1621434 -1402858 -757160 -50993 225264 -232480 -1158341 -1737723 -1353882 -369962
58293 -369962 245101 232291 432502 1447153 2501347 2440550 1527229 1234504 2173112 3149029
58283C149029m72414j891735j939333q46842K05351N10924M47734Q33111J683081
58274A678906J848283M37813j566352k138837q30216O37675Q41638L58107K01380
58265A468397N4981o02495r20883j4939J037990N31988j047305j579855n11363
58256a583484N37101M80252R3777J83633K85101o4314l20930p6056Q5502k70801
58246f50219n29540r9346N64387P64064N25050J14165n06830j109061j008398
58237a935728j42623N58381N62605N37999R98603J189352L57514p61708r60449
58228D03946m11174k10459m81752k82542O56619J327646Q56794l41975j177245
58219C39858j105729m71886N2460J77239K33215O52702J211629J149518K15169
$$ plain form
58283 3149029 2676615 784880 -1154453 -2001295 -1795944 -1285020 -837286 -4175 1678906
58274 1678906 3527189 3965002 2398650 259813 -570403 67272 908910 1267017 1468397
58265 1468397 1523378 920883 0 -14939 1023051 1555039 507734 -1072121 -1583484
58256 -1583484 -1046383 -566131 -472354 -288721 -3620 -67934 -388864 -464920 -379418 -650219
58246 -650219 -1179759 -1279105 -714718 49346 574396 688561 181731 -927330 -1935728
58237 -1935728 -2078351 -1519970 -957365 -419366 579237 1768589 2126103 1364395 403946
58228 403946 -7228 -217687 -699439 -981981 -325362 1002284 1859078 1517103 339858
58219 339858 -765871 -1237757 -1185297 -1008058 -774843 -122141 1089488 2239006 2454175
58210B454175q56012j217378q31022j90628L42948M85504q1345j079068j402190
58201b375016l86054J033649J389674P09557L47635P47487P12854m83685j527095
58192A69006q65032O70631P66688q57946j714850j73235J861746J598149m48208
58183A006949j259375R857Q96261j69024j276575l68867J163582P61739r79758
58174b15211j264000L43147J383059N85648m37281k16476M42924L74474p3449
58165I22835k15715k58640l02407J67102Q39661M40832r78115j551988n44897
58156a481332L10460j75766n41563N41827J570446P30799p39443n50915O98347
58147C62860O79566n14415o47969N94331J094804P4405o69154J6373Q68656O50269
$$ plain form
58210 2454175 1598163 380785 -450237 -640865 -297917 187587 106242 -972826 -2375016
58201 -2375016 -2761070 -1727421 -337747 371810 719445 1466932 2179786 1696101 169006
58192 169006 -696026 -25395 741293 -116653 -1831503 -2004738 -142992 1455157 1006949
58183 1006949 -252426 -242569 653692 484668 -791907 -1160774 2808 764547 -215211
58174 -215211 -1479211 -1136064 246995 832643 395362 178886 621810 996284 922835
58165 922835 707120 448480 146073 313175 1152836 1593668 615553 -936435 -1481332
58156 -1481332 -1170872 -1346638 -1888201 -1346374 224072 954871 215428 -335487 362860
58147 362860 1042426 528011 -119958 474373 1569177 1643582 974428 990801 1859457 2509726
58137B509726N5354L5905J50396k26000o13273m52986j19611M334K34982N83412
58127B162239L10508o86945j255888o43579K95337M23600j07128m77379n58850
58118e38085p64540j099475j079394l23830J010836K061615J751478J63860r89469
58109A92996l80264R13084Q85805l18239p81317q7773J74896m91313n17225P06962
58099B97612J392361L77014p32636k51731P88160O02874l23915m57364m2431l18160
58089A331784r52501o87060J76313K88663k29421n9635Q16310J090517M83610
58080B258580K6823L805l26828q46410m90733O18932R48714L901q13913m95135
58070H87736R1091j49597q04664q19606m6387Q65686J307462R25102j70654j074666
$$ plain form
58137 2509726 2565080 2600985 2751381 2525381 1912108 1459122 1339511 1343845 1578827 2162239
58127 2162239 2472747 1785802 529914 -113665 181672 605272 498144 20765 -538085
58118 -538085 -1302625 -2402100 -3481494 -3805324 -2794488 -732873 1018605 1182465 192996
58109 192996 -187268 725816 1611621 1293382 512065 424292 599188 107875 -409350 297612
58099 297612 1689973 2066987 1334351 1082620 1870780 2473654 2149739 1692375 1649944 1331784
58089 1331784 379283 -307777 -131464 157199 -72222 -131857 684453 1774970 2258580
58080 2258580 2285403 2289208 1962380 1115970 625237 1244169 2192883 2196784 1382871 887736
58070 887736 978827 829230 24566 -795040 -841427 24259 1331721 2256823 2086169 1011503
58060A011503q74688K2331L85572O8568Q8838O32700O47333n2079p8383J129403
58050B981098J906508P92561j027931j437152n46066k54551j166122j849390j201499
58041a802544R9103Q81585R45586P02801L23545j14910k41008J99528P76994P03403
58031B474083k26308j232230j290298l55626M13442N5578p80891n90434P84099
58022g48585J732930J138425k1580k49088K18694O6994p42785q90484M8963Q49527
58012A403011N78981o0109q2877J97056p1103p25287r19460n58703k99298k85082
58002h22871M2086P60520J070515M70575l89971n60172l2150L92371K15967k74408
57992H72462n48399m27044q7560K23559L39525J80645k01942n33986m11776K31498
$$ plain form
58060 1011503 136815 159146 544718 613286 702124 1334824 1982157 1930078 1851695 2981098
58050 2981098 4887606 5680167 4652236 3215084 2669018 2414467 1248345 -601045 -1802544
58041 -1802544 -1703441 -821856 123730 826531 1150076 1035166 794158 993686 1770680 2474083
58031 2474083 2247775 1015545 -274753 -630379 -216937 -161359 -942250 -1532684 -748585
58022 -748585 984345 2122770 2101190 1852102 2070796 2137790 1395005 504521 553484 1403011
58012 1403011 1981992 1921883 1839006 2036062 1964959 1239672 320212 -238491 -537789 -822871
58002 -822871 -780785 -20265 1050250 1520825 1130854 570682 538532 930903 1146870 872462
57992 872462 324063 -102981 -190541 33018 372543 553188 351246 -182740 -594516 -363018
57982c63018P28914K33347r85181j367140M72J694561J487721m22905j333857
57973c27086J62900J967786J460311o70499j607237o39939J74250m32343j140799
57964a052656n34647O72866J078907O80356K31055k25929q38999r81448j84501
57955a154996P22614O91004M7159j60473K04028N19349N74426M50130r0613r02810
57945H99818r00700M25985J657341J166191m25131j216155r05041p47852r98027
57936a043571n94395N18988R69278L06839k42365j683J16565m02342n42235L04721
57926f10200R66063L77093n51747l71971O58676J137246N52088m14045r91164
57917G52039q00070J17151R71007P05883m85509j064315k96312O16694M58012
$$ plain form
57982 -363018 365896 599243 -385938 -1753078 -1752606 -58045 1429676 1006771 -327086
57973 -327086 -164186 1803600 3263911 2593412 986175 346236 520486 88143 -1052656
57964 -1052656 -1587303 -914437 164470 844826 1075881 849952 10953 -970495 -1154996
57955 -1154996 -432382 258622 305781 145308 349336 868685 1443111 1893241 1802628 899818
57945 899818 -882 425103 2082444 3248635 2823504 1607349 702308 -45544 -1043571
57936 -1043571 -1637966 -1118978 -149700 157139 -85226 -86909 29656 -372686 -914921 -610200
57926 -610200 355863 732956 181209 -190762 467914 1605160 2157248 1743203 752039
57917 752039 -48031 69120 1040127 1746010 1260501 196186 -100126 516568 974580
57908I74580j80411j78245J78276j6472n20862n13423j81071k03092k88492K20201
57898g09011Q51315P14799K11067L37612O92132K9597j334873j620580k97551
57889a125493J069741J134751L58788k34340m53496m49066q6672M70440N60580
57880A245233K3856m69198n37074n97217q29475o46829K43682J164011J397020
57871I94009R76040J54676r27160j630382j062273L97996J025900Q7591r34948
57862i18551n67466L77521K49066o45027n84739O14483J220259L71777n82196
57853d64873k40247Q24206J181956O31541O1751p1757l3064K7870J64004P6070
57843B157457n76075j332738j285333l80564M14698M43689J17108P3336K91073
$$ plain form
57908 974580 794169 615924 794200 777728 256866 -256557 -437628 -640720 -929212 -709011
57898 -709011 142304 857103 1068170 1405782 2097914 2127511 792638 -827942 -1125493
57889 -1125493 -55752 1078999 1437787 1203447 749951 300885 214213 684653 1245233
57880 1245233 1269089 799891 262817 -334400 -1163875 -1810704 -1567022 -403011 994009
57871 994009 1970049 2124725 1197565 -432817 -1495090 -1097094 -71194 16397 -918551
57862 -918551 -1486017 -1108496 -859430 -1504457 -2089196 -1474713 -254454 117323 -464873
57853 -464873 -705120 119086 1301042 1932583 1994334 1922577 1889513 1917383 2081387 2157457
57843 2157457 1581382 248644 -1036689 -1417253 -1002555 -558866 -441758 -368422 -77349
57834g7349M12959L31968O7754l47069n18836K8834Q14366N98276o73094j225494
57824e87685P5365J642561J234298n98003j222204P8007J125746L63330q91447
57815A219968q29931O5975J85979n59735r11741l34434N14647R43145P60873P7115
57805A131861o17093p03206l84093n40310j062172o03516J089626K121489J126387
57796A558973m51938n70583K39180J15166p69517o71956M44552Q29054J05302
57787H28233j21499Q07048J497299R59755q021o03977j130408j556960j028940
57778c57470K47659O16563m10821j032538M9110J482334J433095L20409l32797
57769B015544m68099r94869j622006j167895K89218J253963Q47981k16530q00667
$$ plain form
57834 -77349 335610 667578 735332 388263 -130573 -101739 712627 1310903 637809 -587685
57824 -587685 -512320 1130241 2364539 1766536 544332 622339 1748085 2111415 1219968
57815 1219968 390037 456012 641991 82256 -829485 -1163919 -649272 293873 1054746 1131861
57805 1131861 514768 -188438 -572531 -1112841 -2175013 -2778529 -1688903 432586 1558973
57796 1558973 1107035 536452 775632 890798 121281 -550675 -106123 722931 828233
57787 828233 706734 1513782 3011081 3970836 3962815 3358838 2228430 671470 -357470
57778 -357470 -109811 506752 95931 -936607 -887497 594837 2027932 2348341 2015544
57769 2015544 1547445 552576 -1069430 -2237325 -1948107 -694144 153837 -62693 -863360
57760h63360n96033r3770J62672J91411N16062J275924J623368P63884n80879
57751B399279r12140j85273J19007n67338r99226k81669O59374O78814P2311l30846
57741F52293m24726k68867L60223R73423M45778r67279j427602m25386J35035
57732i47108p75325j212466M18512K134490J315857q28132j046040P65762J657425
57723A482975M91798p66767q06865o98283j138025r27449O29937K161777K257294
57714B686392J221302p9222j324897j956995j169228M52798J058871J37731p40313
57705B86439n31596j51679l98176m85318J25175L95452l05975p16340J37646R52957
57695f91415K87765p88865m05157Q80413R93825j53160o01997K98165R04553J38375
$$ plain form
57760 -863360 -1459393 -1553163 -1390491 -1199080 -683018 592906 2216274 2980158 2399279
57751 2399279 1487139 1301866 1420873 853535 -145691 -427360 232014 910828 983139 652293
57741 652293 227567 -41300 318923 1292346 1738124 770845 -656757 -1082143 -947108
57732 -947108 -1722433 -2934899 -2516387 -381897 933960 105828 -940212 -174450 1482975
57723 1482975 1974773 1208006 401141 -297142 -1435167 -2362616 -1732679 429098 2686392
57714 2686392 3907694 3828472 2503575 546580 -622648 -169850 889021 1026752 286439
57705 286439 -245157 -396836 -795012 -1280330 -1155155 -759703 -1065678 -1782018 -1644372 -691415
57695 -691415 -403650 -1192515 -1597672 -717259 276566 123406 -478591 -180426 724127 862502
57685H62502p93338n11471L36798L03462m78419o01773K91592Q76134J47931r39929
57675e06511o94257Q48649J728952O31599j272979j837363o55641P82176J295809
57666C20434J110634P73257L22667j04792n7624K97981Q1729q73989j506438j081831
57656g17972k78094L4618J02946M83758Q60277P28583M83046O56708P31615k1845
57646C063640r98783r43335J1453L78063m74166j389401j121695K4552Q26370
57637f23302P27526J62844k99202n10743n36645l96555j66072m0022l6548J93288
57627a525431Q69373J444575J062504j36381q99652n79436j58137o47668j257234
57618a827487n75564R25740J379291M63896j34952L61242N24930o52795j752728
$$ plain form
57685 862502 69164 -442307 -105509 197953 -280466 -882239 -590647 285487 433418 -506511
57675 -506511 -1200768 -352119 1376833 2008432 735453 -1101910 -1757551 -975375 320434
57666 320434 1431068 2204325 2526992 2422200 2364576 2662557 2744286 1870297 363859 -717972
57656 -717972 -996066 -961448 -858502 -374744 485533 1214116 1697162 2353870 3085485 3063640
57646 3063640 2064857 1121522 1132975 1511038 1036872 -352529 -1474224 -1449672 -623302
57637 -623302 104224 267068 -32134 -542877 -1079522 -1476077 -1642149 -1682171 -1718719 -1525431
57627 -1525431 -656058 788517 1851021 1714640 814988 235552 77415 -570253 -1827487
57618 -1827487 -2403051 -1477311 -98020 365876 230924 592166 1117096 464301 -1288427
57609a288427j102739M92098J009746K31869l39851K052N42385P80990J013494
57600A341617J206681P53977l30562j081570q10331R3957P86377P69372K3784
57591B753302j047738j736180j555407o88649L18770J049545J191816N93449k50786
57582F28122m09895K42580O71083J67040n77038o38612k91604l07661n80787n41418
57572a638190l19352l66858m58373j68282J90824K07231L34806J010604J450906
57563B43316P24736m99755p78052o8672M10802J87744j21195k06746k84454j46479
57553e38755M78725Q78536K52496o56540n55227J35139P338o29518j55053J216961
57543D34102J339022k68814j347020m46498R01949R21300K26067O2726m7440r04681
$$ plain form
57609 -1288427 -2391166 -1899068 -889322 -657453 -997304 -995252 -452867 328123 1341617
57600 1341617 2548298 3302275 2971713 1890143 1079812 1173769 1960146 2729518 2753302
57591 2753302 1705564 -30616 -1586023 -2274672 -1955902 -906357 285459 878908 628122
57582 628122 218227 460807 1131890 1298930 721892 83280 -208324 -515985 -1096772 -1638190
57572 -1638190 -1957542 -2324400 -2782773 -2951055 -2760231 -2553000 -2218194 -1207590 243316
57563 243316 968052 468297 -309755 -378427 32375 220119 98924 -107822 -392276 -538755
57553 -538755 -60030 818506 1071002 414462 -140765 -5626 1712 -627806 -782859 434102
57543 434102 1773124 1504310 157290 -289208 612741 1534041 1760108 1822834 1775394 870713
57533H70713j527428o87970O00450L96226j033141j523518k42493J260829J372242
57524e14090L45726l89000N3569J191588J640123N93062r27341j016247N17161
57515A494551J574973N89238j242365j746598p85957N8491J09447J47080N67568
57506G66428O73731M9427o58998p48879l49049M4811K61711L92825M59271L36550
57496A227828j04948o65711o67372K97887J392441J218625j70516j044778m29581
57487A053875M51199J84789n94026m43493L84580N09302o5066J2958R36057J210430
57477C640605J04138j018713o78606N37990Q00647m87211j902109j714116K6300
57468f91075J429481R68611n78290j135190j91192O04011J28462m88126M2239
$$ plain form
57533 870713 -656715 -1344685 -744235 -348009 -1381150 -2904668 -3147161 -1886332 -514090
57524 -514090 -168364 -557364 -503795 687793 2327916 2920978 1993637 977390 1494551
57515 1494551 3069524 3658762 2416397 669799 -116158 -57667 51780 198860 766428
57506 766428 1440159 1489586 830588 81709 -267340 -222529 39182 432007 891278 1227828
57496 1227828 1122880 457169 -210203 87684 1480125 2698750 2528234 1483456 1053875
57487 1053875 1505074 1689863 1095837 652344 1036924 1546226 1481160 1494118 2430175 3640605
57477 3640605 3744743 2726030 2047424 2585414 3386061 2898850 996741 -717375 -691075
57468 -691075 738406 1707017 1128727 -6463 -197655 406356 534818 46692 88931
57459H8931Q18817K74087j006653j133377m6796M61476j94906n74084J68131R21454
57449b22920O66681R3954J74916N47427L94257j66413n56803p14371p29046l18383
57439h30701N12745J007860O53255M0529J15L72802L40620l62549j148335j292874
57429g06533o25184L40711Q50430O61785K29516o1123l48146n34086P7939J416115
57419A301424J828217J90332j880953j908021k35710N05464m13837q66485L22514
57410a157055J422072R25043L3012K07486N12068l80263j391308p79739O56865
57401D8181P34296o01594j404564q74883n4748L23868N23027N21073Q1642r4663
57391g98365P00847J362525K97348j558020j529737P29864K495898J919199K76742
$$ plain form
57459 88931 907748 1181835 175182 -958195 -1004991 -543515 -738421 -1312505 -1144374 -222920
57449 -222920 443761 537715 712631 1260058 1654315 1487902 931099 216728 -512318 -830701
57439 -830701 -317956 689904 1343159 1383688 1383803 1756605 2097225 1734676 586341 -706533
57429 -706533 -1331717 -991006 -140576 521209 750725 689602 341456 -192630 -114691 1301424
57419 1301424 3129641 3319973 1439020 -469001 -704711 -199247 -613084 -1479569 -1157055
57410 -1157055 265017 1190060 1223072 1430558 1942626 1562363 171055 -608684 48181
57401 48181 782477 180883 -1223681 -2098564 -2153312 -1829444 -1306417 -785344 -703702 -798365
57391 -798365 -97518 1265007 1562355 4335 -1525402 -795538 1700360 3619559 3896301
57382C896301o48394j015039j404164j104504K55288J158421L34780q93802n03265
57373G5622R94813J385567K17826p63635n06819R8043J32046K001K70718N44344
57363B450526K79965k90152o85224q32069o78911N1137J127574J535145O33838
57354C591829q68198j722341j533810p79675J24417R92483J344971O55651o95578
57345A109749j459789r12755K62704Q76221N97643l3273n61194q79003p28990
57336a728687J75319J335246J594469N75781o31523q36513k80083m0506l30876
57327a67373m04805k7733J05948l11430n32106J7046O95370O24989P0394q1805
57317a1505J80060O1572n52255p44458r954Q19757O96517j54987n99381k15901
$$ plain form
57382 3896301 3247907 2232868 828704 -275800 -20512 1137909 1472689 578887 75622
57373 75622 1070435 2456002 2673828 1910193 1403374 1501417 1633463 1635464 1906182 2450526
57363 2450526 2730491 2440339 1755115 923046 244135 295272 1422846 2957991 3591829
57354 3591829 2723631 1001290 -532520 -1312195 -1187778 -195295 1149676 1805327 1109749
57345 1109749 -350040 -1262795 -1000091 -123870 473773 440500 -120694 -999697 -1728687
57336 -1728687 -1553368 -218122 1376347 1952128 1320605 484092 204009 163503 -167373
57327 -167373 -572178 -599911 -493963 -805393 -1337499 -1320453 -625083 -94 70300 -11505
57317 -11505 168555 230127 -322128 -1066586 -1076540 -256783 439734 284747 -314634 -530535
57307e30535K05195p0346o15971n04038K75893P50255L70462j87220n2361N15670
57297A57004N30158k18886q75828p99750l27014K2502L01112N86624M29723l66664
57287e61019r63381m36097P77338J352661Q73201J62484j35193k02395j40209
57278G27390L54797R58779O08423p90761j669089q86453M32053N07772l76967
57269a34056m33716O92849J374358N96100o15099r73540o54593l72464k8717O28335
57259G9457J011311N70716p1741n6494K44303q3737q04359q33971M230P89891
57249H49606R63420P71512L26057m94995j126622o54102N85432J013320k0702
57240B212926j187523r85390L19021J291353J141159K33137o17277p36346J0260
$$ plain form
57307 -530535 -325340 -395686 -1011657 -1515695 -1239802 -489547 -119085 -306305 -358666 157004
57297 157004 687162 468276 -407552 -1207302 -1534316 -1511814 -1210702 -624078 -194355 -561019
57287 -561019 -1524400 -1960497 -1183159 169502 1042703 1205187 1069994 867599 727390
57278 727390 1082187 2040966 2649389 1858628 189539 -696914 -264861 242911 -134056
57269 -134056 -567772 125077 1499435 2095535 1480436 506896 -147697 -520161 -548878 79457
57259 79457 1090768 1661484 1589743 1533249 1777552 1693815 889456 55485 59715 849606
57249 849606 1813026 2584538 2910595 2415600 1288978 634876 1220308 2233628 2212926
57240 2212926 1025403 40013 359034 1650387 2791546 3024683 2407406 1671060 1681320
57231A681320R03389R44640J04970o06812o02605m00890m58189l40140K51122
57222A476805O03028P1615p43294q55453k84693K68130M57636J84693o90203j560222
57212a071958j027361J045841K449392J289929j050041j608083n34J338232R51602
57203B317019r98k81946l65532p72447p46388J00424N85643j15690q16344j96728
57193b92987Q97011P98468k74129p38988k87372o8904m30248l41107O61494J532938
57183A456176J251545J07342j042030j789120j932607j167190K66164J289838
57175a559882J112577K78178n1721L65319O57826J66128o06063o63556J31881
57166a69313Q33789O33743p6888k73323K88164Q31350P47599K93677j57691p63898
$$ plain form
57231 1681320 2584709 3529349 3634319 3027507 2424902 2024012 1565823 1225683 1476805
57222 1476805 2079833 2151448 1408154 552701 268008 536138 993774 1178467 488264 -1071958
57212 -1071958 -2099319 -1053478 1395914 2685843 1635802 27719 27185 1365417 2317019
57203 2317019 2316021 2034075 1668543 896096 149708 250132 835775 720085 -96259 -292987
57193 -292987 604024 1402492 1128363 389375 102003 33099 -397149 -738256 -76762 1456176
57183 1456176 2707721 2815063 1773033 -16087 -1948694 -3115884 -2849720 -1559882
57175 -1559882 -447305 -169127 -220848 144471 802297 968425 362362 -301194 -169313
57166 -169313 664476 1298219 1221331 948008 1236172 2067522 2815121 3108798 2951107 2187209
57156B187209j512713j591450m04316J153282J492460L85057p23196o23293K76900
57147F39940Q06190N29941r2761n34777o36988m84707k89734k71370l82253l06076
57137a022595O0678L49542K30025j2291K02815Q72855J238612O73782m64740j150891
57127I77792q35780k7687L82726J36406l10251n19916m55736j62518L91442R61221
57117E37699J016912M39851j70237k70162p3896m2680j04080J5231P1161k72539
57107A147260n54875n0385Q18946P27103n54384j485473q03213O44769J109404
57098I99152L90404j37591K40184O37952K11409m14424k06123M98889L93456p39203
57088A874105j449317n49996J106895J559617K14662j389983j495720j94768Q82891
$$ plain form
57156 2187209 674496 -916954 -1321270 -167988 1324472 1709529 986333 363040 639940
57147 639940 1446130 1976071 1883310 1348533 711545 226838 -62896 -334266 -716519 -1022595
57137 -1022595 -961917 -612375 -382350 -394641 -191826 681029 1919641 2593423 2128683 977792
57127 977792 142012 114325 497051 633457 323206 -196710 -652446 -814964 -423522 537699
57117 537699 1554611 1994462 1824225 1554063 1480167 1437487 1333407 1348638 1419799 1147260
57107 1147260 592385 542000 1360946 2088049 1533665 48192 -755021 -110252 999152
57098 999152 1389556 1251965 1492149 2130101 2341510 1927086 1720963 2219852 2613308 1874105
57088 1874105 424788 -125208 981687 2541304 2755966 1365983 -129737 -324505 558386
57079E58386O27711m18993j007251o84829m1219K31131P9546q3613J9140K31700
57069d88291J67720l15303q09415o57737K54407J142679J085109J14802q24648
57060c30677j044670p45610l46494J61387P39710Q36814J92928l58955O9943Q48000
57050B2376N42341p49030j228370m4803J312078J164262m9064p93736p08807m44698
57040i77451j13574M49512N16269n88139j711706j047430R45642J872448R30445
57031B76016o5860J67429M81867k47449q82277m5551J234440J030166l60533r49188
57021F39060j84555M95388J25842n72069o45110j59232K92710L14565j73879p33174
57011f00454n17848N36171J078356M5983j458618j450982L5205R88182M13595
$$ plain form
57079 558386 1186097 767104 -240147 -924976 -966195 -735064 -655518 -739131 -719991 -488291
57069 -488291 -320571 -635874 -1445289 -2103026 -1848619 -705940 379169 493971 -330677
57060 -330677 -1375347 -2120957 -2467451 -2306064 -1566354 -729540 -536612 -895567 -825624 22376
57050 22376 564717 -184313 -1412683 -1457486 -145408 1018854 969790 176054 -532753 -977451
57040 -977451 -1091025 -641513 -125244 -713383 -2425089 -3472519 -2526877 -654429 276016
57031 276016 210156 377585 859452 612003 -270274 -315825 918615 1948781 1588248 639060
57021 639060 454505 949893 1075735 503666 -141444 -300676 -7966 306599 132720 -600454
57011 -600454 -1118302 -582131 496225 542208 -916410 -2367392 -2332187 -1344005 -930410
57002i30410m29912k37058M75204N12035j55349n96717k75969M76225R18427N50197
56992C06673k51097l33625P71147J743459R43720j124291k201899j297504J50481
56983a292936N81294L01790L57021O61758L58362o65164j519352j262573K27139
56974b252661J877756K002849J51682j769483j535758K99062J074809r811p79497
56965i41052K60699J461203Q07347p85934j053292J13594R64881Q15975M69878
56956B113299K07774n28320j529831j714906p83916L71650R35293P60840J0876
56947a57241o73983k00194J430056K253960P13581j682602k054992j95197J279662
56938G13050Q20796l19770o52578m32283k38711K84550J074139Q83421o66707
$$ plain form
57002 -930410 -1360322 -1597380 -1122176 -610141 -765490 -1362207 -1638176 -1161951 -243524 306673
56992 306673 55576 -278049 493098 2236557 3180277 2055986 -145913 -1443417 -1292936
56983 -1292936 -711642 -409852 -52831 608927 967289 302125 -1217227 -2479800 -2252661
56974 -2252661 -374905 1627944 1779626 10143 -1525615 -1226553 -151744 -161555 -941052
56965 -941052 -680353 780850 1588197 802263 -251029 -137435 827446 1643421 2113299
56956 2113299 2321073 1792753 262922 -1451984 -2235900 -1864250 -928957 -168117 -157241
56947 -157241 -831224 -1031418 398638 2652598 3366179 1683577 -371415 -566612 713050
56938 713050 1533846 1214076 561498 129215 -109496 175054 1249193 2132614 1465907
56929A465907j781310q46159J043916J557827L45561q28645p27844P9064M88763
56920G97080K09720k87264l85240J58074Q31221P35792k29994j009541p93384
56911B6464k31663m09692j078367r88628J57740J221831J296668Q56621P25180
56902A576154O85461l3833j223230j631347p03662L95495K19461q96820j201938
56893b814259j4633J260356J155805J58930k92553n0194j31172p16835p79212
56884b223767J60989J213027J419470Q31710m6178q79717j230448o86568L00120
56875a141362O59019J94408j36382J72862M14915N2639l24695j94362j08364n43734
56865i55056p76582n7826R13687R45575J92281k00007J02309L66353J43725k17216
$$ plain form
56929 1465907 -315403 -1161562 -117646 1440181 1785742 957097 229253 308317 797080
56920 797080 1006800 719536 334296 492370 1323591 2059383 1829389 819848 26464
56911 26464 -205199 -614891 -1693258 -2681886 -2524146 -1302315 -5647 850974 1576154
56902 1576154 2261615 2227782 1004552 -626795 -1330457 -934962 -715501 -1612321 -2814259
56893 -2814259 -2828892 -1568536 -412731 -253801 -546354 -596548 -727720 -1444555 -2223767
56884 -2223767 -2062778 -849751 569719 1401429 1355251 475534 -754914 -1441482 -1141362
56875 -1141362 -482343 -287935 -424317 -251455 163460 216099 -108596 -302958 -411322 -955056
56865 -955056 -1731638 -1789464 -875777 69798 262079 62072 164381 530734 674459 457243
56855D57243l89701m96675o23614n36323L530R14863J658625J398564r9444j602961
56845F84107j413021L44429J539724Q56178m20100m63781M37221P33765J60521
56836B459043k76117k57358l48345n28681k04389L86084L15046m45226r39092
56827A60965p36209k48537L24836R82559J036365j45021j541962j380987J94161
56818a353830J126087M71914m00262k37399L05628K25423j09559M3476L95217
56809D66695L85191K63459L19307L8213q61823j455219q12167N29725J313585
56800A86966J150906M95017k58846p70609n74525K10954O75201L99896J21948
56791A636908L08796J45422r32848j779964j103160L51486Q54623L46908K16664
$$ plain form
56855 457243 67542 -429133 -1052747 -1589070 -1585540 -670677 987948 2386512 2287068 684107
56845 684107 -728914 -384485 1155239 2011417 1591317 1127536 1564757 2298522 2459043
56836 2459043 2182926 1925568 1577223 1048542 844153 1230237 1545283 1100057 160965
56827 160965 -575244 -823781 -498945 483614 1519979 1374958 -167004 -1547991 -1353830
56818 -1353830 -227743 244171 -156091 -393490 -87862 137561 28002 71478 466695
56809 466695 851886 1115345 1434652 1472865 611042 -844177 -1656344 -1126619 186966
56800 186966 1337872 1832889 1574043 803434 228909 439863 1115064 1514960 1636908
56791 1636908 1945704 2091126 1158278 -621686 -1724846 -1373360 -518737 -171829 44835
56782D4835P22830O12027m80644j101308j73832J261519J450320K22916r54267
56773A604396p96558N01394J573862J241124k70740j503557j402892m95613O133
56764D57549j70506m02158m56996o77272r77008p85207j45754J79357O17Q7435
56754b889943Q20675J406113J076932L10557O7050L54181L97060l8585l41974
56745A162066j19365J48998j38226p04221o81885J06319O98549K34451p14773
56736h087q06157J26663P52727K51311l91254K4267Q66478N73813p70301j319983
56726g00523j75753J180598R17590o25581j447153n22048R93827J305931J34065
56717A060953j078944r75059J59418R55568P62941J93533j13074l17729n74365
$$ plain form
56782 44835 767665 1379692 899048 -202260 -376092 885427 2335747 2558663 1604396
56773 1604396 807838 1309232 2883094 4124218 3853478 2349921 947029 451416 457549
56764 457549 287043 -115115 -572111 -1249383 -2226391 -3011598 -3157352 -2977995 -2977378 -2889943
56754 -2889943 -2069268 -663155 413777 724334 791384 1145565 1542625 1504040 1162066
56745 1162066 1042701 1191699 1053473 349252 -332633 -226314 472235 706686 -8087
56736 -8087 -814244 -687581 65146 316457 -74797 -50530 815948 1389761 619460 -700523
56726 -700523 -876276 304322 1221912 596331 -850822 -1372870 -379043 926888 1060953
56717 1060953 -17991 -993050 -833632 121936 884877 1078410 965336 647607 73242
56708G3242l86276M17348Q91331K31929p96318q83921j43008K66425J15378K08339
56698e531O20932M45990m66771j025973o15716K9653K05163K61543O26532R00024
56688I75846O08071l5458o45988j064317q98395K06542J432886J259050k85688
56679A552549j214563l27158R94341Q94425k83685q74923m98554j90952m61432
56670d09952p17259m54755J42871O85980Q01813J74702q53449j181254k95262
56661b106565P90561Q47325J37672j81504J70177N14855M80993K69296N172j84393
56651G43589J45231J022042J505808Q94224j04656n13658o73792j325598j850715
56642a57525j163704J36933M41436k33441k70215P77825J420976O74706n21526
$$ plain form
56708 73242 -313034 104314 995645 1227574 431256 -452665 -595673 -329248 -213870 -5531
56698 -5531 615401 1061391 594620 -431353 -1047069 -1017416 -812253 -550710 75822 975846
56688 975846 1583917 1548459 902471 -161846 -1060241 -853699 579187 1838237 1552549
56679 1552549 337986 10828 1005169 1899594 1615909 740986 242432 51480 -409952
56670 -409952 -1127211 -1581966 -1439095 -753115 48698 223400 -630049 -1811303 -2106565
56661 -2106565 -1316004 -468679 -331007 -512511 -342334 172521 653514 922810 927982 743589
56651 743589 888820 1910862 3416670 4310894 4206238 3692580 3018788 1693190 -157525
56642 -157525 -1321229 -1184296 -742860 -976301 -1246516 -468691 952285 1626991 1105465
56633A105465r47170o28715j20661L36238L93432k84387r78214m51545R52533
56624f23024J359893K12442o45811K25657J579580J384172k65507j644867j869874
56615b87339j388441o76871J23515O37761N39643K17902K61698N12006L73117
56606C12991j81468n52032k86281M35997Q47056J58774j303180j804241k23292
56597b595676J837272J736263k79890j112023N07288J963902R49273q58790p18727
56588A428892O78296P03108o19993r15591K63056Q50359K8429n86545n2581M46914
56578B224344P1083l21489k32779n42178j377931j287660J56650J105010L11685
$$ plain form
56633 1105465 158295 -470420 -591081 -254843 138589 -145798 -1124012 -1575557 -623024
56624 -623024 736869 949311 303500 529157 2108737 3492909 3227402 1582535 -287339
56615 -287339 -1675780 -2352651 -2229136 -1591375 -1051732 -833830 -572132 -60126 312991
56606 312991 131523 -420509 -706790 -270793 576263 735037 -568143 -2372384 -2595676
56597 -2595676 -758404 977859 697969 -414054 93234 2057136 3006409 2147619 1428892
56588 1428892 2107188 2810296 2190303 1274712 1537768 2388127 2416556 1830011 1777430 2224344
56578 2224344 2295427 1973938 1741159 1198981 -178950 -1466610 -1309960 -204950 106735
$$ [...]
##END NTUPLES=NMR SPECTRUM
##END=
