##TITLE=31Pdec_SA_PPhvCl(toulene)
 CDCl3, 24 sc
 16.9.2019
##JCAMPDX= 6.0         $$ Bruker NMR JCAMP-DX V2.0
##DATA TYPE= NMR SPECTRUM
##DATA CLASS= NTUPLES
##ORIGIN= UXNMR, Bruker Analytische Messtechnik GmbH
##OWNER= root
$$ XWIN-NMR		Version 3.5
$$ Mon Sep 16 14:25:44 2019 Russian Standard Time (UT+4h)  she@DPX200
##.OBSERVE FREQUENCY= 81.013821
##.OBSERVE NUCLEUS= ^31P
##.ACQUISITION MODE= SIMULTANEOUS
##.ACQUISITION SCHEME= undefined
##.AVERAGES= 24
##.DIGITISER RES= 17
##SPECTROMETER/DATA SYSTEM= spect
##.PULSE SEQUENCE= zgpg30
##.SOLVENT NAME= CDCl3
##.SHIFT REFERENCE= (INTERNAL, CDCl3, 0, 182.463)
##AUDIT TRAIL= $$ (NUMBER, WHEN, WHO, WHERE, WHAT)
$$ ##TITLE= Audit trail, XWIN-NMR		Version 3.5
$$ ##JCAMPDX= 5.01
$$ ##ORIGIN= Bruker BioSpin GmbH
$$ ##OWNER= she
$$ F:/spectra/data/she/nmr/P31/1/pdata/1/auditp.txt
$$ ##AUDIT TRAIL=  $$ (NUMBER, WHEN, WHO, WHERE, WHAT)
(   1,<2019-09-16 14:24:36.40 +0400>,<she>,<DPX200>,
      <created by zg, POWCHK disabled, PULCHK disabled
       configuration hash MD5:
       00 E9 B6 7A A2 85 ED C7 34 08 36 98 17 FE 4E 26
       data hash MD5: 32K
       E0 24 32 B6 17 02 90 E5 FC 1F 6E 01 46 B2 EB 0D>)
(   2,<2019-09-16 14:24:38.93 +0400>,<she>,<DPX200>,
      <Start of raw data processing
       efp BC_mod = 2 LB = 1 FT_mod = 6 PKNL = 1 PHC0 = -496.4354 PHC1 = 368.2003 SI = 64K 
       data hash MD5: 64K
       10 0B 89 BA DB B2 3D 7E EC 28 B0 DB 69 64 6A DF>)
(   3,<2019-09-16 14:24:55.37 +0400>,<she>,<DPX200>,
      <pk PHC0 = 28.97418 PHC1 = -80.39999 
       data hash MD5: 64K
       D6 F2 98 C2 BB 47 24 89 EC F0 10 88 6F E1 1A E9>)
(   4,<2019-09-16 14:24:59.15 +0400>,<she>,<DPX200>,
      <abs ABSG = 5 
       data hash MD5: 64K
       C5 AA 7C A9 F1 56 F6 51 4A 38 12 E7 15 A2 70 E1>)
$$ ##END=
$$ 
$$ hash MD5
$$ C5 81 15 68 26 38 87 4F 00 10 97 24 06 69 42 7F
##$RELAX= 
##$RELAX= 
##$RELAX= 
##$RELAX= 
##$RELAX= 
##$RELAX= 
##$RELAX= 
##$RELAX= 
$$ Bruker specific parameters
$$ --------------------------
##$DU= <F:/spectra>
##$EXPNO= 1
##$NAME= <P31>
##$PROCNO= 1
##$TYPE= <nmr>
##$USER= <she>
##$AMP= (0..31)
100 100 100 100 100 100 100 100 100 100 100 100 100 100 100 100 100 100 
100 100 100 100 100 100 100 100 100 100 100 100 100 100 
##$AQSEQ= 0
##$AQ_mod= 1
##$AUNM= <au_zg>
##$AUTOPOS= <>
##$BF1= 81.014009
##$BF2= 200.13
##$BF3= 200.13
##$BF4= 200.13
##$BF5= 200.13
##$BF6= 200.13
##$BF7= 200.13
##$BF8= 200.13
##$BYTORDA= 1
##$CFDGTYP= 0
##$CFRGTYP= 5
##$CHEMSTR= <none>
##$CNST= (0..31)
1 1 145 1 1 1 1 1 1 1 1 1 1 1 1 1 1 1 1 1 1 1 1 1 1 1 1 1 1 1 1 1 
##$CPDPRG= <waltz16>
##$CPDPRG1= <>
##$CPDPRG2= <waltz16>
##$CPDPRG3= <>
##$CPDPRG4= <mlev>
##$CPDPRG5= <mlev>
##$CPDPRG6= <mlev>
##$CPDPRG7= <mlev>
##$CPDPRG8= <mlev>
##$CPDPRGB= <>
##$CPDPRGT= <>
##$D= (0..31)
0 1 0 0 0 0 0 0 0 0 0 0.03 2e-05 3e-06 0 0 0 0 0 0 0 0 0 0 0 0 0 0 0 0 
0 0 
##$DATE= 1568629475
##$DBL= (0..7)
120 120 120 11 120 120 24 19 
##$DBP= (0..7)
150 150 150 150 150 150 150 150 
##$DBP07= 0
##$DBPNAM0= <>
##$DBPNAM1= <>
$$ [...]
##$SUBNAM3= <"">
##$SUBNAM4= <"">
##$SUBNAM5= <"">
##$SUBNAM6= <"">
##$SUBNAM7= <"">
##$SUBNAM8= <"">
##$SUBNAM9= <"">
##$SW= 369.568048894756
##$SWIBOX= (0..15)
0 1 3 0 0 0 0 0 0 0 0 0 0 0 0 0 
##$SW_h= 29940.119760479
##$TD= 32768
##$TD0= 1
##$TE= 0
##$TE2= 300
##$TE3= 300
##$TEG= 300
##$TL= (0..7)
0 120 53 12 22 120 120 120 
##$TP= (0..7)
150 150 150 150 150 150 150 150 
##$TP07= 0
##$TPNAME0= <>
##$TPNAME1= <>
##$TPNAME2= <>
##$TPNAME3= <>
##$TPNAME4= <>
##$TPNAME5= <>
##$TPNAME6= <>
##$TPNAME7= <>
##$TPOAL= (0..7)
0.5 0.5 0.5 0.5 0.5 0.5 0.5 0.5 
##$TPOFFS= (0..7)
0 0 0 0 0 0 0 0 
##$TUNHIN= 0
##$TUNHOUT= 0
##$TUNXOUT= 0
##$USERA1= <user>
##$USERA2= <user>
##$USERA3= <user>
##$USERA4= <user>
##$USERA5= <user>
##$V9= 5
##$VALIST= <valist>
##$VCLIST= <CCCCCCCCCCCCCCC>
##$VD= 0
##$VDLIST= <DDDDDDDDDDDDDDD>
##$VPLIST= <PPPPPPPPPPPPPPP>
##$VTLIST= <TTTTTTTTTTTTTTT>
##$WBST= 1024
##$WBSW= 4
##$XGAIN= (0..3)
0 0 0 0 
##$XL= 0
##$YL= 0
##$YMAX_a= 5915
##$YMIN_a= -6096
##$ZGOPTNS= <>
##$ZL1= 120
##$ZL2= 120
##$ZL3= 120
##$ZL4= 120
##$ABSF1= 182.463
##$ABSF2= -187.1042
##$ABSG= 5
##$ABSL= 3
##$ALPHA= 0
##$AQORDER= 0
##$ASSFAC= 0
##$ASSFACI= 0
##$ASSFACX= 0
##$ASSWID= 0
##$AUNMP= <proc_1d>
##$AZFE= 0.1
##$AZFW= 0.5
##$BCFW= 0
##$BC_mod= 2
##$BYTORDP= 0
##$COROFFS= 0
##$CY= -3
##$DATMOD= 1
##$DC= 0
##$DFILT= <>
##$DTYPP= 0
##$F1P= 0
##$F2P= 0
##$FCOR= 1
##$FTSIZE= 65536
##$FT_mod= 6
##$GAMMA= 0
##$GB= 0
##$INTBC= 1
##$INTSCL= 5.30512e-09
##$ISEN= 30
##$LB= 1
##$LEV0= 0
##$LPBIN= 0
##$MAXI= 10000
##$MC2= 0
##$MEAN= 0
##$ME_mod= 0
##$MI= 50
##$NCOEF= 0
##$NC_proc= -6
##$NLEV= 6
##$NOISF1= 182.463
##$NOISF2= 159.3651
##$NSP= 0
##$NTH_PI= 0
##$NZP= 0
##$OFFSET= 182.463
##$PC= 4
##$PHC0= -467.4612
##$PHC1= 287.8003
##$PH_mod= 1
##$PKNL= yes
##$PPARMOD= 0
##$PSCAL= 0
##$PSIGN= 0
##$REVERSE= no
##$SF= 81.0140089999434
##$SI= 65536
##$SIGF1= 159.3651
##$SIGF2= -187.1042
##$SINO= 113.3802
##$SIOLD= 16384
##$SREGLST= <1H.CDCl3>
##$SSB= 0
##$STSI= 65536
##$STSR= 0
##$SW_p= 29940.119760479
##$SYMM= 0
##$S_DEV= 0
##$TDeff= 32768
##$TDoff= 0
##$TI= <>
##$TILT= no
##$TM1= 0
##$TM2= 0
##$TOPLEV= 0
##$USERP1= <user>
##$USERP2= <user>
##$USERP3= <user>
##$USERP4= <user>
##$USERP5= <user>
##$WDW= 1
##$XDIM= 65536
##$YMAX_p= 289684042
##$YMIN_p= -33451456
$$ End of Bruker specific parameters
$$ ---------------------------------
##NTUPLES= NMR SPECTRUM
##VAR_NAME=  FREQUENCY,     SPECTRUM/REAL,   SPECTRUM/IMAG
##SYMBOL=    X,             R,               I
##VAR_TYPE=  INDEPENDENT,   DEPENDENT,       DEPENDENT
##VAR_FORM=  AFFN,          ASDF,            ASDF
##VAR_DIM=   65536,         65536,           65536
##UNITS=     HZ,            ARBITRARY UNITS, ARBITRARY UNITS
##FACTOR=    0.456856943014862, 1,           1
##FIRST=     14782.0589164792, 0,            0
##LAST=      -15158.0608439998, 0,           0
##MIN=       -15158.0608439998, -33451456,   0
##MAX=       14782.0589164792, 289684042,    0
$$ Real data points
##PAGE= N=1
##DATA TABLE= (X++(R..R)), XYDATA
$$ [...]
43468 2096898 3606594 4700909 4367595 2091690 -918705 -2699399 -2638735 -1779247 -1194878
43459 -1194878 -934004 -565643 -12783 370200 176619 -644420 -1561783 -1848256 -1437543
43450 -1437543 -1044882 -1081146 -902011 288631 2151535 3511050 3701357 2917665 1437768
43441 1437768 -646237 -2868144 -4346928 -4584317 -3866939 -2839552 -2146651 -2342002 -3388926
43432 -3388926 -4256981 -3898650 -2782323 -2521778 -3702464 -5101310 -5529507 -5307964 -5114247
43423 -5114247 -4514586 -2914698 -1139516 -541305 -990526 -1321470 -1499947 -2544855 -4180966
43414 -4180966 -4542321 -2962356 -1338021 -1560901 -2970187 -3716495 -3496223 -3276393 -3099900
43405 -3099900 -2074498 -346117 727747 665706 658276 1788586 3618731 5065585 5674829
43396 5674829 5458916 4378028 2683976 1130359 199921 -394454 -962825 -1143833 -503506
43387 -503506 619014 1398426 1364969 671075 -25569 281595 2161120 4610684 5491807
43378 5491807 3901878 1526834 714698 1648971 2464975 1884303 549152 -298508 -304378
43369 -304378 194255 897935 1525349 1736440 1607321 1647175 1873732 1474556 34867 -1447934
43359 -1447934 -1694483 -1009699 -942942 -2009813 -2916226 -2614816 -2082454 -2937070 -4876772
43350 -4876772 -5905635 -5087016 -3643790 -2878757 -2405940 -1426146 -574607 -993381 -2213016
43341 -2213016 -2645557 -2037223 -1758542 -2437133 -2943545 -2322122 -1228338 -569003 -65535
43332 -65535 675327 816838 -519297 -2456578 -3261432 -2666257 -1924841 -1765062 -1628413
43323 -1628413 -941851 89234 1111253 1988814 2370400 1848996 746095 -117345 -535561
43314 -535561 -922547 -1161338 -521119 1003902 2271924 2322165 1341572 54171 -974543
43305 -974543 -1179171 -182628 1395417 2265622 2087836 1804034 1865926 1299495 -618915
43296 -618915 -2816766 -3671884 -3023824 -1817493 -473781 1026682 1919547 1112133 -1005064
43287 -1005064 -2471482 -1916622 -50827 1261282 827848 -1058306 -3017915 -3679588 -2866719
43278 -2866719 -1713396 -1238507 -1123170 -512137 434665 821244 597315 606582 998309 915777
43268 915777 107505 -496429 -458438 -782054 -2206614 -3694788 -3924197 -3408329 -3548463
43259 -3548463 -4102750 -3441680 -1340884 350052 391284 -199551 -182671 -225149 -1405594
43250 -1405594 -2698776 -2059435 296103 1880976 1602037 1339030 2792532 4595986 4349524
43241 4349524 2291307 739659 434079 -135278 -1542733 -2032937 -427828 1542892 1522334
43232 1522334 -120948 -1046713 -297628 941376 1583685 1800256 1877615 1619743 1267639
43223 1267639 1524757 2141327 1870603 530605 -240216 741363 2342746 2730046 1909986
43214 1909986 1284311 1341726 1350888 1069458 1164253 1769142 2016497 1441444 751671 716943
43204 716943 1230530 1921231 2716886 3215805 2498243 430162 -1633035 -2406848 -2290470
43195 -2290470 -2378581 -2496647 -1625357 -33095 583985 -604160 -2428618 -3376509 -3235417
43186 -3235417 -2486290 -1227360 320284 1140538 488442 -815607 -1266046 -603648 102767
43177 102767 68361 -533932 -1349683 -2164663 -2408631 -1488582 81807 889381 374652 -470809
43167 -470809 -560093 -23875 395936 440590 245654 -126366 -482426 -498001 -470394 -1309346
43157 -1309346 -3087563 -4376962 -3932834 -2434411 -1581405 -1906438 -2426347 -2098102 -712785
43148 -712785 1315098 3154301 3880805 3424566 2757079 2335045 1146174 -1478853 -3978042
43139 -3978042 -4278575 -2863031 -1997680 -2129854 -1572202 -99201 10871 -2154064 -3815960
43130 -3815960 -2221596 1160105 2674233 1570595 407297 839091 1657336 1344864 332008
43121 332008 -159182 77237 563167 1220686 2208040 3246853 3742359 3315140 2074788
43112 2074788 702005 61935 151127 -215092 -1791386 -3397151 -3284440 -1743090 -705518
43103 -705518 -656169 153136 2692303 5202524 5585523 4342867 3494983 3498970 3044057 1538201
43093 1538201 74205 -243190 344947 837714 497723 -819084 -2466560 -3097767 -1957003
43084 -1957003 -255022 -174902 -2068844 -3662336 -2803394 -248378 1264178 363611 -1525554
43075 -1525554 -2156450 -979493 769541 1911195 2410772 2609502 2260441 1078880 -162983
43066 -162983 -211939 771907 991940 -583757 -2518543 -2758145 -1537687 -867012 -1279074
43057 -1279074 -1006663 926708 2584444 1622347 -1145773 -2571361 -1302086 703191
43049 703191 1120743 135467 -494518 -61994 643655 920276 901753 832418 716774 843953
43039 843953 1611351 2415717 1745515 -769458 -3121252 -2909699 -365072 1753371 1411801
43030 1411801 -604871 -2196494 -2434809 -1783424 -769562 347803 957778 361231 -1234665
43021 -1234665 -2794822 -3570818 -3461531 -2475800 -870762 194818 -567960 -2708457 -4060821
43012 -4060821 -3297179 -1509021 -532703 -667480 -984290 -987841 -744748 -29905 1236837
43003 1236837 2048347 1256442 -590370 -1720905 -1550708 -1246735 -1603825 -1800681 -980303
42994 -980303 117690 98850 -1204029 -2630099 -3021836 -2093289 -497660 469455 -141717
42985 -141717 -1678484 -2259868 -1029857 636667 909778 -204825 -1277575 -1575712 -1643282
42976 -1643282 -2033336 -2556606 -2812122 -2663403 -2208139 -1882257 -2311700 -3319340 -3486386
42967 -3486386 -1727401 964128 2492511 2253453 1529511 1336988 1298551 919265 525317
42958 525317 332433 -126197 -890925 -1089694 -436261 -44847 -637937 -1031838 121745
42949 121745 1865097 1958234 140568 -1339812 -707664 1266954 2675099 2739794 1993357
42940 1993357 1173742 836419 1416593 2717462 3636127 3266369 2180964 1807001 2438411
42931 2438411 2685116 1302746 -1092118 -2808731 -3162636 -2878112 -2539922 -1784549 -473572
42922 -473572 401424 -10609 -896392 -738438 487914 1361199 1229759 988518 1336169
42913 1336169 1690447 1549714 1607575 2404601 2918833 1907981 52337 -707958 194630
42904 194630 1291716 1165701 124884 -521925 -116760 769839 1035786 189199 -1062022
42895 -1062022 -1585643 -1285827 -1121031 -1354986 -892641 728460 1832558 683724 -1628900
42886 -1628900 -2264981 -376592 2108703 3503873 4166356 4824718 5084863 4593485 4103308
42877 4103308 4213571 4274416 3656070 3013566 3131232 3437337 2846940 1378245 -80407
42868 -80407 -929963 -919887 91209 1445167 1645611 161249 -1495403 -1611730 -393097
42859 -393097 901570 1940292 2956178 3343902 2433929 1030447 313339 -222276 -1664074
42850 -1664074 -3030875 -2254857 205149 1468458 482240 -594341 -279851 -201207 -1840196
42841 -1840196 -3453050 -2879476 -1540038 -2452853 -5181675 -6018584 -3205354 945494 3650722
42832 3650722 4692458 4908170 4211647 2797744 2314486 3684073 5038071 4074160 1684675
42823 1684675 813724 1906032 2107228 -290539 -2945195 -2576560 569537 3266591 3522353
42814 3522353 2363059 1638779 1841499 2430040 2887660 2860054 2270067 1818879 2459236
42805 2459236 3901140 4621035 3922179 2918148 2676814 2524428 1437152 202516 505082
42796 505082 2171168 3051345 1922353 75264 -584429 77622 726420 524508 -79890
42787 -79890 -307809 -115041 -110389 -591098 -939978 -360259 770379 978365 -370748 -1872832
42777 -1872832 -1672141 198217 2011907 2497197 1681056 -62967 -2357117 -4172321 -4328851
42768 -4328851 -3048639 -1775015 -1097843 -195036 1205735 1862254 943317 -415665 -684043
42759 -684043 -57389 234910 -60055 -206961 69258 401302 738383 1326845 1840596 1498855
42749 1498855 109690 -1599113 -2637788 -2458717 -1408334 -720064 -1342415 -2479022 -2357751
42740 -2357751 -943644 -426787 -1997273 -3735067 -3378557 -1783805 -1383437 -2202606 -2134769
42731 -2134769 -848606 -469315 -1871298 -3039302 -2311858 -1019608 -1323075 -3070224 -4453946
42722 -4453946 -4636492 -4156492 -3529421 -2867438 -2400160 -2239494 -1997105 -1433444 -953963
42713 -953963 -777520 -365682 535221 1151911 948991 751358 1416717 2183594 1755397 443079
42703 443079 -331242 -325175 -614704 -1487258 -1871514 -1171737 -125008 685608 1670571 2777536
42693 2777536 2650651 589896 -1661212 -1776361 -118868 602428 -789033 -2075379 -689193
42684 -689193 2536294 4256123 2959891 771108 383710 1578746 1993576 603236 -1089898
42675 -1089898 -1339111 -247794 949150 1675006 2248415 2882169 3271755 3033344 2032801
42666 2032801 430847 -1183617 -1906914 -1263093 185840 1318968 1557068 1266753 1115741
42657 1115741 1266092 1292564 842086 248462 243314 957380 1595611 1466790 930150 730987
42647 730987 810140 654135 514779 1092501 2054188 2230056 1538852 1282011 2002354 2558804
42637 2558804 2183367 1933465 2815390 3812557 3451274 2327257 2168798 2971430 3045633
42628 3045633 1744790 245802 -531333 -1004220 -1509043 -1408956 -351312 786832 994227
42619 994227 401252 -42515 435907 1891522 3344689 3076744 383686 -2874638 -3809756
42610 -3809756 -1940857 230261 565930 -222047 -248087 768746 1640370 1653442 1035455
42601 1035455 48192 -1146991 -2013843 -2086376 -1770236 -1909686 -2699303 -3648234 -4332782
42592 -4332782 -4499440 -3742768 -1945633 9738 735179 -270320 -2133052 -3581504 -4107147
42583 -4107147 -4129874 -4266035 -4591213 -4737071 -4715611 -5160217 -6221637 -6692063 -5252787
42574 -5252787 -2478811 -419546 -41495 -346754 -334773 -371357 -928560 -1436379 -1419467 -1449968
42564 -1449968 -1771136 -1322833 306120 1202969 -552088 -3665922 -4949781 -3591531 -1960104
42555 -1960104 -2067031 -3311657 -4181932 -4273365 -3859748 -3065349 -2358141 -2593219 -3741131
42546 -3741131 -4629391 -4540090 -3913367 -2992079 -1295864 733191 1246871 -412709 -1979307
42537 -1979307 -928460 1961389 3591330 2650804 844057 40991 100880 67309 -62936
42528 -62936 253193 939158 1556396 2155451 2975307 3620522 3370057 2239901 1055749
42519 1055749 378212 -71079 -671648 -1078948 -631259 600245 1728877 2129848 2084601
42510 2084601 2009293 1532100 81154 -1721870 -2167739 -432072 2092242 3072562 1703916
42501 1703916 -578636 -1797681 -1374156 -266479 398895 436036 401863 678474 1057625
42492 1057625 1179807 1046937 894056 733353 306124 -498152 -1297356 -1306895 112663 2665175
42482 2665175 4842896 5002500 3114355 1017668 456300 1249104 1920427 1606085 524276
42473 524276 -931127 -2367275 -2860361 -1628352 536943 1766639 1446245 861560 1033856
42464 1033856 1234269 485108 -710374 -1307445 -1373434 -1427701 -918105 1014157 3589457
42455 3589457 4841707 4120928 2808032 2321745 2609728 2908532 2858332 2412412 1621243
42446 1621243 1005932 1272325 2126529 2195896 737471 -1286261 -2442930 -2438282 -1830880
42437 -1830880 -928433 50662 318389 -700804 -2086880 -2209149 -1017812 -357973 -1416084
42428 -1416084 -2879123 -2613546 -549674 1286608 1449446 574009 -66211 -377165 -1044668
42419 -1044668 -2042367 -2555195 -2175464 -1305498 -393286 458586 1075992 1221170 1241213 1926487
42409 1926487 3316085 4314280 4021313 2922890 2212234 2371106 2975867 3495791 3653311
42400 3653311 3305355 2607295 2061230 1798065 1076730 -779353 -3092191 -4257557 -3542023
42391 -3542023 -1834164 -505753 -72460 -107770 7774 451324 792221 438547 -524940
42382 -524940 -1175340 -858734 -164209 -105284 -516831 -198900 1176597 2208825 1362179
42373 1362179 -1102621 -3352992 -3948503 -3211502 -2661668 -3218196 -4054993 -3544541 -1503774
42364 -1503774 87359 -679225 -3067511 -4384477 -3223350 -949866 320954 172200
42356 172200 -298538 -253544 172769 520339 555752 247954 -287488 -761535 -818859 -163510
42346 -163510 1301199 3127900 4272544 4012588 2951783 2428198 2827153 3255669 3019099
42337 3019099 2423872 1769864 713648 -622845 -1017079 240500 1891543 2180721 1298744
42328 1298744 991073 1960363 3102030 3454785 3515828 4056880 4706598 4527325 3427444
42319 3427444 2301128 2022231 2703006 3666517 3832463 2470126 3854 -2077512 -2470620
42310 -2470620 -1235855 360421 1047165 523304 -506701 -1020536 -507927 641900 1537247
42301 1537247 1661668 1369025 1433367 2094074 2676033 2334449 1139440 82132 -189520
42292 -189520 -237942 -929707 -1955859 -2084821 -925567 507893 1357081 2052492 3101147
42283 3101147 3609113 2327271 -114700 -1448723 -589467 921431 987195 -337107 -1162805
42274 -1162805 -418091 893594 1260703 572838 -182267 -567104 -1054329 -1779206 -2024553
42265 -2024553 -1503320 -1269336 -2366858 -4086465 -4731294 -3921893 -2888414 -2434592 -2018901
42256 -2018901 -1276081 -999555 -1671044 -2147096 -1047258 1189049 2761472 2647742 1370521
42247 1370521 -21992 -908005 -1317207 -1871329 -3128611 -4487970 -4448603 -2635898 -701202
42238 -701202 -285107 -990408 -1486731 -1600581 -1787882 -1463445 142675 1920654 1796065
42229 1796065 -251123 -1967384 -1812469 -464546 764314 1204789 368867 -1749766 -3438725
42220 -3438725 -2378120 1197775 4260868 4753480 3832941 3515932 4027853 4660831 5344250
42211 5344250 5826025 4954674 2478737 175190 -470440 -355460 -818723 -1049344 464566
42202 464566 3058204 4748881 5130083 5111933 4517810 2515655 71284 -776276 -236381
42193 -236381 -696386 -2769813 -4003839 -2629374 -317890 376517 -429898 -776652 -38642
42184 -38642 685015 852654 1295936 2519704 3504268 2882686 763140 -1220681 -1644433
42175 -1644433 -757861 -60071 -611241 -2117598 -3585095 -4261718 -3831373 -2524046 -1480139
42166 -1480139 -2103405 -4263069 -5901903 -5364961 -3439379 -2083705 -1881269 -1988929 -1891883
42157 -1891883 -1672685 -1046824 154716 806308 -395828 -2603433 -3348016 -1656598 909107
42148 909107 2530010 2882881 2424997 1632749 1352860 2283292 3637715 3855262 2953122
42139 2953122 2451510 2680318 2287829 1048539 789147 2321409 3673064 2998859 1364097
42130 1364097 808809 1240376 1200336 452248 -118833 -208526 -5940 639167 1468837 1383115
42120 1383115 240648 -323264 438853 635643 -1112110 -2556756 -897286 2317944 2935257
42111 2935257 347750 -1767421 -1061379 719776 1390456 1352088 1514624 1138056 -315618
42102 -315618 -1437520 -1003933 -170266 -665011 -2128045 -2938634 -2558727 -1525070 -187632
42093 -187632 1037700 1134756 -269041 -1873508 -2257751 -1726443 -1379911 -1218302 -611537
42084 -611537 70326 -120615 -1052855 -1713194 -1824806 -1994542 -2410514 -2544251 -2057141 -1048351
42074 -1048351 406413 2053514 3076979 2879239 2019812 1493071 1400154 1273139 1264564
42065 1264564 1790204 2258399 1543483 -185968 -1356914 -997022 148650 774248 406718
42056 406718 -557799 -1310446 -889452 1077797 3509551 4589253 3816618 2608456 2363908
42047 2363908 2657754 2049539 154435 -1951013 -3238131 -3850657 -4500245 -5261870 -5461186
42038 -5461186 -4697534 -3545082 -2978467 -3348031 -4283168 -5375112 -6332968 -6542808 -5379179
42029 -5379179 -3317731 -1935360 -2190684 -3280606 -3776216 -3289539 -2368848 -1397763 -451776
42020 -451776 262679 703836 1280629 2012004 1976977 609042 -1041250 -1512688 -861205
42011 -861205 -97856 629423 1587168 1767074 -70156 -2675020 -3166265 -1245698 -31449
42002 -31449 -1438828 -3165087 -2280737 157171 742295 -1160860 -2813237 -2404707 -1264249
41993 -1264249 -1201274 -1869600 -1925307 -1279249 -824847 -710030 -126010 1332133 2874961
41984 2874961 3233041 1965967 62912 -878467 -331036 511650 227928 -948256 -1508020
41975 -1508020 -843286 -17387 -43022 -406999 -90738 639572 541073 -677900 -1782302
41966 -1782302 -1678691 -907097 -869259 -1941899 -3024960 -2922518 -1593514 70118 1126831
41957 1126831 995509 -368220 -2139063 -2950499 -2263633 -1054764 -417587 6683 1094310
41948 1094310 2191383 1691209 -224509 -1293474 -327074 1131471 1416887 1229613 1829314
41939 1829314 2320220 1090932 -991121 -1506392 -353819 27793 -1315043 -2258869 -1099050
41930 -1099050 654522 577459 -1248257 -2857579 -3255329 -2886435 -2075794 -807863 243304
41921 243304 58169 -1225388 -2200183 -1670222 384852 2993320 4585439 3738250 671317
41912 671317 -2240262 -2637028 -904319 282949 -767280 -2944851 -4023239 -3222034 -1608347
41903 -1608347 -600967 -645375 -1122160 -1204811 -786904 -488176 -663770 -787364 -225230 737706
41893 737706 1249009 1005667 326338 -702209 -2309732 -4215958 -5498611 -5560249 -4717446
41884 -4717446 -3623308 -2515920 -1232366 275272 1536321 1690196 378599 -1367659
41876 -1367659 -1851291 -821664 -63268 -1049551 -2856290 -3625266 -3320514 -3331353 -3777167
41867 -3777167 -3259582 -1426229 250363 787601 893711 1114438 689490 -641547 -1485251
41858 -1485251 -888894 -48713 -299301 -774074 46825 1583822 2074178 1476479 1240456
41849 1240456 1605984 1436085 704341 815734 1986039 2432137 1069200 -698657 -950977
41840 -950977 291603 1629162 2258102 2345185 2193416 1997412 1966754 2016936 1720649 956259
41830 956259 125279 -470624 -793367 -511445 742673 2320578 2925298 2480658 2380865
41821 2380865 3201535 3521254 2123921 193737 -149229 1230006 2502769 2428560 1536201
41812 1536201 936646 1156185 2117774 3286386 3834980 3442270 2770226 2461153 2109983
41803 2109983 1179962 431010 1116196 2952760 4271535 4237969 3592578 2981634 1912799
41794 1912799 -108657 -2496300 -4217159 -4709153 -3863146 -2064905 -579936 -730390 -2102730
41785 -2102730 -2692312 -1551024 -130116 -4832 -424149 392729 2265659 3130572 2011763
41776 2011763 274757 -500110 -549712 -1045231 -2085123 -2586258 -1883508 -584028 297326
41767 297326 517711 596037 843930 835845 21414 -1401920 -2602696 -3013781 -2666706 -1642011
41757 -1642011 128651 2172961 3288299 2819499 1783075 1795032 2861337 3171273 1520755
41748 1520755 -791980 -1295243 652771 2995710 3349533 1675030 79596 220756 1577616
41739 1577616 2444668 2033125 1073637 630330 925856 1360524 1258443 518891 -200762
41730 -200762 -55758 863568 1217199 -94651 -2208473 -2966527 -1555390 409098 930739
41721 930739 -22569 -898304 -599893 701204 2263230 3268585 2909343 1095267 -862555
41712 -862555 -1283871 -148963 713818 -88273 -1706523 -2166542 -934844 362686 -78653
41703 -78653 -2013473 -3365009 -2689716 -918159 -102170 -683674 -974397 335883 2178556
41694 2178556 2533726 1201963 -57877 57150 1068988 1896825 2149053 1839954 937899
41685 937899 -80846 -111942 1181950 2389816 1805625 -311938 -1911000 -1678716 -477538
41676 -477538 196371 403920 1464484 3679958 5490945 5454059 4249842 3696258 4115859
41667 4115859 3982609 2367073 363645 -634875 -849475 -1150344 -1198910 -130788 1490371
41658 1490371 2171262 1785602 1591698 1844249 1320003 -189335 -834128 643976 2680781
41649 2680781 2747938 486327 -2310421 -3999978 -4066071 -2584056 -280105 1265904 977306
41640 977306 -230702 -526303 403981 1200898 1000173 414110 196532 212315 156993 236034
41630 236034 546289 532854 -361029 -1898929 -3191198 -3356848 -2163387 -528571 -127310
41621 -127310 -1653444 -3609823 -3833522 -2204302 -683179 -536909 -900859 -603913 -11075
41612 -11075 -40825 -427086 -245467 445374 757532 486238 303466 478426 469285 31778
41602 31778 -98342 907359 2797071 4290460 4196167 2488906 497063 -81444 1266563
41593 1266563 3246524 3985585 2947397 1372491 788778 1411970 2186443 2120348 1211388
41584 1211388 84447 -862483 -1610431 -2006424 -1673815 -716011 -112426 -852631 -2662467
41575 -2662467 -4001094 -3531806 -1510253 331234 314888 -1563474 -3490878 -3617743 -2055446
41566 -2055446 -608438 -383260 -509318 191802 1197976 1090531 -210208 -1401360 -1805321
41557 -1805321 -2011946 -2411176 -2464439 -1842568 -1135711 -947853 -1213839 -1736262 -2438785 -2863458
41547 -2863458 -2504414 -1821028 -1657981 -1541179 -219163 1762580 2099431 219944 -1402773
41538 -1402773 -828249 527657 510692 -252955 140309 1366706 1625862 875102 459162
41529 459162 209559 -1058272 -2508777 -2020271 -141418 31892 -2281550 -4053279 -3134465
41520 -3134465 -1354683 -1010639 -1023778 797351 3675836 4959733 4191263 3386769 3735894
41511 3735894 4329964 4051281 2841061 1092959 -682734 -1634856 -1296564 -356558 408015
41502 408015 1449101 3339972 4988513 4787590 3279145 2676472 3582660 4169103 3178666
41493 3178666 1877079 1996182 3232489 4086373 4129912 4002813 3736907 2572655 491682
41484 491682 -1216906 -1372749 -270548 817774 1152840 1034803 904592 559551 -365434
41475 -365434 -1526079 -2088438 -1711752 -719966 582347 1935213 2470797 1208923 -1310384
41466 -1310384 -2979851 -2483386 -800300 411777 870138 1055089 712991 -422927 -1238541
41457 -1238541 -482358 955297 967374 -570660 -1480898 -500963 1035833 1375416 511924
41448 511924 -667984 -1878518 -2958067 -3097360 -1773004 271705 1878164 2633135 2567553
41439 2567553 1680547 560332 416893 1422758 1939105 631844 -1371062 -1790408 -209802
41430 -209802 1531733 1706164 229353 -2027358 -4205201 -5566460 -5641677 -4645049 -3249884
41421 -3249884 -1899809 -727644 115413 604005 948003 924683 -322365 -2811466 -4577751
41412 -4577751 -3481345 -169903 2230578 1791943 -125266 -1060547 -523571 117403 -37293
41403 -37293 -476965 -474663 -181416 -267168 -972102 -1732161 -1594203 -81804 2137478 3601976
41393 3601976 3415783 2251384 1711335 2616317 4119027 4630630 3517806 1717695 637257
41384 637257 602780 626963 -284353 -1898512 -3050796 -2985720 -2087467 -1297108 -1098657 -1218800
41374 -1218800 -1180341 -919060 -701929 -507361 132604 1357926 2358145 2163950 1026697
41365 1026697 263313 540603 1130993 1280422 1392792 2038137 2566397 1901665 326588
41356 326588 -793016 -950846 -863220 -785181 75959 1856424 3062006 2409587 835944
41347 835944 432023 1721653 3156473 3270049 2250354 1114127 282950 -374804 -652470
41338 -652470 24075 1750220 3803710 5300855 5876566 5598890 4582954 3037361 1483925
41329 1483925 442051 -162669 -858737 -1751112 -2225603 -1852493 -1189774 -1158711 -1811336
41320 -1811336 -2282761 -1925536 -939165 155439 1027889 1300721 471630 -1353080 -3046494
41311 -3046494 -3500731 -3002216 -2894990 -3758272 -4617513 -4377237 -3406236 -2915898 -3114706
41302 -3114706 -3055034 -2409091 -2191342 -3048528 -3880300 -3319922 -1914021 -1387995 -2002976
41293 -2002976 -2228115 -1202335 91986 675098 1035737 1774305 2123564 1172841 -343210
41284 -343210 -898591 -275010 443808 514549 -12129 -1000572 -2123158 -2441715 -1418604
41275 -1418604 -44759 350911 75884 409287 1305285 1499086 809771 432390 706770
41266 706770 529675 -492088 -1215288 -1071347 -1130631 -1951994 -2113105 -351274 2222696
41257 2222696 3635768 3676039 3413199 3073461 2182662 1185276 1038403 1378572 804178
41248 804178 -874490 -2098750 -1602151 95249 1535467 1801816 930784 -369881 -1155659
41239 -1155659 -980507 -361357 -78770 -94528 243063 945746 1028192 -311450 -2481284
41230 -2481284 -3732738 -2710902 76690 2485117 2882239 1941425 1551644 2108585 2185215
41221 2185215 1119450 236750 566164 971671 107692 -1034927 -459899 1743760 3618626
41212 3618626 4161689 3902660 2925998 573882 -2551725 -4375161 -3967540 -2861151 -2943055
41203 -2943055 -4255848 -5569113 -5988505 -5299209 -3714881 -1960563 -793175 22225 1423182
41194 1423182 3450593 4971407 5328919 5103698 4786169 3971476 2561689 1539836 1626259
41185 1626259 2148062 2156811 1811197 1768888 2008345 2143976 2198260 2232651 1912177 1218011
41175 1218011 846151 1118179 1334570 1076945 1203527 2409506 3635574 3269502 1374628
41166 1374628 -595658 -1813673 -2414992 -2248172 -943338 761989 1341365 488770 -467259
41157 -467259 -576234 -504571 -1182128 -2257549 -2710350 -2315835 -1711202 -1395085 -1293052 -1073573
41147 -1073573 -436781 677326 1790964 2064509 1192569 -53488 -578938 -152253 526811
41138 526811 849965 940095 1183679 1548340 1687966 1540464 1460273 1725151 2169294 2429420
41128 2429420 2406876 2340656 2453101 2610230 2418684 1771139 1212207 1364236 1866243 1530687
41118 1530687 86423 -966356 -283382 1141665 1261534 142556 -138911 1091129 2161474
41109 2161474 2245004 2840937 4628707 5621100 4741832 4576008 7428283 10974682 11663067
41100 11663067 10448929 10619101 11614395 10590200 9118347 11731152 17883565 23296190
41092 23296190 30747381 49616854 78879595 99328570 92655848 64061050 36277410
41085 36277410 23350401 20012851 16232267 11072376 8504639 8433885 8143033 7640559
41077 7640559 8134414 8367740 6795910 4843529 4336403 4080229 2413044 855543 1632280
41068 1632280 3421365 3178480 860821 -1041718 -1641534 -2079770 -2598144 -2357305 -1800456
41059 -1800456 -2255922 -3242316 -2802120 -667231 1197303 1422083 626439 -162457 -658180
41050 -658180 -740023 -392388 -334446 -1222795 -2262012 -2102025 -1016151 -621763 -1467061 -2429214
41040 -2429214 -2520439 -1825732 -671959 659797 1422720 1083486 456799 659330 1095741
41031 1095741 248362 -1586962 -2417223 -1720755 -1337794 -2390640 -3348987 -2479174 -613386
41022 -613386 123511 -710344 -1774452 -2199232 -2382111 -2658240 -2492693 -1339905 449961
41013 449961 1962836 2575536 2172755 749539 -1664124 -4361340 -5671918 -4289843 -1129825
41004 -1129825 1174110 1347518 1076318 2386958 4316855 3974531 677109 -2872014 -3920155
40995 -3920155 -2550187 -606549 721732 1226229 831583 -199475 -819963 -185051 1141717
40986 1141717 1897428 1842005 1850283 2300979 2340328 1193756 -419513 -909747 246983 1866737
40976 1866737 2606715 2545724 2583143 2743604 2207914 1019425 398137 797840 938647 -240715
40966 -240715 -1782517 -2165686 -1645230 -1528438 -1746086 -1053107 472931 1089348 -30817
40957 -30817 -1552860 -2063396 -2049515 -2810246 -4270701 -4911498 -3606611 -936123 1306475
40948 1306475 1830531 1156251 917339 1676422 2210579 1568425 739121 996177 1573121
40939 1573121 827304 -919211 -1849983 -1662190 -1710779 -2076838 -1158653 1085143 2065699
40930 2065699 92710 -3095820 -4804944 -4599663 -3551200 -2005448 35629 1572011
40922 1572011 1550045 456379 -419375 -593297 -210199 674421 1472387 911662 -1141538
40913 -1141538 -2810915 -2506262 -970371 267182 1110504 2018343 2383367 1727162 1189572
40904 1189572 1687956 1844623 152458 -1959527 -2020963 -608564 -421062 -1727258 -2137772
40895 -2137772 -1045582 -750463 -2245571 -3186825 -1661236 747690 1570761 957593 570376
40886 570376 707622 592279 279116 349463 596240 657375 1118810 2413455 3424005 2855807
40876 2855807 1424442 989245 1820234 2357775 1655823 550693 139395 380422 722251
40867 722251 1166707 1994839 2893160 3013383 1951944 399661 -390513 154982 1380051
40858 1380051 2248352 2478725 2493561 2614008 2966160 3854643 5247176 6017405 4920165
40849 4920165 2536137 1034566 1560239 2997639 3836797 3976264 3842524 2998732 942363
40840 942363 -1507859 -2946370 -3081981 -2660744 -2158256 -1617112 -1372991 -1801287 -2542777
40831 -2542777 -2948513 -3047934 -3147287 -2842959 -1583969 26158 752322 503145 326378
40822 326378 590245 550221 -3051 -158141 386353 425899 -797171 -1877610 -997464 1213896
40812 1213896 2222878 945563 -988302 -1653548 -1022829 8535 1359345 3104315
40804 3104315 4030726 2781556 324351 -621273 862337 2574710 2312765 754970 -77873
40795 -77873 113320 199749 84505 716850 1905539 2234605 1387669 650882 659963 474582
40785 474582 -437965 -1060821 -608049 107028 131288 -207007 -403797 -879869 -1760391 -1990174
40775 -1990174 -1127437 -659292 -1793159 -3125510 -2506815 -329947 1164782 1211661 898746
40766 898746 631417 -325203 -1651458 -1691373 10911 1814811 2289620 1730099 798633
40757 798633 -546638 -1946388 -2170326 -840475 753323 1565689 2158542 3068975 3247984
40748 3247984 1638977 -708891 -1722471 -939770 311267 927054 931721 678982 381354
40739 381354 327806 573874 529551 -286379 -1289848 -1512334 -1034839 -808702 -1141535 -1265432
40729 -1265432 -448112 1184243 2874505 3614397 2528129 -210705 -2896543 -3661965 -2468057
40720 -2468057 -972566 -396951 -416574 -275665 49839 261483 431479 627131 424638
40711 424638 -540899 -1863746 -2700132 -2565033 -1470258 354709 2423380 3930607 4217952
40702 4217952 3304137 1787494 347409 -619652 -1182304 -1758059 -2424117 -2385192 -876995
40693 -876995 1222677 1726404 -209227 -2663320 -3220052 -1921036 -623461 -10158 891411
40684 891411 2177351 2155544 -103568 -2949423 -4217442 -3924153 -3457656 -3080778 -2008215
40675 -2008215 -403769 604664 814682 1066586 1344099 606656 -990128 -1534575 32045
40666 32045 2286426 3462629 3862278 4709959 5724101 5568573 4139842 2724904 2083956
40657 2083956 1823308 1574507 1419407 1112334 174551 -1103035 -1930774 -2384394 -3234187
40648 -3234187 -4232054 -3982956 -2040708 171062 1283836 1703910 2486940 3445338 3545240
40639 3545240 2664136 1800237 1633840 1758260 1440464 565138 -345944 -765770 -687639 -540140
40629 -540140 -549422 -367723 388853 1484869 2439994 3253867 3986614 3916931 2313337 64039
40619 64039 -886682 -167437 385311 -519004 -1672054 -1332176 159469 1305473 1975217
40610 1975217 3029293 3935257 2978461 102356 -2438548 -3017533 -2631324 -2924078 -3507654
40601 -3507654 -2668044 -92941 2517008 3494290 2784678 1346313 -76897 -1106301 -1333827
40592 -1333827 -595740 432554 603552 -433861 -1725088 -2123274 -1582489 -870142 -317223
40583 -317223 386914 1250239 1741421 1700994 1624620 1705495 1493206 979161 1035628 2046446
40573 2046446 3071605 3336839 3595947 4714578 5705273 4830012 2275936 47778 -673598
40564 -673598 -393662 375879 1632298 2352126 661087 -3304169 -6456696 -6189821 -3516590
40555 -3516590 -1338453 -726430 -622115 -322608 -175624 -51553 848292 2309738 2863423
40546 2863423 1825765 315129 -427069 -642680 -1190606 -1938220 -1980261 -1027366 247444
40537 247444 1053927 1059553 304731 -793564 -1316465 -348628 1947981 3941148 3753065
40528 3753065 1290646 -1140379 -967671 1608516 3466121 2218570 -618084 -1413752
40520 -1413752 816234 3111790 2585543 148265 -1052289 194005 2217599 3206437
40512 3206437 3124202 2786966 2579095 2610787 2991115 3362009 3073436 2264670 1783100 1590196
40502 1590196 508271 -1653622 -3079683 -2393960 -1030559 -1399102 -3352517 -4509030
40494 -4509030 -3922828 -3239397 -3712968 -4167175 -3088474 -1145951 -101441 -220420 -314182
40485 -314182 209232 783343 919699 723908 220905 -712382 -1636786 -1743977 -1002386 -371760
40475 -371760 -607841 -1356347 -1593301 -623708 1287420 2910115 2938768 1425276 1204
40466 1204 -36145 505993 -143009 -2019513 -3170104 -2342740 -670377 13300 -435936 -703139
40456 -703139 -72050 727182 626677 -535488 -2002815 -2944475 -3149855 -2964929 -2604192
40447 -2604192 -1729608 -7515 2027506 3129462 2474559 363912 -2135347 -3853231
40439 -3853231 -3970343 -2492000 -434423 964432 1371341 1358639 1455181 1812086 2569000
40430 2569000 3564527 3734120 2060732 -563356 -1755469 -591378 1108931 1351917 604382
40421 604382 582675 1455944 1941748 1619030 1337177 1423068 1217726 657258 711124 1677961
40411 1677961 2446109 2246452 1949201 2604914 3609130 3503462 2103305 710186 390513
40402 390513 959044 1608250 1764251 1309635 622513 410458 915824 1353084 830760 -222877
40392 -222877 -468887 325726 725800 -328314 -1864672 -2249143 -1540995 -1203081 -1713953
40383 -1713953 -1889078 -833084 737853 1734212 2120605 2215938 1535058 -399724 -2590746
40374 -2590746 -3269247 -2089274 -592175 -380948 -1647212 -3469384 -4625681 -4087782 -1809056
40365 -1809056 679382 1454558 399075 -647867 -268476 1023798 2129839 3028533 4151921
40356 4151921 5030616 4777768 3473086 2046708 1117565 807457 1248920 2226326 2637367
40347 2637367 1488640 -629700 -2142837 -2579953 -2939883 -3784233 -4176799 -3150839 -1316043
40338 -1316043 -129874 -49258 -258792 -82354 138766 -177373 -741376 -649323 245541 791926
40328 791926 -125165 -1973885 -3061529 -2738284 -2273750 -3032337 -4495785 -4928683 -3621444
40319 -3621444 -1599712 -229777 108007 -55017 -19173 515064 1174715 1213030 430142
40310 430142 -392460 -413099 163991 407625 -201559 -1485246 -2999992 -4050531 -3775194
40301 -3775194 -2225827 -964873 -1320304 -2239899 -1385289 1474183 3764045 3421759 1453599
40292 1453599 179428 114143 -81178 -1267397 -2853370 -3931483 -4214372 -3805297 -2967713
40283 -2967713 -2276339 -2249869 -2599457 -2409432 -1305197 45537 913824 1582129 2889021
40274 2889021 4753820 5754693 4643353 2052748 33083 -281180 110862 -348669 -1597031
40265 -1597031 -2177085 -1325913 147591 1100074 1257247 944074 390111 -321153 -1132805
40256 -1132805 -2078864 -3008617 -3244015 -2223617 -549842 499809 720353 1202958 2350791
40247 2350791 2807945 1313882 -1201013 -2572679 -2082634 -1037725 -758481 -1105481 -1320632
40238 -1320632 -1423878 -2033988 -3145872 -3896195 -3797936 -3654040 -4562063 -6136373 -6617370
40229 -6617370 -5118853 -2911768 -1751442 -1699472 -1613207 -1078360 -472715 356544 1722557
40220 1722557 2590195 1448313 -1018278 -2175487 -1050818 293785 -11494 -1071136
40212 -1071136 -1314807 -1233394 -2028389 -3006778 -2643114 -1357101 -953763 -1764946 -2445729
40203 -2445729 -2312357 -1846409 -1059506 522711 2135290 2104843 356207 -1197845 -1300590
40194 -1300590 -770800 -742177 -1079150 -1257306 -1380475 -1501508 -1171692 -476632 -385352 -1241917
40184 -1241917 -1955296 -1562587 -677141 -475248 -999129 -1364574 -1116991 -633340 -547990 -1200239
40174 -1200239 -2173171 -2222305 -513934 1816102 2454936 785109 -1187098 -1485378 -528008
40165 -528008 158019 370416 921544 1756410 2100508 2134291 2816784 3963457 4067597 2490226
40155 2490226 518101 -465222 -795779 -1542128 -2428102 -2016951 72018 2254411 2766691
40146 2766691 1621029 113363 -1036447 -2015698 -2613615 -1990057 -267399 892909 338679
40137 338679 -850541 -935774 -85045 182605 -355032 -454210 41489 -476376 -2740596 -5010418
40127 -5010418 -5289162 -3906249 -2670515 -2400406 -2536758 -2492293 -2118365 -1265987 -49271
40118 -49271 678069 122408 -1235180 -2011068 -1498172 -314071 470497 442485 170071 601212
40108 601212 1921204 3072882 2979936 2111588 1827195 2157545 1693683 132085 -778947
40099 -778947 67852 1062540 141225 -1997868 -2870600 -1823574 -779784 -1486777 -3628696
40090 -3628696 -5732279 -6579430 -5638902 -3348306 -1134892 -162931 -50153 309649 996502
40081 996502 1308136 1373744 1981287 2839994 2643349 1196021 31609 367911 1607631
40072 1607631 2398159 2183835 1237099 66531 -739515 -837142 -624563 -758030 -1107297
40063 -1107297 -992229 -387638 117692 469779 1034692 1389699 716798 -429192 -386116
40054 -386116 1109246 2284300 1868974 716603 90962 -75501 -192284 124995 865084
40045 865084 750901 -805948 -2070066 -1139409 1138614 2345159 1957627 1514812 1548141
40036 1548141 681315 -1651417 -3612552 -3324571 -1588556 -865078 -2060330 -3544810 -3435192
40027 -3435192 -1984511 -1164636 -2099878 -3548185 -3401320 -1454006 131970 -535677 -2645176
40018 -2645176 -3579770 -1980582 768697 2150719 1151163 -877025 -1819472 -1093518 -99924
40009 -99924 -289764 -1340884 -1927857 -1771895 -1637359 -1422256 10930 2494627 3748547
40000 3748547 2206068 -581868 -1923332 -1533476 -1386544 -2397693 -3031434 -1538785 1639608
39991 1639608 4229846 4356304 2299724 334441 523894 2371933 3325979 2039450 36391
39982 36391 -717750 -521232 -675073 -795017 357770 2051996 2168086 565377 -660249
39973 -660249 -643337 -934140 -2429991 -3641762 -3354863 -2732853 -2969639 -2788959 -513190
39964 -513190 2765568 4484100 4216025 3577987 3026999 1356553 -1379788 -2908063 -1758012
39955 -1758012 451709 1023404 -552134 -2458492 -2982316 -2021762 -577066 252969 -178938
39946 -178938 -1677865 -3090390 -3067648 -1339933 882628 2038597 1739279 938776 548783
39937 548783 329585 -365044 -1071835 -435899 1740703 3608258 3298295 1320961 -127429
39928 -127429 -88841 123859 -861245 -2378079 -2756456 -1797927 -1027010 -1514416 -2567016
39919 -2567016 -3010951 -2857618 -2877448 -3108824 -2856406 -1975304 -1033503 -124818 1249642
39910 1249642 2725526 2842338 1145616 -677512 -998181 -521959 -781455 -1313217 -540049
39901 -540049 978144 856284 -1151229 -2220923 -727814 1026441 320518 -1719549 -1917897
39892 -1917897 92128 1622934 1164740 114132 -78700 -43709 -814659 -1913888 -2367159
39883 -2367159 -2332448 -2484039 -2676461 -2358466 -1678545 -1154620 -729964 -127221 240858 -233861
39873 -233861 -1057296 -878518 668255 2152337 1961361 350638 -785097 -208033 1214709
39864 1214709 1767428 1139313 625884 1137648 2028937 2417282 2743687 3971958 5685250
39855 5685250 6209714 4751398 2458048 1030527 941064 1338252 1210692 355479 -491996
39846 -491996 -397329 616641 1301329 571674 -1015058 -1878530 -1444332 -725881 -782921 -1458031
39836 -1458031 -1936710 -1805578 -1165383 -309949 317574 338391 -88551 -410573 -399906 -222990
39826 -222990 156460 860237 1349311 791472 -552769 -1314838 -815769 69233 303691
39817 303691 -53575 -513329 -957988 -1063235 -125058 1506840 1969331 220999 -2065741
39808 -2065741 -2498610 -1191120 -275290 -554470 -552475 886266 2762072 3363338 2366233
39799 2366233 807122 -237991 -431040 -256851 -652871 -1979652 -3256063 -3150744 -1803896
39790 -1803896 -750431 -831704 -1186032 -729215 320031 1020918 1051312 740980 272536
39781 272536 -457204 -1406962 -2261531 -2607283 -2180349 -1311891 -1013157 -1850730 -2715322 -1797993
39771 -1797993 803033 2606809 1726637 -607058 -1611815 -410987 1328804 1910150
39763 1910150 1388168 653744 -44900 -936716 -1729796 -1669853 -663625 195616 -304615
39754 -304615 -1900668 -2833269 -1890596 -116220 365216 -830806 -1822397 -1157028 163451
39745 163451 306787 -711374 -1362562 -1074707 -726701 -680900 -11278 1670079 2980742
39736 2980742 2426867 477462 -1109158 -1547484 -1523473 -1668545 -1716339 -1381235 -1026920
39727 -1026920 -875616 -315981 1160195 2745583 3027164 1903974 836707 842232 1107568
39718 1107568 280205 -1513828 -2849892 -2819804 -1691586 -34170 1593555 2100605 539609
39709 539609 -2069176 -2988531 -967916 1788785 2175249 32780 -1970375 -1862942 -156294
39700 -156294 1804411 3468090 4485170 4043743 1930391 -592000 -1985364 -2034801 -1529482
39691 -1529482 -947408 -336935 -49845 -550882 -1558103 -2185239 -1985908 -1250222 -315262
39682 -315262 767835 1869452 2713748 3226195 3387314 2835952 1446492 339160 1179894
39673 1179894 3898502 6077714 5551985 2973925 781849 153892 282938 413754 968330
39664 968330 2228061 3341394 3510577 3094211 2569844 1387450 -883601 -2993911 -3125087
39655 -3125087 -1326335 540119 1224741 1144754 1032879 996899 1155585 1721639 1992263
39646 1992263 741463 -1707939 -3279013 -2897425 -1970148 -1938564 -1886828 -349474 1639612
39637 1639612 1506848 -1200409 -4077567 -4847542 -3490882 -1345741 340149 710257 -412578
39628 -412578 -2104620 -3240490 -3920192 -4885964 -5639206 -4710250 -2044346 487866 1499422
39619 1499422 1565929 1702200 1816415 1522605 1251623 1612921 2538988 3670527 4626038
39610 4626038 4556566 2841141 725161 552661 2521519 4033666 3439710 2441856 3063212
39601 3063212 4161637 3353212 983883 -554091 -621185 -632952 -970345 -484670 760566
39592 760566 1021624 -212544 -1278785 -1177775 -1118676 -2106210 -2991660 -2376138 -940242
39583 -940242 -398427 -1162195 -2234760 -2590025 -1784408 -101116 1239125 1092386 187057
39574 187057 502128 2170097 2796519 1034555 -1085677 -1177675 -88268 -81174 -760724
39565 -760724 234114 2929570 4456552 3226046 1050599 179327 405310 354233 -148240
39556 -148240 -508905 -891765 -1731514 -2441480 -1967954 -277669 1665440 2993101 3190819
39547 3190819 1865093 -674255 -2959422 -3591238 -2826032 -2053651 -1880655 -1759648 -1438293
39538 -1438293 -1502406 -2106470 -2351252 -1709716 -1164348 -1857903 -3185096 -3523954 -2731996
39529 -2731996 -2478058 -3645270 -4760239 -4080232 -2279560 -1524099 -2258570 -2683925 -1696363
39520 -1696363 -544415 -576112 -871810 244892 2271097 3033605 1836936 163747 -913062
39511 -913062 -1996555 -3326365 -3469256 -1588287 390152 -99157 -2556718 -3857806 -2464618
39502 -2464618 -381971 -291119 -2162614 -3718230 -3386210 -1746533 -437592 -514744 -1800359
39493 -1800359 -3205524 -3593651 -2650679 -991839 564818 1553426 1682507 713782 -1033816
39484 -1033816 -2463887 -2582436 -1519127 -321278 123969 -314813 -1195211 -1849641 -1794774
39475 -1794774 -1266697 -1155089 -1935663 -2891203 -2931939 -1957615 -764814 161276 919645
39466 919645 1359163 990339 -52772 -896946 -1136919 -1280003 -1548030 -1210415 133486
39457 133486 1458219 1544936 776451 557344 1177484 1441745 576442 -534830 -508235 803119
39447 803119 2263845 2775380 2125789 693117 -1080982 -2597977 -2894514 -1412333 699796
39438 699796 1007156 -1377019 -3960300 -3538776 -653320 707117 -1420526 -4044541 -3423774
39429 -3423774 -234084 1942283 1907727 1554348 1867047 1646039 628841 578024 1994298
39420 1994298 2629345 1078143 -586668 42287 1925024 2430982 1483601 1139097 1934260
39411 1934260 2381204 1770224 995822 618334 341349 470645 1650052 2890541 2146954
39402 2146954 -503859 -2344409 -1535664 697606 2294920 2871372 2817549 1784600 -185597
39393 -185597 -1445800 -697370 660606 116805 -2416979 -4515797 -4566562 -3337777 -1983833
39384 -1983833 -353045 1767561 3118768 2173324 -562771 -2734298 -2785785 -1572504 -963580
39375 -963580 -1506229 -2190883 -2250554 -2199390 -2700664 -3226021 -2764860 -1566872 -1140118 -2334189
39365 -2334189 -4253763 -5443947 -5505062 -5085243 -4776958 -4527538 -3879789 -2475978 -551222
39356 -551222 964696 1258020 664982 360214 862441 1518217 1702880 1704251 1962302 2294928
39346 2294928 2533693 3061832 3831996 3686045 1885657 -258501 -737327 411957 1240516
39337 1240516 847103 562242 1570352 2846994 2650205 1114142 -55907 -102534 -19047
39328 -19047 -633291 -1091435 -42323 2249258 3921372 3696731 2315642 1384209 1311390
39319 1311390 1159992 450878 148758 1292456 3259684 4259975 3438834 1747915 617977
39310 617977 406175 449976 178620 -286895 -479306 -153269 558523 1365699 1997857 2121579
39300 2121579 1347573 -288217 -1932622 -2590370 -2329734 -2110968 -2083794 -1015533 1696464
39291 1696464 4293677 4409377 2254440 427401 378233 736027 -193296 -1887515 -2786201
39282 -2786201 -2760637 -2816039 -3061594 -2698977 -1798795 -1417159 -1769231 -1801675 -1034478 -422004
39272 -422004 -614187 -609686 696548 2475401 2872213 1643276 553408 1051430 2721362
39263 2721362 4396949 5703682 6726607 6993949 5984135 4435660 3996569 5257410
39255 5257410 6945284 7476736 6572650 4809305 2464334 -66729 -1279945 318848
39247 318848 3774040 5854884 4583848 1551056 -294555 -178386 513084 927911 1521773
39238 1521773 2314117 2391606 1641801 1239566 1650514 1802184 1277977 1659675 4087328
39229 4087328 6836167 7356128 5880648 4788170 4786233 4169086 2100313 234999 150382
39220 150382 1107038 1609626 1679115 2184904 3036928 3442887 3224550 2707134 1951144 1108545
39210 1108545 833137 1339634 1817495 1770335 1977139 2899032 3224315 1708885 -389201
39201 -389201 -747470 643328 1716486 1728576 1994743 2942935 2982863 1333842 -222153
39192 -222153 88640 1379850 1652176 713118 -125791 -295418 -175773 308227 1560023
39183 1560023 3022541 3564514 3156219 2830062 2876844 2361565 794200 -792593 -1060288
39174 -1060288 -43628 954884 882403 -25617 -646115 -214525 894796 1636301 1357928
39165 1357928 146435 -1629502 -3478434 -4560157 -4204915 -2935856 -2105208 -2092924 -1784894
39156 -1784894 -453279 813799 534358 -999553 -2053793 -1599045 -238630 708483 286693
39147 286693 -1581210 -3879078 -5075584 -4557006 -3157579 -1841478 -588074 777582
39139 777582 1610795 1359880 647045 251832 -243170 -1485616 -2764178 -2914995 -2245119
39130 -2245119 -1916410 -1876005 -1179814 -69612 185693 -539855 -1097221 -1135385 -1387623 -1760789
39120 -1760789 -1184477 281891 1237391 1315477 1663977 2429148 2059197 152768 -1256778
39111 -1256778 -710354 385385 119138 -1092615 -1866901 -2374831 -3372376 -4052365 -3192833
39102 -3192833 -1581050 -1029677 -1506154 -1352979 -30629 1362444 2119616 2543649 2559415
39093 2559415 1585121 29922 -724390 -229917 462523 449413 -10343 -391928 -696207
39084 -696207 -1019934 -1235852 -1362427 -1602764 -2013852 -2667877 -3752996 -4840970 -4773307
39075 -4773307 -3305310 -2024894 -2221238 -2680968 -1477210 692145 1287991 -88581 -1022242
39066 -1022242 -50927 1310361 1271256 351128 -69705 -60653 -493214 -1337818 -2039388 -2661119
39056 -2661119 -3399497 -3738605 -3204126 -2282147 -1623336 -1010972 -8658 1071657 1751274
39047 1751274 2279124 3047278 3649546 3312015 1823644 -466372 -2930555 -4520772 -4276600
39038 -4276600 -2606083 -1170799 -905256 -1139938 -1205802 -1526703 -2252459 -2316652 -1142523
39029 -1142523 85008 352302 682478 2228973 3695215 2946602 524303 -862118 -206396
39020 -206396 705043 303395 -735302 -1034787 -394073 551869 1240065 1208747 309399 -751343
39010 -751343 -1050239 -723629 -573832 -545487 87349 1141358 1657492 1581950 1686690 1846734
39000 1846734 1259208 435970 814627 2069927 2209272 996041 671710 2134001 3080005
38991 3080005 1690558 -340512 -684490 -69110 -467636 -1471274 -1448510 -861494 -1161110
38982 -1161110 -1413987 376236 2989347 2783438 -830810 -4185217 -4524291 -3195598 -2444237
38973 -2444237 -2097426 -1256630 -650962 -1063429 -1384836 -447178 784013 944263 720918
38964 720918 1349671 1955776 860416 -1327987 -2413140 -1893161 -1146261 -656004 437632
38955 437632 1935268 2234400 991476 -45728 293778 1011064 989770 860324 1522251
38946 1522251 2262589 1879024 704693 699 -71360 -446997 -1408229 -2125435 -2009579
38937 -2009579 -1527544 -1404857 -1639860 -1596121 -791763 555066 1709302 2179180 2201327
38928 2201327 2206349 1989789 1032720 -375420 -1169507 -916852 -352236 -95422 273633 1201817
38918 1201817 2056923 1939989 1000653 1312 -907855 -1930142 -2594711 -2282349 -1616415
38909 -1616415 -1903702 -2952624 -2866497 -727540 1667306 1849330 -222041 -2309849 -2872807
38900 -2872807 -2576328 -2561244 -2453316 -1137795 1040200 2165817 1127188 -887213 -1942832
38891 -1942832 -1741757 -1521615 -1945320 -2280884 -1829242 -1033813 -592248 -333587 237599
38882 237599 907146 1183177 1402210 2400237 4064373 5068231 4345704 2298382 243839
38873 243839 -967444 -1449410 -1581452 -1252693 -120429 1450393 2286117 1775982 970619
38864 970619 1406915 2902165 3655515 2835266 1762859 1751096 2048344 1254023 -187127
38855 -187127 -611350 216057 887252 743251 665029 1105269 1073828 -64621 -1189228 -939868
38845 -939868 341892 1295906 1413040 1097045 468520 -590872 -1427175 -938015 874961
38836 874961 2639252 3233195 2923322 2511030 2073479 1217878 155293 -317730 53230
38827 53230 527425 304546 -556524 -1487443 -2240108 -2840566 -3038093 -2546442 -1795247 -1662254
38817 -1662254 -2239396 -2536179 -1757709 -353061 535102 222104 -1086354 -2410908 -2400408
38808 -2400408 -454256 2229971 3629452 3315117 2853946 3310813 3724024 2994842 1838120
38799 1838120 1415338 1296424 578096 53 835688 2332730 2497357 1118614 -192302
38790 -192302 -809856 -1615627 -2642850 -2638073 -1447905 -569355 -661459 -636122 64003 401618
38780 401618 -227952 -961589 -1259316 -1604569 -1653466 -128054 2427499 3455475 2313089
38771 2313089 1547847 2467207 2525507 -282436 -3350560 -3180182 -802685 404368 501374
38762 501374 2156794 4975588 5360790 2299464 -911994 -1627265 -917867 -553433 -265569
38753 -265569 434651 591680 -244091 -693628 121305 895123 397043 -359475 187314 1801801
38743 1801801 3285106 4237795 4573237 3696864 1759096 528883 1343248 3012250 3255509
38734 3255509 1591864 -458625 -1416650 -891327 823485 2972345 4455255 4674350 4098582
38725 4098582 3476709 2943819 2346170 1802837 1435227 1163133 1152356 1718603 2473511 2485910
38715 2485910 1625879 709297 7150 -1089081 -2485235 -3005000 -2327828 -1740704 -1984948
38706 -1984948 -1934784 -662612 714766 804916 224511 363437 939135 652178 -497718
38697 -497718 -1380157 -1610818 -1499423 -717631 1064506 2631798 2413714 1189245 1501893
38688 1501893 3950543 5959299 5096063 2173238 -9285 -72602 865041 1109025 436752
38679 436752 -17535 422805 852444 15699 -1596493 -2021273 -589820 834625 367218
38670 367218 -1217885 -1728360 -780415 -141159 -1009326 -2460189 -2842679 -1629845 403162
38661 403162 2062003 2605893 2278048 1979947 2124663 2222449 1951413 1817862 2047645 1769923
38651 1769923 378972 -1146540 -1572196 -1306822 -1529798 -2060352 -1705056 -299330 1223981
38642 1223981 2501678 3854943 4958717 5026453 4219638 3381043 2623466 1791183 1908364
38633 1908364 4089759 7059539 7983412 6213867 4260974 4459409 6379406 8100475
38625 8100475 8470132 7589060 6527104 6956837 9715332 13641119 17252491 21142025 26629621
38616 26629621 32548516 36266593 37938845 40580611 45581275 51677065 59029415 70304539
38608 70304539 86747032 108198188 138690800 184621141 240932091 284274290 289684042
38601 289684042 254930411 202229634 155504478 122105576 97325947 77980903 65285068
38594 65285068 58834191 54976302 51190330 47884392 45440328 42467413 37705644 31682650
38586 31682650 25792680 20924129 17334176 14940546 13418396 12459465 11894038 11343058
38578 11343058 10305524 9029144 8546020 9124349 9412587 8085866 5793709 4373399
38570 4373399 4421310 4738809 4122068 2669800 1152964 -31545 -919479 -1596441 -2126140
38561 -2126140 -2484542 -2321954 -1170592 793246 2473977 2755636 1655038 317008 -144621
38552 -144621 431656 1475138 2407017 2891185 2775699 2347342 2415810 3392840 4331448 3829252
38542 3829252 2119122 1163683 2049087 3381827 3302340 2125907 1559690 1974896 2203241
38533 2203241 1813236 1712560 2226987 2371454 1690732 1236576 1778418 2398405 1994213
38524 1994213 1056493 685742 755601 495060 286307 1281878 3315454 4622510 4001315
38515 4001315 2279732 1182085 1346523 1890846 1657736 582586 -226636 178251 1336493
38506 1336493 1935721 1599901 1319300 1804801 2387221 2249702 1810012 1808438 1804594 995690
38496 995690 70628 591113 2492594 3828810 3466754 2601604 2825760 3893200 4429030
38487 4429030 3988600 3227693 2503301 1526837 409418 45161 1042371 2749487 3745602
38478 3745602 3250514 1920828 1160027 1556191 2177395 1764956 483343 -184406 555629
38469 555629 1661907 1639468 491765 -412241 -73088 1275065 2827617 3922227 4070763
38460 4070763 3108106 1663746 907330 1318997 1978459 1540172 -131895 -1675533 -1717385
38451 -1717385 -440958 600979 238904 -1090817 -2126640 -2419968 -2540480 -2737054 -2336058
38442 -2336058 -924713 688833 1537999 1992954 3149987 4906543 5746959 4663522 2405843
38433 2405843 457689 -518236 -806333 -828295 -741203 -523489 -100171 432246 683104 497967
38423 497967 538002 1560280 3012224 3328112 2047865 625690 417112 824333 454648
38414 454648 -672492 -1341102 -1057665 -400102 305580 1253158 2077502 1907297 828019
38405 828019 54237 129522 38196 -1231776 -3142914 -4368780 -4399151 -3639268 -2480898
38396 -2480898 -1106162 60585 426057 -221389 -1500217 -2634095 -2818440 -1845268 -523943
38387 -523943 22550 -362677 -855504 -950212 -868093 -443035 1196992 4089631 6617524
38378 6617524 7252187 6338776 5108890 3760601 1926790 440171 817563 2870137 4384131
38369 4384131 3700685 1511037 -399220 -1233280 -1471737 -1884153 -2859227 -4174523 -4946838
38360 -4946838 -4246232 -2144530 182677 1590156 1817471 1221992 355790 -21165 703727
38351 703727 2212353 3465629 4097708 4904970 6371988 7370380 6217117 2833191 -869158
38342 -869158 -2791304 -2457110 -1118146 -431411 -996342 -1960122 -2107779 -1349981 -787548
38333 -787548 -1200941 -2044806 -2358681 -2154098 -2176424 -2512818 -2273092 -883369 863428
38324 863428 1486096 388933 -1549069 -2953035 -3245997 -2772637 -1876790 -470550 1236486
38315 1236486 2255315 1869886 880378 812869 1848800 2561670 1990668 876917 218336
38306 218336 -333233 -1577988 -3030591 -3381111 -2385740 -1056792 -36682 994504 2116745
38297 2116745 2562813 1810052 374927 -1029313 -2354748 -3640513 -4306996 -3854088 -2822022
38288 -2822022 -2215366 -2155230 -1824444 -681441 894422 2157301 2671547 2478264 2097589
38279 2097589 2269021 3076926 3430835 2247470 236947 -522579 719315 2128351 1644181
38270 1644181 -198354 -1117740 -373854 387637 -145249 -917754 -170042 1841630 3038820
38261 3038820 2144854 108076 -1119424 -535679 1226551 2632852 2578580 1322759 105303
38252 105303 -273584 -151624 -99781 -19226 248071 138402 -743422 -1433582 -650212 1090529
38242 1090529 1829380 867769 -275813 -124357 863259 1431140 1361134 1129910 703354
38233 703354 -97070 -679548 -388813 255352 180867 -625485 -1194143 -1045924 -535043 79898
38223 79898 754932 933943 -53423 -1726760 -2773783 -2881057 -3040288 -3635006 -3528497
38214 -3528497 -1859580 330455 1325899 903314 258485 268142 812073 1458654 1806249
38205 1806249 1324853 -143592 -1706344 -2108441 -1224040 -162322 158551 -184499 -754402
38196 -754402 -1299078 -1461563 -874857 44243 260647 -393653 -774858 -173169 416650 -164759
38186 -164759 -1225488 -1242269 -489974 -823337 -2594081 -3646181 -2350539 -159308 304212
38177 304212 -1231766 -2675558 -2610519 -1668850 -849387 -98653 828913 1334800 730151
38168 730151 -636295 -1808853 -2411286 -2774749 -3161659 -3444013 -3435028 -3096401 -2451989 -1577854
38158 -1577854 -633608 256284 1064257 1753353 2307402 2868945 3493839 3695115 2698223
38149 2698223 429114 -2087756 -3605444 -3704086 -2841588 -1765484 -1135099 -1299100 -1978818
38140 -1978818 -2346209 -1792837 -593081 337815 231258 -974066 -2505562 -3122965 -2100540
38131 -2100540 -117234 1213018 984067 -134094 -844669 -615526 119290 677596 690061
38122 690061 309499 166469 767570 1734791 2133185 1798258 1721239 2707069 4229369 5109630
38112 5109630 4839941 3795120 2669835 2132527 2426867 2882178 2540559 1700597 1827027
38103 1827027 3242117 4159272 3240346 1975433 2770268 5365179 7144136 6794394 5636140
38094 5636140 5075427 4688628 3584373 2088108 1047215 534896 198320 139777 646522
38085 646522 1567034 2489281 3044425 2769632 1414096 -269103 -838378 254370 2041838
38076 2041838 3314393 3758607 3542915 2734472 1678939 1122124 1327359 1734605 1953787
38067 1953787 2305258 2876565 2944817 2039326 819851 200927 279627 704479 1277959 1548306
38057 1548306 766540 -881962 -1912865 -1410026 -427021 -467908 -1427835 -2272059 -2895182
38048 -2895182 -3745879 -4237978 -3349845 -1607714 -710600 -1088458 -1480263 -1179541 -1010518
38039 -1010518 -1497954 -1651349 -559303 952713 1343963 331987 -1042884 -1772669 -1541923
38030 -1541923 -547126 557933 870450 96865 -957166 -1231317 -554273 386328 881942
38021 881942 639422 -223164 -1115337 -1199593 -205311 1121685 1761166 1424828 511382 -585899
38011 -585899 -1588623 -2001759 -1395138 -129768 723585 449338 -585075 -1407200 -1420205
38002 -1420205 -766021 98630 953934 1899405 2960737 3761026 3776485 2958676 1903785
37993 1903785 1281345 1272079 1692169 2372019 3075892 3295677 2700764 1822642 1692911 2523532
37983 2523532 3285938 3101386 2596124 3061486 4415376 5026957 3922499 2221098 1581403
37974 1581403 1888338 1586960 31504 -1753840 -2772350 -3201232 -3276279 -2291294 107214
37965 107214 2379024 2330802 -109575 -2521075 -2636400 -481739 2322686 4391845 5171162
37956 5171162 4592622 3105944 1781566 1577617 2403626 3273500 3334139 2476310 1149767
37947 1149767 -5012 -481128 -313038 -106443 -284490 -452430 -15244 736422 926152
37938 926152 557243 765631 2132450 3558760 3652253 2711712 2327929 3206476 4400450
37929 4400450 4754684 4121867 2880525 1195052 -715486 -2289864 -3174526 -3511658 -3252307
37920 -3252307 -1912556 347182 2117721 2116578 733570 -600609 -1129983 -994359 -264396
37911 -264396 1076429 2423304 2987086 2886343 2783326 2604085 1813260 823246 676583
37902 676583 1206191 1078062 79207 -228410 1111207 2849677 3271628 2294298 853592
37893 853592 -551516 -1532274 -1266039 221748 1208642 365720 -1050336 -882886 615236
37884 615236 1249286 557000 703392 2945871 5146134 4303774 594226 -2597266 -2468827
37875 -2468827 393566 3077798 3475578 2002082 566133 411739 1197462 1776776 1247338
37866 1247338 -644491 -3272539 -5096390 -4786071 -2859974 -1315821 -1050024 -688743 1114868
37857 1114868 3324824 3849561 2438083 662020 -494149 -1328124 -1966947 -2041116 -1906297
37848 -1906297 -2432860 -3238826 -2826056 -1026833 330695 3919 -946247 -1076196 -835151
37839 -835151 -1534994 -2996344 -3742831 -3122193 -1929102 -1059701 -607810 -270204 243228
37830 243228 1239125 2674625 3620006 2833649 266588 -2478089 -3692362 -3403597 -3147626
37821 -3147626 -3792196 -4187432 -2666188 357567 2351584 1627907 -579041 -1749961 -1054378
37812 -1054378 287585 1032954 1095210 949007 1031804 1681802 2642372 2748084 1216506
37803 1216506 -827347 -1328735 134420 1933061 2587743 2163729 1393255 764427 716996
37794 716996 1380494 1797140 785342 -1046740 -1605333 -138229 1698518 2200128 1543621
37785 1543621 638475 -389280 -1565498 -2301358 -2343702 -2327617 -2486017 -2112490 -1197703
37776 -1197703 -1027892 -1961173 -2250440 -662301 1220626 1199928 -238910 -882008 -175677
37767 -175677 439777 78710 -662121 -1072567 -965708 -199185 1004485 1682248 1424987
37758 1424987 1324516 2089478 2193112 -34952 -3263951 -4542639 -3380590 -1875141 -999336
37749 -999336 304805 2012797 2103507 -81635 -2213583 -2287545 -1409393 -1547568 -2329695
37740 -2329695 -2056961 -611285 650434 1150390 1499418 2074249 2573727 2702073 2264461
37731 2264461 1025714 -576208 -1146975 145323 2174132 2995372 2086114 591886 -275387
37722 -275387 -210101 429657 912861 488465 -661122 -1119912 169720 2261791 3170162
37713 3170162 2369557 1277934 1156642 1587278 1429994 447498 -628267 -1148029 -1075271
37704 -1075271 -696527 -303964 -171193 -515801 -1305473 -2140506 -2485388 -2211775 -1901789
37695 -1901789 -2280749 -3151595 -3298329 -2002237 -436148 -653298 -2853158 -4506849 -3122742
37686 -3122742 533247 3185798 3089681 1947077 2109911 3251196 3317909 1923616 768838
37677 768838 797364 1037080 764330 764645 1389562 1268198 -415967 -1872968 -951008 1527957
37667 1527957 2786807 1916659 591921 178304 234372 101644 63276 391867 795438
37658 795438 1311951 2354984 3423988 3191442 1441054 -385454 -1146554 -1233861 -1253725
37649 -1253725 -808627 544597 2183466 3152101 3237674 2694761 1706934 681640 276896
37640 276896 628384 1264637 1997347 2912122 3357391 2346276 393331 -552515 289122
37631 289122 1440800 1497259 1029188 1082138 1261227 748419 54232 192519 939816 1375063
37621 1375063 1485254 1869374 2408164 2501730 2151176 1695042 1024663 109667 -371546 -23242
37611 -23242 402573 294814 433350 1521512 2369460 1349536 -914351 -2249796 -2058326
37602 -2058326 -1772448 -2192077 -2382588 -1675170 -940106 -1025378 -1312564 -786014 424920
37593 424920 1455226 1976396 2263769 2401509 2098180 1215079 137212 -435476 -103221
37584 -103221 789796 1551607 2027420 2605940 3222272 3156563 2241418 1356491 1068437 787718
37574 787718 192173 351789 2006465 3611446 2895597 5197 -2590521 -3184677 -2257151
37565 -2257151 -939685 234212 830116 318758 -1105142 -2523534 -3308668 -3317174 -2441348
37556 -2441348 -1185946 -1108113 -2872658 -4284842 -2620280 1003575 2296747 -328901
37548 -328901 -3249744 -2632001 347948 1590448 -146206 -2175745 -2052264 -434989 462837
37539 462837 -392325 -2180554 -3283580 -2662537 -811728 548606 201612 -1221820 -2036556
37530 -2036556 -1404034 4885 955144 777926 -184565 -863852 -471263 528067 904329
37521 904329 324746 -223033 -34242 263133 -21980 -324998 117210 702820 361728 -486534
37511 -486534 -456457 443010 611546 -680640 -2152959 -2439225 -1758467 -791264 753032
37502 753032 3050636 4672085 4092158 2371521 2242864 4090909 4883994 2352821 -1434415
37493 -1434415 -2617852 -692433 1234849 1156646 622044 1694536 3637775 4225166 2994429
37484 2994429 1494195 1032293 1652033 2815915 3760298 3596047 2325209 1382660 1957754
37475 1957754 3190330 3285052 1957247 374852 -870922 -2078336 -2980188 -2805791 -1888611
37466 -1888611 -1479865 -1698319 -1314365 82119 1355022 1742346 1869863 2191492 1972200
37457 1972200 698670 -766190 -1285390 -689425 627206 2191329 3047906 2202332 95594
37448 95594 -1611656 -2240460 -2676193 -3288668 -3046192 -1539304 -75287 385207 661315
37439 661315 1425912 1598004 283593 -1268470 -1533381 -1196217 -1760693 -2809006 -2828521
37430 -2828521 -1941835 -1565319 -1847351 -1653667 -895373 -766054 -1592744 -2333895 -2404229 -2276736
37420 -2276736 -2005286 -821743 1265234 2855732 2832423 1739604 994891 1381900 2592467
37411 2592467 3713413 4022483 3626826 3143821 2576296 1249595 -649704 -1562286 -606745
37402 -606745 846504 980050 92770 -116089 868135 2109418 2987720 3555223 3554405 2809941
37392 2809941 2294332 3046339 4230430 4040030 2399460 971547 557410 373176 -34032
37383 -34032 -90701 328567 557368 575860 1051793 1696436 1403206 314601 -165956 211073
37373 211073 150896 -661206 -817061 264498 1240494 1344934 1820258 3456364 4695875
37364 4695875 3936385 2135406 1306605 1666366 2027337 1969559 1833103 1323082 -146740
37355 -146740 -2118294 -3456885 -3729264 -3236786 -2240531 -1090485 -445631 -422423 -236144
37346 -236144 468702 863596 448569 197562 963167 1818423 1473849 451369 225749
37337 225749 880457 1291904 1196144 1418108 2228104 2906022 2847417 1948657 192660 -1972533
37327 -1972533 -3260774 -2878445 -1892100 -1941902 -2927671 -3351064 -2615840 -1485966 -516759
37318 -516759 365989 850203 453708 -223472 -82838 575777 432305 -449769 -486909 719152
37308 719152 1456790 489043 -1158099 -1961004 -1851859 -1292963 20398 2052680 3315224
37299 3315224 2572611 793936 -230246 -437919 -865062 -1117063 263801 2843302 3992311
37290 3992311 2385272 3127 -552327 652331 1697964 1826667 1869230 2177387 2013445
37281 2013445 1137601 371011 112561 -277432 -978462 -1017727 -54548 464551 -672112
37272 -672112 -2286112 -2346953 -981876 -105031 -424956 -850002 -846816 -1190531 -1909549 -1689978
37262 -1689978 -283427 511242 -432194 -1694811 -1717944 -1345622 -1970059 -2596320 -1236095
37253 -1236095 1579212 3233218 2726009 1550043 811876 -131094 -1640966 -2621982 -2364428
37244 -2364428 -1825971 -1954190 -2124902 -1437518 -474133 -511749 -1640159 -2719180 -2817342
37235 -2817342 -1956827 -832378 -387512 -1240130 -2952105 -4176362 -3924638 -2414058 -557827
37226 -557827 824853 1212599 637496 44609 538446 1842580 2393877 1531824 665687
37217 665687 1423284 3380649 4619039 4053559 2254321 334860 -936602 -1076304 -20281
37208 -20281 1433858 2092205 1660732 1147583 1664367 3089254 4177236 3879870 2372641
37199 2372641 792167 106613 379402 1057456 1597059 1600040 806444 -452845 -1075834
37190 -1075834 -252890 1328165 2174257 1987663 2039676 3195498 4517594 4525044 3127020
37181 3127020 1475603 369721 -339412 -1019673 -1760791 -2537133 -3174821 -3142303 -1987647
37172 -1987647 -108448 1386337 1759578 1307055 857685 871147 1122164 1113424 721230 426434
37162 426434 759353 1459157 1505485 317392 -1260677 -1639207 -268186 1581495 2103587
37153 2103587 920767 -578678 -991029 -572301 -608914 -1308429 -1307251 269646 2195456
37144 2195456 2586906 1400784 259943 33113 -11583 -516094 -986587 -1024526 -1256117
37135 -1256117 -2060443 -2422654 -1278717 653191 1633598 1140169 161580 -559219 -1304739
37126 -1304739 -2209768 -2484565 -1498582 9790 585369 -218562 -1329378 -1495871 -771435
37117 -771435 -300128 -720273 -1306375 -1004869 117368 1036708 1112221 573806 -113858 -512326
37107 -512326 21278 1686827 3246840 2992604 1183726 218311 1579341 3809846 4517442
37098 4517442 3251172 1192320 -844989 -2462930 -2652584 -800462 1546565 1956145
37090 1956145 361381 -746977 209722 1914435 2310388 1228184 -80287 -818054 -953281
37081 -953281 -483309 538407 1679932 2589228 3397280 4186090 4627328 4632797 4650069 4687371
37071 4687371 3809905 1483948 -1165038 -2437402 -2070900 -1234746 -752694 -331483 429875
37062 429875 1214693 1518932 1417155 1400085 1664234 1774821 1064965 -477844 -1739446
37053 -1739446 -1427888 176579 1042819 -343110 -3005492 -4691672 -4729711 -4470570 -4854256
37044 -4854256 -4965890 -3730470 -1910704 -1203079 -1850114 -2398660 -1822167 -782571 -422235
37035 -422235 -766649 -989642 -788089 -730885 -1284354 -2074598 -2329688 -1773672 -889008 -408163
37025 -408163 -652415 -1300691 -1722368 -1510791 -668980 623360 2114150 3227742 3155657
37016 3155657 1742590 103535 -326151 554789 1465569 1542908 1396492 1852851 2417008
37007 2417008 1918714 275856 -1426500 -2469657 -3040581 -3195835 -2484861 -1035223 83551
36998 83551 314596 552207 1751743 3363420 4228899 4426764 4873388 5386933 4720326
36989 4720326 2716702 903465 333003 216132 -368155 -689532 310550 1835442 2120433
36980 2120433 1134426 586363 1158978 1575908 985076 484874 1133609 1890717 1135419
36971 1135419 -672031 -1589087 -1023167 -235946 -83768 -5939 344451 98158 -1297583
36962 -1297583 -2721607 -2665345 -1225899 140859 448784 -44648 -604069 -827176 -797874
36953 -797874 -915042 -1449723 -2021755 -1885322 -1032247 -468254 -898780 -1688466 -1807054 -1365963
36943 -1365963 -1394981 -2322160 -3470611 -3984075 -3548263 -2237776 -368225 1363648 2150157
36934 2150157 1712946 444361 -1033589 -2173530 -2553472 -2062534 -1022819 84843 846962
36925 846962 809978 -248002 -1563564 -1641575 -8584 1870804 2311967 1525736 989611
36916 989611 1192756 1326939 1000601 763149 743243 195803 -1072575 -2008837 -1734113 -792688
36906 -792688 -333122 -689310 -1286441 -1421416 -805059 151136 491882 -142270 -588467 582745
36896 582745 2843048 4068565 3409001 2275385 1888757 1547784 409169 -678482 -756194
36887 -756194 -833125 -2313997 -4132026 -3741619 -911362 1570216 1459371 -339945 -1444178
36878 -1444178 -928663 315170 1253187 1708978 1974185 2140513 1974829 1357052 720321
36869 720321 636688 730290 -328579 -3009448 -5635948 -5976989 -3928376 -1568943 -640942
36860 -640942 -1080800 -2050981 -3094368 -3795000 -3440420 -1859262 3574 1012904 1024485
36851 1024485 798995 1109423 2162069 3484924 4188671 3715516 2438298 1205107 443597
36842 443597 165540 430263 925311 502633 -1513378 -3617707 -3311963 -421751 2250643
36833 2250643 2278943 279416 -1579798 -2365106 -2524193 -2382372 -1884615 -1211071 -575007
36824 -575007 6652 -15057 -1655600 -4591296 -6611385 -6244585 -4779277 -4064463 -3594270
36815 -3594270 -1974739 -150423 -227635 -1526440 -1125381 1250807 2254337 82053 -2500728
36806 -2500728 -2329279 -398937 350180 -239450 -142601 736551 393962 -1529182 -2838886
36797 -2838886 -2110807 -450975 813368 2056381 3917840 5671632 6263394 5780614 4813286
36788 4813286 3324511 1171608 -985573 -2175242 -2013962 -680261 1207640 2280995
36780 2280995 1145789 -1746595 -3941895 -3664184 -1836110 -524300 -344078 -583750 -953276
36771 -953276 -1604071 -1947446 -1173530 146243 523132 -280063 -959441 -760662 -479793
36762 -479793 -963047 -1836397 -2265770 -1956064 -924107 679346 1987983 1742109 -35100
36753 -35100 -1541310 -1199744 448987 1522782 896630 -1000042 -2811685 -3146757 -1571196
36744 -1571196 717178 1940686 1920856 2188498 3358736 3827034 2237872 -133882 -1171928
36735 -1171928 -1036324 -1465544 -2644769 -3059396 -2306365 -1738643 -2005276 -2094481 -1401468
36726 -1401468 -753774 -639384 -339925 296507 185022 -786737 -891173 648577 1991708
36717 1991708 1641031 1102678 2160031 3232810 1651771 -1414379 -1919127 1172468 4473480
36708 4473480 5385810 5319493 6185271 6800012 5286554 2856353 2267920 3627190 4440775
36699 4440775 3413282 1779904 839735 279071 -580833 -1440972 -1543325 -592357 1081760
36690 1081760 2526919 2527874 977570 -371647 213580 1991351 2592807 1255759 -452328
36681 -452328 -1340879 -2164939 -3778976 -5416032 -5875722 -5090990 -3480007 -1104033 1302244
36672 1302244 1882264 -25727 -2153162 -1847429 265103 1209778 -45926 -1463086 -1320977
36663 -1320977 -506501 -545059 -1227425 -1516960 -1434724 -1538705 -1485764 -707823 51958 -459783
36653 -459783 -1809706 -2118435 -829405 249315 -505494 -2083813 -2199459 -554340 669117
36644 669117 -246338 -2266206 -2912318 -1175873 1599505 3317470 2865391 602678 -1915021
36635 -1915021 -2773909 -1359402 549270 395477 -1926048 -3518862 -2019745 1280336
36627 1280336 3092661 2230262 499082 -276490 -372517 -841136 -1524131 -1402840 -205246
36618 -205246 1254116 2115222 2324206 2507937 3129079 3667852 2957535 817472 -1157016
36609 -1157016 -1460780 -960472 -1793000 -3966261 -4948651 -3335614 -1018851 -327018 -607536
36600 -607536 396859 2771386 4241264 3476649 1555519 -23289 -966108 -1352642 -792850
36591 -792850 720704 2181273 2600958 2016883 1000906 -104923 -1029311 -1400487 -1263327
36582 -1263327 -1217265 -1671396 -2469526 -3356342 -4013468 -3530736 -1042804 2574744 4847281
36573 4847281 4434882 2737208 1781138 1545136 773978 -405282 -596948 310441 664565
36564 664565 -370411 -1383544 -788368 877300 1842632 1521874 902953 943812 1639139
36555 1639139 2524055 3186516 3271440 2724247 2075145 1857968 1799166 1292745 608092 670344
36545 670344 1456304 1676674 627137 -587276 -551543 447579 996408 716832 620228 1334081
36535 1334081 2153474 2164342 1379573 389136 -289888 -127083 1244228 3102827 3655552
36526 3655552 1853737 -1233556 -3609048 -4481509 -4401566 -3748937 -2325371 -485411 593574
36517 593574 384796 -66249 539881 1992864 2931085 2739337 2183859 1975008 1564773
36508 1564773 75828 -2046184 -3287946 -3021111 -2257778 -2064145 -2130937 -1693438 -1075439
36499 -1075439 -1098920 -1373576 -646858 1052065 2054492 1340899 8034 -203298 1099339
36490 1099339 2996762 4285992 3899739 1486160 -1582508 -2940847 -2017398 -981906
36482 -981906 -1736772 -3199253 -3169707 -1758738 -861600 -952658 -783758 -49983 132880 -282939
36472 -282939 253543 2087377 3175269 1952193 -364398 -1745707 -2178567 -2918046 -3985857
36463 -3985857 -4188289 -3177800 -1978826 -1530892 -1811732 -2367369 -2788753 -2617599 -1544023
36454 -1544023 78186 1288804 1248569 -88411 -1836549 -2759931 -2403216 -1626573 -1523167
36445 -1523167 -1951767 -1930005 -1384728 -1393792 -2464036 -3714701 -4211371 -4020709 -3417010 -2180947
36435 -2180947 -409697 1014191 1563578 1742563 1897003 1423772 43563 -1271141 -1751993
36426 -1751993 -2156835 -3325825 -4354506 -3739158 -1707796 120943 969274 1311353 1378184
36417 1378184 770231 -479550 -1750988 -2775973 -3702707 -4396528 -4732900 -5283409 -6476914
36408 -6476914 -7321427 -6315986 -3554333 -622684 1495709 3022394 3981220 3853078 2921639
36399 2921639 2379927 2533686 2287640 1074352 -34642 -15536 437736 -18907 -1430195
36390 -1430195 -2711998 -3279201 -3508558 -3750325 -3703555 -2937054 -1634422 -604150 -525610
36381 -525610 -1208282 -1803788 -1822898 -1494742 -890374 510837 2623571 3893392 2914672
36372 2914672 585820 -724113 -154001 815771 653385 -426380 -1339644 -1601729 -1328246
36363 -1328246 -692192 41384 579857 1011411 1544906 1857432 1574989 1282404 1813918
36354 1813918 2514758 1755206 -445753 -1954595 -1473703 -464503 -1018348 -2991789 -4464606
36345 -4464606 -4149470 -2208459 547890 3115726 4508322 4510327 3802703 2730767 801768
36336 801768 -1794963 -3288744 -2317206 -71931 1049482 530045 -3285 583806 1557461
36327 1557461 1808731 1422817 1175797 1284529 1283401 805374 105137 -106388 712928 2371558
36317 2371558 4018023 4756441 4063814 1906882 -923559 -2780313 -2482627 -857457 82003
36308 82003 -218974 -283149 805397 1733423 991928 -708405 -1551691 -1264858 -1057812 -1462750
36298 -1462750 -1799317 -1543959 -847972 170006 1424935 2276296 2009634 738577 -1031525
36289 -1031525 -3162058 -5104862 -5245095 -2791320 189998 709797 -1194040 -2491559
36281 -2491559 -1403294 486926 999067 195727 -656259 -1255771 -1980841 -2639449 -2908914
36272 -2908914 -3180737 -3723514 -3706530 -2281952 -157619 1032892 665191 -426956 -1137053
36263 -1137053 -967124 -47994 1006288 1531034 1627139 2102708 3090176 3446685 2387405
36254 2387405 1029459 1103949 2501405 3424407 2926611 1934966 1448989 1046816 -59070
36245 -59070 -1474388 -2180717 -2114739 -2116079 -2461697 -2503787 -1955505 -1574741 -2016174 -2725568
36235 -2725568 -2762964 -2249168 -2022402 -2095141 -1667368 -846901 -987901 -2523102 -3631257
36226 -3631257 -2407636 304768 1826976 1216391 248441 424899 626892 -1074027 -4227483
36217 -4227483 -6100134 -4835463 -1378176 1982956 4052982 5079540 5261607 4042557
36209 4042557 1290712 -1558064 -2523686 -1288927 408869 871608 206307 -411317 -427948
36200 -427948 -111308 270646 466088 -107355 -1579490 -2752120 -2281877 -752369 -233491
36191 -233491 -1440673 -2618474 -1950839 -40690 996790 330469 -689254 -336525 1444267
36182 1444267 2957442 2560112 522373 -1073910 -567951 1380784 2644645 2175997 979533
36173 979533 615090 1557714 3111155 4103703 3522718 1350173 -923958 -1392334 328581
36164 328581 2802274 4404477 4457231 2933449 401876 -1489039 -956642 1785698 4503633
36155 4503633 5627993 5672709 5363770 4087800 1522226 -711659 -885493 276487 751759
36146 751759 308990 483325 1750355 2782988 2781166 2664033 3184795 3303747 1555393
36137 1555393 -1668523 -4164737 -4137813 -1962406 249270 797509 149720 264345 2019939
36128 2019939 3964866 4194849 2821632 1637866 1727509 2455529 2682441 2009284 832542
36119 832542 -15076 269115 1595643 2729617 2655072 1918304 1722915 2041636 1792287
36110 1792287 698350 -325489 -656978 -544393 -101602 900677 1944117 1841931 441646
36101 441646 -943959 -1325206 -1054360 -541209 603591 2212246 2731050 1167669 -1038135
36092 -1038135 -1619723 -466662 486489 162038 -387199 93822 1141908 1361775 442652
36083 442652 -490034 -446295 174093 229761 -568905 -1287003 -1120129 -531037 -479496 -915871
36073 -915871 -868512 47692 1068388 1385488 1072375 678069 570976 904935 1549989 1818971
36063 1818971 993469 -564327 -1527032 -1161335 -105589 665022 870875 663242 275898
36054 275898 361228 1652127 3652930 4604318 3484728 1234742 -609985 -1486335 -1325822
36045 -1325822 145337 2409201 3628909 2687499 946655 394169 776330 379246 -872889
36036 -872889 -1210969 71240 1488354 1576329 598862 -486657 -1359100 -2057466 -2546395
36027 -2546395 -3013791 -3563432 -3435228 -1808832 452730 1405829 726361 138377 625311
36018 625311 1083177 614153 169296 544260 614742 -611997 -1803138 -1345685 -279972
36009 -279972 -624293 -1634607 -683189 2277769 4212338 3672526 3127766 5104877 8250810
36000 8250810 9291489 7429295 4591723 2192021 1845 -1902278 -2414229 -1399799
35992 -1399799 -673587 -1680349 -3259543 -3211033 -1596637 -823049 -2220410 -4114335 -4225779
35983 -4225779 -2778878 -1764292 -1813266 -1651841 -641622 87628 -300741 -905952 -807530
35974 -807530 -693022 -1315256 -1685308 -700712 435794 -314615 -2445081 -3396405 -2393938
35965 -2393938 -1323510 -1368742 -1313319 -221724 550254 -320480 -1601757 -1235221 625963
35956 625963 2152421 2518493 2283928 1806011 1081938 774304 1641057 3014506 3344668
35947 3344668 2307806 1106833 645676 606985 451471 236017 181926 183323 -118552 -1171768
35937 -1171768 -3052918 -4697374 -4450527 -2328813 -737949 -1502687 -3087935 -2678627 -373527
35928 -373527 1056145 485048 -74329 1076719 2761649 3050228 2087002 1324581 1236076
35919 1236076 1229419 988544 712053 611128 971793 2044734 3280409 3528981 2566705
35910 2566705 1442166 758113 -175263 -1720504 -2755677 -2214764 -715024 432177 847991
35901 847991 703333 -159803 -1463649 -1880359 -621402 1134540 1744964 1263755 758973
35892 758973 358114 -396475 -955218 -376205 794992 1005385 -67786 -1325960 -2125616
35883 -2125616 -2664587 -2524577 -703058 2387687 4513746 4062044 1951853 450258 688266
35874 688266 1739450 1731994 -202005 -2710258 -3275038 -1105383 1536821 1840133 -220690
35865 -220690 -2222878 -2531681 -1725682 -922914 -295560 359827 816989 747336 134347 -874950
35855 -874950 -1979986 -2702071 -2927948 -3049648 -2872024 -1235665 2051076 4781223 4575405
35846 4575405 2000809 -319901 -1190795 -1391929 -1227425 -75674 1524256 1909874 939591
35837 939591 276536 519570 488646 -7269 577898 2426457 3271853 1991814 718948
35828 718948 1444531 2887462 2980945 2301743 2396589 2501603 896652 -1676659 -2920657
35819 -2920657 -2588598 -2388730 -2727815 -2298420 -831537 321506 578639 799629 1242030
35810 1242030 997922 -28452 -541598 87761 848940 808385 321442 -30994 -279373
35801 -279373 -273406 483625 1470098 1007386 -1475074 -4042791 -4219455 -1776885 1291254
35792 1291254 3137170 3580187 3451642 3199702 2522003 1246081 99466 10597 668860
35783 668860 656708 -566489 -1741533 -1628285 -830420 -690483 -1127719 -990818 -119811
35774 -119811 445294 174732 -422229 -946579 -1452324 -1619557 -959490 -8900 49162 -706054
35764 -706054 -723211 749860 2294037 1981529 -259935 -2543354 -2896329 -991358 1559835
35755 1559835 2508827 975128 -1806970 -3950382 -4705451 -4384818 -3297220 -1747020 -512307
35746 -512307 -104922 142822 1153071 2623259 3581658 3905284 3948166 3219800 1141387
35737 1141387 -1179061 -1786614 -528891 837890 1232194 1199620 1235583 1079974 978842
35728 978842 1740540 3049854 3507120 2837541 2290942 2373053 2094794 1106935 596829 1170514
35718 1170514 1657796 966638 -529305 -2208494 -3978927 -5091671 -4262888 -1982720 -606464
35709 -606464 -1056265 -1652196 -1368894 -1590706 -2929639 -3143089 -731085 1882796 1782799
35700 1782799 127480 -61894 965664 539278 -1394808 -2009039 -269257 1740079 2566336
35691 2566336 3172431 4194898 4401930 3077013 1529117 977648 884139 493360 262103
35682 262103 629881 881113 341202 -451237 -619634 -15452 1106161 2409808 3107138
35673 3107138 2410029 694326 -863307 -1885796 -2798412 -3389049 -3031031 -2330182 -2644609
35664 -2644609 -3795672 -4299832 -4113872 -4760262 -6165410 -6070541 -3753780 -1671988 -1678006
35655 -1678006 -2074001 -653025 1478938 1838901 748632 598790 1812653 2501084 1903198
35646 1903198 1457236 2158293 3081850 3026697 1886432 58915 -1892958 -2748766 -1468852
35637 -1468852 1069883 2680651 2597386 2150713 2405748 2795579 2698260 2656417 3022674 2871685
35627 2871685 1549171 194631 333518 1666311 2520656 1999902 572166 -996444 -2153884
35618 -2153884 -2388535 -1727530 -1205060 -1727309 -2660379 -2722635 -2084689 -2069088 -2630431 -1957390
35608 -1957390 545165 2541872 1634971 -1097591 -2386953 -1242406 -90187 -1118290
35600 -1118290 -3412248 -4721163 -4520169 -3853977 -3203869 -2280099 -1441055 -1471178 -1913990
35591 -1913990 -1379982 84075 642712 -495899 -1499490 -478576 1657077 2621575 2147089
35582 2147089 1901444 2362623 2101579 636778 -207842 981649 2828242 3095736 1816160
35573 1816160 748544 575441 589534 680064 1438847 2245471 1505964 -600671 -1771568
35564 -1771568 -1030145 -471532 -1979976 -4053218 -4093115 -2494522 -1782648 -2371005 -2117052
35555 -2117052 -225573 1281987 884949 -136326 -101007 390780 -126382 -1378923 -1942247
35546 -1942247 -1431067 -523953 377189 1063759 882917 -366577 -1605157 -1927274 -2092799
35537 -2092799 -3058148 -3913341 -3183381 -1519852 -917922 -1542664 -1604666 -445642 559709
35528 559709 583791 566554 1122082 1379041 959084 1112551 2542922 3903664 4055024 4182990
35518 4182990 5698998 7291446 6396482 3043553 -1918 -891258 -499065 -320884 -437640
35509 -437640 -315688 -168033 -468616 -994945 -1314707 -1647525 -2349871 -2920106 -2469413 -1169344
35499 -1169344 -361458 -856386 -1736629 -1505399 -161986 707908 97286 -1017467 -1102537
35490 -1102537 -247980 161907 -283310 -419992 502633 1547817 1685740 1640424 2781409
35481 2781409 4600375 4839839 2471909 -671578 -2026859 -1280882 -237933 -117061 -246909
35472 -246909 316399 1114512 1154310 631269 474794 526150 -289569 -1856242 -2609908 -2017867
35462 -2017867 -1619428 -2425266 -2884787 -1239609 1317909 2103585 933513 244785 1317203
35453 1317203 2754512 3040017 2287848 841095 -1523095 -3934612 -4220335 -1928857 222376
35444 222376 -327948 -2625942 -3907017 -3374029 -2337822 -1601269 -846742 -128843 34676
35435 34676 -78318 246508 638321 104557 -990592 -1052620 357406 1693221 1431016
35426 1431016 -228317 -2073362 -3252410 -3422840 -2436783 -616910 1050682 1571501 816894
35417 816894 -340571 -786182 -259096 283549 -208548 -1395015 -1905528 -1296932 -595495
35408 -595495 -479208 -209399 791198 1640710 1579819 1659783 3140846 5049421 5273715
35399 5273715 3676994 2168157 1756244 1439382 277511 -1156701 -1920929 -1912216 -1390301
35390 -1390301 -439267 581254 995123 677401 262386 269949 637247 1054752 1087181 261064
35380 261064 -1115950 -1692408 -732700 474821 194689 -1306427 -2439864 -2818611 -3110213
35371 -3110213 -2827265 -805086 1953744 2581963 316208 -2201192 -2668131 -1961904 -1898295
35362 -1898295 -2259029 -1856414 -952334 -650509 -900966 -842915 -413164 -157406 -40791 329335
35352 329335 822861 1045233 838519 -85806 -1943233 -3607372 -2990909 171429 3299691
35343 3299691 4070784 3235802 2868103 3163182 2843710 1691536 670936 218575 214137
35334 214137 953849 2367507 3061635 2130107 1161125 2204728 4365400 4944247 3602465
35325 3602465 2542545 2475741 1558006 -791478 -2064499 -384893 2359679 3258250 2484563
35316 2484563 2317421 3238040 3555374 2568842 1723234 2190111 3128526 3180698 2422090 1788772
35306 1788772 1342621 301783 -1368319 -2515204 -2344280 -1576341 -1313535 -1316537 -531056
35297 -531056 837316 1188756 -99414 -1534446 -1629945 -944774 -768284 -874917 -271670
35288 -271670 593100 410776 -453070 -146029 1678460 3055139 2518335 917544 -396249
35279 -396249 -1464279 -2665465 -3317429 -2797515 -1917407 -1646376 -1322719 264931 2569676
35270 2569676 3680009 2852495 1247222 130689 -397069 -722358 -876946 -726554 -233173
35261 -233173 707733 2075671 3297201 3671198 3279992 2811037 2460496 1785432 708485
35252 708485 -229803 -863378 -1706424 -2794507 -3115491 -1960021 -178954 817651 911770
35243 911770 1169499 2090127 3019997 3427085 3717385 4299868 4690279 4308638 3604680 3449349
35233 3449349 3623928 2930499 1023616 -713049 -663393 1119356 3057537 3831970 3486632
35224 3486632 2874753 2591325 2650955 2839459 2991168 2930843 2435556 1496654 571323 280904
35214 280904 708967 1241578 1333800 1161489 1142712 1106689 552330 -410963 -1147914 -1572672
35204 -1572672 -2275476 -3271645 -3507573 -2265725 -432694 417010 -124110 -1030048 -1214470
35195 -1214470 -574453 224129 536126 362254 398546 1219399 2304649 2433091 1305202
35186 1305202 59677 -270031 14967 258718 719396 1772629 2605416 2121067 789591
35177 789591 159747 615231 1019649 707649 424539 864113 1479959 1369568 463548 -685397
35167 -685397 -1524360 -1459475 4273 2467259 4512900 4907889 3640458 1629635 -87737
35158 -87737 -801793 -486564 16973 -211401 -973722 -1138764 -160943 1281914 2307028
35149 2307028 2670798 2373054 1325334 -137382 -1164667 -1293951 -871341 -284253 513019
35140 513019 1381492 1691046 1112044 108117 -704957 -1076095 -819101 133799 1078057
35131 1078057 905635 -400550 -1545819 -1670159 -1358963 -1399656 -1608157 -1592811 -1617489 -1839250
35121 -1839250 -1676807 -897160 -398241 -849904 -1403622 -889798 444405 1533480 2107887
35112 2107887 2510554 2578779 1989829 1140496 425216 -700537 -2510631 -3560103 -2271084
35103 -2271084 348277 1494009 170804 -1739896 -2234047 -1259982 371046 2320502
35095 2320502 4060241 4382777 2828283 723586 -250274 76648 701149 969861 902438
35086 902438 517564 -248106 -1150153 -1839988 -2338688 -2834272 -3162829 -2906537 -1913324 -460987
35076 -460987 938734 1720821 1534681 642894 -101296 16132 815637 1307335 647057
35067 647057 -856119 -1787009 -1100492 369617 537293 -1366052 -3522765 -3595703 -1551142
35058 -1551142 524666 1057277 327965 -637384 -1285311 -1462349 -1183587 -776351 -440488
35049 -440488 412647 2381123 4527618 4871673 2898796 446616 -540451 -134060 356812
35040 356812 235471 -394749 -1355476 -2212525 -2060714 -660585 663328 443714 -857982
35031 -857982 -1400198 -579388 116094 -706371 -2269075 -2561824 -981772 819789 981426
35022 981426 -204745 -659183 734082 2587171 2887389 1767329 1199520 2113501 3296998
35013 3296998 3546189 3385143 3662508 3732314 2563896 929107 712695 2082377 2952063
35004 2952063 1780271 -269639 -780471 898463 2857590 2815903 733192 -982163 -77879
34995 -77879 2773082 4430600 2937409 -5180 -1150913 222799 1771240 1600482 664829
34986 664829 836482 1927114 2110874 783967 -529263 -328036 962571 1833978 1746338
34977 1746338 1580656 2203856 3193865 3247873 1698104 -625212 -2194528 -2383948 -1977104
34968 -1977104 -1966455 -2299781 -2340665 -2229518 -2808989 -4014080 -4391937 -2974013 -843161
34959 -843161 235788 243920 611803 1638805 1870836 622785 -420074 627781 3050735
34950 3050735 4384403 3653608 2313765 1958098 2404010 2471838 1722023 845377 790530
34941 790530 1825949 3172872 3547885 2468638 935352 347509 946250 1913542 2636941
34932 2636941 2926493 2281084 313315 -1936957 -2532522 -1071872 584323 731660 -123356
34923 -123356 -493232 -143860 96994 28330 203571 671671 868213 765885 1004945 1634828
34913 1634828 1688590 538287 -920731 -1083998 479606 2411654 3001264 2024858 793384
34904 793384 348450 219561 -499862 -1399603 -1157378 366538 1656260 1598927 989430
34895 989430 1249786 2358087 2868436 1673553 -793858 -2913760 -3259544 -2033672 -1098104
34886 -1098104 -1869039 -3307754 -3153673 -1181496 330979 -211564 -1846304 -3146618 -4190682
34877 -4190682 -5051656 -4348251 -1484111 1193437 1082334 -771295 -1189701 272072 934582
34868 934582 -520480 -2209192 -2408462 -1989412 -2226154 -2510134 -1883013 -1067210 -1221408
34859 -1221408 -1908240 -1894891 -1091967 -351813 -82203 -204203 -769658 -1585036 -1909653 -1426236
34849 -1426236 -764817 -314600 422442 1350936 949959 -1604409 -4496578 -5184284 -3628598
34840 -3628598 -1911415 -1131368 -591598 55206 -114001 -1564450 -3243197 -3933826 -3488243
34831 -3488243 -2187942 -150435 1867741 2274356 415150 -2142218 -3241975 -2705901
34823 -2705901 -2207259 -2737901 -3356964 -2805086 -1425713 -679505 -1139031 -1847510 -1761867
34814 -1761867 -1065863 -587290 -470686 -202901 237371 145275 -776523 -1777266 -1994001
34805 -1994001 -1527963 -1102982 -1012103 -922620 -543755 -44172 146183 -283326 -1201900 -1928860
34795 -1928860 -1687670 -373232 1338592 2720591 3480821 3500389 2722180 1560800 747684
34786 747684 346761 -387481 -1643316 -2386858 -1982664 -1730709 -3379179 -6316755 -7765293
34777 -7765293 -6154044 -3049289 -1008836 -504480 -14398 1408101 2958927 3568120 3402076
34768 3402076 3176324 2692834 1201542 -839166 -1620092 -298181 1465393 1451453 -111367
34759 -111367 -925891 -6867 933851 128258 -1650985 -2318180 -1360344 -139646 206200
34750 206200 -140745 -545192 -761322 -848688 -1089402 -1978866 -3516598 -4560455 -3733467
34741 -3733467 -1075872 1876580 3690032 4089072 3517640 2451459 1288895 309950 -430222
34732 -430222 -864068 -778678 -324094 -168467 -449402 -144946 1480050 3313072 3622220
34723 3622220 2516473 1584837 1183831 9230 -2208957 -3594419 -2788502 -1086812 -491776
34714 -491776 -867152 -622255 645682 1908901 2657492 3388781 4140636 4024245 2609750
34705 2609750 727219 -550331 -985969 -900312 -465354 258832 914175 891511 -121118
34696 -121118 -1602665 -2335683 -1555234 -131170 48383 -1607268 -3304594 -2913819 -698656
34687 -698656 990554 637642 -818110 -1440803 -524801 992592 1752362 1231754 101942
34678 101942 -492852 -228964 -40844 -835287 -2032725 -2214450 -1213916 -548564 -1353704
34669 -1353704 -2764229 -3067669 -1886611 -394251 351202 460145 580140 883748 972059
34660 972059 494999 -339032 -812607 -308847 969367 1970988 1730343 354796 -1065728
34651 -1065728 -1512936 -865626 248281 1170391 1711212 2095306 2538471 2901723 2824400
34642 2824400 2249406 1671586 1647682 2100168 2364977 1977069 1128688 206034 -800238
34633 -800238 -2040734 -3143169 -3373427 -2634121 -1839997 -1912715 -2673869 -3178457 -2972013
34624 -2972013 -2462481 -2058005 -1610760 -1041936 -951472 -1958809 -3619686 -4647854 -4359494
34615 -4359494 -3460817 -3150727 -3712329 -4303911 -4067066 -3148049 -2465033 -2542445 -2809033 -2262907
34605 -2262907 -756265 757803 1433988 1572265 1940790 2317955 1550290 -692838 -3000500
34596 -3000500 -3701810 -2780754 -1530323 -648633 231914 1100001 989002 -408850 -1559989
34587 -1559989 -713926 1721901 3582316 3556033 2287456 932433 -80459 -548510 -109730
34578 -109730 847600 926889 -621859 -2679969 -3644361 -3450189 -3241886 -3573755 -4061495
34569 -4061495 -4449032 -4808305 -4823966 -4049248 -2876001 -2173498 -1938889 -1380618 -371206
34560 -371206 351690 549342 798546 1211507 1183862 845845 1335797 2873025 3889431
34551 3889431 3136259 1592593 1100702 1911046 2774769 2849555 2294010 1360778 66034
34542 66034 -1336682 -2389535 -2858605 -2674057 -1892558 -1183081 -1566546 -2908131 -3490080
34533 -3490080 -2084276 285186 1720906 1810582 1366789 665509 -418856 -1151369 -731977
34524 -731977 -100197 -960368 -2950464 -3788898 -2599542 -1102746 -823125 -1036180 -546092
34515 -546092 199421 185155 -220360 125716 1353449 2650378 3473900 3570718 2426176
34506 2426176 -58510 -2690479 -3924365 -3568317 -2728390 -2264027 -2112073 -1965634 -1762377
34497 -1762377 -1418487 -695079 481508 1813823 2771180 2914936 2322389 1638959 1271343
34488 1271343 658436 -909732 -2829261 -3626055 -3027001 -2302329 -2109042 -1469521 244607
34479 244607 1799070 1884375 1156870 900890 730549 -428766 -1806494 -1520056 264238
34470 264238 1163546 48099 -1318958 -1012941 332806 809395 119163 -259098 642559
34461 642559 2052706 2615419 2020244 1146111 837229 917959 695128 251712 499431 1618735
34451 1618735 2292695 1328117 -585486 -1780899 -1814105 -1576296 -1562231 -1424442 -1142442
34442 -1142442 -1125362 -969245 392383 2840074 4682112 4662332 3236333 1480641 57671
34433 57671 -281482 1206970 3674023 4595546 2579220 -691762 -2451412 -1914335 -323589
34424 -323589 1044572 1687999 1608401 1553402 2672016 4571974 4722065 1541619 -2757716
34415 -2757716 -4527895 -3390549 -2260916 -2791989 -3404572 -2445039 -782741 32830 151952
34406 151952 309108 -57407 -1621227 -3148136 -2689250 -349095 1901014 2935494 3285970
34397 3285970 3255064 2059889 -489158 -2841884 -3221703 -1566736 734420 2410854 2945209
34388 2945209 2248542 615453 -1137530 -2177002 -2345051 -1997122 -1340997 -439005 281789
34379 281789 212008 -574143 -1183909 -955782 -247302 204818 402573 1053691 2493707 4111488
34369 4111488 4957355 4603361 3303008 1634166 189988 -644977 -912378 -972290 -974111
34360 -974111 -574154 556296 2034716 2904863 2530151 1157072 -392773 -1331563 -1220091
34351 -1220091 -103517 1394627 2385732 2499377 2281063 2517621 3246385 3789358 3739180
34342 3739180 3425587 3227658 2916085 2095023 949523 16525 -569385 -970244 -892940
34333 -892940 256374 2271355 3950824 4408255 3938324 3121109 1802986 -236840 -2202577
34324 -2202577 -2987527 -2789586 -2899235 -3718128 -3987785 -2407670 698847 3741176 5303173
34315 5303173 4906390 2993714 696364 -760969 -889538 -63090 1173106 2453880 3287685
34306 3287685 3199339 2458565 1930556 1863426 1578176 706812 -198196 -830832 -1856812 -3594770
34296 -3594770 -4927994 -4702586 -3517977 -2872699 -3050507 -3163658 -2878195 -2644308 -2421274
34287 -2421274 -1714096 -941993 -1253757 -2659477 -3722122 -3562142 -2916815 -2712404 -2840942
34278 -2840942 -2984737 -3391759 -3944658 -3572456 -1710070 446817 1286690 862151 571708
34269 571708 1124976 1845310 1872513 1199642 445234 128726 211978 143738 -417686 -847306
34259 -847306 -142566 1452705 2286236 1444560 268360 705335 2634327 3943391 3131960
34250 3131960 870808 -1054704 -1567743 -975134 -434968 -869363 -2059374 -2895776 -2733111
34241 -2733111 -2070545 -1539552 -888839 321937 1633548 2222774 2094943 1811281 1452000
34232 1452000 859496 464120 677169 847139 182250 -600770 -166549 1006357 951088
34223 951088 -729824 -2054943 -1610365 -436529 97398 500734 1662274 2619689 1876504
34214 1876504 140096 -368499 863938 2035779 1843159 1157844 1261682 1800180 1516757
34205 1516757 258776 -793969 -739910 -48528 155705 -472407 -1193797 -1360456 -1377022
34196 -1377022 -1896239 -2404643 -1721138 -44201 845967 144799 -530795 502669 2293052
34187 2293052 2629701 1453110 841067 1668499 2403879 1804307 919025 1303226 2610088
34178 2610088 3272419 2762282 1966789 1726010 1907422 1724499 483865 -1611211 -3138314
34169 -3138314 -2678425 -785575 167554 -1219452 -3611353 -4771941 -4289633 -3460502 -3234423
34160 -3234423 -3508029 -3950531 -4308843 -4210632 -3722268 -3680841 -4372175 -4468652 -2739037 -376064
34150 -376064 132992 -1627574 -3571678 -4200523 -4192400 -4374606 -4083906 -2678694 -1146286
34141 -1146286 -855981 -1755108 -2931764 -3949885 -4498861 -3792899 -1707497 307804 856141
34132 856141 466822 486719 800813 222965 -1362729 -2937017 -4102448 -5156792 -5569628
34123 -5569628 -4318861 -1998069 -719730 -1315613 -2277447 -2213220 -1754403 -2005963 -2545359
34114 -2545359 -2313546 -1464948 -911492 -695987 -180601 540540 673679 820 -940416
34105 -940416 -1833243 -2710393 -3109216 -2170532 16191 1879253 1764849 -269042 -2335901
34096 -2335901 -2464466 -494715 1820872 2745846 2364054 1993520 2078134 1705562 455864
34087 455864 -475274 138852 1678874 2430463 1719780 324288 -845149 -1442919 -1328844
34078 -1328844 -568651 249125 587945 793825 1496355 2307348 2145655 938145 -12285
34069 -12285 360569 1697234 2856852 3011722 1956201 168689 -1178927 -1095277 13761
34060 13761 730146 454753 -42102 -220456 -777355 -2250327 -3577374 -3261061 -1528867
34051 -1528867 -133714 -59119 -506134 -423422 -121364 -713813 -2400360 -4031276 -4423693
34042 -4423693 -3599132 -2429207 -1397455 -274034 973061 1605298 930992 -634393 -1866630
34033 -1866630 -2008939 -1379257 -830807 -946276 -1581396 -1874526 -1006066 660868 1644633
34024 1644633 1123059 112270 29718 613362 464536 -646186 -1439660 -1112038 -210136
34015 -210136 710168 1806067 2848763 2905326 1901013 1159325 1474488 1903373 1477684
34006 1477684 804597 680779 382076 -985079 -2408279 -2233045 -985223 -831952 -2223544
33997 -2223544 -3094758 -1932631 71888 819024 -18422 -1154235 -1738945 -2173533 -3077498
33988 -3077498 -4186098 -4482085 -3341820 -1485236 -445377 -786715 -1288620 -514066 1209714
33979 1209714 2245471 1823353 712840 -248269 -1133769 -2130904 -2801071 -2700460 -2017142
33970 -2017142 -1096472 25742 1125590 1463352 637853 -565091 -810999 332967 1922932
33961 1922932 2603500 1912381 661485 20211 219926 459054 235626 153458 779888
33952 779888 1301180 437917 -1504375 -2782184 -2583625 -1968165 -1933614 -1779041 -358641
33943 -358641 1858784 3135422 2604582 1201280 514353 1255093 2731197 3406623 2213347
33934 2213347 -240915 -2030164 -1967305 -1016760 -1009845 -2161538 -2761405 -1531501 579300
33925 579300 1614179 1083472 274753 176959 206724 -467070 -1309701 -1244552 -549142 -506592
33915 -506592 -1241380 -1470592 -753835 -307774 -752845 -743350 776680 2453582 2527274 1812935
33905 1812935 2461067 4412423 5466929 4670212 3277770 2269745 1273151 327654 376152
33896 376152 1332761 1857754 1749547 2220643 2934688 1487399 -2560096 -5688569 -4750813
33887 -4750813 -1363585 504869 -129663 -917610 -137089 1587423 3031834 3547572 2717152
33878 2717152 748376 -990677 -1387279 -1065468 -1035023 -809580 342207 1404958 1194115
33869 1194115 935271 2515472 4867427 5257289 3912114 3841343 5620354 6022488 3192730
33860 3192730 -142308 -721992 612271 761646 -1028381 -2903384 -3559805 -3362917 -2856906
33851 -2856906 -1986594 -653339 1018132 2626989 3190850 1848787 -518583 -1652952
33843 -1652952 -745085 458908 289625 -687541 -1289895 -1697793 -2206005 -1756373 164318
33834 164318 1613299 623929 -1508323 -1962292 -660058 -5374 -695925 -792441 675295
33825 675295 1971850 1459616 -160020 -1521802 -2535414 -3377647 -3239717 -1587943 472256
33816 472256 1447998 1260023 741234 200435 -418232 -712115 -357727 10569 -427420 -1286278
33806 -1286278 -1323503 -110252 1384572 1894973 1057688 -439246 -1533544 -1639398 -1009029
33797 -1009029 -220915 522993 1216893 1451797 840659 23401 180997 1239129 1672372
33788 1672372 699602 -426021 -246138 735671 950144 191723 -264506 227311 828764
33779 828764 649951 -123771 -948575 -1830428 -2910136 -3746044 -3681010 -2735324 -1712703
33770 -1712703 -1444088 -2050891 -2829301 -2829737 -1793111 -600546 -533142 -1897716 -3532600
33761 -3532600 -3865833 -2446735 -329824 1079152 1469795 1761508 2768132 4075360 4641809
33752 4641809 4265027 3734452 3477647 2917251 1625840 386042 378764 1732790 3481774
33743 3481774 4526648 4090491 1937551 -885084 -2138954 -575829 2200803 3411232
33735 3411232 2520061 1455312 1399500 1338389 474766 24705 1103713 2405499 1969535
33726 1969535 306133 -360011 481046 1120057 614625 155565 796536 1615772 1258265
$$ [...]
##END NTUPLES=NMR SPECTRUM
##END=
