##TITLE=31Pdec_SA_PPhvCl(H2O)Cl
 CDCl3, 8 sc
 20.9.2019
##JCAMPDX= 6.0         $$ Bruker NMR JCAMP-DX V2.0
##DATA TYPE= NMR SPECTRUM
##DATA CLASS= NTUPLES
##ORIGIN= UXNMR, Bruker Analytische Messtechnik GmbH
##OWNER= root
$$ XWIN-NMR		Version 3.5
$$ Fri Sep 20 14:28:38 2019 Russian Standard Time (UT+4h)  she@DPX200
##.OBSERVE FREQUENCY= 81.013821
##.OBSERVE NUCLEUS= ^31P
##.ACQUISITION MODE= SIMULTANEOUS
##.ACQUISITION SCHEME= undefined
##.AVERAGES= 24
##.DIGITISER RES= 17
##SPECTROMETER/DATA SYSTEM= spect
##.PULSE SEQUENCE= zgpg30
##.SOLVENT NAME= DMSO
##.SHIFT REFERENCE= (INTERNAL, DMSO, 0, 182.463)
##AUDIT TRAIL= $$ (NUMBER, WHEN, WHO, WHERE, WHAT)
$$ ##TITLE= Audit trail, XWIN-NMR		Version 3.5
$$ ##JCAMPDX= 5.01
$$ ##ORIGIN= Bruker BioSpin GmbH
$$ ##OWNER= she
$$ F:/spectra/data/she/nmr/P31/1/pdata/1/auditp.txt
$$ ##AUDIT TRAIL=  $$ (NUMBER, WHEN, WHO, WHERE, WHAT)
(   1,<2019-09-20 14:27:01.70 +0400>,<she>,<DPX200>,
      <created by zg, POWCHK disabled, PULCHK disabled
       configuration hash MD5:
       00 E9 B6 7A A2 85 ED C7 34 08 36 98 17 FE 4E 26
       data hash MD5: 32K
       B2 D4 A6 5F 89 76 EA A8 8C 3C B7 B3 49 E2 44 2D>)
(   2,<2019-09-20 14:27:04.12 +0400>,<she>,<DPX200>,
      <Start of raw data processing
       efp BC_mod = 2 LB = 1 FT_mod = 6 PKNL = 1 PHC0 = -121.2632 PHC1 = -555.9997 SI = 64K 
       data hash MD5: 64K
       92 D9 89 B7 25 D0 79 15 7A 96 BE E0 BA 4F B9 F1>)
(   3,<2019-09-20 14:27:25.17 +0400>,<she>,<DPX200>,
      <pk PHC0 = -6.103541 PHC1 = 0 
       data hash MD5: 64K
       3A 48 7A F0 3D B9 9F BC A2 F5 7F EC 40 33 8B 53>)
(   4,<2019-09-20 14:27:28.10 +0400>,<she>,<DPX200>,
      <abs ABSG = 5 
       data hash MD5: 64K
       BD 69 30 82 7E 15 3F 79 07 0D 6C A7 58 44 88 3D>)
(   5,<2019-09-20 14:27:54.42 +0400>,<she>,<DPX200>,
      <pk PHC0 = -25.91078 PHC1 = 58.8 
       data hash MD5: 64K
       B1 4A C6 4B 3B 1B 81 5C 2F DB F9 D9 DA C8 E0 77>)
$$ ##END=
$$ 
$$ hash MD5
$$ 29 BC 9C 88 60 40 7F D4 F2 BD 2E BA 33 6C 9F E0
##$RELAX= 
##$RELAX= 
##$RELAX= 
##$RELAX= 
##$RELAX= 
##$RELAX= 
##$RELAX= 
##$RELAX= 
$$ Bruker specific parameters
$$ --------------------------
##$DU= <F:/spectra>
##$EXPNO= 1
##$NAME= <P31>
##$PROCNO= 1
##$TYPE= <nmr>
##$USER= <she>
##$AMP= (0..31)
100 100 100 100 100 100 100 100 100 100 100 100 100 100 100 100 100 100 
100 100 100 100 100 100 100 100 100 100 100 100 100 100 
##$AQSEQ= 0
##$AQ_mod= 1
##$AUNM= <au_zg>
##$AUTOPOS= <>
##$BF1= 81.014009
##$BF2= 200.13
##$BF3= 200.13
##$BF4= 200.13
##$BF5= 200.13
##$BF6= 200.13
##$BF7= 200.13
##$BF8= 200.13
##$BYTORDA= 1
##$CFDGTYP= 0
##$CFRGTYP= 5
##$CHEMSTR= <none>
##$CNST= (0..31)
1 1 145 1 1 1 1 1 1 1 1 1 1 1 1 1 1 1 1 1 1 1 1 1 1 1 1 1 1 1 1 1 
##$CPDPRG= <waltz16>
##$CPDPRG1= <>
##$CPDPRG2= <waltz16>
##$CPDPRG3= <>
##$CPDPRG4= <mlev>
##$CPDPRG5= <mlev>
##$CPDPRG6= <mlev>
##$CPDPRG7= <mlev>
##$CPDPRG8= <mlev>
##$CPDPRGB= <>
##$CPDPRGT= <>
##$D= (0..31)
0 1 0 0 0 0 0 0 0 0 0 0.03 2e-05 3e-06 0 0 0 0 0 0 0 0 0 0 0 0 0 0 0 0 
$$ [...]
##$SUBNAM3= <"">
##$SUBNAM4= <"">
##$SUBNAM5= <"">
##$SUBNAM6= <"">
##$SUBNAM7= <"">
##$SUBNAM8= <"">
##$SUBNAM9= <"">
##$SW= 369.568048894756
##$SWIBOX= (0..15)
0 1 3 0 0 0 0 0 0 0 0 0 0 0 0 0 
##$SW_h= 29940.119760479
##$TD= 32768
##$TD0= 1
##$TE= 0
##$TE2= 300
##$TE3= 300
##$TEG= 300
##$TL= (0..7)
0 120 53 12 22 120 120 120 
##$TP= (0..7)
150 150 150 150 150 150 150 150 
##$TP07= 0
##$TPNAME0= <>
##$TPNAME1= <>
##$TPNAME2= <>
##$TPNAME3= <>
##$TPNAME4= <>
##$TPNAME5= <>
##$TPNAME6= <>
##$TPNAME7= <>
##$TPOAL= (0..7)
0.5 0.5 0.5 0.5 0.5 0.5 0.5 0.5 
##$TPOFFS= (0..7)
0 0 0 0 0 0 0 0 
##$TUNHIN= 0
##$TUNHOUT= 0
##$TUNXOUT= 0
##$USERA1= <user>
##$USERA2= <user>
##$USERA3= <user>
##$USERA4= <user>
##$USERA5= <user>
##$V9= 5
##$VALIST= <valist>
##$VCLIST= <CCCCCCCCCCCCCCC>
##$VD= 0
##$VDLIST= <DDDDDDDDDDDDDDD>
##$VPLIST= <PPPPPPPPPPPPPPP>
##$VTLIST= <TTTTTTTTTTTTTTT>
##$WBST= 1024
##$WBSW= 4
##$XGAIN= (0..3)
0 0 0 0 
##$XL= 0
##$YL= 0
##$YMAX_a= 87321
##$YMIN_a= -98006
##$ZGOPTNS= <>
##$ZL1= 120
##$ZL2= 120
##$ZL3= 120
##$ZL4= 120
##$ABSF1= 182.463
##$ABSF2= -187.1042
##$ABSG= 5
##$ABSL= 3
##$ALPHA= 0
##$AQORDER= 0
##$ASSFAC= 0
##$ASSFACI= 0
##$ASSFACX= 0
##$ASSWID= 0
##$AUNMP= <proc_1d>
##$AZFE= 0.1
##$AZFW= 0.5
##$BCFW= 0
##$BC_mod= 2
##$BYTORDP= 0
##$COROFFS= 0
##$CY= -3
##$DATMOD= 1
##$DC= 0
##$DFILT= <>
##$DTYPP= 0
##$F1P= 0
##$F2P= 0
##$FCOR= 1
##$FTSIZE= 65536
##$FT_mod= 6
##$GAMMA= 0
##$GB= 0
##$INTBC= 1
##$INTSCL= 5.30512e-09
##$ISEN= 30
##$LB= 1
##$LEV0= 0
##$LPBIN= 0
##$MAXI= 10000
##$MC2= 0
##$MEAN= 0
##$ME_mod= 0
##$MI= 50
##$NCOEF= 0
##$NC_proc= -4
##$NLEV= 6
##$NOISF1= 182.463
##$NOISF2= 159.3651
##$NSP= 0
##$NTH_PI= 0
##$NZP= 0
##$OFFSET= 182.463
##$PC= 4
##$PHC0= -153.2775
##$PHC1= -497.1997
##$PH_mod= 1
##$PKNL= yes
##$PPARMOD= 0
##$PSCAL= 0
##$PSIGN= 0
##$REVERSE= no
##$SF= 81.0140089999434
##$SI= 65536
##$SIGF1= 159.3651
##$SIGF2= -187.1042
##$SINO= 113.3802
##$SIOLD= 16384
##$SREGLST= <1H.CDCl3>
##$SSB= 0
##$STSI= 65536
##$STSR= 0
##$SW_p= 29940.119760479
##$SYMM= 0
##$S_DEV= 0
##$TDeff= 32768
##$TDoff= 0
##$TI= <>
##$TILT= no
##$TM1= 0
##$TM2= 0
##$TOPLEV= 0
##$USERP1= <user>
##$USERP2= <user>
##$USERP3= <user>
##$USERP4= <user>
##$USERP5= <user>
##$WDW= 1
##$XDIM= 65536
##$YMAX_p= 342268889
##$YMIN_p= -7946535
$$ End of Bruker specific parameters
$$ ---------------------------------
##NTUPLES= NMR SPECTRUM
##VAR_NAME=  FREQUENCY,     SPECTRUM/REAL,   SPECTRUM/IMAG
##SYMBOL=    X,             R,               I
##VAR_TYPE=  INDEPENDENT,   DEPENDENT,       DEPENDENT
##VAR_FORM=  AFFN,          ASDF,            ASDF
##VAR_DIM=   65536,         65536,           65536
##UNITS=     HZ,            ARBITRARY UNITS, ARBITRARY UNITS
##FACTOR=    0.456856943014862, 1,           1
##FIRST=     14782.0589164792, 0,            0
##LAST=      -15158.0608439998, 0,           0
##MIN=       -15158.0608439998, -7946535,    0
##MAX=       14782.0589164792, 342268889,    0
$$ Real data points
##PAGE= N=1
##DATA TABLE= (X++(R..R)), XYDATA
$$ [...]
42053 -1380129 -1530292 -1047439 -257800 381073 606651 523862 455482 551050 601515 336209
42043 336209 -186288 -634571 -784508 -666771 -379230 30048 453147 682738 597677 319814
42033 319814 113673 133871 263192 200885 -206676 -690887 -761829 -299277 207252 197992
42023 197992 -294496 -749605 -826574 -638181 -398581 -143463 115564 255513 216168 102796
42013 102796 -18327 -239991 -597049 -903079 -949467 -736062 -398850 -58205 169526 201844
42003 201844 157517 290662 602148 741249 514389 271724 468118 969125 1154586 706182
41993 706182 -19136 -450016 -368880 58638 569105 946092 1021849 730087 179385 -383697
41983 -383697 -716727 -731507 -543923 -346560 -206962 -51250 132590 193954 1108 -373872
41973 -373872 -724356 -861604 -669246 -209336 137436 -88284 -834051 -1434199 -1374922 -926674
41963 -926674 -675393 -668207 -506426 -140289 19200 -176455 -330856 -111780 314228 647990
41953 647990 835189 858696 571106 28980 -353791 -300533 -30025 165710 383125 794311
41943 794311 1163943 1118977 734033 428245 366609 336863 172208 -40444 -160378 -128051
41933 -128051 74904 372067 559290 541566 506310 639176 808059 795548 686420 694142
41923 694142 736398 556615 176262 -153790 -367727 -538885 -503196 -29661 621463 839827
41913 839827 490419 122829 193192 535535 804951 969545 1070694 941265 555917 311800
41903 311800 525778 905485 950870 682350 522207 590356 596288 399326 215534 192018
41893 192018 168335 1002 -195567 -309667 -469467 -787532 -1039130 -866583 -283398 234010
41883 234010 238233 -194238 -540588 -385151 163819 614685 579804 79600 -560241 -1001483
41873 -1001483 -1110587 -1014263 -966595 -1081392 -1203671 -1126652 -866778 -562017 -175789 412346
41863 412346 1000121 1097297 558137 -88294 -208240 197620 585453 581390 322815 132936
41853 132936 134085 240030 330937 326087 163611 -206521 -767981 -1325867 -1497631 -1013642
41843 -1013642 -111557 560578 595988 242872 14706 64432 172221 196410 221708 312487
41833 312487 423196 564156 783728 953136 839576 466473 143386 23729 -119316 -492577
41823 -492577 -858621 -777838 -215062 344279 448133 184348 6992 135555 311272 207981
41813 207981 -91761 -238467 -162106 -186363 -516291 -885074 -908998 -600546 -297561 -226111
41803 -226111 -372644 -654336 -931768 -955953 -635903 -317742 -441894 -895809 -1069174 -656883
41793 -656883 -72928 98024 -229811 -715074 -1059229 -1150732 -952186 -553167 -241742 -250999
41783 -250999 -460083 -555732 -463082 -407349 -538928 -697515 -627566 -310438 -4261 -2979 -381188
41772 -381188 -922283 -1275435 -1233730 -898287 -562650 -426986 -431437 -370568 -160111 36089
41762 36089 -24402 -382282 -832260 -1158154 -1295305 -1218850 -854935 -273531 175606 185538
41752 185538 -94009 -233776 -110633 -16232 -129113 -220859 -59150 202619 297685 269078
41742 269078 306399 324628 62781 -457250 -905571 -1075469 -1028520 -795384 -293789 335854
41732 335854 674297 562278 426693 719493 1183303 1096501 279105 -541347 -574201 84342
41722 84342 621184 494806 -40819 -387909 -302298 -25907 104743 25548 -39784 139595
41712 139595 493568 658579 397853 -23332 -77663 371011 865026 889693 391059 -360548
41702 -360548 -1137934 -1735246 -1839928 -1336843 -657260 -429836 -755919 -1144302 -1178025 -914943
41692 -914943 -597246 -348546 -279601 -511844 -877035 -919297 -473412 18627 71626 -180382
41682 -180382 -239515 -15252 71323 -244188 -674051 -791481 -584889 -400442 -448370 -560666
41672 -560666 -456095 -124798 152168 152978 -36018 -195398 -269568 -310625 -219169 161409 654433
41661 654433 778673 351381 -185265 -291373 -21004 86952 -268608 -804054 -1039070 -830491
41651 -830491 -457341 -283298 -395145 -563562 -561471 -464071 -517092 -748500 -919752 -884994
41641 -884994 -750345 -604966 -383425 -136557 -129261 -439563 -736051 -720409 -529584 -409942
41631 -409942 -289923 -54945 53799 -177251 -384269 -80965 439908 350363 -497598 -1271898
41621 -1271898 -1282979 -787461 -366410 -97384 194892 354626 157255 -136602 -88753 197425
41611 197425 227552 -61926 -186996 101822 430307 396235 137699 13266 24641 -66935
41601 -66935 -206136 -37425 518536 999749 895730 250297 -407152 -653782 -513415 -233035
41591 -233035 49627 303477 432087 302611 -74603 -526329 -875667 -1038362 -1004253 -842011
41581 -842011 -695722 -644611 -570942 -298080 128246 418356 326523 -117579 -640243 -885199
41571 -885199 -612757 70298 685363 787143 433405 80813 2298 33967 -46920 -164733
41561 -164733 -127408 50085 220713 373630 617596 962403 1286501 1481192 1497717 1302419
41551 1302419 914679 463002 109147 -61781 -43824 100766 204166 93181 -157779 -216660
41541 -216660 99216 519480 618477 341473 25661 -62150 17993 93724 113060 66551 -129291
41530 -129291 -493099 -800886 -724934 -189105 502837 950599 1035041 965493 980010 1090004
41520 1090004 1149638 1073244 885265 625112 336695 120608 54624 70517 44803 -12213
41510 -12213 -25346 -77629 -317322 -613658 -598092 -178683 249435 288653 2274 -306203
41500 -306203 -528003 -685008 -652870 -318354 106155 303398 326167 463629 654438 487067
41490 487067 -98071 -539483 -342907 273936 709883 710774 461478 146175 -197352 -452704
41480 -452704 -443221 -244426 -171830 -335329 -459152 -310535 -91031 -162607 -508188 -729729
41470 -729729 -560975 -147993 206080 350702 269623 -17270 -373402 -542248 -435018 -309225
41460 -309225 -435978 -675018 -655987 -360268 -201531 -434333 -779974 -832049 -602126 -407114
41450 -407114 -365906 -303069 -101768 138231 335896 570781 876144 1082457 1035154 856207
41440 856207 798325 871306 806625 443418 -25823 -329939 -512452 -835874 -1329070 -1682963
41430 -1682963 -1665012 -1397138 -1090347 -753194 -384804 -213100 -388683 -589968 -356327 213375
41420 213375 522201 295205 -73821 -122853 125372 394995 566438 613617 474833 266379
41410 266379 308077 620833 706963 216150 -430052 -527344 -31133 450641 511873 334938
41400 334938 236489 256783 269967 168682 -119838 -521119 -704155 -379282 277075 773441
41390 773441 867146 683899 336733 -155582 -534139 -356560 393888 1088847 1088930 396939
41380 396939 -462648 -984408 -963552 -495578 86050 413885 385650 176187 -66052 -336415
41370 -336415 -561008 -544463 -251893 86313 270494 321331 287160 118685 -147653 -351071
41360 -351071 -491964 -771357 -1171459 -1308653 -968028 -517880 -463973 -768065 -939365 -697915
41350 -697915 -243453 75058 83265 -193834 -576782 -784558 -638620 -249464 117911 344733
41340 344733 502002 622738 576665 219097 -381185 -894863 -975370 -629593 -269168 -224006
41330 -224006 -284124 -9178 532585 739372 320159 -246184 -366574 -100364 88727 70632
41320 70632 98756 275984 428048 483677 574651 703510 656114 359379 67536 51612 259231
41309 259231 392662 245165 -86497 -280917 -107167 295902 537258 427874 184007 90796
41299 90796 148408 204283 236439 281360 254456 109653 36181 201111 403947 303231 -79450
41288 -79450 -395583 -463673 -405518 -311704 -115729 158128 341385 396422 471373 602958 628203
41277 628203 481306 319909 238808 99825 -192688 -432842 -316156 179214 733270 970650
41267 970650 776598 390351 184935 290215 473355 456549 241241 592 -187981 -300947
41257 -300947 -226441 49238 243681 110465 -121021 -30387 314155 415497 132944 -77233
41247 -77233 120734 426859 381948 7857 -350267 -561808 -744232 -903253 -853719 -471737
41237 -471737 155156 787919 1146124 1061751 631118 129980 -263209 -526968 -591847 -337749
41227 -337749 123322 438255 439052 342669 372441 428436 327372 134745 24860 2518 -706
41216 -706 75483 278210 434018 330855 23180 -242383 -327558 -277716 -203283 -214627 -337440
41205 -337440 -385263 -118604 340963 528859 270758 -12271 64673 223782 -28613 -545472
41195 -545472 -669953 -176821 433542 651596 503858 236589 -110321 -540826 -821491 -697543
41185 -697543 -264755 131940 320028 426077 600150 787542 836881 741088 659660 680692
41175 680692 656799 399021 1458 -209788 -107344 47525 -25013 -231155 -267808 -56465
41165 -56465 208071 387845 569819 889880 1319948 1638817 1566370 1014748 274243 -200361
41155 -200361 -307692 -427325 -860045 -1343758 -1395025 -980639 -522939 -306891 -212823 -40450
41145 -40450 207148 425991 558276 560787 397350 114221 -192280 -470062 -671149 -708112
41135 -708112 -596427 -515142 -538137 -454884 -92489 353158 594397 673038 751626 696376 356377
41124 356377 99873 442081 1136870 1312342 677916 -49253 -216972 -127499 -405718 -970462
41114 -970462 -1211229 -916782 -481036 -294523 -366774 -504224 -523520 -323515 -1919 164465
41104 164465 60416 -71068 19864 210641 222724 37173 -188045 -436655 -740724 -925670
41094 -925670 -828031 -666506 -790680 -1100108 -1136559 -797581 -545406 -760398 -1223439 -1441885
41084 -1441885 -1244060 -835617 -438033 -105359 157851 289979 239290 74290 -38037 -4492
41074 -4492 70259 23184 -113549 -159510 -116186 -204116 -433880 -425057 56249 603090 619368
41063 619368 171000 -65485 247825 638761 480263 -209720 -858869 -1010829 -673110 -154541
41053 -154541 194140 140553 -297128 -823738 -1082974 -965008 -685172 -545367 -628362 -753912
41043 -753912 -749050 -680535 -693994 -687900 -415469 24851 130703 -338983 -922796 -1025240 -714066
41032 -714066 -529921 -642245 -695511 -474518 -194955 -26273 172069 429124 428221 -3759
41022 -3759 -513723 -642103 -374844 -24027 175141 95193 -346981 -943169 -1142293 -642907
41012 -642907 127612 494981 355949 143505 111799 93068 -64322 -239511 -296575 -282992
41002 -282992 -291794 -354143 -485988 -629761 -594806 -298733 15795 96729 92835 258179 372038
40991 372038 11165 -592034 -633174 84806 694811 429017 -284818 -483784 -64428 192427
40981 192427 -129633 -520472 -365975 223180 673153 670278 344710 -31343 -267638 -307473
40971 -307473 -262860 -343157 -624768 -935405 -1029296 -816179 -393421 49383 334078 422870
40961 422870 474864 645372 804976 628191 27523 -676749 -1127290 -1308118 -1413785 -1490356
40951 -1490356 -1405919 -1109927 -733726 -438548 -293278 -290064 -360035 -370247 -206136 117979
40941 117979 470560 704414 721047 512720 214456 39051 59874 111415 284 -238590
40931 -238590 -390958 -316510 -75418 119589 8137 -510115 -1130961 -1283164 -752278 -43404
40921 -43404 165341 -157833 -455219 -385094 -140727 68528 356538 772665 1027889 946859
40911 946859 832044 970726 1077087 723221 134511 -20640 384684 720910 500507 6764
40901 6764 -202025 -15119 299622 571959 779335 813892 566776 183322 -61844 -130197
40891 -130197 -214273 -370589 -412199 -241097 -72272 -165156 -429942 -476623 -88520 459010
40881 459010 663872 378592 -8069 -74280 73547 -24546 -470641 -792382 -594079 -146153
40871 -146153 -19670 -280238 -417415 -89719 409277 581043 365369 124917 116987 227582
40861 227582 233776 138710 145338 368143 672800 828762 774993 664264 627615 579130 345884
40850 345884 -49742 -363964 -407212 -241908 -73409 -44689 -175473 -379117 -464281 -256014
40840 -256014 148601 358727 119022 -293423 -328379 164998 756282 1004697 979431 1041168
40830 1041168 1295749 1518679 1530294 1372879 1122595 790101 472804 366475 490235 570249
40820 570249 347026 -112152 -520889 -673888 -531783 -166035 203017 245903 -159977 -702561
40810 -702561 -939061 -808647 -641322 -673419 -787430 -774056 -629494 -490680 -435016 -447739
40800 -447739 -480365 -476798 -433492 -438711 -509707 -410444 121084 889594 1255295 827060 -25118
40789 -25118 -549749 -395519 149725 573725 588788 247501 -168328 -363405 -267154 -67593
40779 -67593 39454 56332 79900 130531 197229 309812 428539 420997 317459 402654 815609
40768 815609 1236074 1277157 1044671 931207 951634 744112 249838 -108697 -99714 -73816
40758 -73816 -374921 -714984 -549466 106078 645803 632274 264053 41401 201381 566702
40748 566702 805145 747544 503220 305922 256438 263749 240749 242189 341795 483251 559076
40737 559076 557908 525896 448570 287295 95540 -4798 44656 186169 302503 298470 174000
40726 174000 34666 -27587 -50342 -103629 -125414 -35063 16586 -216424 -634274 -810337 -616151
40715 -616151 -500664 -857388 -1381206 -1443020 -948945 -407308 -192749 -165868 -81126 15041
40705 15041 -30992 -154261 -126228 175832 644466 1000017 974929 578467 159928 51055
40695 51055 192407 306140 349816 503165 749581 838154 701901 537322 382068 27768
40685 27768 -480062 -696372 -422897 -103036 -178981 -390049 -209755 242969 316838 -182733
40675 -182733 -680172 -636790 -213803 88927 99263 -3314 -94038 -224843 -421524 -591156
40665 -591156 -634892 -531307 -316583 -62604 131920 178926 48378 -191196 -360388 -285027
40655 -285027 -19463 139963 22418 -124789 52684 459302 623773 387994 162678 289176
40645 289176 466186 169482 -534025 -1009182 -879954 -451063 -193877 -146168 -58218 91691
40635 91691 63814 -194767 -373529 -200918 155557 284566 66987 -188686 -193955 -66633
40625 -66633 -95785 -240672 -148645 278929 625722 489712 103181 104386 690247 1296586
40615 1296586 1257957 580904 -121136 -333841 -86863 234783 317208 150661 -7419 114528
40605 114528 467921 633292 278055 -348331 -617212 -289483 166691 177580 -247123 -652506
40595 -652506 -767765 -683474 -511356 -236738 66999 203427 124937 -19044 -178921 -462529
40585 -462529 -783462 -777511 -302395 235411 340806 44097 -230895 -276908 -269950 -393006
40575 -393006 -597341 -748155 -775008 -669015 -516549 -503303 -696004 -887423 -877016 -807837
40565 -807837 -933893 -1139228 -1068745 -727552 -519580 -596061 -602617 -278770 87960 107857
40555 107857 -117163 -187664 11558 247169 304711 129820 -256045 -683298 -795054 -391428
40545 -391428 247929 648432 673633 525690 337726 96450 -105981 -123129 -71264 -242493
40535 -242493 -643114 -943604 -964522 -889077 -887068 -858248 -714305 -606342 -643253 -634329 -375917
40524 -375917 -19182 106064 -76314 -343058 -451925 -280485 180527 736438 989120 694028
40514 694028 96244 -308294 -331689 -209852 -188250 -247472 -285867 -325544 -410963 -484838 -511156
40503 -511156 -585805 -767103 -901566 -809589 -601348 -598773 -895759 -1169636 -1047304 -557710
40493 -557710 -94437 5827 -284312 -780982 -1230077 -1346876 -975048 -346658 15400 -148651
40483 -148651 -523904 -667821 -601736 -653712 -840568 -833377 -552388 -332153 -332631 -238388 143872
40472 143872 383115 -6122 -724071 -969887 -537663 -106244 -297440 -878563 -1164362 -914980
40462 -914980 -508539 -354890 -449528 -535811 -503058 -497984 -673506 -921876 -959759 -703982 -431543
40451 -431543 -433158 -609166 -614256 -348769 -45720 140195 323572 555480 603475 301943
40441 301943 -88577 -164288 80718 269670 160455 -104627 -275074 -291404 -258633 -302670
40431 -302670 -507083 -831361 -1037529 -862738 -347821 149312 357447 367494 397772 445362
40421 445362 364833 200571 197388 452695 748695 814606 630495 381626 207558 104210
40411 104210 21110 -55852 -117029 -147909 -121684 -18934 130544 245078 239981 102712 -37275
40400 -37275 52826 472020 950693 1017497 534791 -64855 -261719 -51443 183998 299759
40390 299759 494340 769821 762582 359766 67350 338358 812443 753486 130952 -307580
40380 -307580 -106546 301971 296153 -102533 -429860 -459737 -277905 80432 593498 940014
40370 940014 698224 -45993 -643164 -605147 -161127 78512 -146787 -537986 -681266 -513515
40360 -513515 -290443 -186056 -59957 299109 778082 986530 758778 406181 300792 373676
40350 373676 281040 -27224 -220047 -79054 224765 441915 556445 632649 599597 426408
40340 426408 341615 588035 1016296 1198346 976500 659295 567249 577391 310802 -302441
40330 -302441 -854443 -913476 -519303 -122678 -95881 -419252 -816942 -1039381 -971968 -641274
40320 -641274 -253694 -116550 -345151 -686086 -773126 -523906 -156509 112807 204003 69637
40310 69637 -293398 -713640 -952945 -971161 -868022 -587108 -11732 597743 689331 155750
40300 155750 -400243 -444995 -206913 -193853 -351194 -263219 -1599 -101035 -656864 -1088777
40290 -1088777 -1008233 -765005 -807848 -960035 -754365 -181541 330401 499578 369337 51786
40280 51786 -319514 -470018 -209366 225065 378980 153066 -128110 -222259 -222295 -255903 -267454
40269 -267454 -224336 -247877 -374541 -439621 -380878 -413615 -666280 -853157 -623009 -121842
40259 -121842 125692 -105497 -477459 -572644 -386466 -205724 -194977 -293002 -408751 -511193
40249 -511193 -537238 -386250 -66030 259465 434312 459783 428050 376365 288408 187701
40239 187701 110200 -11975 -306277 -739249 -1042977 -960811 -523998 -19756 256035 150469
40229 150469 -325912 -956442 -1337604 -1160756 -561122 -54199 -29549 -386380 -725753 -787261
40219 -787261 -593476 -271531 85433 373653 450623 260090 -36352 -135459 125708 551248
40209 551248 731063 484156 86976 -81293 -61421 -235077 -681477 -928585 -579769 46115
40199 46115 262421 -79182 -417790 -273541 157309 376273 251101 32405 -103649 -193535
40189 -193535 -225538 -66077 281630 579223 627701 487127 322703 168661 -30878 -245477
40179 -245477 -364597 -344460 -247485 -157117 -115257 -94327 24076 347931 755836 899471
40169 899471 598016 138527 -44952 69508 154244 152040 426044 1099801 1628123 1404960
40159 1404960 584365 -113086 -292974 -159120 38674 306631 548633 420091 -157333
40150 -157333 -701126 -745606 -461054 -336044 -448597 -470363 -284619 -143009 -172414 -138495
40140 -138495 144859 479011 560148 395169 234087 212561 258313 296364 358576 451330 441897
40129 441897 192344 -204462 -445034 -365553 -181941 -201294 -342193 -224497 204277 477645
40119 477645 257369 -148056 -245371 -74413 -35195 -184245 -214824 -62661 13095 -27286
40109 -27286 58419 213573 34075 -475524 -688299 -263241 255746 215922 -211911 -423024
40099 -423024 -339591 -347625 -504222 -491803 -299347 -297569 -567348 -726610 -567169 -363574 -362938
40088 -362938 -405685 -273488 -45273 116431 214475 243787 77333 -248802 -418845 -248028
40078 -248028 38197 171856 237154 420644 596706 507534 225468 88134 199320 279493
40068 279493 45045 -460521 -939431 -1101017 -849120 -333529 174307 522598 763932 963823
40058 963823 1038486 884625 576922 323944 291946 529538 934865 1211740 1037811 444803
40048 444803 -107326 -223642 -32065 35908 -194829 -523753 -725531 -764950 -682797 -497944
40038 -497944 -252335 -309 234918 365088 190694 -329744 -831853 -855518 -430865 -85564
40028 -85564 -179651 -464562 -438880 25182 558753 708679 366823 -162323 -469174 -442309
40018 -442309 -342106 -420409 -572532 -524343 -261398 -20080 98294 191457 217215 -39632
40008 -39632 -516523 -738432 -403288 138483 287524 -76777 -555209 -791276 -770240 -624874
39998 -624874 -462701 -401981 -494131 -543077 -251765 339309 764427 633321 82212 -425253
39988 -425253 -645981 -727786 -860668 -955060 -786754 -386275 -109069 -227596 -552652 -636343
39978 -636343 -356592 -98784 -243764 -645600 -816429 -537951 -65297 247725 293188 149746
39968 149746 -85991 -291569 -305315 -64717 314381 664978 876975 840336 465138 -108110
39958 -108110 -485531 -416240 -115270 23996 -39861 -20012 172422 259115 58097 -193801
39948 -193801 -205556 -83804 -125271 -315637 -395143 -369459 -549242 -991086 -1283117 -1108372
39938 -1108372 -714746 -526974 -534032 -439684 -259242 -293210 -511484 -459969 41108 524977
39928 524977 504435 162282 47511 276890 449745 295129 3716 -148421 -177565 -251110
39918 -251110 -394278 -494661 -471122 -338119 -206097 -263002 -611527 -1066545 -1268437 -1072702
39908 -1072702 -676963 -293795 102588 562352 880550 768050 246652 -312247 -549798
39899 -549798 -432130 -241648 -321727 -745305 -1165829 -1121101 -584973 -67570 -28528 -357299
39889 -357299 -623152 -656616 -606226 -562605 -475895 -385638 -371537 -289919 54462 435538 329346
39878 329346 -348505 -1024333 -1188555 -969128 -742764 -557286 -290615 -56807 -15460 1585
39868 1585 221298 443268 288958 -155738 -424335 -368994 -301192 -400603 -451458 -272185 8720
39857 8720 218538 289028 61513 -584894 -1270324 -1311772 -652355 -84565 -186594 -526158
39847 -526158 -392098 137549 476630 545764 768320 1168764 1210215 633970 -126593 -542212
39837 -542212 -540513 -322166 -60457 52352 -134527 -429500 -411061 -22805 284830 189511
39827 189511 -78672 -170501 -138131 -243568 -509840 -732317 -731490 -394287 281256 966602
39817 966602 1117151 587814 -109587 -433642 -432334 -439005 -464065 -321612 -136988 -226025 -549250
39806 -549250 -735506 -627954 -412497 -218891 15215 262711 357954 287429 226963 258302
39796 258302 322078 426740 595609 656365 447061 187219 222323 417205 287353 -231803
39786 -231803 -685667 -870929 -1099167 -1462026 -1475215 -885845 -290227 -374951 -919160 -1156031
39776 -1156031 -878137 -572974 -591399 -775224 -898518 -958867 -977167 -935929 -960403 -1175133
39766 -1175133 -1368196 -1204431 -785114 -542758 -528534 -322756 178977 424542 -13110 -732435
39756 -732435 -1007686 -720260 -349404 -211621 -169702 -53911 64209 113325 200934 379743
39746 379743 458249 244464 -132162 -323661 -156388 225725 619038 1004579 1423404 1708803
39736 1708803 1558809 938452 239667 -104126 -62171 85914 185646 324486 534214 628426
39726 628426 439224 71980 -170153 -51840 398141 841376 821295 204641 -546680 -764211
39716 -764211 -307014 288788 467839 237848 -23451 -97446 -38951 75218 245796 424832
39706 424832 467483 235887 -287940 -927385 -1340672 -1290999 -954413 -772323 -903887 -1040979
39696 -1040979 -894033 -598991 -428164 -355719 -213954 -72627 -95919 -157866 -161 278900
39686 278900 287083 -91981 -546164 -795224 -865503 -841694 -690668 -458990 -348688 -446321
39676 -446321 -605439 -690887 -690903 -528956 -100565 381525 458810 67473 -247372 -54735 349568
39665 349568 426168 205757 146839 356801 495705 431752 445576 644727 661119 212593
39655 212593 -386190 -614714 -425538 -187808 -93628 1272 165413 200519 -5734 -225053
39645 -225053 -201558 -30813 19200 -60452 -62307 9700 -93779 -384826 -471670 -114996 315235
39634 315235 275864 -208416 -607919 -627094 -486748 -433814 -371093 -141560 139233 268144
39624 268144 259498 248242 240255 145861 -50139 -281216 -439999 -359071 37598 465077 437118
39613 437118 -117067 -667200 -756366 -588367 -620442 -823850 -792630 -467037 -275527 -514445
39603 -514445 -954333 -1158583 -942211 -463093 -65878 -39228 -331365 -546735 -418660 -167687
39593 -167687 -134480 -234729 -171332 -42475 -213315 -608034 -713574 -398294 -143970 -243721
39583 -243721 -348854 -162415 -33025 -340066 -707930 -472590 282782 803948 740888 548493
39573 548493 689247 947017 823119 300543 -128918 -107422 181497 295118 71922 -245276
39563 -245276 -413628 -538589 -852362 -1253200 -1354908 -1030018 -615689 -463996 -554141 -699608
39553 -699608 -855775 -1001001 -976251 -727827 -503261 -513960 -593025 -499899 -374418 -508911
39543 -508911 -797672 -824047 -454115 25616 338585 432935 295653 -57615 -377773 -343273
39533 -343273 745 287191 344605 314405 230569 -60687 -433602 -424235 80364 504732
39523 504732 307992 -258724 -522292 -298257 6506 90688 98968 220884 342507 277333
39513 277333 99389 31262 113577 186760 187388 272580 533337 700672 378834 -371699 -934515
39502 -934515 -838717 -384614 -247932 -542470 -687147 -282162 297839 433796 79360 -289990
39492 -289990 -378146 -355276 -454534 -586992 -484004 -82600 355007 491959 237182 -206371
39482 -206371 -591943 -838786 -944404 -829838 -460930 -57746 51523 -192048 -521638 -647820
39472 -647820 -428747 178715 1015213 1582272 1411984 686678 126316 110662 278197 175284
39462 175284 -107086 -234675 -200640 -225022 -350028 -484893 -621764 -688777 -455776 62396
39452 62396 398444 242842 -22680 114728 473103 491276 174990 65361 332298 571815
39442 571815 542741 454506 413415 218812 -109217 -207851 -10686 76141 -91579 -88598 289601
39431 289601 529853 199380 -276746 -257359 79223 36889 -473752 -821778 -641743 -297775
39421 -297775 -246022 -449344 -628907 -713004 -785047 -814740 -674108 -349653 -23043 56021
39411 56021 -201001 -587364 -784908 -730997 -647107 -635134 -509814 -211123 -66840 -301472
39401 -301472 -540755 -268398 363648 697322 521976 335295 533818 835463 769740 388210
39391 388210 178494 465487 1126272 1755845 1956775 1617471 1050559 728844 786598 920560
39381 920560 830278 546197 253952 45825 -43445 -15782 -55061 -401796 -913603 -1083809
39371 -1083809 -753885 -461190 -699229 -1133793 -1065615 -496583 -141835 -373736 -732690 -660351
39361 -660351 -224355 172084 420003 691435 1040612 1360170 1594267 1713544 1601854 1242125
39351 1242125 907630 874585 1009465 942484 623004 380463 398667 458970 323891 77434
39341 77434 -99489 -231182 -376564 -365216 -24654 434024 602751 452279 394169 671070
39331 671070 977810 886286 441547 77187 25655 73435 -65586 -331438 -388143 -36745
39321 -36745 543409 980652 1098265 1055784 1062357 1025766 663868 4528 -450699 -272044
39311 -272044 309452 629348 393918 -20652 -145510 -8252 62044 7761 96225 424095
39301 424095 663135 435230 -200943 -777454 -896537 -609884 -337767 -455069 -950543 -1466361
39291 -1466361 -1648256 -1425911 -968902 -486026 -154705 -131656 -427152 -767792 -789476 -446911
39281 -446911 -71229 62432 33576 -859 -164693 -651513 -1261946 -1515041 -1277426 -966153
39271 -966153 -981655 -1201837 -1247613 -1046060 -861508 -871296 -973029 -990396 -864795 -653127
39261 -653127 -502828 -585432 -862726 -974671 -614021 -1307 307229 139535 -78254 39516
39251 39516 303846 301210 19814 -210574 -259079 -308394 -462804 -590960 -619752 -677225 -812572
39240 -812572 -833956 -621562 -406895 -477888 -692061 -577346 13878 582693 505726 -211065
39230 -211065 -909544 -1025460 -653973 -264081 -54119 144873 404019 478442 164719 -377860
39220 -377860 -832132 -1063158 -1089329 -910788 -594890 -376413 -401594 -465966 -271405 129553
39210 129553 417595 464681 398309 249559 -104981 -617011 -1032766 -1258090 -1416503 -1471617
39200 -1471617 -1200914 -699184 -460942 -681670 -895023 -689351 -405128 -600294 -1083430
39191 -1083430 -1094845 -382419 476571 865617 721033 255863 -364174 -865141 -880139 -436677
39181 -436677 -57618 -66820 -145739 70264 318211 126433 -338263 -440381 -47823 246673
39171 246673 -213 -490978 -717301 -677288 -714839 -899777 -953329 -702803 -297197 20023
39161 20023 121772 -7349 -266197 -409375 -226882 195177 552448 697002 754870 807899
39151 807899 677671 211856 -342246 -492741 -59961 568272 806063 441661 -186666 -553726
39141 -553726 -467179 -217024 -189103 -385263 -465390 -275067 -101088 -225638 -412911 -161844
39131 -161844 555912 1152589 1148741 780389 670956 1055666 1567683 1733235 1460720 1017774
39121 1017774 688432 537914 458034 372750 353327 497989 744966 916478 942339 893611
39111 893611 774052 477802 45832 -248380 -237126 -101248 -73771 -77645 81566 313760
39101 313760 360341 222537 120703 68705 -120492 -388805 -428152 -232397 -200698 -461397
39091 -461397 -532962 -35498 606045 661696 115550 -333271 -258565 1910 -31714 -280722
39081 -280722 -291554 101753 563351 657660 324505 -51312 -20274 452602 919370 932076
39071 932076 539142 185855 182888 435511 658517 662523 424949 74412 -156396 -127418
39061 -127418 28222 69557 -14913 -26454 98489 208941 232919 267935 296873 119350 -270539
39050 -270539 -518955 -352744 31667 251281 218824 112008 55013 92530 297175 602112
39040 602112 690534 393284 58482 131440 459955 475852 66628 -229548 -29262 356985
39030 356985 433354 189141 -45912 -132943 -176803 -237692 -310854 -474256 -769958 -1021698
39020 -1021698 -1026020 -855004 -731387 -677520 -546187 -350292 -280849 -382399 -462415 -375842
39010 -375842 -192739 -35532 50241 7376 -239119 -593259 -773105 -635244 -405969 -442008
39000 -442008 -805260 -1182417 -1213657 -839937 -338373 -53349 -89618 -262933 -345947 -306955
38990 -306955 -268131 -315612 -457019 -695174 -983846 -1132968 -936550 -435795 75532 336749
38980 336749 297175 31877 -323080 -530480 -400270 -105804 -127925 -676871 -1327600 -1476773
38970 -1476773 -1073544 -629478 -522184 -578760 -446772 -128237 71939 8794 -138146 -170817
38960 -170817 -128702 -137503 -163450 -93297 27280 46660 -24591 -39366 -43077 -287826 -776842
38949 -776842 -1096511 -971951 -731164 -834058 -1120834 -1009010 -383946 221403 396700 292551
38939 292551 146766 -92191 -399780 -447704 -142357 39867 -268679 -670718 -564825 -75688
38929 -75688 179191 57551 -26293 96130 136827 -23972 -153210 -219679 -499789 -942563
38919 -942563 -1060376 -735970 -529158 -794935 -1066895 -818563 -345176 -276991 -576920 -692782
38909 -692782 -488457 -336328 -359974 -253266 85547 340511 354980 400030 641528 787588
38899 787588 564335 202604 117024 311692 410598 165524 -308530 -735833 -924467 -840707
38889 -840707 -579389 -267400 34115 279479 318887 9279 -493410 -751178 -515243 -62925
38879 -62925 109285 -129546 -431443 -433168 -182176 -30194 -177606 -432302 -459795 -206726
38869 -206726 36651 4233 -249821 -489226 -583227 -525825 -310721 5493 205209 115985
38859 115985 -120236 -221315 -186569 -276878 -554452 -733694 -585621 -241075 24430 90504
38849 90504 -26267 -259049 -433550 -346296 -36174 229980 345869 467992 601412 447421
38839 447421 -68574 -474337 -364652 -67119 -185198 -623618 -652903 9681 733248 806818
38829 806818 330056 -20064 154209 632785 925366 701192 -19033 -855901 -1286615 -1068404
38819 -1068404 -491351 -112470 -207923 -532221 -626027 -328410 53915 123373 -99963 -199349
38809 -199349 39514 258534 -5946 -625567 -1005292 -902854 -724693 -853232 -1054482 -876225
38799 -876225 -398470 -182694 -521880 -1097484 -1449035 -1498568 -1465199 -1468204 -1427024 -1275324
38789 -1275324 -1077718 -917271 -803913 -742196 -777350 -888408 -926283 -794927 -646803 -714229
38779 -714229 -924203 -893421 -429343 138394 308648 -27624 -558972 -963809 -1107099 -930133
38769 -930133 -473969 -21277 110976 6379 81475 462793 737284 534003 89764 -65502
38759 -65502 167205 369053 202898 -187509 -442845 -454922 -440870 -610792 -864699 -891836
38749 -891836 -586104 -244583 -199685 -339611 -268621 46303 148004 -216898 -613570 -465318
38739 -465318 115008 431373 93412 -554804 -945329 -931184 -782215 -720458 -649327 -353548
38729 -353548 108732 327947 -13067 -648649 -909782 -481641 231411 620630 514502 136704
38719 136704 -292030 -619459 -666434 -433276 -252103 -375442 -551763 -398780 -65992 -55987
38709 -55987 -438603 -745265 -687340 -495480 -441828 -489317 -570645 -776035 -1055990 -1119706 -841899
38698 -841899 -434844 -52539 399422 895451 1172496 1207134 1345947 1674729 1758291 1394737
38688 1394737 1112730 1384651 1806074 1732725 1386706 1537569 2249068 2770255 2693309 2431748
38678 2431748 2389042 2395514 2270389 2280468 2615736 2946462 2991372 3086578 3617257 4197181
38668 4197181 4084215 3332420 2882225 3345677 4199376 4480404 3962087 3279115 3042889
38659 3042889 3231415 3496935 3704408 3896843 3937932 3596244 3019560 2749895 3058213 3534609
38649 3534609 3609345 3258189 2845384 2448435 1823444 1034090 596513 790783 1216205 1312932
38639 1312932 1046276 773283 654468 562191 468957 548114 836264 1079210 1045499 827659
38629 827659 692299 712205 684950 425639 40687 -174878 -89049 135655 314339 511033
38619 511033 880222 1310799 1454474 1152267 648798 299300 213313 287001 445725 695173
38609 695173 985067 1163869 1102241 825750 516293 365844 397728 462264 450384 437376
38599 437376 523889 633724 638447 606944 695252 802549 611235 56369 -469928 -516358 -34714
38588 -34714 635766 1097599 1140558 826573 432178 194817 71203 -134312 -426637 -608923
38578 -608923 -596395 -477151 -262513 89513 369721 263451 -61652 13684 664996 1213339
38568 1213339 1018492 399632 153039 434228 707242 649455 472325 332782 33775 -506904
38558 -506904 -956866 -984845 -667860 -296526 -39647 38369 -110665 -390565 -535172 -400674
38548 -400674 -168620 -125405 -322062 -527629 -451054 -4042 560382 814205 604200 276959
38538 276959 271436 561397 742127 604819 326643 117584 17290 74319 378403 817621
38528 817621 1106610 1150085 1091767 953510 595998 138068 -15737 222141 399061 187240
38518 187240 -105646 -49937 218060 269894 107900 109207 344526 440473 160323 -264735
38508 -264735 -473787 -359293 -40900 294050 445070 301948 -12846 -231640 -205767 15608
38498 15608 324160 613066 745056 659269 513530 542890 756192 917355 835545 550713
38488 550713 253472 143954 311400 597954 654090 328610 -56200 -54933 306199 550944
38478 550944 385070 25442 -179911 -186082 -151650 -122444 -26286 119386 173113 24089 -297959
38467 -297959 -635192 -799156 -726341 -550511 -437429 -368389 -227291 -85932 -187540 -574398
38457 -574398 -930632 -924823 -564927 -92490 328367 660386 852007 843912 687998 518126
38447 518126 405355 321423 208750 19325 -248354 -471879 -454819 -167871 144325 236131
38437 236131 160922 122406 97581 -127877 -512896 -645282 -275204 231498 278902 -157217
38427 -157217 -432751 -59173 647972 1005062 875779 766044 987275 1154849 787638 96630
38417 96630 -258906 -97936 69095 -166877 -544372 -596771 -340515 -131700 -42169 183672
38407 183672 578417 776942 526855 70074 -182625 -155342 -76952 -89484 -120472 -92939
38397 -92939 -52193 -72429 -190506 -438557 -789960 -1057010 -1017761 -714450 -465230 -468188 -534799
38386 -534799 -369302 392 268930 271153 134273 16497 -77323 -162261 -177698 -142695 -216016
38375 -216016 -441391 -588920 -443149 -133441 36004 7809 -6133 113491 252437 304801
38365 304801 329586 400344 488048 569757 682095 783397 729581 490265 241640 141135
38355 141135 155467 215080 361129 579457 657348 432105 78319 -93065 -67128 -112746
38345 -112746 -353240 -601812 -667324 -584488 -446414 -229036 61881 237338 122919 -164847
38335 -164847 -322754 -220696 -6696 146530 247109 377358 496886 473096 297618 168561
38325 168561 270149 483177 434291 -63024 -685015 -891314 -562386 -147863 -76878 -220605
38315 -220605 -147650 240625 628880 776002 727937 502519 -30597 -740764 -1069329 -653187
38305 -653187 88419 409719 188941 -11321 176163 468428 500899 387481 405199 468223
38295 468223 320292 54462 23996 296968 560718 579009 447667 366455 416240 597292
38285 597292 844150 958212 763334 389501 177336 234955 319861 249148 190510 398445
38275 398445 834396 1190824 1177642 719297 28745 -455002 -404730 29542 381257 440147
38265 440147 396198 348483 67204 -522222 -996817 -948007 -561508 -289042 -182505 -13186
38255 -13186 146632 18829 -282700 -334920 -124870 -110334 -430650 -625658 -383420 -43224
38245 -43224 -18884 -179373 -200761 -132683 -151488 -83744 292621 700845 675933 301545 101783
38234 101783 256849 451030 480216 451300 318437 -186676 -963102 -1419965 -1253310 -900250
38224 -900250 -876168 -1052727 -994242 -678790 -416640 -276447 -81999 130854 112453 -173105
38214 -173105 -507592 -788063 -1069193 -1255896 -1154702 -871564 -756990 -851911 -769805 -289640
38204 -289640 285504 571209 589096 552453 428486 38549 -545683 -1002646 -1110944 -903680
38194 -903680 -545062 -236559 -176009 -417085 -778711 -1007160 -997505 -805509 -556223 -408793
38184 -408793 -442118 -468001 -165943 429545 801461 556451 -33282 -387280 -353442 -245058
38174 -245058 -263536 -287058 -210862 -105405 7146 177690 276238 76540 -320437 -526293
38164 -526293 -457567 -485679 -788740 -970789 -668226 -188739 -91831 -340953 -369003 68530
38154 68530 575192 714239 526505 298564 142937 29131 -6117 50931 18695 -283651
38144 -283651 -684086 -752576 -333732 198238 362740 134228 -104640 -104845 6155 57484
38134 57484 116809 257070 297714 93490 -75792 195986 771762 1009220 574065 -136230
38124 -136230 -538457 -513117 -310984 -116972 24488 83452 121926 316520 663165 864546
38114 864546 766477 663572 845344 1080618 966588 591043 359559 306289 145125 -46672
38104 -46672 147436 662473 820667 317585 -247611 -252810 32965 -40857 -455014 -627124
38094 -627124 -391762 -207146 -359339 -553876 -472515 -261931 -215999 -325759 -423829 -514366
38084 -514366 -663726 -733856 -519813 -84639 277448 389749 336808 292911 358049 527637
38074 527637 673779 589493 215300 -191167 -283672 -42672 204564 218049 126798 193345
38064 193345 449350 690545 733659 559126 278243 74886 106299 327879 459770 258774
38054 258774 -187544 -533887 -524330 -195077 205748 394339 212827 -243587 -684409 -910718
38044 -910718 -985301 -1019539 -932024 -621530 -253977 -92216 -112466 -113213 -152524 -459025 -869020
38033 -869020 -847200 -281334 195533 14603 -563956 -902621 -899547 -947526 -1155765 -1172188
38023 -1172188 -805091 -348526 -145240 -152430 -91203 190408 602728 899917 852849 504239
38013 504239 235423 384848 827860 1141267 1132474 968021 850632 868756 1112339 1580105
38003 1580105 1971037 1947752 1659293 1620222 1987741 2362591 2436609 2403591 2506524 2596592
37993 2596592 2464460 2270206 2275241 2398505 2404197 2332640 2385983 2544770 2650934 2739523 2927377
37982 2927377 3069931 2903604 2494846 2200438 2182263 2281852 2384354 2571087 2845030 3022705
37972 3022705 3035791 3100245 3433451 3963217 4427783 4629158 4517963 4194168 3927643 4028625
37962 4028625 4551492 5192217 5580628 5642076 5630978 5873699 6530256 7563165 8900721
37953 8900721 10634641 12995884 16029549 19314841 22143017 24014311 24900529 25097643
37945 25097643 25049091 25346615 26582254 28871538 31555453 33622874 34521564 34477078 34054348
37936 34054348 33606204 33212143 32941791 32970540 33487591 34597966 36192073 37752167 38479839
37927 38479839 37985082 36815159 35874590 35227574 33947461 31402573 28194327 25349222
37919 25349222 23000589 20569965 18031192 16113227 15111157 14309234 12997642 11449358
37911 11449358 10363005 9787662 9205450 8414969 7713475 7276456 6897421 6405240 5937285
37902 5937285 5699073 5725896 5926430 6123218 6047131 5556240 4898877 4524634 4579749 4780545
37892 4780545 4816859 4682677 4555651 4532116 4572360 4595085 4546148 4418904 4234312 3995472
37882 3995472 3706275 3440811 3286255 3183657 2973005 2659435 2458224 2478538 2554320 2513921
37872 2513921 2415382 2370922 2361857 2397712 2608464 2962572 3154180 3032473 2879872 2962000
37862 2962000 3086293 2992968 2913258 3242808 3826561 4095022 3850610 3432313 3126076 2890612
37852 2890612 2685779 2610711 2646100 2653360 2674231 2856690 3079150 3061260 2861551 2827660 3021278
37841 3021278 3147259 3093471 3042783 2966203 2545175 1778647 1166167 1052245 1228446 1409756
37831 1409756 1652112 2018893 2258089 2157941 1916113 1860568 2059600 2416655 2848806 3170483
37821 3170483 3136175 2826607 2671271 2873656 3153090 3268954 3418653 3842618 4394086 4812805
37811 4812805 5132345 5539798 6097537 6813167 7688948 8558838 9282568 10266494 12289219
37802 12289219 15561328 19479867 23562098 27920679 32328954 35540161 36393995 35312144
37794 35312144 33999599 33807841 34861388 36512859 38122400 39593249 41535196 44573480
37786 44573480 48151858 50593147 50908891 49952963 49084786 48365533 47067854 45405909 44492604
37777 44492604 44800543 45876319 47481161 49774193 52306483 54057651 54680351 54618956 53913727
37768 53913727 52233105 50357900 50029935 51488066 52485140 50865983 47136052 43352009
37760 43352009 40371300 37570385 34687227 32376713 30940852 29756490 28218984 26395516
37752 26395516 24559464 22809754 21323958 20339605 19689641 18891955 17856965 17021351 16641304
37743 16641304 16414987 15966990 15303697 14626419 14035785 13560346 13181994 12739396 12095494
37734 12095494 11454363 11180749 11230229 11119259 10602518 10033284 9825767 9837136 9585879 8953444
37724 8953444 8371689 8274190 8537294 8595816 8103773 7359302 6946043 7009247 7115138 6876306
37714 6876306 6443186 6206530 6265353 6449406 6668353 6915907 7049854 6911609 6634744 6547363
37704 6547363 6775023 7168214 7559900 7829660 7788827 7346349 6799587 6627159 6922155 7319860
37694 7319860 7558711 7798847 8238400 8704534 8876279 8755488 8664253 8813580 9070476 9195411
37684 9195411 9191144 9307910 9699294 10179037 10441858 10484041 10603883 10927765 11162419 10990158
37674 10990158 10543659 10265675 10379579 10688547 10843619 10664304 10265512 9981681 10045889
37665 10045889 10237045 10040475 9314401 8543870 8188917 8058402 7695446 7146215 6866283
37656 6866283 6984528 7173852 7245393 7374326 7651238 7853566 7808508 7627649 7454121 7290953
37646 7290953 7168630 7160994 7162157 6981580 6707184 6588409 6515869 6101490 5410792 5091119
37636 5091119 5509748 6237924 6714116 6984724 7412067 8047717 8728831 9449811 10156568
37627 10156568 10453325 10046317 9322261 9004836 9336261 10002943 10716315 11403407 11936168
37618 11936168 12169564 12222321 12290159 12240387 11851126 11386480 11390008 11883274 12325656 12460912
37608 12460912 12629404 13062450 13448360 13497510 13409763 13390110 13161553 12439272 11537063 10977747
37598 10977747 10732516 10364813 9783210 9338153 9220557 9230773 9160729 9013031 8828686 8657911
37588 8657911 8681095 8963530 9121116 8718771 8042822 7901919 8460499 8857267 8372057 7465318
37578 7465318 7102773 7398280 7596734 7270989 6844296 6818998 7075253 7215214 7197082 7283048
37568 7283048 7567760 7849667 7892702 7649257 7288273 7087869 7210313 7538117 7837917 8067280
37558 8067280 8339829 8643694 8921344 9457088 10745096 12733742 14567506 15448162 15553620
37549 15553620 15787682 16785902 18443944 20200702 21419597 21690951 21234985 20951257 21620066
37540 21620066 23006365 24070696 24018916 22797413 20703494 18096535 15547456 13657442
37532 13657442 12466622 11481787 10480081 9785490 9516601 9171331 8416500 7754714 7775214
37523 7775214 8118343 7908903 7019591 6152158 5705146 5333077 4788947 4479575 4790083
37514 4790083 5364005 5521399 5104154 4508408 4079555 3846238 3737122 3724472 3774312 3882530
37504 3882530 4130859 4539569 4943526 5198200 5419424 5799356 6247372 6461528 6347548
37495 6347548 6120538 5957324 5803528 5629430 5628079 5939032 6322132 6382149 6107439 5932747
37485 5932747 6171996 6585552 6684949 6349133 5914680 5685149 5607957 5525799 5511365 5739929
37475 5739929 6160118 6539440 6797829 7054841 7330905 7451447 7337985 7168657 7092296 6956909
37465 6956909 6520213 5819630 5130540 4626280 4283910 4082173 4056471 4129241 4103667 3912730
37455 3912730 3711501 3636620 3628251 3589937 3566814 3622553 3672850 3616961 3535028 3555290 3589610
37444 3589610 3424423 3062200 2751633 2655662 2706363 2825986 3033176 3220825 3101352 2595992
37434 2595992 2083365 1994565 2284823 2578563 2736971 2945533 3248682 3366242 3114131 2734497
37424 2734497 2599656 2734053 2803058 2500004 1845709 1187287 950784 1262267 1753552 1903226
37414 1903226 1648691 1479297 1822494 2545514 3205881 3563876 3640192 3503170 3306313 3371349
37404 3371349 3881079 4569226 5044347 5349925 5844544 6582851 7248543 7731777 8303591
37395 8303591 9074305 9731118 10048684 10244615 10526335 10688708 10575279 10595932 11250492 12330403
37385 12330403 13147825 13471405 13674158 13964438 14092271 13975452 14017076 14467237 14945470
37376 14945470 15010512 14826070 14786762 14784048 14416650 13779023 13422149 13504500 13572364 13348450
37366 13348450 13169963 13297253 13271252 12520929 11381329 10875999 11411367 12190067 12165741
37357 12165741 11234166 10149352 9476036 9049975 8475979 7746299 7127639 6679996 6235524
37348 6235524 5812469 5705615 6031666 6432860 6453805 6072947 5628906 5317157 5039971 4736533
37338 4736533 4551715 4581095 4706137 4824205 5015726 5305546 5472317 5338813 5092957 5040617
37328 5040617 5144611 5115857 4908039 4776341 4815021 4798473 4622808 4573133 4889882 5296477
37318 5296477 5286061 4793523 4278685 4130422 4249125 4300832 4165808 3971643 3807125 3611266
37308 3611266 3354968 3169857 3193791 3355820 3436378 3347654 3240162 3264338 3317341 3156065
37298 3156065 2748158 2385219 2392673 2785595 3254930 3468799 3372871 3211543 3243982 3431344
37288 3431344 3469400 3180785 2776620 2603064 2710739 2873998 3009879 3315716 3891522 4449484
37278 4449484 4593628 4277292 3800939 3412075 3082412 2692471 2305566 2182430 2522898
37269 2522898 3191696 3739581 3787861 3397466 2959058 2729778 2639163 2557038 2495006 2423968
37259 2423968 2170491 1745928 1556566 1934472 2579537 2868959 2704586 2623288 2963941 3359012
37249 3359012 3306133 2881594 2516940 2328387 2132831 2003284 2267251 2878195 3307771 3318542
37239 3318542 3397578 3998721 4676401 4559809 3605150 2757957 2722839 3130480 3255785 3089145
37229 3089145 3165372 3592650 3870292 3670959 3270020 3043625 2946708 2709649 2277240 1850471
37219 1850471 1679967 1929410 2518812 3012339 2953824 2458613 2158591 2365038 2636309 2473381
37209 2473381 2094806 2072043 2428859 2634203 2418801 2090278 1999770 2155175 2457072 2871554
37199 2871554 3192923 3050460 2431873 1889433 1915954 2346588 2694721 2879668 3223140 3797470
37189 3797470 4202815 4106075 3698563 3439423 3539467 3878582 4269182 4553989 4525831 4068593
37179 4068593 3465199 3294555 3803504 4534731 4826503 4590865 4313402 4326871 4453977 4463629
37169 4463629 4497509 4774039 5137706 5249700 5094133 4965329 5009725 5084703 5062110 4987177
37159 4987177 4903168 4778147 4680343 4805930 5220695 5718578 6033261 6109161 6122518 6291562
37149 6291562 6640810 6886986 6657029 5952860 5274510 5066237 5146887 4979703 4458291 4081948
37139 4081948 4296662 4979313 5693006 6175534 6409037 6429081 6273611 6021444 5760297 5588856
37129 5588856 5658089 6030511 6458515 6527670 6129699 5610082 5349958 5400734 5644016 6075929
37119 6075929 6713736 7358239 7677603 7511648 6993497 6425148 6090962 6082983 6213085 6170462
37109 6170462 5827987 5329174 4878949 4584034 4499179 4639738 4895921 5107543 5269121 5481820
37099 5481820 5682908 5666166 5431349 5241485 5218804 5153235 4869549 4530696 4383562 4423773
37089 4423773 4510212 4604423 4689596 4648226 4437488 4209722 4056890 3831443 3438743 3088694
37079 3088694 2985726 2971954 2798248 2582652 2634798 2927743 3127511 3117903 3118752 3239018 3268200
37068 3268200 3047454 2771622 2730378 2914015 3067141 3062583 3047510 3186790 3386595 3417319
37058 3417319 3304764 3385923 3810909 4181610 4008036 3421291 3003521 2909504 2693050 2179018
37048 2179018 1929596 2439886 3333711 3885626 4015033 4193468 4595243 4949553 5121528
37039 5121528 5236728 5251530 4980521 4598455 4560513 4914204 5205800 5209103 5235640 5530198
37029 5530198 5870694 6046395 6252000 6626038 6804320 6422312 5818890 5726165 6314787 6976036
37019 6976036 7110336 6808811 6620542 6842372 7206630 7231265 6770585 6149982 5752947 5584180
37009 5584180 5369297 5017813 4764675 4802357 4970720 4941527 4607005 4180742 3967997 4086624
36999 4086624 4363205 4498766 4404917 4338578 4585690 5059056 5385145 5368752 5161778 4960942
36989 4960942 4786188 4637844 4624527 4767444 4849758 4646642 4208608 3774258 3500435 3428444
36979 3428444 3618014 4095658 4661612 4944499 4760717 4332903 4040223 3989381 3957270 3766286
36969 3766286 3558300 3592738 3902648 4315162 4708615 5026966 5120665 4883934 4558575 4565923
36959 4565923 4950398 5308844 5374764 5320122 5345204 5394236 5508556 5997810 6886489 7610410
36949 7610410 7739086 7646461 7922542 8424984 8551388 8248578 8051331 8186253 8340521 8388145
36939 8388145 8692449 9496193 10522855 11366899 11856734 11917513 11528560 10964848 10664746
36930 10664746 10710672 10800224 10790973 10845454 10982682 10998914 10968640 11298603 12059783 12737032
36920 12737032 12900975 12710422 12493014 12246640 11879135 11598781 11696651 12113266 12474023
36911 12474023 12456746 12037459 11519277 11310423 11472272 11585903 11355357 11153354 11500164
36902 11500164 12163125 12395437 12018686 11584990 11424354 11264702 10956981 10845574 11125644
36893 11125644 11450057 11479061 11299598 11079001 10838184 10741962 11033972 11519255 11714976 11641485
36883 11641485 11803516 12300715 12731869 13082253 13806721 14853331 15576671 15870704 16362175
36874 16362175 17193661 17763180 18085316 19189267 21579813 24482030 27263199 30421892
36866 30421892 34456606 38934103 43404995 48041821 52733587 56991752 61472395 67914775
36858 67914775 76757338 86897640 98979283 116373803 140850656 169518134 198289916
36851 198289916 225656737 249698561 264232201 263647014 251579588 239901308 237678461
36844 237678461 244326124 254325282 264977883 277795977 294838509 315183204 333477559
36837 333477559 342268889 338726799 328858375 321235900 316548422 308357806 294996835 284300432
36829 284300432 283381039 289773345 297571146 306788744 319749599 332206912 336593684 332841208
36821 332841208 327717453 323162960 313850277 298909254 287900853 289312000 297978304 300034206
36813 300034206 287957479 265684917 240722462 216792901 194429405 173992914 155938167
36806 155938167 140230128 126894996 116065524 107059145 98581779 90129018 82175705
36799 82175705 74921730 67933561 61121500 55018917 49882641 45364334 41219622 37580839
36791 37580839 34418300 31442327 28645047 26291328 24280935 22132333 19708258 17395421
36783 17395421 15431836 13561189 11535791 9571006 8103462 7318661 7000856 6698259
36775 6698259 6063457 5172215 4412803 3954801 3544966 2982051 2479154 2278487 2205534 1962499
36765 1962499 1626503 1476497 1505526 1476974 1340473 1270710 1399343 1754951 2305313 2825098
36755 2825098 2948539 2640017 2393265 2662432 3306992 3887318 4248934 4470518 4504696 4302960
36745 4302960 4108135 4192086 4440518 4592339 4731453 5102750 5565790 5712574 5493739 5278026
36735 5278026 5270448 5282714 5137990 4924146 4739285 4510967 4225527 4110239 4406201 5027008
36725 5027008 5527809 5451316 4794223 4117186 3987195 4281783 4358785 4008233 3777485 4063286
36715 4063286 4373938 4025271 3207407 2687481 2641083 2509498 2005067 1524202 1389209 1336135
36705 1336135 1068758 787455 766246 792754 465791 -172211 -673443 -724748 -368193 180197
36695 180197 644176 713010 257611 -445821 -895610 -824156 -415024 -96669 -184985 -651655
36685 -651655 -1137658 -1245075 -919682 -520246 -438508 -693059 -967236 -984837 -743589 -421463
36675 -421463 -196108 -186457 -447203 -913662 -1381354 -1628205 -1581952 -1340029 -1042611 -787802
36665 -787802 -654310 -681385 -763267 -681254 -367811 -67946 -90692 -433327 -796798 -953583
36655 -953583 -947690 -933768 -972529 -1002933 -896449 -566478 -163755 -78183 -503811 -1052124 -1117637
36644 -1117637 -660263 -281867 -415673 -780042 -828780 -451440 11938 229868 127839 -133756
36634 -133756 -234898 65272 598177 901865 801177 583794 445306 177830 -274845 -402784
36624 -402784 189876 993346 1131137 575258 163012 361283 663694 446711 -120407 -405720
36614 -405720 -211413 81652 133140 50253 142162 477661 794976 807029 516115 176088
36604 176088 -1094 32069 289292 739269 1088650 907768 204646 -421349 -513311 -365881
36594 -365881 -497259 -784107 -699448 -284856 -199007 -687608 -1145374 -1005243 -555657 -452635
36584 -452635 -751522 -888417 -496257 151728 527116 420208 64694 -177621 -176545 -88838
36574 -88838 -106063 -253917 -477569 -750731 -961561 -899779 -609863 -546429 -996267 -1503812
36564 -1503812 -1371958 -680688 -225100 -362328 -561241 -358199 -115866 -328047 -663334
36555 -663334 -384444 496056 1160443 1108332 767796 813949 1308524 1794879 1987114 2033002
36545 2033002 2134151 2168372 1836369 1123415 453776 288207 644039 1146113 1497092 1702483
36535 1702483 1832435 1811625 1572358 1249888 1075140 1143291 1351358 1477400 1312175 865118
36525 865118 460369 438211 721160 892087 755760 558396 540640 560205 357267 -39283
36515 -39283 -398270 -597588 -638416 -523209 -335234 -269739 -360357 -348295 -75810 170589
36505 170589 32011 -331730 -390838 35676 551235 721104 545115 293603 118426 -18076
36495 -18076 -172422 -326583 -416499 -380391 -206630 35214 220895 224113 -31223 -471694
36485 -471694 -807883 -721933 -230632 252517 336456 41444 -316611 -481090 -371685 -41702
36475 -41702 263646 171089 -406240 -1007631 -1090434 -725632 -502908 -720309 -1030944 -1032682
36465 -1032682 -859263 -889276 -1079328 -966065 -329037 459386 870002 803313 573026 431353
36455 431353 333211 151969 -101127 -351695 -561940 -630586 -385506 122418 481653 352524
36445 352524 -61378 -279332 -210597 -188228 -349632 -425505 -261415 -108550 -164108 -214870
36435 -214870 -47836 119683 -9501 -295589 -401732 -366188 -514860 -899312 -1213702 -1248002
36425 -1248002 -1110226 -1020396 -1137021 -1515342 -1982554 -2158658 -1869972 -1407658 -1090941 -785499
36415 -785499 -262586 175796 9661 -617122 -949058 -655194 -236798 -209211 -429721 -545266
36405 -545266 -618967 -882892 -1202797 -1244338 -996368 -742840 -611035 -468660 -226022 11636
36395 11636 89009 -49398 -319101 -533504 -588979 -656488 -991604 -1472514 -1590378 -1074362
36385 -1074362 -286218 222556 324647 251412 151017 34633 -11939 62332 32811 -364673
36375 -364673 -960124 -1246647 -1003774 -540274 -250286 -200908 -262855 -377915 -493335 -405809
36365 -405809 71037 790306 1292892 1219234 658587 50521 -247194 -247853 -176968 -111373 79586
36354 79586 428242 687897 580467 118116 -444042 -885894 -1128085 -1160732 -1037427 -882801
36344 -882801 -739765 -463598 42182 531923 614816 287198 12752 137044 428735 410838
36334 410838 22239 -308552 -248298 18265 64361 -230550 -584932 -721772 -676385 -630354
36324 -630354 -600953 -476893 -314753 -383023 -814781 -1344103 -1527844 -1198830 -602376 -99445
36314 -99445 172384 326077 491922 626631 569738 268875 -98658 -271204 -152104 130403
36304 130403 384863 501249 450667 256877 10777 -173628 -270835 -350827 -445522 -487622
36294 -487622 -421761 -296780 -203309 -189649 -258665 -351761 -331016 -130670 42443 -129181 -605690
36283 -605690 -909838 -703516 -238823 23307 59544 191163 450052 491397 209683 9721
36273 9721 238362 668578 838958 683663 509712 488061 496555 417497 278956 77742 -259623
36262 -259623 -655119 -842154 -676886 -349884 -186893 -324800 -621542 -781145 -569839 -73953
36252 -73953 246506 -14863 -665576 -1043618 -806712 -320217 -81558 -74748 -14429 50186
36242 50186 -150068 -515388 -626688 -412733 -280545 -459374 -668462 -631482 -496602 -475644
36232 -475644 -445490 -247940 -79136 -205202 -517659 -730537 -813053 -858078 -727535 -265575
36222 -265575 272373 466687 351898 340120 534105 560905 156622 -472620 -965552 -1151534
36212 -1151534 -1020787 -683152 -422856 -471291 -666140 -650585 -426964 -339215 -483658 -578457
36202 -578457 -492591 -424870 -424920 -248097 103889 223235 -22959 -155922 185162 631161 647543
36191 647543 312370 39452 -125150 -384556 -644221 -661766 -567383 -686490 -972363 -1134094
36181 -1134094 -1195701 -1371556 -1484900 -1121561 -364084 219938 385310 432788 527666 403875
36171 403875 -22613 -301838 -63459 425083 664641 569363 372618 166381 -92790 -280770
36161 -280770 -157714 307729 872150 1239999 1240179 882567 367359 -38691 -228794 -302049
36151 -302049 -373501 -463764 -581964 -745344 -876624 -837962 -603824 -284740 -20457 16298
36141 16298 -340067 -939555 -1218088 -818235 -202569 -138404 -602891 -810402 -415250 6624
36131 6624 -57655 -289818 -211557 -312 -25068 -67060 277945 764242 822285 510580 374333
36120 374333 459099 263241 -291318 -636229 -495879 -320941 -470198 -602147 -299363 227530
36110 227530 531451 606198 678177 656211 323380 -138065 -333498 -242705 -147120 -81784 127709
36099 127709 326676 100731 -507957 -887393 -689211 -306604 -194076 -131084 354199 1092773
36089 1092773 1392916 1028624 574848 596244 920238 980823 591176 58630 -300788 -446559
36079 -446559 -474800 -466881 -483288 -512589 -428773 -163742 119044 221751 233649 390729 619894
36068 619894 557370 130916 -214625 -116072 142562 -5972 -615474 -1139291 -1124692 -691138
36058 -691138 -260148 -69988 -82454 -181537 -296684 -405922 -533920 -715320 -906718 -986543
36048 -986543 -882709 -636688 -306376 99679 515886 742807 620722 264068 -16678 -70206
36038 -70206 -67667 -225384 -451850 -420598 -4706 490018 607133 210166 -378099 -677569
36028 -677569 -472541 16725 356464 333726 155160 130147 209368 50892 -427631 -856618
36018 -856618 -934819 -836888 -805791 -625212 26202 844749 1117975 734546 404709 645959
36008 645959 1062411 998246 492377 107455 73346 113735 16336 -109774 -171608 -287485
35998 -287485 -531581 -754382 -777291 -605074 -380820 -238168 -201056 -144185 81897 391810
35988 391810 470751 200391 -84458 -7939 309060 415549 158955 -156982 -218117 -19027
35978 -19027 265161 466646 474153 322608 226340 319603 429444 339100 159136 123726 143939
35967 143939 -24714 -251311 -164832 166741 229952 -144350 -518365 -575512 -584977 -840086
35957 -840086 -1115380 -1067576 -776998 -480985 -127876 352732 648693 441421 -34661 -307775
35947 -307775 -376690 -594191 -955408 -1042336 -693550 -268577 -175562 -486249 -1028851 -1512513
35937 -1512513 -1579693 -1125880 -578523 -475343 -763513 -927392 -799249 -730437 -878095 -896167
35927 -896167 -580776 -306482 -452953 -788337 -819795 -472081 -48671 236600 326173 138022
35917 138022 -300467 -697823 -824977 -842988 -978233 -1078641 -909446 -705315 -899722 -1369067
35907 -1369067 -1511092 -1143295 -778636 -832533 -1065465 -1092672 -989852 -995926 -959884 -562859
35897 -562859 85795 528140 573050 448281 363736 293101 216554 219607 250008 88651 -297841
35886 -297841 -642289 -761806 -792727 -859885 -798712 -498729 -282384 -522862 -982893 -1005316
35876 -1005316 -434768 94427 7475 -454400 -679334 -614613 -765687 -1326110 -1810212 -1722016
35866 -1722016 -1215657 -808080 -670908 -539361 -225289 111048 235400 130433 -78394
35857 -78394 -296199 -438055 -381889 -104389 196879 266858 85097 -109922 -121973 -46668
35847 -46668 -145960 -486516 -795075 -763411 -472727 -366987 -713218 -1208876 -1304355 -866405
35837 -866405 -299904 10405 112590 197938 150789 -299614 -1053782 -1597367 -1570424 -1157459
35827 -1157459 -785688 -610162 -466902 -217515 78430 321674 505714 623886 595165 406648
35817 406648 238593 282604 445326 398327 -15147 -557360 -876183 -886195 -733027 -498950
35807 -498950 -171427 138575 214372 23901 -238354 -468481 -755742 -1055403 -1066117 -677648
35797 -677648 -283073 -309228 -608231 -689649 -447629 -233330 -222938 -171501 85410 292134
35787 292134 159689 -194590 -418365 -324639 52252 568630 936639 805254 150324 -543119
35777 -543119 -735710 -412674 -38791 -4656 -258149 -422583 -189097 331068 634007 381880
35767 381880 -74005 -54789 486122 808868 442624 -76283 10803 526765 618958 25646
35757 25646 -583445 -595623 -206924 15439 -116682 -360560 -459693 -379473 -268198 -291000
35747 -291000 -402305 -330053 28304 318702 157704 -260385 -408296 -228812 -177877 -408209
35737 -408209 -481094 -113310 304530 267047 -171053 -611847 -844868 -815626 -416168 266643
35727 266643 740008 565327 -108876 -776652 -1134426 -1114077 -648792 146290 751487 693228
35717 693228 159862 -235965 -245138 -140689 -165957 -268470 -380634 -527294 -589306 -357966
35707 -357966 71204 310309 202342 21622 41277 205114 353513 469436 527756 367584
35697 367584 -73776 -585981 -927868 -1099385 -1227464 -1327071 -1326651 -1221463 -1072734 -931190
35687 -931190 -834355 -786515 -702977 -506614 -316043 -363812 -653112 -873105 -764376 -412457
35677 -412457 -62934 193378 394884 505935 441623 239435 23128 -195415 -511605 -884759
35667 -884759 -1048955 -801115 -336185 -137849 -453834 -982037 -1221930 -1076316 -892391 -910313
35657 -910313 -970222 -899234 -875969 -1113761 -1395764 -1306651 -843711 -425240 -301396 -320956
35647 -320956 -333137 -449919 -749224 -1011189 -975667 -698892 -465916 -436942 -510773 -490015
35637 -490015 -307156 -98833 -42000 -105601 -86917 38522 21024 -230832 -386209 -177168
35627 -177168 108064 69886 -72990 207207 802681 1030644 700833 387149 414184 316668
35617 316668 -289046 -966094 -1126279 -881636 -636110 -332725 189954 497168 40034 -853841
35607 -853841 -1271074 -951435 -513684 -430569 -500825 -469925 -490225 -692798 -842635 -722988
35597 -722988 -456441 -203020 80692 363589 407304 161963 -48453 9731 142235 100975
35587 100975 -12785 -718 44909 -93618 -405416 -719378 -941789 -1007806 -817994 -466917
35577 -466917 -305819 -494544 -698300 -536353 -139339 82318 55945 36718 85838 -7104
35567 -7104 -279437 -480025 -476680 -426777 -431396 -346501 -95086 124836 146623 108317 186863
35556 186863 250934 47235 -382834 -741132 -875763 -898333 -913178 -875761 -759478 -637926
35546 -637926 -522194 -319280 -60385 24100 -187065 -485316 -600759 -543909 -463674 -314377
35536 -314377 24629 376666 400502 142528 70238 397213 729415 635893 271711 100167
35526 100167 210518 291245 165629 -26066 -144964 -208787 -223114 -177814 -237715 -609768
35516 -609768 -1137868 -1330215 -928494 -232227 249616 276086 -60089 -508103 -797531 -808812
35506 -808812 -702318 -699566 -716853 -490161 -103706 -12686 -363456 -660912 -402253 250812
35496 250812 760762 927168 935614 887731 725570 556509 616752 853288 890479 516594
35486 516594 -58739 -518105 -765284 -845395 -767545 -557158 -337365 -223701 -221336 -297298
35476 -297298 -454331 -663423 -815422 -815998 -676606 -477748 -300768 -205390 -193821 -183523 -100648
35465 -100648 -9107 -40281 -164580 -155031 130028 497381 567312 184551 -390323 -749134
35455 -749134 -765759 -685116 -777119 -1017135 -1201889 -1267518 -1299853 -1279972 -1073840 -719123 -471956
35444 -471956 -459953 -510302 -447149 -330857 -249159 -115469 121731 301950 312636 286908 296268
35433 296268 139340 -231801 -400610 -69230 344115 300590 105701 497663 1323924 1533318
35423 1533318 712072 -252327 -498444 -387509 -699804 -1278938 -1360441 -895072 -607032 -801288
35413 -801288 -965080 -684713 -229701 29451 179208 395368 490141 232837 -181647 -368029
35403 -368029 -273421 -147211 -113862 -64012 80790 222461 204387 -53940 -504190 -948732
35393 -948732 -1130220 -951079 -578534 -274034 -165236 -215900 -330624 -434690 -526554 -685953
35383 -685953 -944787 -1147137 -1081013 -778571 -510069 -412192 -317614 -75365 154832 125689
35373 125689 -108350 -242191 -108460 157966 305545 177413 -196973 -563011 -563163 -96747
35363 -96747 469366 650536 406317 153475 202455 416698 522340 522703 606270 777127 810822
35352 810822 564378 155001 -197887 -378346 -383953 -252049 -55399 106323 200101 300478
35342 300478 454942 553629 448089 184098 -22973 -68391 -58314 -69264 -807 176145
35332 176145 206002 -147991 -673217 -888311 -659231 -333585 -205813 -168043 -22723 173596
35322 173596 290522 375208 468724 413331 140267 -64754 68809 332903 333379 114174 54820
35311 54820 220302 297915 190818 158402 254353 149027 -252632 -493350 -204966 315721
35301 315721 561263 533779 575352 702641 594219 168490 -250572 -369071 -213581 31080
35291 31080 218552 271436 233089 272728 454944 573573 415740 89822 -140298 -225905
35281 -225905 -269383 -231961 -46767 93689 -34867 -246649 -181757 40707 -78935 -592523
35271 -592523 -918981 -701133 -345319 -374960 -653400 -658435 -264245 140794 156888 -309116
35261 -309116 -1067832 -1713931 -1828048 -1380285 -798859 -434581 -169747 207895 530665 519740
35251 519740 306814 255474 390222 425987 276542 100565 -104145 -488185 -916830 -1020329
35241 -1020329 -784155 -657304 -896593 -1173755 -1054252 -569983 -86877 166898 228461 238801
35231 238801 336074 563708 755080 661032 277470 -146068 -487072 -860333 -1220516 -1187196
35221 -1187196 -541144 343000 875991 915916 752928 565005 250862 -203009 -527010 -466302
35211 -466302 -89381 305243 482242 409977 205268 13265 -86726 -95354 -37825 65763
35201 65763 182954 296908 452442 665709 778905 567941 65413 -387668 -529650 -475274
35191 -475274 -486981 -586002 -582274 -420486 -297636 -410517 -685348 -787248 -409845 369564
35181 369564 1043337 1141410 758322 399730 275601 69705 -442250 -919692 -923378 -564700
35171 -564700 -283514 -183866 -55665 62691 -127680 -601654 -896885 -725365 -315817 -4824
35161 -4824 155579 221331 140740 -61629 -173046 -93778 -8164 -46991 -33964 188298 422374
35150 422374 402120 228643 203050 349295 424863 341404 261389 274084 252916 97570 -85214
35139 -85214 -118512 54438 354077 635627 761674 692223 505899 277573 -11949 -367328
35129 -367328 -661362 -750384 -655626 -511252 -378973 -232837 -85937 -13999 -78072 -304838
35119 -304838 -682464 -1090966 -1328062 -1317372 -1200013 -1103834 -941624 -593722 -167740 125593
35109 125593 263388 362350 414992 309581 76998 -102061 -114487 43659 364480 738406
35099 738406 864526 558221 104293 -24414 212912 428435 415785 342403 285028 55009
35089 55009 -337722 -515936 -313361 -109807 -252116 -526745 -614701 -697563 -1068307 -1409483
35079 -1409483 -1120290 -298220 251290 88574 -335872 -424673 -212588 -120301 -318201 -668222
35069 -668222 -1020060 -1227468 -1068358 -490521 163871 464523 361831 125554 -79033 -271323
35059 -271323 -376952 -215662 157471 385911 244605 -55008 -164820 -61499 -9390 -145927
35049 -145927 -329729 -405619 -406296 -406720 -358656 -225302 -160742 -350002 -704774 -922685 -872049
35038 -872049 -721461 -626957 -500895 -223438 104658 317283 455998 658974 861437 859886
35028 859886 654390 480791 473265 516348 482382 403121 328876 213940 35550 -152252 -369886
35017 -369886 -711760 -1071686 -1093428 -606481 45970 347379 181018 -141371 -316409 -268291
35007 -268291 -14172 378496 679981 638216 326374 104256 117925 92446 -195219 -491448
34997 -491448 -420898 -102619 -7322 -207065 -205295 301383 871095 879118 397936 71366 180957
34986 180957 312997 52031 -439265 -770135 -877125 -890193 -741412 -350779 -32617 -215756
34976 -215756 -769003 -1076393 -881004 -622114 -741143 -1030923 -976673 -503554 -59484 -37572
34966 -37572 -349972 -565020 -357026 156698 516561 445358 206787 234100 489929 567746
34956 567746 424541 497425 904608 1070646 540287 -274620 -661653 -579882 -495334 -504502
34946 -504502 -295356 108404 260546 45379 -90798 138140 413820 347941 48119 -132204
34936 -132204 -94172 16536 75044 22101 -137418 -221396 6540 456479 714366 573046
34926 573046 278395 78320 -151178 -573500 -963594 -937863 -463742 114531 448303 413819
34916 413819 129017 -102653 -49544 114959 -17978 -450775 -649376 -297536 189241 273888
34906 273888 92949 160209 508387 684778 517485 336772 392669 535705 588429 618376
34896 618376 683982 652978 457608 272793 274890 414504 544696 607396 617048 613287 657620
34885 657620 720702 617087 280212 32503 244753 732691 888131 491939 -15574 -232611
34875 -232611 -327195 -576437 -758247 -447479 275882 854902 937724 660595 250976 -280807
34865 -280807 -918435 -1383373 -1355172 -895205 -465347 -443779 -684489 -679159 -189725 426927
34855 426927 672486 555355 508412 690884 741440 378872 -77862 -87681 394240 888320
34845 888320 1008942 826052 603741 424824 175142 -211891 -577519 -613646 -169625 503573
34835 503573 942188 968099 844597 834148 806648 493936 -38368 -453773 -583231 -516323
34825 -516323 -325500 -24167 209800 118136 -247181 -520230 -519146 -462459 -554501 -655094
34815 -655094 -568526 -388774 -283240 -151503 173859 531849 597441 388840 265606 403573
34805 403573 589715 606776 526912 500953 500857 418806 236965 -14902 -278650 -349307 6771
34794 6771 645896 1014762 767152 200833 -183199 -324063 -446961 -479293 -132699 469839
34784 469839 783096 586386 288097 283744 413929 329985 56015 -135947 -152296 -59544
34774 -59544 141836 399648 456282 160667 -208143 -275045 -112513 -98755 -320263 -484958
34764 -484958 -396926 -168170 36770 145889 83082 -152185 -332105 -266325 -179629 -422399
34754 -422399 -828294 -861962 -490126 -353324 -823720 -1395157 -1394355 -912832 -571408 -601307
34744 -601307 -642234 -379720 24943 189118 -61243 -564666 -982457 -1075967 -899621 -677208
34734 -677208 -488130 -238783 38109 121870 -46958 -227535 -255141 -291181 -491690 -682980
34724 -682980 -612941 -305146 69284 436110 697416 653856 360076 278963 697198 1218623
34714 1218623 1257319 839894 473359 386398 394047 397489 483883 557442 388850 66656 -75371
34703 -75371 -24861 -112262 -402665 -554383 -404621 -228894 -254054 -342290 -334993 -305980 -298042
34692 -298042 -208623 -114449 -294055 -726107 -986148 -865809 -661659 -599138 -440746 401
34682 401 418690 499650 425585 428481 224483 -542739 -1569414 -2180916 -2175243 -1843848 -1332783
34671 -1332783 -583998 174849 503428 358415 115989 -50929 -314680 -676949 -868458
34662 -868458 -897938 -1161951 -1774383 -2248606 -2127185 -1552121 -943376 -466379 -109672 37211
34652 37211 -69461 -230710 -261572 -256039 -336201 -357693 -166250 47542 -10235 -267900 -387769
34641 -387769 -254021 -61459 23760 11656 -53730 -111482 -1710 353381 706382 702943 350564
34630 350564 7557 -98136 -60070 2169 95071 131606 -86350 -486914 -635923 -276575
34620 -276575 267314 496151 355685 149855 -20656 -342833 -809793 -1034391 -721021 -96252
34610 -96252 336821 358453 164285 6365 -84673 -171507 -186082 -14979 227575 220539 -153626
34599 -153626 -554281 -530707 -74793 387733 553038 524724 474645 329796 16312 -239927
34589 -239927 -182937 46702 100221 -41029 -82270 46958 75368 -105526 -218436 -74145
34579 -74145 78414 -43694 -259535 -161833 280336 660049 632914 256937 -142302 -281070
34569 -281070 -125668 87723 95646 -63855 -104208 49518 87737 -212803 -582462 -597908
34559 -597908 -244795 160045 442511 617464 597855 276444 -139551 -282841 -142231 -63501
34549 -63501 -212341 -410136 -540450 -705630 -878151 -810549 -465823 -174842 -176226 -328203
34539 -328203 -450250 -596432 -781986 -797594 -545823 -228867 38915 425037 898955 999463
34529 999463 511761 -16631 27582 424023 517937 270349 207895 448458 556098 426829
34519 426829 532420 1021234 1285132 852287 151158 -128894 -11671 -98 -167391 -110247
34509 -110247 293351 661979 696146 517284 323088 114746 -84708 -110302 30093 21228
34499 21228 -317685 -685135 -679511 -358608 -97237 -4151 131257 317642 227105 -234049
34489 -234049 -593787 -403192 54118 57801 -576408 -1212369 -1193883 -616845 -100580 -8492
34479 -8492 -163046 -242250 -176399 -87837 -31318 43278 116446 50177 -204149 -446653 -434010
34468 -434010 -219160 -89685 -137493 -148640 -42270 -101275 -485552 -806902 -618890 -134229
34458 -134229 64339 -83059 -119248 32711 -113660 -695444 -1105844 -900091 -489577 -440372
34448 -440372 -605199 -531170 -285661 -217715 -240517 -59935 124568 -105139 -532000 -468433
34438 -468433 221951 930709 1164870 986454 589714 105325 -132076 163022 589121 409236
34428 409236 -281973 -538759 -14682 406976 -52112 -863833 -1035001 -561601 -222695 -301246
34418 -301246 -368232 -190604 -52635 -126222 -177783 -52479 50440 -32893 -130811 2367
34408 2367 361391 729757 876790 692798 281275 -106009 -352609 -602243 -967500 -1289987
34398 -1289987 -1394061 -1377177 -1371785 -1216112 -717263 -101879 187618 78332 -123907 -255773
34388 -255773 -424753 -615895 -593329 -302620 -18136 63775 90220 228734 301737 -24247
34378 -24247 -746939 -1381937 -1368983 -649611 195310 521562 344869 256576 551467 805711
34368 805711 571709 109238 -20868 184564 263366 78550 -76113 -107953 -244630 -464762
34358 -464762 -427597 -139456 -103414 -533753 -941549 -840078 -416218 -131592 -59995 -41437
34348 -41437 -142870 -466123 -722535 -512182 52437 431103 345824 39424 -140502 -98948
34338 -98948 70535 214456 140377 -250927 -793722 -1189164 -1334988 -1370706 -1392366 -1295331
34328 -1295331 -948709 -407459 99640 342150 250660 -52313 -402010 -756716 -1114775 -1296774
34318 -1296774 -1044081 -433611 35478 -38800 -506445 -897320 -944467 -698546 -318937 -5088
34308 -5088 25341 -217564 -384732 -207414 93330 139270 10547 105942 430750 515762 152848
34297 152848 -259347 -341050 -306542 -574652 -1075117 -1328206 -1096471 -622017 -249444 -90044
34287 -90044 -79515 -149087 -271535 -454794 -721025 -1022853 -1204273 -1126546 -808409 -386182
34277 -386182 1387 232276 224319 56402 -44047 15542 27407 -209526 -509101 -474049
34267 -474049 -30928 465132 689764 665950 555785 391560 150580 -114291 -385833 -752299
34257 -752299 -1196127 -1478726 -1436478 -1245463 -1161745 -1125502 -896798 -496531 -194460 -79454
34247 -79454 24104 171721 187716 69728 150149 596739 1022953 934442 414988 16438
34237 16438 11358 94650 -115093 -565578 -899561 -898076 -631592 -278227 44831 283848 395040
34226 395040 347728 193674 115645 314965 754157 1063699 860596 191271 -473626 -745192
34216 -745192 -693899 -632866 -660048 -609345 -413797 -267974 -313965 -354244 -104882 335774 542737
34205 542737 340111 54782 31344 123044 -63179 -554082 -966706 -1034945 -854376 -587224
34195 -587224 -265618 22222 86488 -58587 -130109 3059 111278 11610 -111273 -45363
34185 -45363 77536 68176 71655 291848 544085 515208 307036 252168 302861 130691 -188364
34174 -188364 -160673 325263 706699 505553 -23582 -297922 -160394 77075 153423 135381
34164 135381 237947 535029 829079 793591 347409 -151502 -269148 -11373 253805 333998
34154 333998 364367 444068 484745 465362 479577 467767 265949 -24890 -129067 -117779 -352269
34143 -352269 -783086 -866442 -422535 -8537 -80643 -331538 -321326 -252354 -522295 -910114
34133 -910114 -887356 -497187 -255218 -302962 -289512 -54008 147778 116689 -78068 -366400
34123 -366400 -703264 -844642 -569018 -132969 -47321 -376394 -704024 -799936 -831078 -876407
34113 -876407 -765801 -521209 -442569 -575255 -573601 -304969 -112437 -203194 -236674 102086
34103 102086 492260 398071 -111550 -411033 -140431 358784 484854 72015 -421355 -401686
34093 -401686 166257 637025 409154 -317960 -782337 -609075 -166294 52468 -24308 -259284
34083 -259284 -625254 -1014483 -1074081 -612852 17929 285580 99765 -193126 -313890 -270636
34073 -270636 -161009 -32365 67381 97843 88925 71712 -13246 -226961 -503109 -701769 -735147
34062 -735147 -584831 -293325 8858 194066 304897 476857 656900 623548 378414 256790
34052 256790 465835 731694 637331 165235 -308531 -448729 -212598 209166 524877 530683
34042 530683 337611 298032 548018 753254 492343 -210350 -897717 -1130255 -802605 -158820
34032 -158820 357170 415729 127220 -82542 -34068 -8266 -243029 -510952 -484001 -267522
34022 -267522 -210632 -360392 -476883 -457811 -370615 -182453 125851 264733 -74047 -635063
34012 -635063 -785586 -363006 117515 222882 101883 26527 -84036 -329523 -412497 -36407
34002 -36407 491898 551541 57371 -400615 -314352 199467 707706 979154 1002471 750361
33992 750361 228589 -329185 -595507 -512754 -332226 -244544 -161445 29750 177134 42972
33982 42972 -299534 -481183 -290508 57625 184138 -39973 -410795 -620346 -491585 -74325
33972 -74325 390140 625972 510725 126104 -343360 -712936 -853775 -764988 -586577 -446701
33962 -446701 -322833 -154324 -15193 -1989 -18287 96234 257776 232948 41650 -44034
33952 -44034 45461 51606 -177164 -445399 -544838 -515093 -417866 -187273 101034 160187 -63383
33941 -63383 -213136 -61439 127149 89354 41198 245814 452051 277417 -115889 -286056
33931 -286056 -255520 -393582 -675616 -694399 -408962 -269045 -494359 -777494 -845169 -804608
33921 -804608 -749189 -509457 -64331 202811 -20157 -503514 -752607 -586233 -255251 -125796
33911 -125796 -352253 -724459 -803129 -378644 221743 505159 434031 374893 483656 544198
33901 544198 450750 420975 595102 791892 820777 721759 564569 322722 70169 -13460
33891 -13460 44818 9296 -147933 -167153 50580 275039 353730 411171 494869 413284 107292
33880 107292 -196065 -383933 -620482 -917752 -967059 -645724 -289484 -193595 -228981 -213354
33870 -213354 -245409 -366901 -309017 76878 507715 708279 772871 785913 549790 64752
33860 64752 -215130 -58860 96636 -118736 -344039 -159026 102802 -39471 -253020 74999
33850 74999 665519 688232 124705 -206617 1543 152437 -138750 -468034 -492937 -528605
33840 -528605 -860448 -1136137 -927436 -397940 16285 182318 179212 37737 -94814 80270
33830 80270 550306 858041 749382 579906 723160 939037 763091 257161 -84317 -42206
33820 -42206 108032 49425 -187981 -308224 -88693 333949 509648 154934 -436694 -717902
33810 -717902 -598708 -468929 -482657 -304314 246291 770577 825496 501118 137328 -182087
33800 -182087 -484854 -583690 -328424 34531 166330 139400 263318 545425 685702 516236
33790 516236 145327 -230813 -403363 -203594 234014 445213 190456 -150592 -86449 281778
33780 281778 473651 371189 260377 232356 83880 -162945 -167444 166996 482279 499339
33770 499339 377501 328019 217033 -159982 -648200 -882779 -759051 -518166 -411358 -448495
33760 -448495 -466332 -336522 -96214 92120 113273 8429 -121351 -250316 -379038 -434348
33750 -434348 -363311 -269482 -290283 -377134 -369769 -253908 -151083 -73708 88134 317679 435337
33739 435337 374284 288502 293626 274979 68816 -297248 -659022 -913872 -1059030 -1101338 -1035618
33728 -1035618 -906186 -833736 -947379 -1250634 -1546314 -1575155 -1287104 -899181 -629936 -495866
33718 -495866 -452330 -557293 -816044 -1020936 -992440 -875253 -928506 -1097480 -1084357 -803222
33708 -803222 -461379 -203575 3594 118495 -1563 -308032 -568167 -736432 -972853 -1204660
33698 -1204660 -1083798 -568463 -129798 -89602 -133785 135632 499063 464723 108848 14849
33688 14849 403764 841033 910384 742440 680221 757115 759157 595820 367755 174124 36079
33677 36079 -48894 -101596 -159701 -207331 -188560 -157598 -283707 -573723 -711263 -394021 190880
33666 190880 472313 171805 -327207 -476542 -291449 -290598 -711991 -1132022 -1063260 -671814
33656 -671814 -562672 -950575 -1403530 -1439498 -1052306 -541532 -116711 158346 271307 314339
33646 314339 439980 578578 410605 -150844 -663409 -646380 -214907 108453 98551 -33412
33636 -33412 -141196 -339277 -621717 -695852 -392091 47498 280765 243943 71874 -118990
33626 -118990 -199495 -25014 320221 484884 286964 -1538 -52188 31980 -63380 -308592
33616 -308592 -376266 -198699 -93196 -263490 -501167 -508703 -263212 74117 377177 519565
33606 519565 329992 -183983 -672111 -726654 -329635 122656 249762 57037 -117705 36032
33596 36032 486601 870331 845234 456527 93476 52820 225128 278717 80540 -172999
33586 -172999 -229284 -85562 27492 -57456 -225685 -221794 -1465 175610 82410 -163787
33576 -163787 -278163 -201052 -96266 -15089 147386 332310 279817 -43887 -265227 -61485
33566 -61485 413191 770205 855180 755245 549258 318935 222900 267615 180253 -177291 -466280
33555 -466280 -329331 671 33806 -178443 -166626 81909 54199 -368861 -633065 -434543
33545 -434543 -244458 -471136 -711907 -437352 61713 112389 -274282 -503370 -379299 -264918
33535 -264918 -334138 -384499 -415007 -672664 -999214 -845001 -186265 239756 -13884 -415314
33525 -415314 -295320 130289 180628 -188351 -363487 -35374 411618 500023 186728 -287821
33515 -287821 -698781 -869566 -700577 -310186 21551 122866 27295 -169004 -372487 -456615
33505 -456615 -379287 -319940 -472716 -711078 -715356 -461794 -303174 -464150 -714939 -705577 -421146
33494 -421146 -117981 47769 134041 240069 388106 529815 539280 253753 -331745 -924518
33484 -924518 -1127499 -821025 -292322 45512 38282 -114435 -132053 9864 77663 -55597
33474 -55597 -162167 50212 441274 490758 -38198 -703998 -872891 -486179 -94869 -149576
33464 -149576 -498340 -667607 -456518 -105764 42071 -92914 -308649 -376417 -260185 -94746
33454 -94746 -2736 7419 -24644 -83742 -145348 -165866 -180123 -304285 -527810 -620571 -439069
33443 -439069 -234521 -375598 -767274 -880869 -489108 -42418 -51042 -352427 -371597 21274
33433 21274 354716 290694 92991 166707 449357 553868 341244 44436 -117978 -171797
33423 -171797 -201544 -167599 -20724 133647 109824 -158355 -553053 -868273 -927080 -668660
33413 -668660 -220937 118476 92435 -239756 -498478 -378571 -38370 57332 -263711 -612349
33403 -612349 -518314 -40552 333329 328261 138460 19922 -69390 -277199 -543978 -686123
33393 -686123 -637572 -424282 -45874 405571 639878 451195 60853 -76407 180136 521442
33383 521442 626291 515669 391891 312283 161718 -139064 -507801 -751939 -698628 -321156
33373 -321156 208076 600033 625084 267599 -226386 -482685 -316075 42554 170454 -36488
33363 -36488 -241291 -135823 188735 499456 791361 1116268 1261712 998037 539537 335811
33353 335811 426246 427811 190267 -1711 6705 -36542 -256428 -289043 162909 736447 817095
33342 817095 367763 -70891 -122829 73425 236229 273543 155506 -215508 -803191 -1280073
33332 -1280073 -1287467 -838329 -350395 -246916 -549903 -887901 -902298 -608734 -335365 -375607
33322 -375607 -778317 -1388184 -1928105 -2092689 -1782014 -1270264 -945049 -842274 -638837 -141233
33312 -141233 452144 843201 949566 839641 592024 322277 118790 -125563 -545808 -909617
33302 -909617 -769760 -157275 308421 256448 78656 255784 592844 602469 306263 101812
33292 101812 82084 71642 155590 536935 945757 831820 178114 -449784 -703708 -727515
33282 -727515 -596865 -157510 401338 485250 -67368 -656879 -795195 -758567 -927438 -1012119
33272 -1012119 -554244 175966 487879 304707 209065 474059 692258 502025 116212 -132882
33262 -132882 -312076 -586181 -738223 -458578 31132 131421 -302893 -712421 -618496 -299013
33252 -299013 -325039 -670960 -790087 -525419 -370901 -638574 -897860 -641478 -114139 44082
33242 44082 -247700 -473023 -357049 -202219 -329860 -642760 -861985 -848565 -604191 -264365
33232 -264365 -129334 -375404 -719662 -716180 -365857 -32121 195472 520462 812507 614690
33222 614690 -38193 -451158 -234104 145201 152975 -24656 29839 181649 30758 -362530
33212 -362530 -617354 -657960 -673830 -663049 -533279 -490444 -806402 -1295267 -1494747 -1309510
33202 -1309510 -1054074 -912972 -753614 -441263 -1839 478522 831289 796432 333021 -188182
33192 -188182 -379846 -260056 -35103 250126 509886 413457 -143892 -657995 -623814 -264123
33182 -264123 -112428 -170184 -125970 -124374 -519452 -1031984 -1023864 -575960 -403822 -638734 -621056
33171 -621056 -102963 291623 188737 165159 773393 1582936 1832265 1503952 1126259 915301
33161 915301 719567 523310 444063 400053 217782 -56972 -258235 -341201 -309999 -148292
33151 -148292 -574 -99616 -335079 -294986 55204 210940 -74178 -346141 -179389 162858
33141 162858 248466 167126 181365 146442 -129027 -346870 -188486 22727 -182814 -535579
33131 -535579 -370525 307511 824451 836401 655040 578471 518485 354613 147903 -38186
33121 -38186 -121253 104807 614105 869826 454035 -209984 -410171 -238492 -352407 -754403
33111 -754403 -741068 -160923 244776 59929 -157485 84688 342648 47055 -460496 -448260
33101 -448260 53775 344289 80502 -403893 -711440 -789814 -739382 -608545 -420407 -175182
33091 -175182 149760 472234 607427 522304 404463 360526 285981 159299 157536 299023
33081 299023 303283 43434 -188347 -136802 21475 40211 23144 121234 138936 -115693 -356134
33070 -356134 -191166 201505 281317 -68114 -450868 -638975 -860871 -1310774 -1747642 -1759308
33060 -1759308 -1238753 -510751 -79445 -203662 -609052 -729982 -353952 155849 408759
33051 408759 458051 484978 366761 -35717 -448759 -537592 -476898 -640746 -894317 -800079
33041 -800079 -447177 -413659 -847972 -1224158 -1162200 -901251 -745783 -609501 -408776 -401526
33031 -401526 -750947 -1128581 -1117502 -725262 -212449 275290 618282 605339 256133 -18061
33021 -18061 73572 274764 203568 -57528 -168185 -89829 -16921 69167 328012 645037 718056
33010 718056 515622 282266 153731 136770 369988 941413 1477497 1429489 849795 380289
33000 380289 314268 199122 -327585 -808235 -582666 161968 558415 235849 -206770 -49699
32990 -49699 634679 1174333 1134322 652649 82773 -353044 -540170 -421057 -132403 5591
32980 5591 -161941 -399736 -389719 -148268 88532 275962 520224 669730 385016 -258722
32970 -258722 -671193 -506888 -135119 2560 118534 626856 1234849 1193237 444447 -177766
32960 -177766 -94870 287534 335348 128227 144218 379902 389954 61579 -215091 -179027
32950 -179027 -45270 -106904 -337241 -528824 -565093 -420529 -112062 213255 328125 202200
32940 202200 79777 151576 288607 247839 28097 -145812 -133210 -16195 58506 53411 34930
32929 34930 63334 110717 76864 -91248 -299012 -391758 -354626 -322396 -349836 -308075 -112354
32918 -112354 77997 55795 -122410 -222731 -191860 -193599 -262850 -179687 182753 591216 723476
32907 723476 571763 373856 244059 113455 -5368 29630 211841 303025 169281 22805
32897 22805 142964 454032 575539 281201 -238429 -590748 -559341 -254225 25286 45242
32887 45242 -179870 -408657 -391705 -97018 262478 413357 266205 33840 76719 523302
32877 523302 1046233 1166586 825622 473238 479935 661386 595137 248776 -6637 44119
32867 44119 198014 172049 -59832 -345851 -543662 -540941 -307467 -30317 15681 -149379
32857 -149379 -178186 101804 380547 276608 -122878 -380636 -245106 165372 594164 794206
32847 794206 534817 -210138 -1044273 -1384255 -1015527 -270037 371029 685075 711336 570346
32837 570346 392110 290473 290307 318442 304039 257295 263380 425398 729923 910942 607710
32826 607710 -175126 -907676 -1069293 -738257 -386497 -202495 14183 321866 448032 257522
32816 257522 25940 38188 206173 288567 228306 69381 -198250 -474412 -473416 -87624 358594
32805 358594 473864 253325 -54626 -319156 -493350 -438897 -137997 89909 -35783 -291312
32795 -291312 -259533 -5577 14617 -300916 -531857 -402557 -169417 -166272 -339797 -450453
32785 -450453 -418109 -239720 152971 688263 1028126 927622 582297 378662 409181 447633
32775 447633 302565 -25073 -466976 -947600 -1321518 -1419505 -1202001 -809118 -472283 -388482
32765 -388482 -576712 -790634 -679931 -141284 546582 986638 989058 639732 212142 47735
32755 47735 301818 688650 684032 142632 -472226 -656520 -472872 -356840 -486219 -643515
32745 -643515 -616202 -423775 -165879 70116 132097 -92313 -425181 -486552 -138603 327652
32735 327652 536303 411178 147504 -43184 -55529 118731 393134 624394 723604 707487
32725 707487 621322 465633 224001 -75268 -332441 -396051 -164460 278554 700879 966258
32715 966258 1139614 1247510 1093815 535626 -167632 -577925 -634605 -690943 -963237 -1249566
32705 -1249566 -1286149 -1076435 -718177 -210132 335120 548469 193957 -438509 -820427 -772012
32695 -772012 -502366 -178207 202875 525631 511892 97861 -387809 -576850 -439085 -204995
32685 -204995 -71821 -104269 -274282 -440457 -386324 -39583 393327 636251 645129 590255
32675 590255 591942 616844 616275 610717 605248 553745 465715 438651 507887 558570 488770 390268
32663 390268 430978 565079 493141 -18575 -826034 -1467879 -1547373 -1073943 -451525 -100870
32653 -100870 -55293 22230 359290 700458 584672 -19420 -583122 -631540 -301548 -99484
32643 -99484 -220446 -351177 -143517 339562 738407 817221 659014 502836 484969 550005
32633 550005 575080 534036 494216 471992 396114 252807 147588 136432 116153 9176 -64049
32622 -64049 27548 171942 171158 78774 117097 285156 340803 203873 82766 122657 216016
32611 216016 271107 371980 517919 501902 253344 13082 -83538 -301327 -839581 -1325273
32601 -1325273 -1217937 -597237 -93119 -55553 -224004 -263005 -200555 -193682 -217274 -191164 -161950
32590 -161950 -165400 -98332 110598 355326 495129 495664 355741 84349 -168793 -181917 16663
32579 16663 97502 -166000 -617401 -933252 -912951 -494440 201827 704377 447728 -507651
32569 -507651 -1320601 -1282355 -632360 -109091 28069 60117 131255 106013 17680 53883 78443
32558 78443 -224738 -640656 -507822 256803 859662 735212 362896 465661 895552 983057
32548 983057 650943 407903 361387 33924 -718455 -1300551 -1190270 -644485 -240938 -93281
32538 -93281 92513 423189 663895 586155 190804 -364131 -847532 -1013837 -769760 -295233
32528 -295233 95975 203047 26588 -276330 -460324 -345675 -14374 237641 229068 78009
32518 78009 -9876 -10422 -44262 -192211 -447991 -744682 -941669 -906946 -691580 -485639 -341790
32507 -341790 -135849 122464 203179 32225 -130008 -114654 -163982 -509811 -884370 -847836
32497 -847836 -428534 -23413 192461 303336 230255 -175815 -640793 -661441 -291096 -147646
32487 -147646 -453941 -671841 -408196 -103910 -333753 -874848 -1064805 -804214 -594180 -709982
32477 -709982 -913576 -976710 -984586 -1048391 -1123061 -1195279 -1310875 -1344865 -1065063 -503803 19656
32466 19656 306321 421374 391768 101017 -401004 -802341 -909905 -871881 -869893 -839640 -664819
32455 -664819 -413161 -191123 34806 296399 505572 651899 891471 1225139 1326390 980604
32445 980604 498419 336282 430550 310694 -150003 -516827 -434583 -123675 -16957 -148836
32435 -148836 -178323 81640 395230 376318 -87790 -689421 -927500 -537131 233178 826481
32425 826481 938622 815677 889393 1182177 1261733 830853 180640 -114926 106891 412451
32415 412451 343571 2816 -115117 186608 529139 465914 74406 -174209 -56508 153882
32405 153882 124533 -101127 -279079 -392810 -637857 -1027483 -1290733 -1232425 -974924 -730065
32395 -730065 -528581 -338017 -268390 -414874 -597482 -539331 -290919 -200963 -411637 -640091
32385 -640091 -568343 -224207 152759 392996 368923 -71682 -849188 -1467413 -1420825 -779229
32375 -779229 -105065 213598 290630 388616 541392 652416 719584 772813 751824 635932
32365 635932 574919 687727 803621 625203 154427 -245102 -287730 -115330 -79176 -264379
32355 -264379 -407309 -292103 -52240 30365 -98816 -264992 -374402 -501029 -633625 -572681
32345 -572681 -216803 218452 439702 420543 343759 303284 255325 203616 235513 375205 536252
32334 536252 611325 531029 308634 103205 93053 173300 -7231 -512529 -875780 -702687
32324 -702687 -284054 -181163 -382480 -411479 -194919 -194450 -584312 -923336 -878286 -702602
32314 -702602 -668052 -549923 -122143 266874 140578 -364778 -711662 -720381 -642928 -627643
32304 -627643 -589118 -544815 -638361 -820153 -857012 -665754 -352122 37042 508496 921217
32294 921217 1078952 980635 736475 350092 -133153 -417297 -267876 71659 164598 3621
32284 3621 -48508 135160 336147 439429 518053 468619 64090 -550912 -888184 -748671
32274 -748671 -393699 -11914 479873 975053 1074120 698042 304994 192767 55441 -411080
32264 -411080 -906171 -958167 -607551 -223503 57609 280390 353421 260777 337926 813916
32254 813916 1263640 1075491 366096 -148883 -192978 -244219 -672933 -1117751 -1040673 -523327
32244 -523327 -119150 -101308 -231459 -247261 -253686 -484602 -855908 -1002273 -771165 -441030
32234 -441030 -290506 -167943 193627 569684 428271 -217820 -642141 -330271 345621 693378
32224 693378 561001 246310 -94214 -445986 -599664 -369883 -26259 14509 -151292 -78389
32214 -78389 251111 371857 104821 -159124 -92255 121146 157658 -14751 -267040 -536618
32204 -536618 -760916 -874139 -972140 -1176359 -1298199 -1041986 -596189 -516186 -866491 -1036972
32194 -1036972 -691732 -336301 -505499 -885377 -829168 -406004 -274083 -647168 -1014475 -922471
32184 -922471 -519352 -190341 -40540 71366 212844 255457 10601 -523721 -1024227 -1091122
32174 -1091122 -733564 -398693 -356479 -334902 -47034 219515 -7743 -587638 -882206 -643116
32164 -643116 -287178 -230891 -404613 -539908 -518991 -281334 226401 793479 962550 543288
32154 543288 -120112 -564063 -654053 -490978 -176110 130736 209201 83418 85591 369597
32144 369597 607254 448438 46975 -202321 -250895 -345200 -529791 -607882 -538251 -477440
32134 -477440 -432435 -256590 -35840 -99720 -536717 -1035526 -1342346 -1539568 -1682127 -1502833
32124 -1502833 -804501 77616 575475 565489 420716 417628 428574 282967 127694 213108
32114 213108 483693 625983 491379 257980 116354 -20191 -325469 -670956 -667847 -171918
32104 -171918 445513 702505 572251 437857 537835 710035 722029 591239 434880 218823
32094 218823 -119863 -423105 -433204 -148007 136235 156414 -74416 -346521 -439122 -243103
32084 -243103 132481 354135 139205 -387352 -752202 -647981 -281899 -104437 -277939 -551523
32074 -551523 -627562 -496346 -346632 -246500 -54381 320430 684557 729767 420876 52875
32064 52875 -134819 -231691 -422757 -653732 -738854 -678509 -601918 -464715 -125621 268314
32054 268314 330806 -8155 -316669 -223866 101102 261055 177671 44831 -65915 -215449
32044 -215449 -327039 -256708 -104591 -133514 -352166 -470197 -329607 -116593 -49960 -96093
32034 -96093 -125020 -151910 -255794 -392652 -471121 -554377 -811917 -1234934 -1512987 -1314872
32024 -1314872 -715963 -230930 -269793 -606634 -629840 -174374 202644 -15545 -558805 -746428
32014 -746428 -422767 -70751 -50309 -200478 -278498 -347639 -525779 -691036 -679036 -536072
32004 -536072 -380781 -228543 -118292 -179487 -389255 -494305 -375064 -256676 -329804 -393669
31994 -393669 -168517 209501 325525 29158 -439855 -807640 -981267 -931192 -612460 -67547
31984 -67547 519838 915962 975416 779453 645246 808438 1049444 902940 344778 -75675
31974 -75675 -3311 205970 87931 -183147 -161418 43999 -34907 -323574 -235217 299313
31964 299313 548421 48066 -627087 -630148 4339 488508 367784 -17220 -141002 41902
31954 41902 181984 58815 -168061 -210103 -41018 76230 -16284 -111063 44066 282372
31944 282372 189774 -253404 -555974 -384609 -39069 -15266 -311725 -467382 -195472 293774
31934 293774 607118 597736 410023 209732 -14688 -343913 -678343 -758595 -530523 -320136
31924 -320136 -419939 -621178 -477228 5797 319192 158164 -202027 -385625 -402111 -417834
31914 -417834 -372260 -137672 171457 359637 436245 455022 276316 -161932 -510303 -370448
31904 -370448 70190 193188 -217297 -680852 -687622 -333773 -85854 -137306 -258790 -212182
31894 -212182 -77368 -88174 -249978 -269098 77191 599011 871237 719622 346928 -14186
31884 -14186 -309409 -454378 -241548 318992 806023 810184 398434 -68272 -389581 -539608
31874 -539608 -453337 -164601 7740 -171247 -400412 -213144 242081 297527 -284851 -963100
31864 -963100 -1199604 -1127866 -1133105 -1161213 -883368 -347957 -16260 -143547 -453434 -525359
31854 -525359 -301303 -71682 -50068 -124384 -92684 -36049 -244957 -723253 -1018050 -775582
31844 -775582 -297163 -216098 -675139 -1153112 -1120282 -554706 218171 852122 1059691 725702
31834 725702 126308 -236877 -191403 -44628 -64558 -124160 -35586 106397 175577 288752
31824 288752 505405 542312 184354 -244265 -267483 27808 140374 -48108 -139049 61488
31814 61488 200674 -17446 -294843 -143115 415892 895708 978729 789663 557979 311247
31804 311247 16927 -190705 -143618 69527 168014 69788 5043 112555 131293 -242450
31794 -242450 -810394 -1033718 -743162 -324973 -106892 53890 360481 625159 571207 318975
31784 318975 177766 128376 -80817 -432676 -654893 -690258 -740593 -832131 -747528 -462369
31774 -462369 -258930 -275478 -288020 -98301 168256 316775 343066 261906 -31072 -496318
31764 -496318 -800860 -691925 -333647 -43463 110566 202240 148025 -147269 -461950 -428749
31754 -428749 -28786 369525 483188 376124 212870 -4724 -345812 -747306 -1013437 -972615
31744 -972615 -625445 -192879 30810 -26435 -118883 1378 251456 364177 288767 213221
31734 213221 213933 161110 36344 71002 406421 813933 952263 784411 549089 396921
31724 396921 253553 29292 -211810 -339470 -308268 -175700 -31764 60308 97152 130717
31714 130717 206887 303218 341176 250064 16014 -290428 -515858 -515787 -303716 -68157 22665
31703 22665 3384 36756 187710 347653 369143 206056 -65300 -292298 -332393 -181654
31693 -181654 -9593 23325 -31332 -731 128642 177393 48090 -144215 -288131 -420306
31683 -420306 -511475 -323628 250847 837825 913952 490733 128646 178564 342872 188553
31673 188553 -208155 -462273 -535298 -766300 -1251539 -1598271 -1466849 -1072114 -896751 -1063558
31663 -1063558 -1249672 -1161605 -848895 -526941 -306449 -190011 -171208 -195851 -124193 108352
31653 108352 330979 294300 -3255 -289899 -363860 -327035 -402127 -646371 -958685 -1250012
31643 -1250012 -1439450 -1364404 -917009 -281718 158879 223587 107205 113149 341106 668840
31633 668840 883913 782929 320434 -248184 -534453 -423433 -153127 74628 304282 508821
31623 508821 398553 -126369 -591310 -461086 88208 386456 215361 13488 73932 121635
31613 121635 -57770 -125188 219655 572139 344654 -266561 -482174 -86272 256073 -6888
31603 -6888 -554375 -752369 -543119 -329331 -230843 23178 498211 824736 713285 369030
31593 369030 168447 123426 -77355 -559810 -1022760 -1055726 -584644 62765 497975 633645
31583 633645 692964 874817 1085152 1084860 851746 630877 597552 648361 612310 486496 327283
31572 327283 105010 -125536 -113513 213761 425566 66971 -592143 -795602 -367956 12220
31562 12220 -146046 -389131 -67388 599509 833214 433720 -64344 -298045 -451186 -625129
31552 -625129 -508050 6866 387955 96000 -636645 -1061996 -805272 -185291 249668 238129
$$ [...]
##END NTUPLES=NMR SPECTRUM
##END=
