##TITLE=31Pdec_SA_PPhvCl(CH2Cl2)Cl
 CDCl3, 8 sc
 20.9.2019
##JCAMPDX= 6.0         $$ Bruker NMR JCAMP-DX V2.0
##DATA TYPE= NMR SPECTRUM
##DATA CLASS= NTUPLES
##ORIGIN= UXNMR, Bruker Analytische Messtechnik GmbH
##OWNER= root
$$ XWIN-NMR		Version 3.5
$$ Fri Sep 20 14:17:17 2019 Russian Standard Time (UT+4h)  she@DPX200
##.OBSERVE FREQUENCY= 81.013821
##.OBSERVE NUCLEUS= ^31P
##.ACQUISITION MODE= SIMULTANEOUS
##.ACQUISITION SCHEME= undefined
##.AVERAGES= 24
##.DIGITISER RES= 17
##SPECTROMETER/DATA SYSTEM= spect
##.PULSE SEQUENCE= zgpg30
##.SOLVENT NAME= DMSO
##.SHIFT REFERENCE= (INTERNAL, DMSO, 0, 182.463)
##AUDIT TRAIL= $$ (NUMBER, WHEN, WHO, WHERE, WHAT)
$$ ##TITLE= Audit trail, XWIN-NMR		Version 3.5
$$ ##JCAMPDX= 5.01
$$ ##ORIGIN= Bruker BioSpin GmbH
$$ ##OWNER= she
$$ F:/spectra/data/she/nmr/P31/1/pdata/1/auditp.txt
$$ ##AUDIT TRAIL=  $$ (NUMBER, WHEN, WHO, WHERE, WHAT)
(   1,<2019-09-20 14:15:51.42 +0400>,<she>,<DPX200>,
      <created by zg, POWCHK disabled, PULCHK disabled
       configuration hash MD5:
       00 E9 B6 7A A2 85 ED C7 34 08 36 98 17 FE 4E 26
       data hash MD5: 32K
       AE B0 50 EC 35 49 13 4E 52 37 B4 22 EE 8A 74 C6>)
(   2,<2019-09-20 14:15:53.65 +0400>,<she>,<DPX200>,
      <Start of raw data processing
       efp BC_mod = 2 LB = 1 FT_mod = 6 PKNL = 1 PHC0 = -406.7602 PHC1 = 108.6003 SI = 64K 
       data hash MD5: 64K
       C3 2F E6 30 B2 A2 31 65 FA 3F 5D D7 6C 4B F1 B2>)
(   3,<2019-09-20 14:16:10.45 +0400>,<she>,<DPX200>,
      <pk PHC0 = 4.308777 PHC1 = 0 
       data hash MD5: 64K
       7D 90 B4 BB 09 EA 23 DE 1F 93 7D 77 5D 43 E6 6D>)
(   4,<2019-09-20 14:16:34.06 +0400>,<she>,<DPX200>,
      <pk PHC0 = 281.1882 PHC1 = -664.6 
       data hash MD5: 64K
       82 70 FB E6 72 9F C7 16 DE 89 A9 0B BE E9 4F E5>)
$$ ##END=
$$ 
$$ hash MD5
$$ 7D 7B 0F 5E EF 77 5F F5 6A 4B 0D 50 E0 07 1C 4B
##$RELAX= 
##$RELAX= 
##$RELAX= 
##$RELAX= 
##$RELAX= 
##$RELAX= 
##$RELAX= 
##$RELAX= 
$$ Bruker specific parameters
$$ --------------------------
##$DU= <F:/spectra>
##$EXPNO= 1
##$NAME= <P31>
##$PROCNO= 1
##$TYPE= <nmr>
##$USER= <she>
##$AMP= (0..31)
100 100 100 100 100 100 100 100 100 100 100 100 100 100 100 100 100 100 
100 100 100 100 100 100 100 100 100 100 100 100 100 100 
##$AQSEQ= 0
##$AQ_mod= 1
##$AUNM= <au_zg>
##$AUTOPOS= <>
##$BF1= 81.014009
##$BF2= 200.13
##$BF3= 200.13
##$BF4= 200.13
##$BF5= 200.13
##$BF6= 200.13
##$BF7= 200.13
##$BF8= 200.13
##$BYTORDA= 1
##$CFDGTYP= 0
##$CFRGTYP= 5
##$CHEMSTR= <none>
##$CNST= (0..31)
1 1 145 1 1 1 1 1 1 1 1 1 1 1 1 1 1 1 1 1 1 1 1 1 1 1 1 1 1 1 1 1 
##$CPDPRG= <waltz16>
##$CPDPRG1= <>
##$CPDPRG2= <waltz16>
##$CPDPRG3= <>
##$CPDPRG4= <mlev>
##$CPDPRG5= <mlev>
##$CPDPRG6= <mlev>
##$CPDPRG7= <mlev>
##$CPDPRG8= <mlev>
##$CPDPRGB= <>
##$CPDPRGT= <>
##$D= (0..31)
0 1 0 0 0 0 0 0 0 0 0 0.03 2e-05 3e-06 0 0 0 0 0 0 0 0 0 0 0 0 0 0 0 0 
0 0 
##$DATE= 1568974550
##$DBL= (0..7)
120 120 120 11 120 120 24 19 
##$DBP= (0..7)
150 150 150 150 150 150 150 150 
##$DBP07= 0
##$DBPNAM0= <>
$$ [...]
##$SUBNAM2= <"">
##$SUBNAM3= <"">
##$SUBNAM4= <"">
##$SUBNAM5= <"">
##$SUBNAM6= <"">
##$SUBNAM7= <"">
##$SUBNAM8= <"">
##$SUBNAM9= <"">
##$SW= 369.568048894756
##$SWIBOX= (0..15)
0 1 3 0 0 0 0 0 0 0 0 0 0 0 0 0 
##$SW_h= 29940.119760479
##$TD= 32768
##$TD0= 1
##$TE= 0
##$TE2= 300
##$TE3= 300
##$TEG= 300
##$TL= (0..7)
0 120 53 12 22 120 120 120 
##$TP= (0..7)
150 150 150 150 150 150 150 150 
##$TP07= 0
##$TPNAME0= <>
##$TPNAME1= <>
##$TPNAME2= <>
##$TPNAME3= <>
##$TPNAME4= <>
##$TPNAME5= <>
##$TPNAME6= <>
##$TPNAME7= <>
##$TPOAL= (0..7)
0.5 0.5 0.5 0.5 0.5 0.5 0.5 0.5 
##$TPOFFS= (0..7)
0 0 0 0 0 0 0 0 
##$TUNHIN= 0
##$TUNHOUT= 0
##$TUNXOUT= 0
##$USERA1= <user>
##$USERA2= <user>
##$USERA3= <user>
##$USERA4= <user>
##$USERA5= <user>
##$V9= 5
##$VALIST= <valist>
##$VCLIST= <CCCCCCCCCCCCCCC>
##$VD= 0
##$VDLIST= <DDDDDDDDDDDDDDD>
##$VPLIST= <PPPPPPPPPPPPPPP>
##$VTLIST= <TTTTTTTTTTTTTTT>
##$WBST= 1024
##$WBSW= 4
##$XGAIN= (0..3)
0 0 0 0 
##$XL= 0
##$YL= 0
##$YMAX_a= 17653
##$YMIN_a= -20550
##$ZGOPTNS= <>
##$ZL1= 120
##$ZL2= 120
##$ZL3= 120
##$ZL4= 120
##$ABSF1= 0
##$ABSF2= 0
##$ABSG= 0
##$ABSL= 0
##$ALPHA= 0
##$AQORDER= 0
##$ASSFAC= 0
##$ASSFACI= 0
##$ASSFACX= 0
##$ASSWID= 0
##$AUNMP= <proc_1d>
##$AZFE= 0.1
##$AZFW= 0.5
##$BCFW= 0
##$BC_mod= 2
##$BYTORDP= 0
##$COROFFS= 0
##$CY= -3
##$DATMOD= 1
##$DC= 0
##$DFILT= <>
##$DTYPP= 0
##$F1P= 0
##$F2P= 0
##$FCOR= 1
##$FTSIZE= 65536
##$FT_mod= 6
##$GAMMA= 0
##$GB= 0
##$INTBC= 1
##$INTSCL= 5.30512e-09
##$ISEN= 30
##$LB= 1
##$LEV0= 0
##$LPBIN= 0
##$MAXI= 10000
##$MC2= 0
##$MEAN= 0
##$ME_mod= 0
##$MI= 50
##$NCOEF= 0
##$NC_proc= -6
##$NLEV= 6
##$NOISF1= 182.463
##$NOISF2= 159.3651
##$NSP= 0
##$NTH_PI= 0
##$NZP= 0
##$OFFSET= 182.463
##$PC= 4
##$PHC0= -121.2632
##$PHC1= -555.9997
##$PH_mod= 1
##$PKNL= yes
##$PPARMOD= 0
##$PSCAL= 0
##$PSIGN= 0
##$REVERSE= no
##$SF= 81.0140089999434
##$SI= 65536
##$SIGF1= 159.3651
##$SIGF2= -187.1042
##$SINO= 113.3802
##$SIOLD= 16384
##$SREGLST= <1H.CDCl3>
##$SSB= 0
##$STSI= 65536
##$STSR= 0
##$SW_p= 29940.119760479
##$SYMM= 0
##$S_DEV= 0
##$TDeff= 32768
##$TDoff= 0
##$TI= <>
##$TILT= no
##$TM1= 0
##$TM2= 0
##$TOPLEV= 0
##$USERP1= <user>
##$USERP2= <user>
##$USERP3= <user>
##$USERP4= <user>
##$USERP5= <user>
##$WDW= 1
##$XDIM= 65536
##$YMAX_p= 409741946
##$YMIN_p= -29916628
$$ End of Bruker specific parameters
$$ ---------------------------------
##NTUPLES= NMR SPECTRUM
##VAR_NAME=  FREQUENCY,     SPECTRUM/REAL,   SPECTRUM/IMAG
##SYMBOL=    X,             R,               I
##VAR_TYPE=  INDEPENDENT,   DEPENDENT,       DEPENDENT
##VAR_FORM=  AFFN,          ASDF,            ASDF
##VAR_DIM=   65536,         65536,           65536
##UNITS=     HZ,            ARBITRARY UNITS, ARBITRARY UNITS
##FACTOR=    0.456856943014862, 1,           1
##FIRST=     14782.0589164792, 0,            0
##LAST=      -15158.0608439998, 0,           0
##MIN=       -15158.0608439998, -29916628,   0
##MAX=       14782.0589164792, 409741946,    0
$$ Real data points
##PAGE= N=1
##DATA TABLE= (X++(R..R)), XYDATA
$$ [...]
40568a457478O07573P89294J332625Q33843j013314k605396k248189k57038J368622
$$ -1457478 -849905 -60611 1272014 2105857 1092543 -1512853 -3761042 -4018080 -2649458
40559b649458J343794M98090L37096Q57742Q23100o6456o69879l37102P1753k18111
$$ -2649458 -1305664 -807574 -470478 387264 1210364 1143908 474029 136927 208680 -9431
40549i431n99466l63667o1015l19671l87712N94183J714263J459348K12157l08676
$$ -9431 -608897 -972564 -1033579 -1353250 -1740962 -1146779 567484 2026832 2238989 1930313
40539A930313J78383L01375l75760o14622J85223Q61079M78292k05212k31529
$$ 1930313 2108696 2410071 2034311 1419689 1604912 2465991 2944283 2739071 2507542
40530B507542J3988j91599n48493m47210n1671K77614O47571Q23962o8267j897137
$$ 2507542 2521530 2329931 1781438 1334228 1282557 1560171 2207742 3031704 2963437 1066300
40520A066300k764575j389596O94452J020429m05620j396988q78081Q4516N22071
$$ 1066300 -1698275 -3087871 -2393419 -1372990 -1778610 -3175598 -4053679 -3969163 -3447092
40511c447092Q15644J236807J072860Q6254o41209l79549m0768n96665j222040
$$ -3447092 -2631448 -1394641 -321781 -235527 -876736 -1256285 -1297053 -1893718 -3115758
40502c115758m74224J269906K090554J107546n79217j635453j877744j542129
$$ -3115758 -3589982 -2320076 -229522 878024 298807 -1336646 -3214390 -4756519
40494d756519m34038J348324K695132K508105J061799m47310j333990j592197
$$ -4756519 -5190557 -3842233 -1147101 1361004 2422803 1975493 641503 -950694
40486i50694j092767J80084J215321P09008r31048j647668m85892R77808R56686
$$ -950694 -2043461 -1863377 -648056 60952 -870096 -2517764 -3003656 -2025848 -1069162
40477a069162l955k53780J75846m4623q31662o06869Q06864J387539n4795j841040
$$ -1069162 -1073117 -1326897 -1151051 -1195674 -2027336 -2634205 -1827341 -439802 -494597 -2335637
40467b335637j727322Q0377J604823J753572Q81502m13025j496240j361264K48364
$$ -2335637 -4062959 -3982582 -2377759 -624187 257315 -155710 -1651950 -3013214 -2764850
40458b764850J747315J399690j05754n32022M43732O41055j153850l027930k508958
$$ -2764850 -1017535 382155 276401 -255621 188111 829166 -324684 -3352614 -5861572
40449e861572K4686J988420J904536O47153k61622k34927N19073J506027J919612
$$ -5861572 -5836886 -3848466 -1943930 -1296777 -1558399 -1793326 -1274253 231774 2151386
40440B151386J017022q29806j971694j116319R70025K052368R37164j119615j966367
$$ 2151386 3168408 2338602 366908 -749411 220614 2272982 3210146 2090531 124164
40431A24164j123992l4962J26213j91663j63501p0403m92380p82896J94359J974672
$$ 124164 -999828 -1034790 -908577 -1100240 -1263741 -1334144 -1826524 -2609420 -2415061 -440389
40421d40389K598331J124603j141560k391866k246567j423293n16570J28606J83290
$$ -440389 2157942 3282545 2140985 -250881 -2497448 -3920741 -4437311 -4308705 -4125415
40412d125415j35164N8399J046447J719525J031834k53421m34620P04274J513376
$$ -4125415 -4260579 -4202180 -3155733 -1436208 -404374 -657795 -1092415 -388141 1125235
40403A125235O77203j165217k335450j948667m86673R08776J336817O98304k89739
$$ 1125235 1802438 637221 -1698229 -3646896 -4133569 -3224793 -1887976 -1189672 -1479411
40394a479411p73088n69281j55049R5654L25264P76900J273702J306231N73359
$$ -1479411 -2252499 -2821780 -2976829 -2881175 -2555911 -1779011 -505309 800922 1374281
40385A374281n94559j363589j128188k03490M52931L22732j96044n12695n37207
$$ 1374281 779722 -583867 -1712055 -1915545 -1462614 -1139882 -1335926 -1848621 -2385828
40376b385828l95966j03651K7090n90542j648624j625803J96673K069566J709413
$$ -2385828 -2781794 -2885445 -2858355 -3448897 -5097521 -6723324 -6526651 -4457085 -2747672
40367b747672l99129j488445m56184P16508K84189n44437K26585K012503K516117
$$ -2747672 -3146801 -4635246 -5091430 -4374922 -4090733 -4635170 -4408585 -2396082 120035
40358A20035J203157k00886n19953m37621o79532o77938J52473J131879J273490
$$ 120035 1323192 1122306 602353 164732 -514800 -1192738 -1040265 91614 1365104
40349A365104O58757J8435l72653o14924o02877l08252j68948m48445o18504j18930
$$ 1365104 2023861 2042296 1669643 1054719 451842 143590 -25358 -473803 -1092307 -1211237
40339a211237O45671Q43559M15920q5892n44083j164298j498774p42694Q45879
$$ -1211237 -565566 277993 693913 608021 63938 -1100360 -2599134 -3341828 -2495949
40330b495949J930700J852692J347481J015214K35642j425691k670244j767024
$$ -2495949 -565249 1287443 2634924 3650138 3885780 2460089 -210155 -1977179
40322a977179Q60383K709821K103068j2176j546700j683217j188215r15672q35215
$$ -1977179 -1116796 1593025 3696093 3683917 2137217 454000 -734215 -1649887 -2485102
40313b485102n02458J01876M88056K82288k46709l97955J93342J102656J527406
$$ -2485102 -2987560 -2885684 -2397628 -2115340 -2362049 -2760004 -2566662 -1464006 63400
40304F3400J054039o5620j211023j793709j570477q18428q4793L84356P47765
$$ 63400 1117439 1051819 -159204 -1952913 -3523390 -4341818 -4426611 -4042255 -3294490
40295c294490J020292R07853M68553L29025P24172R40781M15521k63216l50530
$$ -3294490 -2274198 -1366345 -897792 -568767 155405 1096186 1511707 1248491 897961
40286H97961k27632m68491l54466R42108K149403J101497j704100l140052j769193
$$ 897961 670329 201838 -152628 789480 2938883 4040380 2336280 -803772 -2572965
40277b572965K10325N22829l4849J95248N40841m42379j749029j191511Q29252
$$ -2572965 -2362640 -1839811 -1874660 -1679412 -1138571 -1580950 -3329979 -4521490 -3692238
40268c692238J685213N18418p65719p32558j86678j31529j58985K45159N43792
$$ -3692238 -2007025 -1488607 -2254326 -2986884 -3173562 -3305091 -3464076 -3218917 -2675125
40259b675125K03885m24430r08960j194458r36134K37028J543916J669401P85454
$$ -2675125 -2471240 -2895670 -3804630 -4999088 -5935222 -5698194 -4154278 -2484877 -1699423
40250a699423L00088M70663K51290l25187n1473P21621Q8763j745060j928407
$$ -1699423 -1399335 -928672 -677382 -1002569 -1054042 -332421 -243658 -1988718 -3917125
40241c917125L33218J816021M01978j059984O16909L227563K409491j157675k650579
$$ -3917125 -3583907 -1767886 -1365908 -2425892 -1808983 1418580 3828071 2670396 19817
40232A9817o24573J263104N47334p13998m03496P4264q97332j643220o7075K282615
$$ 19817 -604756 658348 1205682 491684 88188 162452 -734880 -2378100 -2445175 -162560
40222a62560K235659j86480j936512j384520k6398K61029m45687r80276p90763
$$ -162560 2073099 1886619 -49893 -1434413 -1460811 -1199782 -1645469 -2625745 -3416508
40213c416508j72127L57123M88430L48533L45066M92004J91595q09411j603440
$$ -3416508 -3588635 -3231512 -2743082 -2394549 -2049483 -1557479 -1365884 -2175295 -3778735
40204c778735j011972P87023K223061K091755Q52521j25237k84761l17329p99673
$$ -3778735 -4790707 -4003684 -1780623 311132 1163653 1038416 753655 436326 -363347
40195c63347j085071l47333O40719J73351j622440k322044n84993J565416J619976
$$ -363347 -1448418 -1795751 -1155032 -981681 -2604121 -4926165 -5511158 -3945742 -2325766
40186b325766M04588N20732J782769J402639j081762k447089o92817J625988J142893
$$ -2325766 -1921178 -1400446 382323 1784962 703200 -1743889 -2436706 -810718 332175
40177C32175j402273k557864j146078P53601J244502O84374K74469M27758R19933
$$ 332175 -1070098 -3627962 -4774040 -4020439 -2775937 -2091563 -1817094 -1389336 -469403
40168d69403J446881J689475J502536J040528K91220j021476k540100l071688
$$ -469403 977478 2666953 4169489 5210017 5501237 4479761 1939661 -1132027
40160a132027k107007p49314j74740j744O81597J512627J459686N98250j39754
$$ -1132027 -3239034 -3988348 -4163088 -4164832 -3483235 -1970608 -510922 87328 -52426
40151e2426m96321p87249p94588k57795L923q63076j883546j249858Q41108K161234
$$ -52426 -548747 -1335996 -2130584 -2388379 -2384456 -3247532 -5131078 -6380936 -5539828 -3378594
40141c378594J513511J26697m35384j52274K89757P39696J104211P65163n29496
$$ -3378594 -1865083 -1738386 -2173770 -2326044 -2036287 -1296591 -192380 572783 43287
40132D3287j847440j914882m63664J538460K608920J784470l46918j769768j124656
$$ 43287 -1804153 -3719035 -4182699 -2644239 -35319 1749151 1402233 -367535 -1492191
40123a492191M53798P18707n71281j397751n50136P30885Q70903J66074k18458
$$ -1492191 -1038393 -319686 -890967 -2288718 -2838854 -2107969 -1237066 -1070992 -1289450
40114a289450j96313l62534n02788O8580J069920J419936P85062j5236k18441
$$ -1289450 -1485763 -1848297 -2351085 -2282505 -1212585 207351 992413 977177 758736
40105G58736M511K9778l59847p71002o55417M9972P09885O27473o6317n06938
$$ 758736 763247 793025 433178 -337824 -993241 -943269 -233384 394089 327772 -179166
40095a79166j80977M86138P80475N10774l3652n08802o33725k54379L97225P40798
$$ -179166 -360143 125995 906470 1417244 1383592 874790 241065 -13314 383911 1124709
40085A124709L89451m44733j116616r93943P6512J412089J800155O62765j138166
$$ 1124709 1514160 1069427 -47189 -1041132 -964620 447469 2247624 2910389 1772223
40076A772223k086983j536059j22925J047614J205977L12235p52623q06600J79748
$$ 1772223 -314760 -1850819 -1973744 -926130 279847 592082 -160541 -967141 -787393
40067g87393Q02063J48616p86795p20223j69954k92242m62871P02876K270294
$$ -787393 14670 163286 -623509 -1343732 -1513686 -1805928 -2268799 -1565923 704371
40058G04371J648049j247110l198036k136799P6286Q39605N15896Q92351J730121
$$ 704371 2352420 1105310 -2092726 -4229525 -4153239 -3313634 -2797738 -1905387 -175266
40049a75266J361491k12761j196546o67817M85248J125248Q55735k73241j600793
$$ -175266 1186225 973464 -223082 -890899 -405651 719597 1575332 1302091 -298702
40040b98702j678538K50947K704077L257721J425814r05212j852426j252423r1064
$$ -298702 -1977240 -1726293 977784 4235505 5661319 4756107 2903681 1651258 1560194
40031A560194O66441O05172P9451j07923J68939j3713j148277k167201j899490
$$ 1560194 2226635 2831807 2911258 2803335 2972274 2958561 1810284 -356917 -2256407
40022b256407r33586o10991p69086j91653J052166J617278J189198Q27840P75417
$$ -2256407 -3189993 -3800984 -4570070 -4761723 -3709557 -2092279 -903081 -75241 700176
40013G00176k8404j590769k039244l45174J736706J914295L80430r08870j079594
$$ 700176 671772 -918997 -2958241 -3303415 -1566709 347586 728016 -180854 -1260448
40004a260448q29205o19471j53648L38158m2914j187903j506493n7202J776953
$$ -1260448 -2089653 -2709124 -2862772 -2524614 -2567528 -3755431 -5261924 -5319126 -3542173
39995c542173J941728N82905j17843R12668K064225J371016p00696k012145j612129
$$ -3542173 -1600445 -1017540 -1135383 -222715 1841510 3212526 2511830 499685 -1112444
39986a112444m17447N79955J152530R50865l52381j627574r46720J412929K487876
$$ -1112444 -1529891 -949936 202594 1153459 801078 -826496 -1773216 -360287 2127589
39977B127589N15109k363323l011486j487976k42208k26715k53866K74460M86529
$$ 2127589 2642698 279375 -2732111 -4220087 -4462295 -4689010 -4942876 -4668416 -4181887
39968d181887K580l55466j77822k8344q7799J32508M89941K73887k05982J71264
$$ -4181887 -4179307 -4534773 -4712595 -4740939 -4828738 -4696230 -4206289 -3932402 -4138384 -3967120
39958c967120J241299J490228N25446k76358j93760k56058j034812j331228l31805
$$ -3967120 -2725821 -1235593 -710147 -986505 -1180265 -1436323 -2471135 -3802363 -4134168
39949d134168P15079N07462j50834J06095P90546N74779k30570k29336N32416
$$ -4134168 -3419089 -2911627 -3062461 -2956366 -2165820 -1591041 -1821611 -2050947 -1518531
39940a518531N73111n39986j488656j303281o88681o33570p73494n776J712374
$$ -1518531 -945420 -1485406 -2974062 -4277343 -4966024 -5599594 -6373088 -6378864 -4666490
39931d666490K944754K300379J06587j742462j720747j89027J265869J587038
$$ -4666490 -1721736 578643 685230 -1057232 -2777979 -2967006 -1701137 -114099
39923a14099Q07975n95412j883431j928447k90853J569373J629082Q7859p49483
$$ -114099 693876 98464 -1784967 -3713414 -4004267 -2434894 -805812 -717953 -1467436
39914a467436K01971J377127J263021O44783P67058R25092j86608j824802k001275
$$ -1467436 -1265465 111662 1374683 2019466 2786524 3711616 3525008 1700206 -301069
39905c01069m77789R16534Q84558M0284l87836L520P80620J183331O21173o68599
$$ -301069 -778858 137676 1022234 1062518 674682 678202 1458822 2642153 3263326 2594727
39895B594727j637599j613886j007382l92304K17104N52962j41157j457113j429160
$$ 2594727 957128 -656758 -1664140 -2056444 -1839340 -1286378 -1427535 -2884648 -4313808
39886d313808N72241K047372P29211j540799j247200J217599J948646k68124j899334
$$ -4313808 -3741567 -1694195 -964984 -2505783 -3752983 -2535384 -586738 -854862 -2754196
39877b754196k29523K347812K023649q33487k636317j750587R7333R96379R09263
$$ -2754196 -2983719 -635907 1387742 554255 -2082062 -3832649 -3735316 -2738937 -1829674
39868a829674N44040K35917K98728R34281J445251Q05618p10246j621769j207626
$$ -1829674 -1285634 -1049717 -750989 183292 1628543 2434161 1723915 102146 -1105480
39859a105480k56818L80175P57661R14235K77866j158051k089962j440274J872
$$ -1105480 -1362298 -982123 -224462 689773 967639 -190412 -2280374 -3720648 -3718776
39850c718776N94331Q8061l14069K8835M07547K26980N8587N71571J285387J244147
$$ -3718776 -3124445 -3036384 -3350453 -3321618 -2914071 -2687091 -2628504 -2056933 -771546 472601
39840D72601M27243l38984n70532m42649j08608M86987J091736J138611M33534
$$ 472601 899844 560860 -9672 -452321 -560929 -73942 1017794 2156405 2589939
39831B589939n63906j179373r64541J8815R07557N20326j077688k007260p70300
$$ 2589939 2026033 846660 -117881 -99066 808491 1328817 251129 -1756131 -2526431
39822b526431J319668J491529o04454k171172j092454J219463K008989Q54772
$$ -2526431 -1206763 284766 -319688 -2490860 -3583314 -2363851 -354862 499910
39814D99910l87187m66314P1220K62479q6016o01307p71207k01454Q55437J438867
$$ 499910 112723 -353591 -282371 -19892 -105908 -707215 -1478422 -1679876 -824439 614428
39804F14428R64220l075o53847j022251j397656j350012m11515P84455J185230
$$ 614428 1578648 1575573 921726 -100525 -1498181 -2848193 -3259708 -2475253 -1290023
39795a290023P83741L43974O3118l51445o42318l02341L03033L47436p6208j91019
$$ -1290023 -506282 -162308 -99190 -450635 -1092953 -1395294 -1092261 -744825 -821033 -1012052
39785a012052K0034j00303m48029j93174O45668R84160K87886p19557j166595
$$ -1012052 -992018 -1092321 -1540350 -1733524 -1087856 -103696 184190 -535367 -1701962
39776a701962q28899K13231J552369K074895R34830r34989j644706r01459k70078
$$ -1701962 -2530861 -2317630 -765261 1309634 2244464 1309475 -335231 -1236690 -1506768
39767a506768n28341m61762Q32937J988531J141681j189220k473538j277742J031277
$$ -1506768 -2035109 -2496871 -1663934 324597 1466278 277058 -2196480 -3474222 -2442945
39758b442945J928364N86422j267395j432019J10242J296771Q40869j57971j91644
$$ -2442945 -514581 71841 -1195554 -2627573 -2517331 -1220560 -379691 -537662 -729306
39749g29306L54870L00209l7388L88428J006677L73248j012573j112361K83088
$$ -729306 -374436 -74227 -111615 276813 1283490 1656738 644165 -468196 -185108
39740a85108J098069L79401l49883K5869M50647R122l20045K65523O28483l03814
$$ -185108 912961 1292362 942479 968348 1418995 1428117 1108072 1373595 2002078 1698264
39730A698264j535785j717021j269547j107508p62973M31794J683811K009950
$$ 1698264 162479 -1554542 -2824089 -3931597 -4694570 -4262776 -2578965 -569015
39722e69015J811581J526204L50428j716609k358268r5213K509270J907019j047580
$$ -569015 1242566 2768770 3119198 1402589 -955679 -1050892 1458378 3365397 2317817
39713B317817k106581J77858K627941K343677L39169r25575j077897j189815j409010
$$ 2317817 211236 389094 3017035 5360712 5699881 4774306 3696409 2506594 1097584
39704A097584j121817n26944l97406o25514k79333Q38013J577182Q00243j011538
$$ 1097584 -24233 -551177 -948583 -1574097 -1853430 -1015417 561765 1362008 350470
39695C50470k072302j382521N2057O86458N24731N72272O74159k21631j571584
$$ 350470 -1721832 -3104353 -3052296 -2365838 -1841107 -1268835 -594676 -816307 -2387891
39686b387891j320821P32267K029745J065810k39673J66154J091748M50438j023727
$$ -2387891 -3708712 -2976445 -946700 119110 -120563 45591 1137339 1587777 564050
39677E64050j297357o64561p21256j008984m3952J267694P97342q30375j074370
$$ 564050 -733307 -1397868 -2119124 -3128108 -3172060 -1904366 -1107024 -1937399 -3011769
39668c011769M7368J18117j070487j072446O01174J447320M51559l10555K36160
$$ -3011769 -2964401 -2846284 -3916771 -4989217 -4388043 -2940723 -2489164 -2799719 -2563559
39659b563559L60709o41714o98814R56660J715474M9849j495432o13121P47744
$$ -2563559 -2202850 -2844564 -3543378 -2586718 -871244 -821395 -2316827 -2929948 -2182204
39650b182204o0045j694725j323580N29794J387553J213870J633064K185503J148269
$$ -2182204 -2242249 -3936974 -5260554 -4730760 -3343207 -2129337 -496273 1689230 2837499
39641B837499q46891j571710r14565n71870p10102j91136N09954j0421r42171
$$ 2837499 1990608 418898 -495667 -1067537 -1777639 -1968775 -1458821 -1469242 -2411413
39632b411413k52186J449483J565881j5369p61165l8423n963j276343j579575
$$ -2411413 -2663599 -1214116 351765 336396 -424769 -463192 -469155 -1745498 -3325073
39623c325073o8188P70134n76484j755965m02638J879301K121939N09882m99859
$$ -3325073 -3393261 -2623127 -3199611 -4955576 -5358214 -3478913 -1356974 -847092 -1346951
39614a346951j27232L26634J26268k23778m65412q00030r38997m83587J22749
$$ -1346951 -1474183 -1147549 -1021281 -1245059 -1710471 -2510501 -3449498 -3933085 -3810336
39605c810336K92563L68075P56107P43236l57743j518422j086801P59561K189273
$$ -3810336 -3517773 -3149698 -2393591 -1650355 -2008098 -3526520 -4613321 -3853760 -1664487
39596a664487K184519J394511O00327j79830q15256o57057L72605J175134O45345
$$ -1664487 520032 1914543 2514870 2335040 1519784 862727 1235332 2410466 3055811
39587C055811r39053k130416j792942k59002R33694N97838p23191j274485j78096
$$ 3055811 2116758 -13658 -1806600 -2065602 -1131908 -534070 -1257261 -2531746 -2709842
39578b709842J489554K074298J273401J39006m11575m09461l71488o21587j027266
$$ -2709842 -1220288 854010 2127411 2266417 1854842 1445381 1073893 452306 -574960
39569e74960j096243n11287K72417M16026p8518j88497O31002J484521J272242
$$ -574960 -1671203 -2182490 -1910073 -1494047 -1572565 -1761062 -1130060 354461 1626703
39560A626703K66164m08266l92431k70326m56875q36498j276134j603071j289188
$$ 1626703 1892867 1484601 1092170 821844 364969 -471529 -1747663 -3350734 -4639922
39551d639922r3004J159008J410835Q47670M73125L72883k74207j359401j533837
$$ -4639922 -4732926 -3573918 -2163083 -1315413 -842288 -469405 -743612 -2103013 -3636850
39542c636850k80210J091525J340143R23025O84779J55447j313978k609115j973833
$$ -3636850 -3917060 -2825535 -1485392 -562367 122412 277859 -1036119 -3645234 -5619067
39533e619067J71875J455836Q41027j15462R9157Q02258O88678M1157j37113n5641
$$ -5619067 -5447192 -3991356 -3150329 -3265791 -3166634 -2364376 -1675698 -1634541 -1771654 -1827295
39523a827295m28992o36622L69372J686174J235583r07440k216447j386959q4437
$$ -1827295 -2256287 -2892909 -2523537 -837363 398220 -509220 -2725667 -4112626 -4197063
39514d197063O5441j2061R22877J705977P36706p75443m24244J279830J510376
$$ -4197063 -4131622 -4143683 -3220806 -1514829 -778123 -1553566 -1977810 -697980 812396
39505H12396k25628j236482j30576R51814P5275j250570p60893O89614N78228
$$ 812396 586768 -649714 -780290 171524 246799 -1003771 -1764664 -1075050 -496822
39496d96822j157035k106882j082876N45634J252742J078563O36240J18907j75909
$$ -496822 -1653857 -3760739 -4843615 -4297981 -3045239 -1966676 -1330436 -1211529 -1387438
39487a387438K70434J160417J305749J99187j170801j591335j015492k40318J91067
$$ -1387438 -1117004 43413 1349162 1548349 377548 -1213787 -2229279 -2469597 -2278530
39478b278530L18893M14164O15399P02159K85077m50260n63340L61729J174145
$$ -2278530 -1959637 -1545473 -930074 -227915 57162 -393098 -956438 -594709 579436
39469E79436N36717q75868j066588K40780J018957J21434p95601m67J231886M73086
$$ 579436 1116153 240285 -826303 -585523 433434 554868 -240733 -241200 990686 1463772
39459A463772j776439k506318p96954O73023k10683j662291p87130J859638L015415
$$ 1463772 -312667 -2818985 -3615939 -2942916 -3153599 -4815890 -5603020 -3743382 -727967
39450g27967J451643n44555p06346M27666J115416R30098M20266l02241j159569
$$ -727967 723676 179121 -527225 -99559 1015857 1945955 2366221 2063980 904411
39441I04411j335926m19692M60995J26880p20244o11735K93131O81569M01484
$$ 904411 -431515 -851207 -390212 -263332 -983576 -1595311 -1302180 -620611 -219127
39432b19127K88250Q0197j116839k334258j421878J237724K476484R05614r70600
$$ -219127 69123 149320 -967519 -3301777 -4723655 -3485931 -1009447 -103833 -1074433
39423a074433p92941J50740l09530j311935o92740J041784J593430P01256L5958
$$ -1074433 -1867374 -1716634 -2026164 -3338099 -4030839 -2989055 -1395625 -694369 -658411
39414f58411q1451p78906j753862j408834K4668N25744j52353J6449J511315J994919
$$ -658411 -739862 -1518768 -3272630 -4681464 -4656796 -4131052 -4283405 -4266956 -2755641 -760722
39404g60722J93254j722426j454023k7213J40324j049392j673982p34048R47858
$$ -760722 -567468 -2289894 -3743917 -3771130 -3630806 -4680198 -6354180 -7088228 -6140370
39395f140370K058786J815856M28238o69453j47015J091136P64156j093315j573825
$$ -6140370 -4081584 -2265728 -1837490 -2506943 -2653958 -1562822 -798666 -1891981 -3465806
39386c465806O17088K646656J735471m66742o49235Q36064R97305n01393j005279
$$ -3465806 -2848718 -202062 1533409 1066667 417432 1253496 2250801 1749408 744129
39377G44129K48745Q05121o02924j801048q89115O75931P25428j43956m9974P86737
$$ 744129 992874 1797995 1195071 -605977 -1495092 -819161 -93733 -237689 -287663 499074
39367D99074O11952o65169j194001j27017J043444O77794p12235j220202j08337
$$ 499074 1111026 445857 -748144 -875161 168283 846077 133842 -1086360 -1194697
39358a194697J209207R51338p22214j867653j309202j60585r8172q83552q66600
$$ -1194697 14510 965848 243634 -1624019 -2933221 -3093806 -3191978 -4075530 -4942130
39349d942130L81731J473291J429499R81639R53712O53502r24490k979055l320164
$$ -4942130 -4560399 -3087108 -1657609 -675970 277742 931244 6754 -2972301 -6292465
39340f292465j042489K017986L010934J183417j123373j047582J316066K915493
$$ -6292465 -7334954 -5316968 -2306034 -1122617 -2245990 -3293572 -1977506 937987
39332I37987J665056p55321j229527N39494J912419J183791m46325j147070q28439
$$ 937987 2603043 1847722 618195 1157689 3070108 4253899 3807574 2660504 1832065
39323A832065l81345q4337J21896q9592p70356j169995q35400m29063n40633n52795
$$ 1832065 1450720 1366383 1488279 1398687 628331 -541664 -1377064 -1806127 -2346760 -2899555
39313b899555K21764J033442O26546p16504j327448l41595J227174J762580P89735
$$ -2899555 -2677791 -1644349 -1017803 -1734307 -3061755 -3403350 -2176176 -413596 376139
39304C76139o92797j294783o04972M46659P27418K21774k69532m73072p42389
$$ 376139 -316658 -1611441 -2216413 -1769754 -1042336 -820562 -1090094 -1563166 -2305555
39295b305555r00830k61588R16406J342916O24447n5832J02831L13455o2226r0762
$$ -2305555 -3206385 -3467973 -2551567 -1208651 -584204 -640036 -537205 -223750 -285976 -376738
39285c76738R59591J740991O22970j449865j939634k92949J335141J065535n55636
$$ -376738 582853 2323844 2946814 1496949 -442685 -735634 599507 1665042 1109406
39276A109406j734489j549193m68949M44621N40276J77098K38694Q25497J070548
$$ 1109406 -625083 -2174276 -2643225 -2198604 -1658328 -1481230 -1242536 -417039 653509
39267F53509O92181O72656J482609J799317M05815j609914k238789j368880m14889
$$ 653509 1345690 2018346 3500955 5300272 5706087 4096173 1857384 488504 73615
39258G3615J69041R26602J445853P11370o95916j096839n28469o77354j726445
$$ 73615 242656 1169258 2615111 3326481 2630565 1533726 1005257 327903 -1398542
39249a398542j855965n43701L14896l00611p48116J98657R88955J27863q26301
$$ -1398542 -3254507 -3798208 -3483312 -3783923 -4532039 -4333382 -3344427 -3216564 -4042865
39240d042865K34138K086345J863614k17888j005142O80701K253633J351823q01135
$$ -4042865 -3808727 -1722382 141232 -76656 -1081798 -401097 1852536 3204359 2403224
39231B403224j497150l80887N50008J7451j106213j436522q86929l05804k5932
$$ 2403224 906074 525187 1075195 1092646 -13567 -1450089 -2337018 -2642822 -2668754
39222b668754L92833J080478J341445O24239n67532j321965j411738j018699R8930
$$ -2668754 -2275921 -1195443 146002 770241 202709 -1119256 -2530994 -3549693 -3450763
39213c450763K012268L480465K885082N23053j422254j632993j028575q23805
$$ -3450763 -1438495 2041970 4927052 5450105 4027851 2394858 1366283 542478
39205E42478p12853j2693O70419L11971p47923j192954n17558N36380R92579M27912
$$ 542478 -170375 -183068 487351 799322 51399 -1141555 -1659113 -1122733 -130154 297758
39195B97758p43450j264004j14650J817116K207111K59740j933563k071013n44714
$$ 297758 -445692 -1709696 -1824346 -7230 2199881 2459621 526058 -1544955 -2089669
39186b089669O17376O15844J51100k17703k82809M59974J891281K408264Q98174
$$ -2089669 -1472293 -856449 -705349 -923052 -1205861 -745887 1145394 3553658 4451832
39177D451832j076005j211056n6227j54506j757008k258061m58421J423898J247550
$$ 4451832 3375827 2164771 2108544 1954038 197030 -2061031 -2519452 -1095554 151996
39168A51996Q993l07616N0931l50454j235534j056932K51114J038102M46809n04450
$$ 151996 160989 -146627 -95696 -446150 -1681684 -2738616 -2487502 -1449400 -1002591 -1507041
39158a507041o51074k14377p5082l66640m51906L3358O63984Q31919N64884L75496
$$ -1507041 -2158115 -2372492 -2447574 -2814214 -3266120 -3232762 -2568778 -1736859 -1171975 -796479
39148g96479L17515j96398j229280j639827m74319J350162J904764P39749o30059
$$ -796479 -478964 -675362 -1904642 -3544469 -4018788 -2668626 -763862 -24113 -654172
39139f54172q49112j74660M49747N96142J95389p04780j475874j225529j47449
$$ -654172 -1503284 -1677944 -1228197 -632055 -436666 -1141446 -2617320 -3842849 -3990298
39130c990298M48449K9454l23294L27125J303243J496413R72410L78715k56526
$$ -3990298 -3541849 -3512395 -3835689 -3508564 -2205321 -708908 263502 642217 385691
39121C85691r72008j051900j20607O92252J84428q56464o35097Q57986J681673
$$ 385691 -586317 -1638217 -1758824 -1066572 -882144 -1738608 -2373705 -1515719 165954
39112A65954O88746j030589j801375j259577j78407O04838O58502J42760j57662
$$ 165954 854700 -175889 -1977264 -3236841 -3415248 -2810410 -2151908 -2009148 -2166810
39103b166810L24227R60220O56514l50331n62456N25292J433442P54975p68506
$$ -2166810 -1842583 -882363 -225849 -576180 -1138636 -613344 820098 1575073 806567
39094H06567j321636n79136L2295m65181j262499j001976L82666J676900J971923
$$ 806567 -515069 -1094205 -1061910 -1527091 -2789590 -3791566 -3408900 -1732000 239923
39085B39923J619763J413790J273171M02504j182355k096586j247235M45473J017432
$$ 239923 1859686 3273476 4546647 4949151 3766796 1670210 422975 868448 1885880
39076A885880L4519r96277j032744r32144j603548j970159l83939K449387L777278
$$ 1885880 1920399 924122 -108622 -1040766 -2644314 -4614473 -4998412 -2549025 1228253
39067A228253K284348k59231j463023j123205o02743m71064j42759N88429J045318
$$ 1228253 3512601 3253370 1790347 667142 64399 -406665 -549424 39005 1084323
39058A084323P94685K57770n7525j97939m01591o64083q57334q63189n73788j63795
$$ 1084323 1879008 2136778 2079253 1881314 1479723 815640 -41694 -904883 -1478671 -1642466
39048a642466j55583o35259p49454J44654J172596R88067q5834m83130J2207m0524
$$ -1642466 -1798049 -2433308 -3182762 -3038108 -1865512 -877445 -963279 -1446409 -1434202 -1474726
39038a474726j001646j216229R2294J062580O8532j392095q93238J119871K184569
$$ -1474726 -2476372 -3692601 -3600307 -2537727 -2469195 -3861290 -4754528 -3634657 -1450088
39029a450088J601031P44813J37399r42204j953408j181286J069272K161766J058815
$$ -1450088 150943 895756 1033155 90951 -1862457 -3043743 -1974471 187295 1246110
39020A246110k9924O41193J452681K63916j793756j889202J86066J705675P73960
$$ 1246110 1216186 1857379 3310060 3573976 1780220 -108982 77084 1782759 2556719
39011B556719j518500k851871k239831n77675N59660M82377o782J92686P85526
$$ 2556719 1038219 -1813652 -4053483 -4631158 -4071498 -3589121 -3595903 -3403217 -2617691
39002b617691N37259n14592q20886J49077Q65700K96096k44972O11109J711409
$$ -2617691 -2080432 -2595024 -3415910 -3266833 -2401133 -2105037 -2350009 -1738900 -27491
38993b7491J161856m79664j114614n01322l15720j065452j352383m57001N15082
$$ -27491 1134365 654701 -459913 -961235 -1276955 -2342407 -3694790 -4151791 -3636709
38984c636709O54695N74429R32970J130436L76160r76212j892795j749139o00172
$$ -3636709 -2982014 -2407585 -1474615 -344179 31981 -944231 -2837026 -4586165 -5186337
38975e186337R11397J771194J514323R21920R19727J038077K37284r55514q70878
$$ -5186337 -4274940 -2503746 -989423 -67503 852224 1890301 2127585 1172071 301193
38966C01193N30157J211302J31355j052985o05100M93769J11482j582947k231406
$$ 301193 831350 2042652 2174007 1121022 515922 1009691 1121173 -461774 -2693180
38957b693180p72540R83243R32433m19671q18050M48195J498833N97087j176949
$$ -2693180 -3465720 -2482477 -1550044 -1969715 -2787765 -2339570 -840737 -243650 -1420599
38948a420599j308501M84234J705112O72707j080894j240968r5541L50996k79383
$$ -1420599 -2729100 -2244866 -539754 132953 -947941 -2188909 -2284450 -1933454 -2212837
38939b212837m90764K68028P90310M40116K56676R78841J637113J086845k96699
$$ -2212837 -2703601 -2435573 -1645263 -1205147 -948471 30370 1667483 2754328 2457629
38930B457629j351986j570082j080363j40626P13822Q98398O56028P37473Q49775
$$ 2457629 1105643 -464439 -1544802 -1685428 -971606 -73208 582820 1320293 2170068
38921B170068k27316k311452l122465j163576J836094K848931J287224n83241
$$ 2170068 1942752 -368700 -3491165 -4654741 -2818647 30284 1317508 734267
38913G34267o85001O48040J547733Q49871p81568j649589q98548M96575J003770
$$ 734267 49266 697306 2245039 3094910 2313342 663753 -234795 261780 1265550
38904A265550N49596L25127O44163M04555q45059j784431j252957o5251L55959
$$ 1265550 1815146 2140273 2784436 3188991 2343932 559501 -693456 -758707 -402748
38895d02748J77189N24863J302818J210612j96810j777369k267929j582556n56633
$$ -402748 -225559 299304 1602122 2812734 2615924 838555 -1429374 -3011930 -3568563
38886c568563n1366k86643n74104O0296J519205K336160J381774n68041j738897
$$ -3568563 -3619929 -3906572 -4480676 -4420380 -2901175 -565015 816759 248718 -1490179
38877a490179j476927o43194j74071j49515k44845l23070m16986n36625n38904
$$ -1490179 -2967106 -3610300 -3784371 -3933886 -4178731 -4501801 -4918787 -5455412 -5994316
38868e994316q8774Q87109J596445J004503n04065j040453L35720J941762J523913
$$ -5994316 -6083090 -5195981 -3599536 -2595033 -3099098 -4139551 -3803831 -1862069 -338156
38859c38156n55970j702588o00403J160539J424397K15330p03034l20216N43185
$$ -338156 -894126 -2596714 -3197117 -2036578 -612181 -396851 -1099885 -1420101 -876916
38850h76916O00143j63612n37134K65810J477213J654426M74528r03575j304399
$$ -876916 -276773 -440385 -977519 -711709 765504 2419930 2894458 1990883 686484
38841F86484p88696k40778k21956n50374o87129l18758K49464L69430K6054J23430
$$ 686484 -102212 -342990 -564946 -1115320 -1802449 -2121207 -1871743 -1502313 -1476259 -1352829
38831a352829J097421J780183Q77277p76220j092519J15604P57408l03246j603794
$$ -1352829 -255408 1524775 2402052 1625832 533313 648917 1406325 1103079 -500715
38822e00715j535064n35121L35410J160228K009348J741301j62981j928688j617654
$$ -500715 -2035779 -2570900 -2235490 -1075262 934086 2675387 2512406 583718 -1033936
38813a033936J22126J278180J367348J173570P03476l49576r68491o4272J182577
$$ -1033936 -911810 366370 1733718 2907288 3610764 3261188 2292697 2228425 3411002
38804C411002O61867j286106k216018j203971J66936M86678J1535n94166r26191
$$ 3411002 4072869 2786763 570745 -633226 -466290 20388 31923 -562243 -1488434
38795a488434k61294J538168K616837J007349k031502l112849j381603O18257
$$ -1488434 -1749728 -211560 2405277 3412626 1381124 -1731725 -3113328 -2495071
38787b495071J107609J106936J487358J125253m91404j596584r47085N0797j04266
$$ -2495071 -1387462 -280526 1206832 2332085 1840681 244097 -702988 -652191 -756457
38778g56457m86970K46524J312320J329574O37544R9288o15363j519315j077480
$$ -756457 -1243427 -996903 315417 1644991 2282535 2381823 1766460 247145 -830335
38769h30335J063606K088301k11403l264965k844486O04858K525576R24678j299603
$$ -830335 233271 2321572 2110169 -1154796 -3999282 -3394424 -868848 55830 -1243773
38760a243773j292714K6509N23384K19803K85907P57763J058838J289855J480047
$$ -1243773 -2536487 -2509978 -1986594 -1766791 -1480884 -723121 335717 1625572 3105619
38751C105619Q94391m91096j134485j19849R55913J19179j766021j996930m7432
$$ 3105619 4000010 3508914 2374429 2254580 3210493 3329672 1563651 -433279 -480711
38742d80711J502455N99533j424032j765695R0854J909358J726695J18969q71940
$$ -480711 1021744 1621277 197245 -1568450 -1477596 431762 2158457 2277426 1405486
38733A405486k55492J032214J380192J49165j712284k384157q79776J559291K309238
$$ 1405486 1149994 2182208 3562400 3711565 1999281 -384876 -1264652 294639 2603877
38724B603877L42394k133538k118734L43193K152912J129486j462445k916587
$$ 2603877 2946271 812733 -1306001 -962808 1190104 2319590 857145 -2059442
38716b059442k250672m92500J017019J488852P40886m57478p32007K33242J074396
$$ -2059442 -4310114 -4802614 -3785595 -2296743 -1555857 -2013335 -2745342 -2512100 -1437704
38707a437704O96956j02541j38212J09332m21043j122149o23981N35870M68043
$$ -1437704 -740748 -843289 -981501 -872169 -1293212 -2415361 -3039342 -2503472 -2035429
38698b035429q30170j208114J32201J257611P27373m2088O47742J678990Q98283
$$ -2035429 -2865599 -4073713 -3941512 -2683901 -1956528 -1998616 -1350874 328116 1226399
38689A226399j117119j669820p6341J316626P64657m42248l51725O08288P02419
$$ 1226399 109280 -1560540 -1636881 -320255 444402 2154 -349571 258717 961136
38680I61136p8616j61765O67466O23754j107830k554953j503634J230580K727468
$$ 961136 882520 720755 1388221 2011975 904145 -1650808 -3154442 -1923862 803606
38671H03606J703474k95421j397784j472309j265015r47001l89648J48697N23226
$$ 803606 2507080 2211659 813875 -658434 -1923449 -2870450 -3260098 -3111401 -2588175
38662b588175J105922J851236J758944L11133j175155q75352J050189K406271
$$ -2588175 -1482253 368983 2127927 2439060 1263905 388553 1438742 3845013
38654C845013J552488p38414k254743j695593K54379K146447L844688O664770
$$ 3845013 5397501 4659087 2404344 708751 963130 3109577 6954265 13619035
38646A3619035J0670745J2586082Q479558q78069r309872j1337740p681701l276222
$$ 13619035 24289780 36875862 45355420 44477351 35167479 23829739 16148038 12871816
38638A2871816j302604j218856j498962j570127j163832j58716N71404k020j217354
$$ 12871816 11569212 10350356 8851394 7281267 6117435 5958719 6530123 6528103 5310749
38629E310749j507907r78335j078970j679879j039609Q15088J505788K36393n06710
$$ 5310749 3802842 2824507 1745537 65658 -973951 -158863 1346925 1583318 1076608
38620A076608R95493K540564J409782j145108j845113m62364L13083n17811j104338
$$ 1076608 2072101 4612665 6022447 4877339 3032226 2569862 2882945 2365134 1260796
38611A260796l78072K59027k47144p51849k11477L33730k79936j067355m51895
$$ 1260796 882724 1141751 894607 142758 -68719 265011 -14925 -1082280 -1534175
38602a534175R97035J295335L880j267757j231424l46139L04701L85499J93959
$$ -1534175 -537140 758195 762075 -505682 -1737106 -2083245 -1778544 -1393045 -1199086
38593a199086L9575J38573N33197Q27485N24191j57224l55687K67321R95820J048800
$$ -1199086 -1159511 -1020938 -487741 339744 863935 706711 351024 618345 1614165 2662965
38583B662965N58244Q3460l31971r45310j521206j557416j154266q44677o02606
$$ 2662965 3221209 3304669 2972698 2027388 506182 -1051234 -2205500 -3050177 -3652783
38574c652783N9785Q89999Q75362j01032o65245J18838J137632P52580o95248
$$ -3652783 -3592998 -2702999 -1827637 -1928669 -2593914 -2475076 -1337444 -584864 -1280112
38565a280112j380354p23735L8855J92494O39488J834264K262688N07817k161991
$$ -1280112 -2660466 -3384201 -3345346 -3152852 -2513364 -679100 1583588 2091405 -70586
38556g0586l048615j543709K79526O87551K95179M83822J194339J362576P43326
$$ -70586 -3119201 -4662910 -4383384 -3695833 -3400654 -2916832 -1722493 -359917 383409
38547C83409J32904N7395K09494J84805L9961R072J85155N49314Q89351P18925
$$ 383409 516313 573708 783202 968007 1007968 1017040 1202195 1751509 2640860 3359785
38537C359785k18666j347174j678832r12639L54186J456132K029470J602635j14130
$$ 3359785 3141119 1793945 115113 -797526 -443340 1012792 3042262 4644897 4530767
38528D530767k119405k417364l53171K122008K597896J051759o20288j397668
$$ 4530767 2411362 -6002 -359173 1762835 4360731 5412490 4792202 3394534
38520C394534j895263k421230k085605n22252R49627R94824J96833J60644J148540
$$ 3394534 1499271 -921959 -3007564 -3529816 -2580189 -1585365 -1388532 -1227888 -79348
38511g9348J727991P78586r55186j647649n04997J165250J302583l68879j785370
$$ -79348 1648643 2427229 1472043 -175606 -680603 484647 1787230 1418351 -367019
38502c67019j211951K62953L11815r87489j199051M36461J434059p5278k024782
$$ -367019 -1578970 -1316017 -1004202 -1991691 -3190742 -2754281 -1320222 -1395500 -3420282
38493c420282j238684J695726L057057J214757j274663j341619P57022K302106
$$ -3420282 -4658966 -2963240 93817 1308574 33911 -1307708 -550686 1751420
38485A751420J666556j04495r65048m07576N4186q66158k022417j170380J380501
$$ 1751420 3417976 3313481 2348433 1940857 1995043 1128885 -893532 -2063912 -683411
38476f83411K410701K32075k493592k427198l80670L30013p50845r44461O70202
$$ -683411 1727290 1959365 -534227 -2961425 -3342095 -3012082 -3762927 -4707388 -4037186
38467d037186J745314Q47950k14247K29808R09984J63570j078733j052887l9873
$$ -4037186 -2291872 -1443922 -1658169 -1428361 -518377 -354807 -1433540 -2486427 -2526300
38458b526300O94746J218029J960503J905999J94746j621048j468442l2180M54084
$$ -2526300 -1831554 -613525 1346978 3252977 3447723 1826675 358233 326053 780137
38449G80137j4879M55682J835211J840973q0254j482528q10389J09903p95395
$$ 780137 765258 1220940 3056151 4897124 4816870 3334342 2523953 2633856 1838461
38440A838461k374453k099269J6134J633650J524280O80581K33162J52119J70807
$$ 1838461 -535992 -2635261 -2619127 -985477 538803 1219384 1452546 1604665 1775472
38431A775472L76534M99719o701p02525k91088J285025K123170Q18531j288658
$$ 1775472 2152006 2651725 2645024 1942499 1651411 2936436 5059606 5878137 4589479
38422D589479j684872l1942J473030J049831o61763j857750j741636r11801l33175
$$ 4589479 2904607 2872665 4345695 5395526 4733763 2876013 1134377 222576 -110599
38413a10599m26255p23723k81830J010370J713519N04793j522715j823000k4391
$$ -110599 -536854 -1260577 -1542407 -532037 1181482 1686275 163560 -1659440 -1683831
38404a683831J283168L16916j304850j284944j16335L31656J72155P56839J594815
$$ -1683831 -400663 -83747 -1388597 -2673541 -2789876 -2458220 -2286065 -1529226 65589
38395F5589J064623k22966l658J540358J572446o94200k298663j010702J349763
$$ 65589 1130212 907246 903588 2443946 4016392 3322192 1023529 12827 1362590
38386A362590J994891J113499M78233J65014p41303j609131j096736K90312Q75594
$$ 1362590 3357481 4470980 4949213 5114227 4372924 2763793 1667057 1957369 2832963
38377B832963N17802M37451P11045J42601j354444k243071j584488k22853O43317
$$ 2832963 3350765 3788216 4499261 4641862 3287418 1044347 -540141 -762994 -119677
38368a19677Q41193Q00760P05577M14871l00038j420189k206524j602233K16889
$$ -119677 721516 1522276 2227853 2642724 2342686 922497 -1284027 -2886260 -2669371
38359b669371J407358O09829j053252j351620Q3957J465705J355279K18085o08010
$$ -2669371 -1262013 -652184 -1705436 -3057056 -2973099 -1507394 -152115 65970 -542040
38350e42040m81702K02961N73779P7033r09290j432630j136972n22261J50999
$$ -542040 -1023742 -820781 -247002 -169969 -1079259 -2511889 -3648861 -4171122 -4020123
38341d020123J179345K149944J726636k43403j680219p81214J377053K278063
$$ -4020123 -2840778 -690834 1035802 792399 -887820 -1669034 -291981 1986082
38333A986082J229110l51271j197855j145151m18868L91907J88035j212681k079459
$$ 1986082 3215192 2863921 1666066 520915 102047 493954 681989 -530692 -2610151
38324b610151q89902J158170J630935L28256p74290o55659j06022L62402J112929
$$ -2610151 -3500053 -2341883 -710948 -382692 -1156982 -1812641 -1918663 -1556261 -443332
38315d43332J755317J224238j19352o21955l9218M8816q96440j342762m31737
$$ -443332 1311985 2536223 2416871 1794916 1755698 1804514 908074 -434688 -866425
38306h66425M26484k0912p64825m04326M35101K96560n65747o16103M72601J272566
$$ -866425 -439941 -460853 -1225678 -1630004 -1194903 -898343 -1464090 -2080193 -1607592 -335026
38296c35026N72065j057257j881197q71695J114354K158742J465732K22327k52335
$$ -335026 237039 -820218 -2701415 -3573110 -2458756 -300014 1165718 1388045 1135710
38287A135710l74181j144467j957951j403076Q3841M76711p19613j621410p64179
$$ 1135710 761529 -382938 -2340889 -3743965 -3660124 -3183413 -3903026 -5524436 -6288615
38278f288615J075016K460217K912866K236461R5971k635818l712444k020529
$$ -6288615 -5213599 -2753382 159484 2395945 2491916 -143902 -3856346 -5876875
38270e876875Q07952K305965J767824K42453r40914r04144L91938J732274J633595
$$ -5876875 -5068923 -2762958 -995134 -752681 -1693595 -2597739 -2205801 -473527 1160068
38261A160068L10959m53405J53781R18953O20883l29400r32606r06069l32632
$$ 1160068 1471027 1017622 1171403 2090356 2711239 2381839 1449233 543164 210532
38252B10532N83114R20208j73287j642504j409192L35162J018303k41797j080991
$$ 210532 793646 1713854 1540567 -101937 -1511129 -1175967 -157664 -399461 -1480452
38243a480452J28188J449973P22899p09287l85739J028543J012027m88836j150145
$$ -1480452 -1352264 97709 820608 111321 -274418 754125 1766152 1277316 127171
38234A27171j43307R43155Q93591Q8510r80499k107536k314402o72862J651161
$$ 127171 -16136 927019 1820610 1909120 928621 -1178915 -3493317 -4166179 -2515018
38225b515018K296258R16172m80704o46537m70482p68648q40010j80611K31137
$$ -2515018 -218760 697412 216708 -429829 -900311 -1668959 -2508969 -2689580 -2458443
38216b458443l14038o67119M36482J972703J727497m18219j969015j088976R11802
$$ -2458443 -2772481 -3439600 -3003118 -1030415 697082 278863 -1690152 -2779128 -1867326
38207a867326J488582M54650o6165P27310R06345p75089k136389o55784K044738
$$ -1867326 -378744 75906 9741 737051 1643396 868307 -1268082 -1923866 120872
38198A20872K027178r92650l049690j901203L650J0220p05364O4289J569479J752632
$$ 120872 2148050 1155400 -1894290 -3795493 -3791843 -3781623 -4486987 -4422698 -2853219 -1100587
38188a100587P31810j75093j026095k040577j697705P95123K833338J730689o93843
$$ -1100587 -368777 -543870 -1569965 -3610542 -5308247 -4513124 -1679786 50903 -642940
38179f42940o81867J394565J830871k1014q53098O27562J489462j67412j919926
$$ -642940 -1324807 69758 1900629 1879615 1026517 1654079 3143541 2976129 1056203
38170A056203j247270L78537L12392r89769j346079n93076j77825k73421J13517
$$ 1056203 -191067 187470 499862 -489907 -1835986 -2429062 -2606887 -2880308 -2766791
38161b766791Q83090R59319L18902l270J96976K8927p93059j334081q18688L18851
$$ -2766791 -1883701 -924382 -605480 -608750 -411774 -382847 -1175906 -2509987 -3328675 -3009824
38151c009824J110702J187383R15500P22764N94792K62345k72150o47415o16892
$$ -3009824 -1899122 -711739 203761 926525 1521317 1783662 1511512 864097 247205
38142B47205k85793K00507P40475R71653N89801J07052K87846O06043k66938j864114
$$ 247205 -38588 161919 902394 1874047 2463848 2570900 2858746 3464789 3197851 1333737
38132A333737j754711P18744K575846J199035j546613j964832m6814R08887l81916
$$ 1333737 -420974 297770 2873616 4072651 2526038 561206 514392 1423279 1041363
38123A041363j711332j412570n47781k59593R2699R45773J212366L30571m52596
$$ 1041363 -669969 -2082539 -2630320 -2889913 -2797214 -1851441 -639075 -308504 -761100
38114g61100j62555L63634K12775p2477J24224K37414j48043k40275M78392J098786
$$ -761100 -923655 -560021 -347246 -419723 -295499 -58085 -206128 -446403 31989 1130775
38104A130775P70955R1538n2617J35035Q0319j55925l78967p01350r22167o25745
$$ 1130775 1901730 1993268 1940651 2075686 2156005 2000080 1621113 919763 -2404 -628149
38094f28149k20031m39330o36808N10300K241390K007635o15320k710759k012149
$$ -628149 -848180 -1287510 -1924318 -1414018 827372 2835007 2219687 -491072 -2503221
38085b503221J42289J367748J514754J511309J013642m49446j586212j058048
$$ -2503221 -2360932 -993184 521570 2032879 3046521 2597075 1010863 -47185
38077d7185O1859q7322j008060p58182O14842J088378L8941p51422P1014J489211
$$ -47185 14674 -72648 -1080708 -1838890 -1224048 -135670 -96729 -848151 -777137 712074
38067G12074J813051R88599K61969K74667M36019R7417l54863p6101P73078R80264
$$ 712074 2525125 3513724 3775693 4050360 4486379 4583796 4228933 4152832 4925910 5906174
38057E906174O4882q36103o90990j61229j80476m4405J152892K085777P51436
$$ 5906174 5971056 5134953 4443963 4282734 4102258 4057853 5210745 7296522 8047958
38048H047958j936749k925417j455602J58218M81349N90719J101520Q48352l11612
$$ 8047958 6111209 3185792 1730190 1888408 2369757 2960476 4061996 4910348 4598736
38039D598736n81632M50016P17912n06248j033599J12212N45801j036484j908366
$$ 4598736 4017104 4467120 5185032 4678784 3645185 3757397 4303198 3266714 1358348
38030A358348j6365J815977L64863k238328j825597Q81353J594627n27206k071603
$$ 1358348 1341983 3157960 3522823 1284495 -541102 340251 1934878 1407672 -663931
38021f63931j160649M47595J131841J246386Q92270m50352j665639q36783J237128
$$ -663931 -1824580 -1376985 -245144 1001242 1893512 1443160 -222479 -1059262 177866
38012A77866J682833J24472p62180J86085R86870L53976k35933L67006R43413
$$ 177866 1860699 1985171 1222991 1409076 2395946 2749922 2513989 2880995 3824408
38003C824408M96221O7968L21441j5679j396008j654954O93177L354092L064362
$$ 3824408 4320629 4388597 4710038 4694359 3298351 1643397 2336574 5690666 8755028
37994H755028K28198j815261j452254k06925M48154J229780K969916M129988K332718
$$ 8755028 8983226 7167965 5715711 5508786 5956940 7186720 10156636 14286624 16619342
37985A6619342j862424m630165l388646l40156L70405j609176k557928m89656
$$ 16619342 14756918 10126753 6738107 6397951 6768356 5159180 2601252 2111596
37977B111596J763993R56175j675258k512380q10995J036634J444646R92824L89016
$$ 2111596 3875589 4831764 3156506 644126 -166869 869765 2314411 3307235 3696251
37968C696251k79143m73544K89289J029970M76878o62606o31699N91444J499057
$$ 3696251 3417108 2943564 3232853 4262823 4739701 4077095 3445396 4036840 5535897
37959E535897J538343J259991N85281p70222j725305j116802m269j96928j122538
$$ 5535897 7074240 8334231 8919512 8149290 6423985 5307183 5302914 5105986 3983448
37950C983448q93632J80864K61230l40727L90278K135705K287396M14660q86971
$$ 3983448 3089816 3270680 3531910 3191183 3581461 5717166 8004562 8419222 7532251
37941G532251l72646Q6276p73471j386194l58831J120822J477251R84181L74152
$$ 7532251 7159605 7245881 6472410 5086216 4727385 5848207 7325458 8309639 8683791
37932H683791n98928j817787k025498p79491M97583O05066K04692L66785Q24846
$$ 8683791 8084863 6267076 4241578 3462087 3959670 4564736 4769428 5136213 5961059
37923E961059O28216l71967j248793p60289J320184L203096K639749K98217m22865
$$ 5961059 6589275 6217308 4968515 4208226 5528410 8731506 11371255 11669472 11246607
37914A1246607J631894L269479K059319L89249J174750K885031L095183L572987
$$ 11246607 12878501 16147980 18207299 18596548 19771298 22656329 25751512 29324499
37906B9324499O537672R196985Q419645P807805J2574233J9731355K1571387J7031822
$$ 29324499 35862171 45059156 53478801 61286606 73860839 93592194 115163581 132195403
37898A32195403J1235593O534116M086222J0492076K8609027M4072737L9524452
$$ 132195403 143430996 149965112 154051334 164543410 193152437 237225174 276749626
37891B76749626K3761013K4295479M2768148M2167680l181500o4305368q9372722
$$ 276749626 300510639 324806118 367574266 409741946 406560446 342255078 252882356
37884B52882356o7643228l5031969k1142974j9547574j3965470o317936n694162
$$ 252882356 185239128 150207159 129064185 109516611 95551141 89233205 83539043
37877H3539043q745819p119887l208047m439784q951969q970543l982626m16570
$$ 83539043 74793224 67673337 64465290 60025506 51073537 42102994 38120368 37703798
37869C7703798j000331k699718l293823l203911k248932j09129J293214K93868
$$ 37703798 36703467 34003749 30709926 27506015 25257083 25147954 26441168 26735036
37861B6735036j204496o29403J082167J744979K054361L661838N191783M101742
$$ 26735036 25530540 24901137 25983304 27728283 29782644 33444482 38636265 42738007
37853D2738007J061023j058727j406347j233892p87932R09746L677059N896080
$$ 42738007 43799030 42740303 41333956 40100064 39312132 40221878 43898937 49795017
37845D9795017O479862N869042N468433O301482O997443L684219n312576j4840514
$$ 49795017 56274879 62143921 67612354 73913836 80911279 84595498 79282922 64442408
37837F4442408j6993708j0821039l837896k178394l611286k966378j52697J223048
$$ 64442408 47448700 36627661 32789765 30611371 27000085 24033707 23881010 25104058
37829B5104058J25603j360249k021165k381098k644199k585151k506356k290200
$$ 25104058 25229661 23869412 21848247 19467149 16822950 14237799 11731443 9441243
37821I441243r80604R67169J141095j116392k807378j434059J271026K302462
$$ 9441243 8460639 9427808 10568903 9452511 6645133 5211074 6482100 8784562
37813H784562J739128J343066J008539k78400j696802j835689j237759j029122
$$ 8784562 10523690 11866756 12875295 12596895 10900093 9064404 7826645 6797523
37805F797523n79271Q64629J906469J090778l50206m96114J84176L60281N44359
$$ 6797523 6218252 7082881 8989350 10080128 9729922 9233808 9417984 9778265 10322624
37796A0322624J445315J621392o5868j539852m52357J659203J705557J1889p26120
$$ 10322624 11767939 13389331 13323463 11783611 11331254 12990457 14696014 14707903 13981783
37787A3981783j22273M0027m70986n21374n54367j588504k220750n47196J769224
$$ 13981783 13859510 13899537 13428551 12907177 12352810 10764306 8543556 7996360 9765584
37778I765584J496041p27809j299822L14422J021990k61605j057983j75152L38050
$$ 9765584 11261625 10533816 9233994 9548416 10570406 10308801 9250818 9075666 9413716
37769I413716o15445j085234J98259J573229J632368J416801J709049J223208
$$ 9413716 8798271 7713037 7911296 9484525 11116893 12533694 14242743 15465951
37761A5465951n96636j775330q69925N52954N24145l44737m85567j36818m09384
$$ 15465951 14869315 13093985 12224060 12777014 13301159 12956422 12470855 12334037 11924653
37752A1924653r81074p00734L66081J085535R39378M75596M11863Q35415J025984
$$ 11924653 10943579 10242845 10608926 11694461 12633839 13109435 13521298 14356713 15382697
37743A5382697J97131j085046r81403J032447K725608K031368L51932N81784K659613
$$ 15382697 15579828 14494782 13513379 14545826 17271434 19302802 19654734 20236518 22896131
37734B2896131L881053L139267J837795Q48741k07042o66862P82481L162613M042820
$$ 22896131 26777184 29916451 31754246 32602987 32395945 31729083 32511564 35674177 39716997
37725C9716997L555110L935474M939862M150450K391899L451155O601363N215025
$$ 39716997 43272107 47207581 52147443 56297893 58689792 62140947 68742310 73957335
37717G3957335l540709j2648690j3764018q123889l665920l896887n312513m580628
$$ 73957335 70416626 57767936 44003918 35880029 32214109 28317222 23004709 18424081
37709A8424081k598428j106576P2180J257164J640341Q69368k95738j301627j939307
$$ 18424081 15825653 14719077 14791257 16048421 17688762 18558130 18262392 16960765 15021458
37700A5021458j482677J95498J197236k58565k733695l226346j532717j30084
$$ 15021458 13538781 13734279 14931515 14672950 11939255 8712909 7180192 7050108
37692G050108J2416L00405J029273M97530j443588k191349l66341J707072J481184
$$ 7050108 7062524 7362929 8392202 8889732 7446144 5254795 4888454 6595526 8076710
37683H076710j1078r9436J289313J763133J78953j891110k429395j220263M28914
$$ 8076710 8065632 7966196 9255509 11018642 11197595 9306485 6877090 5656827 6085741
37674F085741J264804J083210O17655O09315R16589P49084j80260j208252j625147
$$ 6085741 7350545 8433755 9051410 9660725 10577314 11326398 11146138 9937886 8312739
37665H312739j507790j294577r88452l20309N08670Q47596N18121K93393R69176
$$ 8312739 6804949 5510372 4521920 4201611 4710281 5557877 6075998 6369391 7338567
37656G338567K026531J925884J78110j571682j500539j80383K25496p58914j259764
$$ 7338567 9365098 11290982 11469092 9897410 8396871 8216488 8441984 7683070 6423306
37647F423306j74759R98288O64553k78985j00656Q86459J170608P67629P71562
$$ 6423306 6248547 7246835 7911388 7632403 7531747 8418206 9588814 10356443 11128005
37638A1128005P79519o40199k890052l358149j182670J239943J580167N42562
$$ 11128005 11907524 11267325 8377273 5019124 3836454 5076397 6656564 7199126
37630G199126J95057Q46957J179182N67743k55467m93026q8926N82730J037527
$$ 7199126 7394183 8241140 9420322 9988065 9732598 9239572 9150646 9733376 10770903
37621A0770903Q48164O1926p25278j048263r93427p22577j47940O05360J094205
$$ 10770903 11619067 11680993 10955715 9907452 8914025 8191448 8043508 8648868 9743073
37612I743073J327611J852706K493008J937692l64306k608052k385348O3020J765924
$$ 9743073 11070684 12923390 15416398 17354090 16989784 14381732 11996384 12059404 13825328
37603A3825328O28603k000065l131864j746195L97259J226393N50821m20943q24379
$$ 13825328 14453931 12453866 9322002 7575807 7973066 9199459 9750280 9329337 8504958
37594H504958o82044j77208O66615J458365J364115P4579j527633k210739j766374
$$ 8504958 7822914 7645706 8312321 9770686 11134801 11209380 9681747 7471008 5704634
37585E704634j051797p00221l66416M65380J374367J331041J66219q80602n64956
$$ 5704634 4652837 3952616 3586200 4051580 5425947 6756988 6923207 6042605 5477649
37576E477649O80729J158866J03991j252586j292264j12980P39684L83937m00010
$$ 5477649 6158378 7317244 7421235 6168649 4876385 4763405 5503089 5887026 5487016
37567E487016l72435O11201J502365J235170n4865r25835j38789J538123J854277
$$ 5487016 5114581 5725782 7228147 8463317 8408452 7482617 7343828 8881951 10736228
37558A0736228J0250j986452k052828j002280r44270j608339q61668J297078K241676
$$ 10736228 10746478 8760026 6707198 5704918 4760648 3152309 2290641 3587719 5829395
37549E829395Q76535o20442m83013K3534m93500p13729P79625K269209J387345
$$ 5829395 6705930 6085488 5602475 5626009 5132509 4418780 5198405 7467614 8854959
37540H854959p32700j115729K24044N77075p12389j302821O443J439450J422656
$$ 8854959 8122259 7006530 7230574 7807649 7095260 5792439 5798882 7238332 8660988
37531H660988P91044O53061M73405l36798r15842n03186M6852l46411j272615
$$ 8660988 9452032 10105093 10578498 10241700 9325858 8822672 8869524 8523113 7250498
37522G250498j592522r23113L95160J769657K262653J248201l60591q72241j86310
$$ 7250498 5657976 4734863 5130023 6899680 9162333 10410534 10049943 9177702 8991392
37513H991392J70128k39749K2564J568794K780033K322591J162858O20763J72336
$$ 8991392 9161520 8921771 8944335 10513129 13293162 15615753 16778611 17399374 17571710
37504A7571710j125197k540727k808213k121721j299930j99894J263604J775416
$$ 17571710 16446513 13905786 11097573 8975852 7675922 7476028 8739632 10515048
37496A0515048L63970j477176j538225n8093R09378O45199J31025k23242q91482
$$ 10515048 10879018 9401842 7863617 7805524 8714902 9360101 9491126 9267884 8376402
37487H376402j447255q21457M48391M38692j175978k353915j643069j46271M18910
$$ 8376402 6929147 6107690 6556081 6994773 5818795 3464880 1821811 1675540 2094450
37478B094450J51131K95845J153030J835058J651690Q42518L9556m83884r26201
$$ 2094450 2245581 2541426 3694456 5529514 7181204 8023722 8063278 7579394 6653193
37469F653193j393615j411598m86834P91580J075239J00554p90328o49301k77697
$$ 6653193 5259578 3847980 3361146 4152726 5227965 5328519 4538191 3888890 3611193
37460C611193n76452q19072k5565J084213J241940P39348N31767K90351m90214
$$ 3611193 3034741 2215669 2190104 3274317 4516257 5255605 5787372 6077723 5587509
37451E587509n46240J297779L220863K565616M32457M95571L158675M823611L753349
$$ 5587509 5041269 6339048 9559911 12125527 12557984 13053555 16212230 21035841 24789190
37442B4789190K632918L822627O009339P595047R364152J0857512Q017041j246686
$$ 24789190 27422108 31244735 37254074 44849121 54213273 65070785 73087826 71841140
37434G1841140j1729744j5811217j2377663o884008l678989k510936k031814k168247
$$ 71841140 60111396 44300179 31922516 25038508 21359519 18848583 16816769 14648522
37426A4648522k352052j211660Q20138J498687K33946j084000j348373j520438
$$ 14648522 12296470 11084810 11904948 13403635 13637581 12553581 11205208 9684770
37418I684770j916578j207231O59963J369679k79737k187703j995286k76173J036921
$$ 9684770 7768192 6560961 7220924 8590603 8310866 6123163 4127877 3851704 4888625
37409D888625J511346J651423J161848k06268j311889j011384L3332N01908M22993
$$ 4888625 6399971 8051394 9213242 9006974 7695085 6683701 6717033 7218941 7641934
37400G641934N51141O97487K16799o19856j118945j284292j257658n82297P18757
$$ 7641934 8193075 8890562 9107361 8487505 7368560 6084268 4826610 4244313 4963070
37391D963070J361934N05850p45225r73685n43501m95540m56157M43452J443287
$$ 4963070 6325004 6830854 6085629 5111944 4568443 4072903 3616746 4060198 5503485
37382E503485J070906l27998j036170o53111l54907o04674n62269R7163N28577
$$ 5503485 6574391 6246393 5210223 4557112 4202205 3597531 3035262 3132425 3661002
37373C661002J69228n25884r16593n97533P37114K533271K984980J075348j413427
$$ 3661002 3830230 3304346 2387753 1790220 2527334 5060605 8045585 9120933 7707506
37364G707506j811047j59857J125624R05107K58340j49920r46012j826972j225961
$$ 7707506 5896459 5736602 6862226 7767333 8025673 7875753 6929741 5102769 3876808
37355C876808P71324J694573K78225j409514j037718O85867J548102J081895M27720
$$ 3876808 4648132 6342705 6620930 5211416 4173698 4859565 6407667 7489562 7917282
37346G917282J47351m0180j89378k81003o74401j213416q51405O21703J581307
$$ 7917282 8064633 8024453 7835075 7554072 6879671 5666255 4814850 5436553 7017860
37337G017860O89258r98807j504179n97725M22852P20186K43887r51779k139198
$$ 7017860 7707118 6708311 5204132 4606407 5029259 5749445 5993332 5041553 2902355
37328B902355j677346Q07800K864262J941952q72741k092596o18398J018792N58872
$$ 2902355 1225009 2032809 4897071 6839023 5966282 3873686 3255288 4274080 4832952
37319D832952r62801j054839P79810K558428K254136P3182j692600j221980M68606
$$ 4832952 3870151 2815312 3595122 6153550 8407686 8480868 6788268 5566288 6034894
37310F034894O58136j212145k401212q34708J521231J463537n69494j337817M3316
$$ 6034894 6693030 5480885 3079673 2244965 3766196 5229733 4660239 3322422 3365738
37301C365738J059617K30856o64678J9430J028798O25433m73897o83001l94205
$$ 3365738 4425355 4656211 3991533 4010963 5039761 5665194 5191297 4508296 4114091
37292D114091r64775j946472j649050l3511J055772O36688j33241J64236J307477
$$ 4114091 3149316 1202844 -446206 -479717 576055 1212743 1079502 1243738 2551215
37283B551215J994752J526135L73340n41186p28870m23779k13970m38793r24450
$$ 2551215 4545967 6072102 6445442 5904256 5175386 4751607 4537637 4098844 3174394
37274C174394j186173p84355L10597J460959J741100R75381J04466j0324K06242
$$ 3174394 1988221 1203866 1514463 2975422 4716522 5691903 5796369 5786045 5992287
37265E992287k06137j071205j178043j06782J000264P93553p68288k410080k619778
$$ 5992287 5786150 4714945 3536902 3430120 4430384 5223937 4455649 2045569 -574209
37256e74209r26256J355468K073087O75211q92681p17946M78348P58737J28683
$$ -574209 -1500465 -144997 1928090 2603301 1710620 992674 1471022 2229759 2358442
37247B358442J16851O95769L24360p88874m26880J729766K816000R75395j692786
$$ 2358442 2475293 3171062 3495422 2706548 2279668 4009434 6825434 7800829 6108043
37238F108043k359353j417173q82262p62782K02208J479706J357412M3115n01841
$$ 6108043 3748690 2331517 1449255 686473 888681 2368387 3725799 3768914 3267073
37229C267073L60592J315348J417660R54599J32694j014986j533859n18590Q43672
$$ 3267073 3627665 4943013 6360673 7315272 7447966 6432980 4899121 4380531 5224203
37220E224203M75606j188332j439916N47932K298881J765284J49416m49191j71128
$$ 5224203 5699809 4511477 3071561 3619493 5918374 7683658 7833074 7383883 7212755
37211G212755l31998p69858l59446P34012J329773J292909J445863J575522M22807
$$ 7212755 6880757 6110899 5751453 6485465 7815238 9108147 10554010 12129532 12552339
37202A2552339j902412l117630j456017J685767L005507J129369j778987k672535
$$ 12552339 10649927 7532297 6076280 7762047 10767554 11896923 10117936 7445401
37194G445401j196138L17690K19401m51438o225J095845J019125m47527j502453
$$ 7445401 6249263 6566953 6786354 6334916 6328691 7424536 8443661 7996134 6493681
37185F493681j089249k88855l15072o78268l75524L41242O31118N50585N50180
$$ 6493681 5404432 5115577 4800505 4122237 3746713 4087955 4719073 5269658 5819838
37176E819838K34006r16578k061640j791099k37968J050919J325815J214180R92782
$$ 5819838 6053844 5137266 3075626 1284527 1046559 2097478 3423293 4637473 5630255
37167E630255L5794j421697j732251k31032J253332Q43155n22211n64773O62609
$$ 5630255 5666049 4244352 2512101 2281069 3534401 4377556 3855345 3290572 3953181
37158C953181Q62448p08525j884986r09565R00823J256871K06761l66037L95347
$$ 3953181 4815629 4107104 2222118 1312553 2213376 3470247 3677008 3310971 3706318
37149C706318J700000K723915L106322K276829J57183j655873j407311J7345o0679
$$ 3706318 5406318 8130233 11236555 13513384 13670567 12014694 10607383 10624728 10564049
37140A0564049k021356l018745j212199J307258J568313r4631j100003o20654
$$ 10564049 8542693 5523948 4311749 5619007 7187320 7092689 5992686 5372032
37132E372032n7041j10354P6818P46969P78999k34827r66628l04296R97145J519569
$$ 5372032 5314991 5204637 5281455 6028424 6807423 6572596 5605968 5301672 6298817 7818386
37122G818386J070210N49817O45238J343210K249048K920820L263753L675619
$$ 7818386 8888596 9438413 10083651 11426861 13675909 16596729 19860482 23536101
37114B3536101M179192L550011N07053l964865o861372o493568m399025k959429
$$ 23536101 27715293 31265304 31772357 27807492 20946120 14452552 10053527 7094098
37106G094098k309592j092746O13570J192275K89557k89676P23392K012115J571130
$$ 7094098 4784506 3691760 4305330 5497605 5787162 5497486 6220878 8232993 9804123
37097I804123l29500j553744j065189n02K94029r2930m67018q21630j416647j845537
$$ 9804123 9474623 7920879 6855690 6855188 7149217 7056287 6589269 5767639 4350992 2505455
37087B505455j501529n30029N06852J453992K195749K026275N51974j140697j535672
$$ 2505455 1003926 473897 980749 2434741 4630490 6656765 7208739 6068042 4532370
37078D532370p57589k51553m81804m81343J85455O87793N61668M15762M43634
$$ 4532370 3774781 3523228 3041424 2560081 2745536 3433329 3994997 4410759 4854393
37069D854393l8901q33126n16322J054880J800770M36742j357129j539776p88283
$$ 4854393 4815492 3982366 3466044 4520924 6321694 6758436 5401307 3861531 3073248
37060C073248q78958j510671j206298k05412K16158M39687J647766K827848J739341
$$ 3073248 2194290 683619 -522679 -728091 -511933 -72246 1575520 4403368 6142709
37051F142709j133271k674597j636168j25132J23501M8103O58417Q97319j65790
$$ 6142709 5009438 2334841 698673 573541 697042 745145 1403562 2300881 2135091
37042B135091j242521q66227J94824M51445J85929N21111J132713Q32587k73634
$$ 2135091 892570 26343 221167 672612 858541 1379652 2512365 3344952 3071318
37033C071318r46524o92418n5878N49160J002187Q77708j2565p45790k27893J056496
$$ 3071318 2124794 1432376 1376498 1925658 2927845 3805553 3792988 3047198 2819305 3875801
37023C875801J414039K42432j048698q93127L14118O84541o34169k093746j529906
$$ 3875801 5289840 5532272 4483574 3590447 3904565 4589106 3954937 1861191 331285
37014C31285R44586K831008K323458M19298p51744o03140j2838L66450K90039
$$ 331285 1275871 4106879 6430337 6849635 6097891 5494751 5481913 5848363 6138402
37005F138402o44622k104132k456909r45959N54548J49343p88620K35920K303618
$$ 6138402 5493780 3389648 932739 -13220 541328 690671 -97949 137971 2441589
36996B441589K238901l042j119066m6870M77907q46671j415330M24904K055946
$$ 2441589 4680490 4677448 3558382 3511512 3989419 3142748 1727418 2152322 4208268
36987D208268J003940p39887j52336J785087J978025J03861j701933k372705k080763
$$ 4208268 5212208 4472321 4319985 6105072 8083097 8186958 6485025 4112320 2031557
36978B031557n02742K047646L238713J500389j118611j709374o77584k38664l25232
$$ 2031557 1528815 3576461 6815174 8315563 7196952 5487578 4809994 4571330 4246098
36969D246098O30908K041733J804979p3843j618472j999955j726269o70353J202053
$$ 4246098 4877006 6918739 8723718 8649875 7031403 5031448 3305179 2634826 3836879
36960C836879K210703J070294n14414l71216M76858P525o39689Q18578L107888
$$ 3836879 6047582 7117876 6603462 6232246 6709104 6716629 6076940 6895518 10003406
36951A0003406L123196J241998L87488Q08328N69099K94578K225499N175260N790520
$$ 10003406 13126602 14368600 14756088 15564416 16133515 16428093 18653592 23828852 29619372
36942B9619372M358105L924176M438434L851988L951746P737331J1785180J0094144
$$ 29619372 33977477 37901653 42340087 46192075 50143821 57881152 69666332 79760476
36934G9760476N658195P872084J6842070K1997916J9753644J8950357K1621156
$$ 79760476 85418671 93290755 110132825 132130741 151884385 170834742 192455898
36927A92455898J3035803j5674992m6144980n1581315l1772297j1865472p748213
$$ 192455898 205491701 189816709 143671729 92090414 60318117 48452645 40704432
36920D0704432j0339262o880761l91602L58050k951933l059306k40209q7942k714594
$$ 40704432 30365170 23484409 23092807 23450857 20498924 17439618 17199409 17111467 14396873
36911A4396873l318502j149357j79290j799036l126768k424529j216998q17714
$$ 14396873 11078371 9929014 9749724 7950688 4823920 2399391 1182393 364679
36903C64679o26484j77059O6489R6598L36355M62519N4120k17459K53790N43860
$$ 364679 -261805 -438864 -372375 -275777 60578 523097 577217 359758 613548 1157408
36893A157408l49442j496646j259481K52654J547377J796786J122593k42820j688624
$$ 1157408 807966 -688680 -1948161 -1695507 -148130 1648656 2771249 2528429 839805
36884H39805k049872j030934Q0154J99015j59205k32753k93854m50106J33054
$$ 839805 -1210067 -2241001 -2160847 -1961832 -2121037 -2353790 -2647644 -3097750 -2964696
36875b964696J407614J631868Q3905j186310k97640J440468J652659M80518m07897
$$ -2964696 -1557082 74786 158691 -1027619 -1325259 115209 1767868 2248386 1840489
36866A840489r58439k085321k959475j965774J72000J141718O92976P27025J750912
$$ 1840489 882050 -1203271 -4162746 -6128520 -5956520 -4814802 -4121826 -3394801 -1643889
36857a643889K075029R44039j81159k03536O5270j80321l18935K20487P99670
$$ -1643889 431140 1375179 1194020 990484 1055754 875433 556498 776985 1576655
36848A576655Q63313Q78710J074938O60238p21883j963115j907110q67599P7790
$$ 1576655 2439968 3318678 4393616 5053854 4331971 2368856 461746 -405853 -328063
36839c28063M83279N57265N85277R14919J753981K485672J984806J48620j618040
$$ -328063 155216 712481 1297758 2212677 3966658 6452330 8437136 8585756 6967716
36830F967716j979089j129996k65273j50175o01302r35390o61334m622L15967
$$ 6967716 4988627 3858631 3593358 3443183 2841881 1906491 1245157 1240535 1556502
36821A556502J28416J49633O97167Q30305j10049q90237R196J647128J536836
$$ 1556502 1684918 1834551 2531718 3362023 3251974 2361737 2370933 4018061 5554897
36812E554897o68291k524808k267244q83007r372K70216N16419N86964L80707
$$ 5554897 4886606 2361798 94554 -788453 -797825 -527609 -11190 575774 956481
36803I56481M44884P63662L93539p20188j220124o98369o62717j742834k038078
$$ 956481 1401365 2165027 2558566 1838378 618254 -80115 -742832 -2485666 -4523744
36794d523744k25141J690862J267075l96509n06198Q56055J296924M63633K51995
$$ -4523744 -4748885 -3058023 -1790948 -2187457 -2693655 -1837600 -540676 -77043 174952
36785A74952Q40456K66376j508182j837426P4928J423921M37016n58351P35980
$$ 174952 1015408 1281784 -226398 -2063824 -1988896 -564975 -127959 -686310 49670
36776D9670K315347J104522j625026j986412L46673J674343P6320j994999j895037
$$ 49670 2365017 3469539 1844513 -141899 204774 1879117 1955437 -39562 -1934599
36767a934599l84406N90724J126434K154498K807969J562946q00258j807776p77890
$$ -1934599 -2319005 -1728281 -601847 1552651 4360620 5923566 5123308 3315532 2537642
36758B537642M16629M11615J91814R30048J666572P75742j169001j906935p82496
$$ 2537642 2954271 3365886 3557700 4487748 6154320 6930062 5761061 3854126 3071630
36749C071630K76026l46708j595188j417981K16354J396649R08723n64381j749652
$$ 3071630 3347656 3000948 1405760 -12221 204133 1600782 2509505 1945124 195472
36740A95472k014376j243463K29245J285532Q24213o51608j340087n14973N46705
$$ 195472 -1818904 -3062367 -2833122 -1547590 -723377 -1374985 -2715072 -3230045 -2683340
36731b683340O19042K64598N66678J223701J139466J77299q48437j370188j236805
$$ -2683340 -2064298 -1799700 -1233022 -9321 1130145 1307444 459007 -911181 -2147986
36722b147986l19050J016358J725084J447790J223451J630034J309587q82575
$$ -2147986 -2467036 -1450678 274406 1722196 2945647 4575681 5885268 5002693
36714E002693l225199k962855l67856J504089J124382N5912j19862J39821J21973
$$ 5002693 1777494 -1185361 -1553217 -49128 1075254 1131166 1011304 1151125 1273098
36705A273098K36184N23439O3312r30526p29299Q03255J188377p31911k318020
$$ 1273098 1509282 2032721 2096033 1165507 436208 1239463 2427840 1695929 -622091
36696f22091j035860J413887J839489N19240m2496J82551o69060j862689o78148
$$ -622091 -1657951 -244064 1595425 2114665 2072169 2254720 1585660 -277029 -955177
36687i55177K225592K621406p33822l513197k043748J404555K437387Q21221m31188
$$ -955177 1270415 3891821 3157999 -355198 -2398946 -994391 1442996 2264217 1833029
36678A833029k76513k46189p87843n90389M29813N51642p34216j597640o53492
$$ 1833029 1556516 1310327 522484 -67905 361908 913550 179334 -1418306 -2071798
36669b071798J027144J653712J001905M6818n11214m69585J79403R10464P54173
$$ -2071798 -1044654 609058 1610963 1657781 1146567 676982 856385 1766849 2521022
36660B521022m54332j460599j022881L81749J051095J79745j169441j427509m33599
$$ 2521022 2066690 606091 -416790 -35041 1016054 1195799 26358 -1401151 -1834750
36651a834750N00707M54911K06947J006305K351732K200215j66324k641186k712392
$$ -1834750 -1334043 -879132 -672185 334120 2685852 4886067 4719743 2078557 -633835
36642f33835o40365J066028R67479Q2647n8655O25859J224759J229542Q62888
$$ -633835 -1274200 -208172 759307 841954 783299 1409158 2633917 3863459 4726347
36633D726347O05665Q16013J401009J723835J329356P29983P74136J289600J285994
$$ 4726347 5332012 6148025 7549034 9272869 10602225 11332208 12106344 13395944 14681938
36624A4681938N80930J09809K76396J44601j070691k662054l361772k893767j901135
$$ 14681938 15262868 15372677 15649073 15793674 14722983 12060929 8699157 5805390 3904255
36615C904255j025184p20385j209291j846359j317028O11446K294178K221994
$$ 3904255 2879071 2158686 949395 -896964 -2213992 -1602546 691632 2913626
36607B913626J113250P23957J163362R46710m87589j901395k086174j241786k43891
$$ 2913626 4026876 4750833 5914195 6860905 6373316 4471921 2385747 1143961 900070
36598I00070L07740O6234q57526j378447l63140J524502K201853R75599l76085
$$ 900070 1207810 1274044 416518 -961929 -1325069 199433 2401286 3376885 3000800
36589C000800j96059O91603M84654p53929j343786o16910K51277J11464o36350
$$ 3000800 2804741 3496344 3980998 3227069 1883283 1266373 1517650 1629114 992764
36580I92764p32999L54686J745311J842087R64k317267k807000j202568J35793
$$ 992764 259765 614451 2359762 4201849 4202813 1885546 -921454 -2124022 -1988229
36571a988229n53616j800836j092973J204724K300194J112146m01216m82240J27657
$$ -1988229 -2541845 -4342681 -5435654 -4230930 -1930736 -818590 -1219806 -1702046 -1574389
36562a574389J56879P3164Q13416J679982J311985l7325q51115n69561m4761K716
$$ -1574389 -1417510 -1344346 -530930 1149052 2461037 2423712 1572597 1003036 958275 960991
36552I60991k43902l80485k51099J57355N02816R4011j034960j523214k85367
$$ 960991 717089 336604 85505 242860 745676 839687 -195273 -1718487 -2003854
36543b003854J611789J966390K77811j664640k098744j011455N75564J761569
$$ -2003854 -392065 1574325 1852136 187496 -1911248 -2922703 -2347139 -585570
36535e85570J851342N45559j262692j834137n04358J360756J930992Q81448o94062
$$ -585570 1265772 1811331 548639 -1285498 -1789856 -429100 1501892 2383340 1689278
36526A689278j724111j912886j519098r79752n28324P7469J070857J853861J472785
$$ 1689278 -34833 -1947719 -3466817 -4446569 -4974893 -4897424 -3826567 -1972706 -499921
36517d99921K59559l5244J379995K675932J445219j898626m195627l298737n52460
$$ -499921 -240362 -275606 1104389 3780321 5225540 3326914 -868713 -4167450 -4719910
36508d719910J184803J064851O38034J078972J496172O31464q50937j125516K5486
$$ -4719910 -3535107 -2470256 -1832222 -753250 742922 1374386 523449 -602067 -576581
36499e76581P13066l25392j808475j709574m614J635757K229351K104252J531016
$$ -576581 136485 -188907 -1997382 -3706956 -3711570 -2075813 153538 2257790 3788806
36490C788806L84778q01829j060921n73238n34651j066790q96484K49017P16854
$$ 3788806 4173584 3371755 2310834 1737596 1202945 136155 -760329 -511312 205542
36481B05542m47431j578974p41845J196463J744854L66713j052410j106673m31208
$$ 205542 -241889 -1820863 -2562708 -1366245 378609 745322 -307088 -1413761 -1844969
36472a844969j50439k85777k35364J96490P59172J113733R97925N30149K98578
$$ -1844969 -1995408 -2281185 -2516549 -2320059 -1560887 -447154 550771 1080920 1379498
36463A379498N72766O39484l15455j837648k556789j830023k80545J123194J720271
$$ 1379498 1952264 2591748 2276293 438645 -2118144 -3948167 -4228712 -3105518 -1385247
36454a385247J181630j00928q52445k48462P32832M82572q47982j530290q52868
$$ -1385247 -203617 -304545 -1156990 -1405452 -672620 -190048 -1038030 -2568320 -3421188
36445c421188O6176L65037O20064J235573J307422K34874q61783o80312K79531
$$ -3421188 -3355012 -2989975 -2369911 -1134338 173084 407958 -453825 -1134137 -854606
36436h54606O18753J61847j94035j69395k12181k49712K50784J026126J103651
$$ -854606 -235853 -74006 -268041 -437436 -649617 -899329 -648545 377581 1481232
36427A481232K93043m81844n45704k18072L4415K84030O14514O77976K61828k20915
$$ 1481232 1774275 1292431 746727 528655 563070 847100 1461614 2139590 2401418 2180503
36417B180503k47464J26687L93850J90480l73997q00354o46538j25723l3341o45484
$$ 2180503 1933039 2059726 2453576 2644056 2270059 1469705 823167 697444 664103 18619
36407A8619j013596j25985J396529J786864M76713j090857j433900q12801l41569
$$ 18619 -994977 -1120962 275567 2062431 2539144 1448287 14387 -798414 -1139983
36398a139983k45973l2552K62469K19082J19274O31767J426133J323335Q1310
$$ -1139983 -1385956 -1418508 -1156039 -936957 -817683 -185916 1240217 2563552 2644862
36389B644862j080211j155837n27556O7566O63679J311855J175293l63354k215474
$$ 2644862 1564651 408814 -118742 -51176 612503 1924358 3099651 2736297 520823
36380E20823k543920j104589N27024J107692R80549R49399R84662O06702j65624
$$ 520823 -2023097 -3127686 -2600662 -1492970 -512421 436978 1421640 2028342 1862718
36371A862718q18972r28669m86510J0919j36473q76696j005438K99430J759224
$$ 1862718 1043746 115077 -371433 -360514 -496987 -1373683 -2379121 -2079691 -320467
36362c20467J296603p71823j678018j30284J603012J038372p52922r06344P39760
$$ -320467 976136 204313 -1473705 -1603989 -977 1037395 284473 -621871 117889
36353A17889J496086r844k017698k499214j691937q17907k5920J078217K019388
$$ 117889 1613975 1604131 -413567 -2912781 -4604718 -5422625 -5448545 -4370328 -2350940
36344b350940J938044R35378l1621k24137M73220J617917K130376R41425j469438
$$ -2350940 -412896 522482 490861 266724 739944 2357861 4488237 5429662 3960224
36335C960224k879022j705381Q05564J851069M31746j559917j792124j76558J397505
$$ 3960224 1081202 -624179 181385 2032454 2464200 904283 -887841 -1064399 333106
36326C33106J489535N62434M411L03233P00997M81706r4992m23552n15112p39502
$$ 333106 1822641 2385075 2389486 2692719 3393716 3875422 3780430 3356878 2841766 2102264
36316B102264r70819p06165N4470O46240M81218m05948j412188j702810r11631
$$ 2102264 1131445 425280 479750 1125990 1607208 1201260 -210928 -1913738 -2825369
36307b825369J51187J69646p81489r91411L44762J557078R70792k52955P3683
$$ -2825369 -2674182 -2504536 -3286025 -4277436 -3932674 -2375596 -1404804 -1657759 -1584076
36298a584076J396086J246278m63619j180909j59556K41876j079076j717783M6312
$$ -1584076 -187990 1058288 594669 -586240 -745796 -503920 -1582996 -3300779 -3254467
36289c254467J890481J105627r10766j135683O5056J38336p62263j94851J719130
$$ -3254467 -1363986 -258359 -1169125 -2304808 -2239752 -2101416 -2863679 -3058530 -1339400
36280a339400K069485K25112q93718J61319Q03661j062397l113809k056070J144074
$$ -1339400 730085 955197 61479 222798 1026459 -35938 -3149747 -5205817 -4061743
36271d061743K627218J186471n67893m37153O34186P32751j15290m85197L3774
$$ -4061743 -1434525 -248054 -815947 -1253100 -618914 113837 -1453 -486650 -452876
36262d52876L49562l05793j091520o52769R20734J993411J354578l70466j608779
$$ -452876 -103314 -409107 -1500627 -2153396 -1232662 760749 2115327 1744861 136082
36253A36082j504409k67722J343454K183711J234404r75296k252084j351550R0368
$$ 136082 -1368327 -1636049 -292595 1891116 3125520 2150224 -101860 -1453410 -1363042
36244a363042r1176j111583m70292J667969K279305K97100j392548m05214J307343
$$ -1363042 -1454218 -2565801 -3036093 -1368124 911181 1208281 -184267 -589481 717862
36235G17862N78890j811172k146377O66346L447808L084207K94303j882383j876227
$$ 717862 1296752 -514420 -2660797 -1994451 1453357 4537564 4831867 2949484 1073257
36226A073257p06268m0172k47705m76824j15100L47497J40337n03470o33797q9756
$$ 1073257 366989 326817 79112 -397712 -512812 -165315 -24978 -528448 -1162245 -1252001
36216a252001K70790Q8119J17398P61723J139093N01256m46262p09823n43284
$$ -1252001 -981211 -893092 -775694 -13971 1125122 1626378 1180116 470293 -72991
36207g2991n90665m22623N43627J412095R00812l54413n23710M94543R02444m893
$$ -72991 -663656 -1086279 -542652 869443 1770255 1415842 892132 1386675 2289119 2284226
36197B284226p75851m28924r3614p96061j396260m75121J016016J052816k16952
$$ 2284226 1508375 1079451 985837 189776 -1206484 -1681605 -665589 387227 170275
36188A70275p15330J72136O53307m09800j480478o94839J202425K007167J338479
$$ 170275 -545055 -372919 280388 -129412 -1609890 -2304729 -1102304 904863 2243342
36179B243342P99235J022928P10591p18940j551648m12584J015881J60147k228375
$$ 2243342 3042577 4065505 4776096 4057156 2505508 2092924 3108805 3268952 1040577
36170A040577k664861q9990K205114J250438j173690j167333J433013K760356
$$ 1040577 -1624284 -1714274 490840 1741278 567588 -599745 833268 3593624
36162C593624N95346k411878k508862J12612K017351J333020l30376q38441m17917
$$ 3593624 4188970 1777092 -731770 -619158 1398193 2731213 2400837 1562396 1144479
36153A144479n69510j415379j682673q89111j545K46001L04100N38460L23178
$$ 1144479 574969 -840410 -2523083 -3412194 -3413739 -3167738 -2863638 -2325178 -2002000
36144b002000o17263j099857j32847J145812R15652m11972p51440K43664O49065
$$ -2002000 -2619263 -3719120 -3851967 -2706155 -1790503 -2202475 -2953915 -2710251 -2061186
36135b061186k82673o21106Q71075K096656O38103k075616k390184K79919K507128
$$ -2061186 -2343859 -2964965 -2093890 2766 640869 -1434747 -3824931 -3545012 -1037884
36126a037884J596785j002059k033261n81321J361283J624083Q7207j537587j559565
$$ -1037884 558901 -443158 -2476419 -3057740 -1696457 -72374 14833 -1522754 -3082319
36117c082319k2432J355637J190370J32147n2639J105975K161706J615660l94555
$$ -3082319 -3104751 -1749114 -558744 -426597 -479236 626739 2788445 4404105 4009550
36108D009550k445851l211564k352212o32618P05963J126031J253598J695342
$$ 4009550 1563699 -1647865 -4000077 -4632695 -3926732 -2800701 -1547103 148239
36100A48239J813549N93166j511238k726204k064212l40514J017070J302282O45805
$$ 148239 1961788 2554954 1043716 -1682488 -3746700 -4087214 -3070144 -1767862 -1122057
36091a122057k61689m92021J81865P12377R7812r51969r43789N373L36162l44017
$$ -1122057 -1383746 -1875767 -1693902 -981525 -883713 -1835682 -2779471 -2774098 -2437936 -2781953
36081b781953o91407n5411N00867L50567M64544J314404J578940M55593n19635
$$ -2781953 -3473360 -3528771 -3027904 -2677337 -2212793 -898389 680551 1136144 616509
36072F16509J87233J459331J305911M9419n47091l77641p24286j485426j319548
$$ 616509 803742 2263073 3568984 3618403 3071312 2693671 1969385 483959 -835589
36063h35589m16789m57718j490246j445186M39246K068587J543959k12375j202653
$$ -835589 -1252378 -1710096 -3200342 -4645528 -4206282 -2137695 -593736 -806111 -2008764
36054b008764j004291k45429R74687K404437K640026P96701j534255j921571l70605
$$ -2008764 -3013055 -3258484 -2283797 120640 2760666 3557367 2023112 101541 -269064
36045b69064P96199K48502q86082j128554o33571l76538n21968n08763j47534
$$ -269064 527135 775637 -110445 -1238999 -1872570 -2249108 -2771076 -3279839 -3427373
36036c427373J54915P8287j38763J09298J132834K316039K437613J122565l55488
$$ -3427373 -3272458 -3194171 -3332934 -3223636 -2090802 225237 2662850 3785415 3429927
36027C429927n53008R2900j31558j500226k210584j095965M78458O32004k85922
$$ 3429927 2876919 2969819 2838261 1338035 -872549 -1968514 -1490056 -858052 -1143974
36018a143974n86695q9169q5037o91932m47733R57917J642820L85953j186471
$$ -1143974 -1730669 -1819838 -1904875 -2596807 -3044540 -2086623 -443803 -57850 -1244321
36009a244321q95354P20619J324739K87461p49240o73286k73493l92449m70066
$$ -1244321 -2139675 -1419056 -94317 193144 -556096 -1229382 -1502875 -1895324 -2365390
36000b365390J73596R05157P41617m7873l59401J49608P50923P31557J44389m31792
$$ -2365390 -2191794 -1286637 -545020 -592893 -952294 -802686 -51763 679794 824183 392391
35990C92391m69831P2278O90983Q87117P77932P53535O05721k37420j476763j892306
$$ 392391 -77440 -5162 685821 1572938 2350870 3104405 3710126 3472706 1995943 103637
35980A03637j003436P7408J12478o59790j122886q34058j51038O43498J405425
$$ 103637 -899799 -822391 -709913 -1369703 -2492589 -3326647 -3477685 -2834187 -1428762
35971a428762J653813R53597l14403j219914j222153m56999N31890R60523L52941
$$ -1428762 225051 1178648 864245 -355669 -1577822 -2034821 -1502931 -542408 -189467
35962a89467n32055j92910J365433J930227J2k520968k493542R647J700947P81948
$$ -189467 -721522 -914432 451001 2381228 2381240 -139728 -2633270 -2623623 -922676 -140728
35952a40728o92044k31725J314602J280338o60338k005845j032266R01191J344153
$$ -140728 -832772 -1064497 250105 1530443 870105 -1135740 -2168006 -1266815 77338
35943G7338l5009j286074r28801K05245L90583m36951o83714L27683J148489L97190
$$ 77338 42329 -1243745 -2172546 -1967301 -1576718 -2013669 -2697383 -2369700 -1221211 -824021
35933h24021r45680q60144O62142J536267N62943j031172j424832l60682J023645
$$ -824021 -1769701 -2629845 -1967703 -431436 131507 -899665 -2324497 -2685179 -1661534
35924a661534J577979R39675k58935p63340n6055P22866K65019p30220m55456
$$ -1661534 -83555 856120 597185 -166155 -222210 500656 765675 35455 -420001
35915d20001R35514J215347l93360j763532j105364L64282O51057J36643M34504
$$ -420001 515513 1730860 1337500 -426032 -1531396 -1167114 -516057 -379414 55090
35906E5090J376217J413532K98028p63458j165978j178966o29624O52681J437200
$$ 55090 1431307 2844839 3142867 2379409 1213431 34465 -595159 57522 1494722
35897A494722L61663j455800j378032Q61580K480268J534678o05400j668415j481173
$$ 1494722 1856385 400585 -977447 -115867 2364401 3899079 3293679 1625264 144091
35888A44091j221398j176854q43378l64391l90416q61366r72391k05568J140431
$$ 144091 -1077307 -2254161 -3097539 -3461930 -3852346 -4713712 -5686103 -5891671 -4751240
35879d751240K172262J964492M94092q96014q39433J72036M35441k78620l19946
$$ -4751240 -2578978 -614486 -120394 -1016408 -1855841 -1683805 -1248364 -1526984 -1846930
35870a846930R46381J687291L67289j604855j819799m03163M26524j81850p55541
$$ -1846930 -900549 786742 1154031 -450824 -2270623 -2673786 -2247262 -2429112 -3184653
35861c184653p4857J092073J381431P17034J40584M29613J293528J628979O18552
$$ -3184653 -3259510 -2167437 -786006 -68972 71612 501225 1794753 3423732 4042284
35852D042284j109237j846738q89608L70586K99052p16140j072128m64707l3535
$$ 4042284 2933047 1086309 196701 567287 866339 150199 -921929 -1386636 -1420171
35843a420171k36158k97511J00264L07333K89132R87481K349199K629792Q07927
$$ -1420171 -1656329 -1953840 -1853576 -1546243 -1257111 -269630 2079569 4709361 5517288
35834E517288j603596k444686j586220m25117L46245R17479R98536Q4749j079141
$$ 5517288 3913692 1469006 -117214 -542331 -196086 721393 1719929 1804678 725537
35825G25537j025916J96988Q36628l2672j170774j121430k69309J44977J23217
$$ 725537 -300379 -103391 733237 700565 -470209 -1591639 -1860948 -1715971 -1592754
35816a592754N87441J385667J213102k22259j336989p56945O79975J053509l205
$$ -1592754 -1005313 380354 1593456 1371197 34208 -722737 -42762 1010747 1007542
35807A007542r44299n24375P15339J460303J193900K36645j008416k096008k329645
$$ 1007542 63243 -461132 254207 1714510 2908410 3145055 2136639 40631 -2289014
35798b289014j367010J24432J068397J122739P19736K49225j41520k07125J07699
$$ -2289014 -3656024 -3531592 -2463195 -1340456 -620720 -371495 -513015 -720140 -612441
35789f12441J86573n28901j348488r19027P67367J992564J445826j31254j062312
$$ -612441 -425868 -954769 -2303257 -3222284 -2454917 -462353 983473 852219 -210093
35780b10093p73826J5076N78072Q16589Q54280P17887M43698J38466m3278Q3398
$$ -210093 -983919 -968843 -390771 425818 1280098 1997985 2441683 2580149 2536871 2620269
35770B620269M52058N04710j76168r37577o23749O26467J176890J20590j329647
$$ 2620269 3072327 3577037 3400869 2463292 1839543 2466010 3642900 3763490 2433843
35761B433843j641425j187094j305755j825336j250840O40903K078713J667443
$$ 2433843 792418 -394676 -1700431 -3525767 -4776607 -4135704 -2056991 -389548
35753c89548J98859o25058l60411J01189O5188j98077j49757J07511q8785r48824
$$ -389548 -190689 -815747 -1176158 -1074969 -1009781 -1207858 -1357615 -1250104 -1338889 -2287713
35743b287713j560122p80292J094384K348633K034322J239485J268757J489422
$$ -2287713 -3847835 -4628127 -3533743 -1185110 849212 2088697 3357454 4846876
35735D846876M73120j323277j915998p98992L20012J56850o02504j012128j284645
$$ 4846876 5319996 3996719 2080721 1281729 1601741 1758591 1156087 143959 -1140686
35726a140686j541103r25299O67104J517069M04425j216289j173877K34107R40876
$$ -1140686 -2681789 -3607088 -2939984 -1422915 -1018490 -2234779 -3408656 -3174549 -2233673
35717b233673K95199m97811o98447o67027l21550Q12835J809030Q91784j536326
$$ -2233673 -1938474 -2436285 -3134732 -3801759 -4123309 -3310474 -1501444 -609660 -2145986
35708b145986k613879q84969J522470K060227J334399J539934K637145K545958
$$ -2145986 -4759865 -5644834 -4122364 -2062137 -727738 812196 3449341 5995299
35700E995299O99729j040889j349394j183697j677295j999032p79098J308483
$$ 5995299 6695028 5654139 4304745 3121048 1443753 -555279 -1334377 -25894
35692b5894K061247P18602r84561j169748k01887J24960p29841j320741l85798
$$ -25894 2035353 2753955 1769394 599646 397759 522719 -207122 -1527863 -1913661
35683a913661J219333J578854K53318j248030j515112p42215J34176P91058J260197
$$ -1913661 -694328 884526 1137844 -110186 -1625298 -2367513 -2233337 -1442279 -182082
35674a82082J086795j51351j742356k280418j282186L59281J535025J825836J304931
$$ -182082 904713 753362 -988994 -3269412 -4551598 -4192317 -2657292 -831456 473475
35665D73475L14269m33860l94641m4393l32073j067210r39897L95713J483361
$$ 473475 787744 353884 -40757 -85150 -417223 -1484433 -2424330 -2028617 -545256
35656e45256J156437K93545K62696O48989J72961q39197q85367L1272K56854o95807
$$ -545256 611181 904726 1167422 1816411 1989372 1150175 264808 296080 552934 -142873
35646a42873j256319m36068N99282O70629M67248Q52620R48954k57253j725953
$$ -142873 -1399192 -1835260 -1235978 -565349 -98101 754519 1703473 1446220 -279733
35637b79733j845578j080366r15487j006569L6743J496219J138104q18119j344080
$$ -279733 -2125311 -3205677 -4121164 -5127733 -5090990 -3594771 -2456667 -3274786 -4618866
35628d618866Q38830L111512K834319R33172k38516m79882r06124j192945k53581
$$ -4618866 -3780036 -668524 2165795 3098967 2860451 2380569 1474445 281500 27919
35619B7919J264834J590178M51434r25469j870515k293055j380257J229761L334270
$$ 27919 1292753 2882931 3334365 2408896 538381 -1754674 -3134931 -1905170 1429100
35610A429100K044241j903364m380474l171800n60485M62686J33019L66061J288348
$$ 1429100 3473341 1569977 -2810497 -5982297 -6542782 -6080096 -5947077 -5581016 -4292668
35601d292668J523244Q09905K46032M01946Q14973J042692R41842L02380o11494
$$ -4292668 -2769424 -1959519 -1713487 -1311541 -496568 546124 1487966 1790346 1178852
35592A178852o62540P10179K094668J643873k09538j167992l19855O22120q5153
$$ 1178852 516312 1226491 3321159 4965032 4755494 3587502 3267647 3889767 3804614
35583C804614j740930k320891j225024K27194P30847L79404k0044j95057m41232
$$ 3804614 2063684 -257207 -1482231 -1255037 -524190 -144786 -164830 -359887 -801119
35574h01119p94167q41445m34091n4051j78198o48672r87036r21238k29387J307193
$$ -801119 -1595286 -2436731 -2870822 -2924873 -3103071 -3751743 -4738779 -5660017 -5889404 -4582211
35564d582211L058067L334770J305507j232825j605003J35953J129167k25345
$$ -4582211 -1524144 1810626 3116133 1883308 278305 414258 1543425 1318080
35556A318080k012279j807474k32632L54050l84154n31671Q18441K125119J645373
$$ 1318080 -694199 -2501673 -2734305 -2380255 -2764409 -3296080 -2477639 -352520 1292853
35547A292853l27368k040007k145739n99812J518135K732434K332009J042563
$$ 1292853 965485 -1074522 -3220261 -3820073 -2301938 430496 2762505 3805068
35539C805068J16110j68713m97540j177159j658372j495538j002357o88108n85251
$$ 3805068 3921178 3752465 3254925 2077766 419394 -1076144 -2078501 -2766609 -3351860
35530c351860l70065J86026R59310J452199J194415L95778j64404j80065j81768
$$ -3351860 -3721925 -3535899 -2576589 -1124390 70025 465803 301399 121334 -60434
35521f0434m78618n54168j46703M1024l60450m49205L09141O31088o14714j955105
$$ -60434 -539052 -1093220 -1239923 -1198899 -1559349 -2008554 -1699413 -1068325 -1683039 -3638144
35511c638144j132678J162838K024289P70888j74970N61668J180989O8699j320062
$$ -3638144 -4770822 -3607984 -1583695 -812807 -987777 -426109 754880 823579 -496483
35502d96483r30455M95994P58065l58327j182051r40226m37939l50518n23034
$$ -496483 -1426938 -930944 -172879 -531206 -1713257 -2653483 -3091422 -3441940 -3964974
35493c964974p57743r32285n54641O25416J808436J957730J115297R1675o21445
$$ -3964974 -4722717 -5655002 -6209643 -5584227 -3775791 -1818061 -702764 -611089 -1232534
35484a232534q20034k43428P47206R73898M4576p12072j36285R03465R88680M78972
$$ -1232534 -2052568 -2295996 -1548790 -574892 -530316 -1242388 -1378673 -475208 513472 992444
35474I92444N74014R28339L27646q11754r25502r3462l194r63540j272814j10544
$$ 992444 1566458 2494797 2822443 2010689 1085187 991725 988531 24991 -1247823 -1358367
35464a358367J066545Q56236j55500p15646o59704m53172k18579M1855K85565
$$ -1358367 -291822 564414 408914 -306732 -966436 -1419608 -1638187 -1596332 -1310767
35455a310767Q26711J698423J650230m04486k810379k423452Q06896L026604J622147
$$ -1310767 -484056 1214367 2864597 2460111 -350268 -2773720 -1966824 1059780 2681927
35446B681927j208614j922013n08399N22346L50351K04826M64865K32551m94908
$$ 2681927 1473313 -448700 -957099 -434753 -84402 120424 585289 817840 322932
35437C22932p06979l86691m26747n76125K74405J617296J523058j28332r43156
$$ 322932 -384047 -770738 -1197485 -1773610 -1499205 118091 1641149 1512817 569661
35428E69661L85814J823745Q89703j695324l060123k041741k25973O08405M81201
$$ 569661 955475 2779220 3668923 1973599 -1086524 -3128265 -3354238 -2745833 -2264632
35419b264632L14821K68717j32498o49915j72683J609158L035785K090244p84282
$$ -2264632 -1949811 -1681094 -1813592 -2463507 -2636190 -1027032 2008753 4098997 3314715
35410C314715k760442k147255n37119k47326q72125l52390J257469J658288J37115
$$ 3314715 554273 -1592982 -2130101 -2377427 -3249552 -3601942 -2344473 -686185 -549070
35401e49070j056646k15576J180470R79622k34342l67252O62136R84997J0026
$$ -549070 -1605716 -1821292 -640822 338800 104458 -262794 399342 1384339 1394365
35392A394365p03144j19762O88112M33901m58881r05259r53031j204095j238034
$$ 1394365 691221 571459 1259571 1693472 1234591 329332 -623699 -1827794 -3065828
35383c065828k13659J179766J097779o44747j697053k85564J939513J925496l84104
$$ -3065828 -3279487 -2099721 -1001942 -1646689 -3343742 -3629306 -1689793 235703 -148401
35374a48401j778013l11984J944927J955650j20286j648425j393754n39108j85710
$$ -148401 -1926414 -2238398 -293471 1662179 1541893 -106532 -1500286 -2039394 -2225104
35365b225104o879L12480J85398o17748j233698r50698j00482P64762J445318
$$ -2225104 -2231983 -1919503 -1734105 -2351853 -3585551 -4536249 -4636731 -3871969 -2426651
35356b426651J496014M47173q74139p79404P84365J745307Q63412m50009m96760
$$ -2426651 -930637 -483464 -1357603 -2137007 -1352642 392665 1256077 806068 309308
35347C09308J70264J84626j75558K2692J31551j000950k471212k262170m55331
$$ 309308 479572 664198 488640 511332 642883 -358067 -2829279 -5091449 -5546780
35338e546780Q20307O53175L28614P81561J216208Q48448J57445k94437o80210
$$ -5546780 -4726473 -4073298 -3744684 -2963123 -1746915 -898467 -741022 -1035459 -1715669
35329a715669r25175m57333M47164O12456j03132l81201L64499J004822P19593
$$ -1715669 -2640844 -3098177 -2651013 -2038557 -2141689 -2522890 -2158391 -1153569 -433976
35320d33976K99017L82474J18948j054602j869718j096439L18680O97842J48806
$$ -433976 -134959 247515 366463 -688139 -2557857 -3654296 -3335616 -2637774 -2488968
35311b488968j20780n6683m04022q05484k95320O70415O89490j68672l73742M69076
$$ -2488968 -2609748 -2666431 -3070453 -3875937 -4171257 -3500842 -2811352 -2980024 -3353766 -2884690
35301b884690R39934K39975m23888J98483J346877J282329l13860j947992k121457
$$ -2884690 -1944756 -1704781 -2128669 -1930186 -583309 699020 385160 -1562832 -3684289
35292c684289r21736K68269M51723J42205M19535J052515O35370j014982j966891
$$ -3684289 -4606025 -4337756 -3886033 -3743828 -3324293 -2271778 -1636408 -2651390 -4618281
35283d618281p84508J182336J688563P86090K14230L85504K95793J8780O22860
$$ -4618281 -5402789 -4220453 -2531890 -1745800 -1531570 -1146066 -850273 -831493 -208633
35274b08633J496588O18660j786298k729341r24068R50080L84772j012422l16346
$$ -208633 1287955 1906615 120317 -2609024 -3533092 -2583012 -2198240 -3210662 -3527008
35265c527008J845972K374429P18172l99080O76401K231758J928185k15912k407539
$$ -3527008 -1681036 693393 1411565 1012485 1688886 3920644 5848829 5632917 3225378
35256C225378l172030k217580m11442O31079j2191j269407j266531J37608J321551
$$ 3225378 53348 -2164232 -2575674 -1944595 -1956786 -3226193 -4492724 -4355116 -3033565
35247c033565J443204J332800J487898J065861k35005j067427n37902Q8311n80751
$$ -3033565 -1590361 -257561 1230337 2296198 2061193 993766 455864 544175 -36576
35238c6576j563449j015470N69917R36422l40494j126341p3878J368795J321337
$$ -36576 -1600025 -2615495 -2045578 -1109156 -1449650 -2575991 -2649869 -1281074 40263
$$ [...]
##END NTUPLES=NMR SPECTRUM
##END=
