##TITLE=31Pdec_SA_PPh3vCl(water)
 CDCl3, 24 sc
 16.9.2019
##JCAMPDX= 6.0         $$ Bruker NMR JCAMP-DX V2.0
##DATA TYPE= NMR SPECTRUM
##DATA CLASS= NTUPLES
##ORIGIN= UXNMR, Bruker Analytische Messtechnik GmbH
##OWNER= root
$$ XWIN-NMR		Version 3.5
$$ Mon Sep 16 14:32:51 2019 Russian Standard Time (UT+4h)  she@DPX200
##.OBSERVE FREQUENCY= 81.013821
##.OBSERVE NUCLEUS= ^31P
##.ACQUISITION MODE= SIMULTANEOUS
##.ACQUISITION SCHEME= undefined
##.AVERAGES= 24
##.DIGITISER RES= 17
##SPECTROMETER/DATA SYSTEM= spect
##.PULSE SEQUENCE= zgpg30
##.SOLVENT NAME= CDCl3
##.SHIFT REFERENCE= (INTERNAL, CDCl3, 0, 182.463)
##AUDIT TRAIL= $$ (NUMBER, WHEN, WHO, WHERE, WHAT)
$$ ##TITLE= Audit trail, XWIN-NMR		Version 3.5
$$ ##JCAMPDX= 5.01
$$ ##ORIGIN= Bruker BioSpin GmbH
$$ ##OWNER= she
$$ F:/spectra/data/she/nmr/P31/1/pdata/1/auditp.txt
$$ ##AUDIT TRAIL=  $$ (NUMBER, WHEN, WHO, WHERE, WHAT)
(   1,<2019-09-16 14:31:47.39 +0400>,<she>,<DPX200>,
      <created by zg, POWCHK disabled, PULCHK disabled
       configuration hash MD5:
       00 E9 B6 7A A2 85 ED C7 34 08 36 98 17 FE 4E 26
       data hash MD5: 32K
       60 EB A0 69 70 92 E2 33 06 E4 BD C9 54 AE C2 40>)
(   2,<2019-09-16 14:31:49.78 +0400>,<she>,<DPX200>,
      <Start of raw data processing
       efp BC_mod = 2 LB = 1 FT_mod = 6 PKNL = 1 PHC0 = -467.4612 PHC1 = 287.8003 SI = 64K 
       data hash MD5: 64K
       8E 3A 13 56 58 2B C6 BB E4 56 28 EE 1E 7C 78 62>)
(   3,<2019-09-16 14:32:02.06 +0400>,<she>,<DPX200>,
      <pk PHC0 = -18.41119 PHC1 = 0 
       data hash MD5: 64K
       FA 2E 70 E6 43 50 BC 98 03 34 E5 E1 0B CB A3 08>)
(   4,<2019-09-16 14:32:05.06 +0400>,<she>,<DPX200>,
      <abs ABSG = 5 
       data hash MD5: 64K
       5E FC 79 0B 6C 5D DC 04 67 DB 12 62 79 05 0B B6>)
$$ ##END=
$$ 
$$ hash MD5
$$ 2B 43 CE 28 00 49 79 B4 37 7E 71 83 59 5D 3B E7
##$RELAX= 
##$RELAX= 
##$RELAX= 
##$RELAX= 
##$RELAX= 
##$RELAX= 
##$RELAX= 
##$RELAX= 
$$ Bruker specific parameters
$$ --------------------------
##$DU= <F:/spectra>
##$EXPNO= 1
##$NAME= <P31>
##$PROCNO= 1
##$TYPE= <nmr>
##$USER= <she>
##$AMP= (0..31)
100 100 100 100 100 100 100 100 100 100 100 100 100 100 100 100 100 100 
100 100 100 100 100 100 100 100 100 100 100 100 100 100 
##$AQSEQ= 0
##$AQ_mod= 1
##$AUNM= <au_zg>
##$AUTOPOS= <>
##$BF1= 81.014009
##$BF2= 200.13
##$BF3= 200.13
##$BF4= 200.13
##$BF5= 200.13
##$BF6= 200.13
##$BF7= 200.13
##$BF8= 200.13
##$BYTORDA= 1
##$CFDGTYP= 0
##$CFRGTYP= 5
##$CHEMSTR= <none>
##$CNST= (0..31)
1 1 145 1 1 1 1 1 1 1 1 1 1 1 1 1 1 1 1 1 1 1 1 1 1 1 1 1 1 1 1 1 
##$CPDPRG= <waltz16>
##$CPDPRG1= <>
##$CPDPRG2= <waltz16>
##$CPDPRG3= <>
##$CPDPRG4= <mlev>
##$CPDPRG5= <mlev>
##$CPDPRG6= <mlev>
##$CPDPRG7= <mlev>
##$CPDPRG8= <mlev>
##$CPDPRGB= <>
##$CPDPRGT= <>
##$D= (0..31)
0 1 0 0 0 0 0 0 0 0 0 0.03 2e-05 3e-06 0 0 0 0 0 0 0 0 0 0 0 0 0 0 0 0 
0 0 
##$DATE= 1568629906
##$DBL= (0..7)
120 120 120 11 120 120 24 19 
##$DBP= (0..7)
150 150 150 150 150 150 150 150 
##$DBP07= 0
##$DBPNAM0= <>
##$DBPNAM1= <>
$$ [...]
##$SUBNAM3= <"">
##$SUBNAM4= <"">
##$SUBNAM5= <"">
##$SUBNAM6= <"">
##$SUBNAM7= <"">
##$SUBNAM8= <"">
##$SUBNAM9= <"">
##$SW= 369.568048894756
##$SWIBOX= (0..15)
0 1 3 0 0 0 0 0 0 0 0 0 0 0 0 0 
##$SW_h= 29940.119760479
##$TD= 32768
##$TD0= 1
##$TE= 0
##$TE2= 300
##$TE3= 300
##$TEG= 300
##$TL= (0..7)
0 120 53 12 22 120 120 120 
##$TP= (0..7)
150 150 150 150 150 150 150 150 
##$TP07= 0
##$TPNAME0= <>
##$TPNAME1= <>
##$TPNAME2= <>
##$TPNAME3= <>
##$TPNAME4= <>
##$TPNAME5= <>
##$TPNAME6= <>
##$TPNAME7= <>
##$TPOAL= (0..7)
0.5 0.5 0.5 0.5 0.5 0.5 0.5 0.5 
##$TPOFFS= (0..7)
0 0 0 0 0 0 0 0 
##$TUNHIN= 0
##$TUNHOUT= 0
##$TUNXOUT= 0
##$USERA1= <user>
##$USERA2= <user>
##$USERA3= <user>
##$USERA4= <user>
##$USERA5= <user>
##$V9= 5
##$VALIST= <valist>
##$VCLIST= <CCCCCCCCCCCCCCC>
##$VD= 0
##$VDLIST= <DDDDDDDDDDDDDDD>
##$VPLIST= <PPPPPPPPPPPPPPP>
##$VTLIST= <TTTTTTTTTTTTTTT>
##$WBST= 1024
##$WBSW= 4
##$XGAIN= (0..3)
0 0 0 0 
##$XL= 0
##$YL= 0
##$YMAX_a= 12274
##$YMIN_a= -15392
##$ZGOPTNS= <>
##$ZL1= 120
##$ZL2= 120
##$ZL3= 120
##$ZL4= 120
##$ABSF1= 182.463
##$ABSF2= -187.1042
##$ABSG= 5
##$ABSL= 3
##$ALPHA= 0
##$AQORDER= 0
##$ASSFAC= 0
##$ASSFACI= 0
##$ASSFACX= 0
##$ASSWID= 0
##$AUNMP= <proc_1d>
##$AZFE= 0.1
##$AZFW= 0.5
##$BCFW= 0
##$BC_mod= 2
##$BYTORDP= 0
##$COROFFS= 0
##$CY= -3
##$DATMOD= 1
##$DC= 0
##$DFILT= <>
##$DTYPP= 0
##$F1P= 0
##$F2P= 0
##$FCOR= 1
##$FTSIZE= 65536
##$FT_mod= 6
##$GAMMA= 0
##$GB= 0
##$INTBC= 1
##$INTSCL= 5.30512e-09
##$ISEN= 30
##$LB= 1
##$LEV0= 0
##$LPBIN= 0
##$MAXI= 10000
##$MC2= 0
##$MEAN= 0
##$ME_mod= 0
##$MI= 50
##$NCOEF= 0
##$NC_proc= -5
##$NLEV= 6
##$NOISF1= 182.463
##$NOISF2= 159.3651
##$NSP= 0
##$NTH_PI= 0
##$NZP= 0
##$OFFSET= 182.463
##$PC= 4
##$PHC0= -485.8724
##$PHC1= 287.8003
##$PH_mod= 1
##$PKNL= yes
##$PPARMOD= 0
##$PSCAL= 0
##$PSIGN= 0
##$REVERSE= no
##$SF= 81.0140089999434
##$SI= 65536
##$SIGF1= 159.3651
##$SIGF2= -187.1042
##$SINO= 113.3802
##$SIOLD= 16384
##$SREGLST= <1H.CDCl3>
##$SSB= 0
##$STSI= 65536
##$STSR= 0
##$SW_p= 29940.119760479
##$SYMM= 0
##$S_DEV= 0
##$TDeff= 32768
##$TDoff= 0
##$TI= <>
##$TILT= no
##$TM1= 0
##$TM2= 0
##$TOPLEV= 0
##$USERP1= <user>
##$USERP2= <user>
##$USERP3= <user>
##$USERP4= <user>
##$USERP5= <user>
##$WDW= 1
##$XDIM= 65536
##$YMAX_p= 374799327
##$YMIN_p= -15897153
$$ End of Bruker specific parameters
$$ ---------------------------------
##NTUPLES= NMR SPECTRUM
##VAR_NAME=  FREQUENCY,     SPECTRUM/REAL,   SPECTRUM/IMAG
##SYMBOL=    X,             R,               I
##VAR_TYPE=  INDEPENDENT,   DEPENDENT,       DEPENDENT
##VAR_FORM=  AFFN,          ASDF,            ASDF
##VAR_DIM=   65536,         65536,           65536
##UNITS=     HZ,            ARBITRARY UNITS, ARBITRARY UNITS
##FACTOR=    0.456856943014862, 1,           1
##FIRST=     14782.0589164792, 0,            0
##LAST=      -15158.0608439998, 0,           0
##MIN=       -15158.0608439998, -15897153,   0
##MAX=       14782.0589164792, 374799327,    0
$$ Real data points
##PAGE= N=1
##DATA TABLE= (X++(R..R)), XYDATA
$$ [...]
39765h44367j67668M80196M76564j43704k48725O63689J287704L69128j146274
$$ -844367 -1012035 -531839 -55275 -198979 -447704 215985 1503689 1872817 726543
39756G26543j366723k18788O67099M70477k5167o2595J30838J49432p990l04155
$$ 726543 -640180 -858968 -191869 278608 253441 190846 321684 471116 463126 158971
39746A58971o60352o00015J76554R68101Q13327m9847m98875k10538P5560l2018
$$ 158971 -501381 -1101396 -924842 43259 856586 806739 307864 97326 172886 140868
39736A40868p1864J98099L27290O8269k09046k90738m15370n23017j28885O73021
$$ 140868 69004 267103 594393 662662 453616 162878 -252492 -775509 -904394 -231373
39726b31373R53650K15731p77664r85948l84841K21775L07046R2406J00798N07266
$$ -231373 722277 938008 160344 -825604 -1210445 -988670 -681624 -589218 -488420 18846
39716A8846Q88018O67847o3297n08477k79656n8394m80907q90619k55398R84933
$$ 18846 906864 1574711 1511414 1002937 723281 664887 183980 -706639 -962037 22896
39706B2896J312116M13585l23667J741M85315M7528p70940p33437J21860O11763
$$ 22896 1335012 1748597 1424930 1426671 1911986 1959514 1188574 455137 576997 1188760
39696A188760J85926m69835n87582k49461J1354j1840r5342j9141J21741Q1018
$$ 1188760 1374686 904851 317269 67808 79162 67322 -28020 -47161 74580 155598
39686A55598j13581j16861J66799K66155j55619n34269n6958R72835J290527M11997
$$ 155598 42017 -74844 91955 358110 202491 -331778 -388736 584099 1874626 2286623
39676B286623o33251p62862k81454k07392p09437r83297m61069M89400J038287
$$ 2286623 1653372 890510 609056 401664 -307773 -1291070 -1752139 -1262739 -224452
39667b24452O98437k51987r15866n47068N98057J414999J156413J98687n70151
$$ -224452 473985 221998 -693868 -1240936 -642879 772120 1928533 2127220 1557069
39658A557069p40307m99277j66979K0657n2716k48768k89140j56336m8935J28802
$$ 1557069 816762 317485 150506 171163 118447 -130321 -419461 -575797 -624732 -495930
39648d95930O58015J199725Q59372m57058j466207j024251K85097Q93424K58612
$$ -495930 162085 1361810 2221182 1764124 297917 -726334 -441237 452187 710799
39639G10799o74334q48152j66149P53371J220634Q58811r3316q36807p96376k65912
$$ 710799 36465 -811687 -977836 -224465 996169 1854980 1761664 924857 128481 -137431
39629a37431J05244J96712K58106K02312j93080o00614n17478k20078m12556r22632
$$ -137431 -32187 164525 422631 624943 431863 -168751 -686229 -906307 -1318863 -2241495
39619b241495q01652O5923N67444O5904n45525k40903N71694Q30876M86699K70508
$$ -2241495 -3043147 -2977224 -2409780 -2343876 -2889401 -3130304 -2558610 -1727734 -1241035 -970527
39609i70527K36491k10836r15673q69498J69052J025143O66836l73844q14798
$$ -970527 -734036 -944872 -1860545 -2730043 -2560991 -1535848 -869012 -1242856 -2057654
39600b057654k79845N74987J150655J316087R81115J31005o93566p38072m9772
$$ -2057654 -2337499 -1762512 -611857 704230 1685345 1816350 1122784 384712 334940
39591C34940M95877L97458R2462J8268j41300o79556r82897l11952Q45193J161444
$$ 334940 830817 1228275 1320737 1339005 1197705 518149 -464748 -776700 68493 1229937
39581A229937K39088q44590r70924k68009L45641L46028m5570l13290j27955L55207
$$ 1229937 1469025 624435 -346489 -614498 -268857 77171 31601 -281689 -409644 -54437
39571e4437N28346J9p14630p06301O935L86783o7865m72738R5773J102500J287488
$$ -54437 473909 473928 -240702 -947003 -940068 -553285 -621150 -1093888 -998115 104385 1391873
39560A391873M40863n23826r95757j133787r97409l13397O83571J159986Q16800
$$ 1391873 1832736 1308910 313153 -820634 -1818043 -2131440 -1447869 -287883 528917
39551E28917L08228J43294k2020n01438q03370m61173J6633j09780n68739n04121
$$ 528917 837145 980439 958419 456981 -346389 -807562 -790929 -900709 -1469448 -1973569
39541a973569J12634M50876J51297k21581j78973O5248J99156K86281L12247k2383
$$ -1973569 -1860935 -1410059 -1258762 -1480343 -1659316 -1594068 -1394912 -1108631 -796384 -818767
39531h18767o10227o96779P1341Q82007P44298j14559n84120k04349M00334N85001
$$ -818767 -1428994 -2125773 -2054432 -1172425 -428127 -542686 -1126806 -1331155 -930821 -345820
39521c45820M28780K64939J20186q8048k72787l85479n39565o98907n91903j48767
$$ -345820 82960 347899 468085 380037 107250 -278229 -817794 -1516701 -2108604 -2257371
39511b257371L15277N44044O02665N25109J69402l03426l31063K31313O72803
$$ -2257371 -1942094 -1398050 -795385 -270276 -100874 -404300 -735363 -504050 168753
39502A68753L81095j67402q8530N02879O25436l1223n77483k46620M59320M90467
$$ 168753 549848 382446 293916 796795 1422231 1391008 813525 566905 1026225 1516692
39492A516692k91357r79907q54850k24060J21344m7488k40361o3338K24035K00282
$$ 1516692 1225335 245428 -609422 -833482 -712138 -759626 -999987 -1063325 -839290 -639008
39482f39008o617J8632J85936L4838l17085j62276N76652R54141L83883l66334
$$ -639008 -645625 -626993 -441057 -406219 -723304 -885580 -308928 645213 1029096 662762
39472F62762l36788J57394K02960j25969m3457M15915M30731j11924m24940k28662
$$ 662762 325974 483368 686328 560359 516902 932817 1363548 1251624 826684 598022
39462E98022j22365l39305l54190m6105j2552l03165j33798N53305N97680m59940
$$ 598022 475657 136352 -217838 -263943 -276495 -579660 -713458 -160153 437527 -22413
39452b2413j266184o05879O41784Q44777N4310l76278k2030K96352J52334J8516
$$ -22413 -1288597 -1894476 -1252692 -407915 -353605 -729883 -751913 -455561 -303227 -284711
39442b84711J46219J96340Q4633J25018K43574K7348l88584m37785j58404j25883
$$ -284711 -138492 57848 142481 267499 511073 538421 149837 -287948 -446352 -572235
39432e72235l03890m0073O14367P00033j40705r49248p85221L4806N93095N89045
$$ -572235 -876125 -916198 -301831 398202 257497 -691751 -1476972 -1442166 -849071 -260026
39422b60026L32343O2407j57210k22530j03980P6042K97216O20996P89792L63696
$$ -260026 72317 134724 -22486 -245016 -348996 -272954 24262 645258 1435050 1798746
39412A798746n07509r74900m97021M46070R56777P07241P5843l97778m77215l55667
$$ 1798746 1291237 316337 -180684 265386 1222163 1929404 2005247 1607469 1130254 774587
39402G74587l79881m83086j32756P55139J244196M98618p95749j155410l68205
$$ 774587 394706 -88380 -221136 534003 1778199 2276817 1481068 325658 -42547
39393d2547L24244K13347k2958J74063K70474j18232l08185J56899M40858j83585
$$ -42547 281697 495044 472086 646149 916623 798391 490206 647105 1087963 904378
39383I04378q69493m94472L86467M26441k45025l33068K95670L89534m12407q03446
$$ 904378 34885 -459587 -73120 353321 108296 -224772 70898 460432 48025 -755421
39373g55421P5499J167898J047428r0552r44955r27396n31822k88559j86854j3671
$$ -755421 -679922 487976 1535404 1444852 499897 -427499 -959321 -1247880 -1434734 -1448405
39363a448405L11683O91586Q16396L68751m44970q52474l91416M12114O79826
$$ -1448405 -1136722 -445136 371260 740011 295041 -557433 -948849 -536735 143091
39354A43091L31768J01873M11282P35729L52546n87981j140248p15228J89822
$$ 143091 474859 576732 988014 1723743 2076289 1488308 348060 -367168 -177346
39345a77346O38196L96724K8934p1109j54652m21286m55969J06120P75923P59811
$$ -177346 460850 857574 886508 815399 660747 239461 -216508 -110388 665535 1425346
39335A425346J06118l94499l67378k04247k51187l75695m47831n22159l73285
$$ 1425346 1531464 1136965 769587 565340 314153 -61542 -509373 -1031532 -1404817
39326a404817L58697J269364J289381J89975q14233o70039K2913L4776n51154
$$ -1404817 -1046120 223244 1512625 1702600 888367 218328 241241 276017 -275137
39317b75137n80460K10974P33344K57419m94420m96111J45468N69419M55530K23074
$$ -275137 -855597 -644623 88721 346140 -148280 -644391 -498923 70496 526026 749100
39307G49100J71368Q5748k60090o69012p60921m47863m4184O0243j71320l40462
$$ 749100 920468 1006216 746126 77114 -683807 -1131670 -1175854 -1115611 -1286931 -1627393
39297a627393n8557N41821R12285P16156J34082m72478q84797r09087l36304O59950
$$ -1627393 -1685950 -1144129 -231844 484312 618394 145916 -738881 -1647968 -1984272 -1324322
39287a324322J363463J168002K95446m63471o44427m33890j87756j5451J10118
$$ -1324322 39141 1207143 1502589 1039118 394691 -39199 -226955 -242406 -132288
39278a32288J57333Q6745o9691k24966k21061R6537N70764O59121M1197p88227
$$ -132288 25045 111790 42099 -182867 -403928 -307391 263373 922494 963691 175464
39268A75464r96305m88503N028J0952j09127P7247L30861K43271J2475R6362L78800
$$ 175464 -820841 -1309344 -1304316 -1293364 -1402491 -1325244 -994383 -751112 -738637 -642275 -263475
39257b63475L51180P571j18915J36380K69198n7772m09706j89339M71437Q34257
$$ -263475 87705 95276 -23639 112741 381939 324167 -85539 -274878 196559 1030816
39247A030816M51475l63191r33299q71024l12548L30458P48164Q80929P79996
$$ 1030816 1482291 1119100 185801 -685223 -997771 -667313 80851 961780 1741776
39238A741776M50608p9126n93420p44881l75620K13802M12237j01463q41480q66689
$$ 1741776 2192384 2113258 1519838 774957 399337 613139 1025376 923913 82433 -784256
39228g84256O3200R31088N98255o00338j136694l37243O79884O11818k55613o82789
$$ -784256 -721056 210032 808287 207949 -928745 -1265988 -586104 25714 -229899 -912688
39218i12688l11112J41434K20473K05888K82824K44715J37582K81282M86166J75296
$$ -912688 -1223800 -1082366 -861893 -656005 -373181 -128466 9116 290398 776564 951860
39208I51860m87804n90186L9446L72433j95629p80300m24909K97093K06303n56526
$$ 951860 464056 -126130 -86684 285749 90120 -690180 -1115089 -817996 -611693 -1168219
39198a168219p73985o4891O63244P06435M09456K75419J89842l4838r8484K49329
$$ -1168219 -1942204 -2007095 -1343851 -637416 -227960 47459 237301 202463 103979 353308
39188C53308O19723M88333j6866l34171l06185l25044o36888q94103n94559K09260
$$ 353308 973031 1461364 1444498 1110327 804142 479098 -157790 -1051893 -1646452 -1437192
39178a437192Q82145R20568N16845K54518L57404N04005L70089K8157k93904n25870
$$ -1437192 -555047 365521 882366 1136884 1494288 1998293 2368382 2396539 2102635 1576765
39168A576765o37539n07955j73846K8243j45858m77184n43283k01408L53957Q03682
$$ 1576765 939226 431271 257425 285668 139810 -337374 -880657 -1082065 -728108 75574
39158G5574Q30071L41357k42353l12201Q1285J89936k68872n14901J13293R49437
$$ 75574 905645 1247002 1004649 692448 773733 963669 694797 179896 293189 1242626
39148A242626Q76122N0896l26579J05910L93496p4789n47721j90659M85677L68329
$$ 1242626 2118748 2169644 1843065 1948975 2342471 2267682 1719961 1529302 2014979 2383308
39138B383308n57572j179095q27050p7642J91965n5243k04864J6272K53303K43571
$$ 2383308 1825736 646641 -180409 -258051 -66086 -121329 -326193 -309921 -56618 186953
39128A86953L24965Q32070J259596O97070p76895j815801j392524j50598M81339
$$ 186953 511918 1343988 2603584 3300654 2523759 707958 -684566 -835164 -353825
39119c53825J50414k61988j60007M8024j00266l33769k15097J53713M28968N22927
$$ -353825 -203411 -465399 -625406 -577382 -677648 -1011417 -1226514 -1072801 -643833 -120906
39109a20906M19072J497m99783m15538M35560J149249P60970l74677r66676m92809
$$ -120906 298166 299663 -200120 -615658 -180098 969151 1730121 1355444 388768 -104041
39099a04041K15803K49386k04427l65649n1940K36279K36014K71635N28562N36385
$$ -104041 111762 361148 156721 -208928 -260868 -24589 211425 483060 1011622 1548007
39089A548007j57343j094067j286308m78626N33118R47784P41697K04802n90722
$$ 1548007 1390664 296597 -989711 -1468337 -935219 12565 754262 959064 368342
39080C68342j373046j414173m78445M68100M24660j22763P3838R76474J233588
$$ 368342 -1004704 -2418877 -2897322 -2429222 -2004562 -2127325 -2053487 -1077013 156575
39071A56575L52696m42124q4831P57123Q07668Q492o93389p60305l83025J44437
$$ 156575 509271 67147 -17684 739439 1547107 1555599 862210 101905 -281120 -136683
39061a36683N40540M07188k43050o71697l43447K10449K01437j80122k16983M7850
$$ -136683 403857 811045 567995 -103702 -447149 -236700 -35263 -215385 -432368 -384518
39051c84518J2579k60582j59687K37753K21198j91375j60643M53188O91853R4575
$$ -384518 -371939 -632521 -792208 -554455 -333257 -524632 -685275 -232087 459766 554341
39041E54341m54374j60632M03719L13941k33769m16861j41174P0975R0536J24022
$$ 554341 99967 -60665 343054 656995 423226 6365 -134809 -63834 26702 150724
39031A50724J9544l84516n19971K14077J166061J028779j89525r84507m82836
$$ 150724 170268 -214248 -734219 -520142 645919 1674698 1485173 500666 17830
39022A7830L95351M82837J2151j51474n1745k70588n51290j03845Q12237R03254
$$ 17830 413181 896018 908169 756695 704950 434362 -116928 -220773 591464 1494718
39012A494718k24689j226087p61794O64903J408367P92042k86882p23117m19663
$$ 1494718 1270029 43942 -717852 -52949 1355418 2147460 1860578 1137461 717798
39003G17798J258J36785J18311K27607M69697N27329J22254n43386q50565m71825
$$ 717798 719056 855841 974152 1201759 1671456 2198785 2321039 1777653 927088 455263
38993D55263J15575J55639l94669q08468n94461j06205R2244N0232J97384N51413
$$ 455263 570838 726477 331808 -476660 -1071121 -1177326 -1085082 -1034850 -837466 -286053
38983b86053O76381L75943m3549k65265l10698k83326j56540q256r9268m38878
$$ -286053 390328 766271 722722 457457 146759 -136567 -293107 -301363 -400631 -839509
38973h39509n88397k46717K30035L08330O8311J9814K58146L90132L00936L43351
$$ -839509 -1427906 -1674623 -1444588 -1136258 -1067947 -1048133 -789987 -399855 -98919 244432
38963B44432N91380N57430K559n51279n83022l38937k87784k78943O7041M88775
$$ 244432 835812 1393242 1395801 844522 261500 -77437 -365221 -644164 -577123 -88348
38953h8348M04604r1827l59068k28842r4754n0242J73674L93108P9543n51568
$$ -88348 316256 224429 -134639 -363481 -458235 -508477 -334803 58305 137848 -413720
38943d13720n98150N8770M18707K527k77055L38666J056832P23896l66504j012573
$$ -413720 -1011870 -953100 -534393 -531866 -808921 -470255 586577 1310473 943969 -68604
38933f8604q91717o17459m02197Q8754P02487Q09974L96425J11397J42605j0253
$$ -68604 -960321 -1577780 -1979977 -1891223 -1188736 -378762 17663 129060 271665 261412
38923B61412n12987q49141o87929l19443n4607J04201R7137j76839m15646k04887
$$ 261412 -251575 -1100716 -1788645 -2108088 -2162695 -2058494 -1961357 -2138196 -2553842 -2758729
38913b758729K25278K75961l1764j70602j13482k37195k89126L54799J300386
$$ -2758729 -2533451 -2257490 -2289254 -2459856 -2573338 -2810533 -3099659 -2744860 -1444474
38904a444474J322859K81069m68778r3231N63757N28840J65542K10947M34408
$$ -1444474 -121615 159454 -309324 -402555 161202 690042 855584 1066531 1500939
38895A500939K62465j43460m08962p39940j243028j256770l75558O04327P97147
$$ 1500939 1763404 1619944 1210982 471042 -771986 -2028756 -2404314 -1799987 -1002840
38886a002840N47773N60019N09734j61606p66308k26996R87432J351029N43803
$$ -1002840 -455067 104952 614686 453080 -313228 -540224 447208 1798237 2342040
38877B342040k91844n28808p24610j098698r03631R6235Q25776L91005n75673
$$ 2342040 2050196 1521388 796778 -301920 -1205551 -1109316 -283540 107465 -468208
38868d68208q80653l88730J17562K26704K62997N29513Q04924O98466K26614j27986
$$ -468208 -1348861 -1737591 -1620029 -1393325 -1130328 -600815 204109 902575 1129189 1001203
38858A001203J7954L89813L45880j74711m40736J0467N97046N30201q780k54913
$$ 1001203 1019157 1408970 1754850 1580139 1139403 1149870 1746916 2277117 2268337 2013424
38848B013424j08927j59069n76554q17276m82576J81750O98530P46476K16466
$$ 2013424 1904497 1745428 1168874 351598 -130978 50772 749302 1495778 1712244
38839A712244n75926q92103l76034L39183M43409P0830j16279r6908l07675n75449
$$ 1712244 1136318 244215 -131819 207364 650773 721603 605324 508416 200741 -374708
38829c74708l16808L20458O07003M66986M56063N51324J85048m58576m96745Q5330
$$ -374708 -691516 -371058 235945 702931 1158994 1710318 1895366 1436790 940045 1025375
38819A025375K46560l85915r21569p71437m54589k76646L70730J550827J966499
$$ 1025375 1271935 886020 -35549 -806986 -1261575 -1538221 -1167491 383336 2349835
38810B349835P28186j097573j845857j320432m44971L03266R14370R96051K11077
$$ 2349835 3078021 1980448 134591 -1185841 -1630812 -1327546 -413176 582875 793952
38801G93952q03021j068705n61596L2986M63734Q62218R49711L60107m69572p18927
$$ 793952 -9069 -1077774 -1639370 -1606384 -1142650 -280432 669279 1029386 559814 -159113
38791a59113l52521n671J00099K50271M25925K92743r5248l74102n15300o52516
$$ -159113 -511634 -517305 -417206 -166935 258990 551733 456485 82383 -432917 -1085433
38781a085433n21705Q9889O33326N03749J79246N32822J199289R40626l11938
$$ -1085433 -1607138 -1517249 -883923 -380174 -200928 331894 1531183 2471809 2159871
38772B159871j163939q30096j69065q9073j79304K26788O79140L83604l49920
$$ 2159871 995932 165836 -3229 -92302 -271606 -44818 634322 1017926 668006
38763F68006n44272o1246L43324K88373J59279K32999K43662R116j50545Q9825
$$ 668006 123734 62488 405812 694185 853464 1086463 1330125 1339241 1188696 1278521
38753A278521N56146Q18832O71863K05764l47982o82777n44882o389M82550M72499
$$ 1278521 1834667 2653499 3325362 3531126 3183144 2500367 1955485 1949096 2431646 2904145
38743B904145n7085o77658q76373m74146J91707N05641J57823m86715p92187o43953
$$ 2904145 2847060 2169402 1293029 818883 1010590 1516231 1674054 1187339 395152 -248801
38733b48801n22019o45513m83181M25200J469620J505040L91497p28134r21623
$$ -248801 -770820 -1416333 -1899514 -1474314 -4694 1500346 1891843 1163709 242086
38724B42086n40989l81740m36282j70119M16604Q04170Q10234O85230M77326L2066
$$ 242086 -298903 -680643 -1116925 -1287044 -870440 -66270 743964 1429194 1906520 1938586
38714A938586m29218m58846j37198j961j91948l31671k84526k90683l10301k2882
$$ 1938586 1509368 1050522 913324 911363 719415 387744 103218 -187465 -497766 -520648
38704e20648M16940M63811J73743K02768N85069N17939k33697p45440l44567L24753
$$ -520648 -103708 360103 533846 736614 1321683 1839622 1605925 860485 515918 840671
38694H40671L67833o1146l09644l23106l49792k20180K00149M20572N4312m13083
$$ 840671 1208504 1147358 837714 514608 164816 -55364 144785 565357 619669 206586
38684B06586m27247l23203n50584o16856L8709P01126K97956o81067o92218M68756
$$ 206586 -220661 -543864 -1094448 -1711304 -1672595 -971469 -673513 -1354580 -2046798 -1578042
38674a578042J282816P84030j64985l88980Q225K73851K68283K72387K11302r0230
$$ -1578042 -295226 488804 323819 -65161 -56936 216915 485198 757585 968887 878657
38664H78657k95697K4236N75820O35878J16402k72590n9829K99326J40953l13649
$$ 878657 582960 607196 1183016 1818894 1935296 1662706 1602877 1902203 2043156 1729507
38654A729507j90537O47057J131049M19431p61249j066711n02697l05481q80982
$$ 1729507 1538970 2186027 3317076 3736507 2975258 1908547 1405850 1100369 219387
38645B19387j202775o36671J3719J8778l3610M53848P39961M1541q15256n77074
$$ 219387 -983388 -1620059 -1606340 -1587562 -1621172 -1167324 -427363 -385822 -1201078 -1778152
38635a778152L56610O66178L33627L71656P35204M20540m47835n87625J70927
$$ -1778152 -1421542 -755364 -421737 -50081 685123 1105663 657828 70203 241130
38626B41130M79032j94747o21459O6911R34742Q54183J90959j37485j49613l00523
$$ 241130 720162 525415 -96044 -29133 905609 1759792 1950751 1813266 1663653 1363130
38616A363130m14576j37704K33953K54616R2559R7166J59514O9743p2435k37674
$$ 1363130 948554 810850 1044803 1299419 1391978 1489144 1648658 1718401 1645966 1408292
38606A408292n58531o92539j5137J101253J286707J33377r32910o31092L35721
$$ 1408292 849761 157222 142085 1243338 2530045 2663422 1730512 1099420 1435141
38597A435141M95049k03702o49319m21734j27890j92047l96909m77199l29373
$$ 1435141 1930190 1726488 1077169 655435 527545 335498 -61411 -538610 -867983
38588h67983J65090Q22756J000177M50644r5020L6290L52226L1080o19534o35518
$$ -867983 -702893 119863 1120040 1570684 1475664 1511954 1864180 1895260 1275726 640208
38578F40208k5798K37056k18558p14662p31615n56493n04574l80194m3549K01064
$$ 640208 614410 851466 632908 -81754 -813369 -1369862 -1874436 -2254630 -2298179 -2097115
38568b097115J48621P3507K23225L68432K04184r2636m1014M95796J046801R97901
$$ -2097115 -1948494 -1874987 -1651762 -1283330 -1079146 -1171782 -1212796 -717000 329801 1327702
38558A327702L25401k84552k75554n097j92246o82794n79204K11156N45988k44575
$$ 1327702 1653103 1368551 1092997 1087900 895654 212860 -366344 -155188 390800 146225
38548A46225j148736r05321P6368M03806j25346l53932K90614R65581Q31895K49854
$$ 146225 -1002511 -1907832 -1831464 -1427658 -1553004 -1906936 -1616322 -650741 181154 431008
38538D31008L5136K73353M50890K88539o1432l61077m53404k91435o7774j15075
$$ 431008 466144 739497 1190387 1478926 1417494 1056417 603013 311578 243804 128729
38528A28729m45793n83579j18983O70618J025854N59433k93008p92111p15840
$$ 128729 -317064 -900643 -1019626 -349008 676846 1236279 943271 151160 -564680
38519e64680m20335j47427K92866R41483J251370P30026k51667q60237q26068
$$ -564680 -985015 -1132442 -839576 101907 1353277 2083303 1831636 971399 145331
38510A45331m82134K001O58935J116616Q46656P9783l78877l27360k81582l77805
$$ 145331 -336803 -334802 324133 1440749 2287405 2367188 1988311 1660951 1379369 1001564
38500A001564k07404J38980N8982k93202n2510O60499N64298o41885j509360j083208
$$ 1001564 794160 933140 992122 698920 646410 1306909 1871207 1229322 -280038 -1363246
38490a363246l34839k35733m5358R55165J564119M72589j176213j230266J94281
$$ -1363246 -1698085 -1933818 -1979176 -1024011 540108 1012697 -163516 -1393782 -1199501
38481a199501J062379O08055J42j5229n932k40105j15751M44559O56609K48711
$$ -1199501 -137122 470933 471075 455846 449914 209809 94058 538617 1195226 1443937
38471A443937k42219o55270j218427j399144m30432R32659J003897k27943r29835
$$ 1443937 1201718 546448 -671979 -2071123 -2501555 -1568896 -564999 -792942 -1722777
38462a722777k49307N80527N09511J27337R3146k7275m15430k67381N24465O73585
$$ -1722777 -1972084 -1391557 -882046 -754709 -661563 -688838 -1104268 -1371649 -847184 -173599
38452a73599l03016q60755J68847J489926J305509O3091n43633k64549j17259
$$ -173599 -476615 -1337370 -1168523 321403 1626912 1690003 1146370 881821 764562
38443G64562k91377j20917K87528J66321l68265m41760R291K03311k2870o7929
$$ 764562 473185 352268 639796 806117 437852 -3908 5383 208694 185824 117895
38433A17895J22652p0683o18674o43411J43718Q63059P32175O7993l85202m45962
$$ 117895 240547 169864 -448810 -1092221 -948503 -85444 646731 714724 329522 -116440
38423a16440l79473k80935k3936L70381O08890M12493r3284l94317k18876j263
$$ -116440 -495913 -776848 -800784 -430403 178487 590980 497696 103379 -115497 -116760
38413a16760k46329n85524k48192N39837O76552o1524n78715k58986R3462j32258
$$ -116760 -363089 -948613 -1196805 -656968 19584 -41940 -620655 -879641 -786179 -918437
38403i18437j81161N16320R66067K59653n82285j98476O51081K90046q61539q11679
$$ -918437 -1099598 -583278 382789 642442 60157 -138319 512762 802808 -58731 -870410
38393h70410O47147J492275O84433m16968n15169k06090l87947o23161k64499
$$ -870410 -223263 1269012 1953445 1536477 1021308 815218 427271 -195890 -460389
38384d60389K18287K33666K04178N83942Q28805M56597Q9978K78668K93974n97751
$$ -460389 -242102 -8436 195742 779684 1608489 2065086 2155064 2433732 2727706 2129955
38374B129955j555483j306308j85925M50351L40089L02132M64265J35188n98257
$$ 2129955 574472 -731836 -917761 -467410 -127321 174811 639076 774264 176007
38365A76007p21494K7469O98543O63822L50623J07918l47350q53061n22723O55347
$$ 176007 -545487 -518018 180525 844347 1194970 1302888 955538 102477 -420246 235101
38355B35101J176178Q0988j323690j143085L70656J246458O82489n3919J77409
$$ 235101 1411279 1492267 168577 -974508 -603852 642606 1325095 1271176 1448585
38346A448585P45428N16786k98700n97367j26086K80368R9658j79753r032K97949
$$ 1448585 2194013 2710799 2412099 1814732 1688646 1969014 2068672 1888919 1879887 2177836
38336B177836J16804m22975n87273j83301J06002k22230o75329n36516n7726j00625
$$ 2177836 2294640 1871665 1284392 1101091 1207093 984863 309534 -226982 -284708 -385333
38326c85333o78669p75802Q4351R51942P67922r3583m46242l1509L31511J68278
$$ -385333 -1064002 -1839804 -1755453 -803511 -35589 -129172 -575414 -606923 -275412 -107134
38316a07134q9680o5120j9799j73313k24380M2600L07605K75886J34471O8913
$$ -107134 -196814 -261934 -281733 -455046 -679426 -636826 -329221 -53335 81136 150049
38306A50049j22864n13384o70261k81264K80295M80267L33856J77296J15798J00301
$$ 150049 27185 -486199 -1156460 -1437724 -1157429 -677162 -343306 -166010 -50212 50089
38296E0089J74824K76993J78987o6659q5880J46714J94150N129J20667O23514
$$ 50089 224913 501906 680893 614234 528354 675068 869218 874347 995014 1618528
38286A618528P45304R7393n98769o95272n77712o42979m03439L37579N68845k75735
$$ 1618528 2363832 2461225 1862456 1167184 589472 -53507 -456946 -119367 449478 173743
38276A73743q38377K27867J732073J441066m30041j491764q01929J14069R8240
$$ 173743 -664634 -436767 1295306 2736372 2306331 814567 12638 126707 224947
38267B24947j01044K24018L85468j24804n00084j46573J83421j35379l82236J46035
$$ 224947 123903 347921 733389 608585 108501 -38072 145349 9970 -372266 -226231
38257b26231P90347O72437J21471q5469N1111K09906M58176O44197J20718j026636
$$ -226231 564116 1236553 1358024 1272555 1323666 1533572 1991748 2635945 2756663 1730027
38247A730027j531001o81559M97756P50564K59287j22091k49862l09927r8869
$$ 1730027 199026 -482533 15223 765787 1025074 902983 653121 343194 244325
38238B44325L04931J94345m77489o27906J30076N44931j85788q46239k20252P61146
$$ 244325 549256 743601 266112 -361794 -231718 313213 127425 -718814 -939066 -177920
38228a77920O82844J30619M45127J117225P36010k91272m13646J87843p8471j190769
$$ -177920 504924 635543 1080670 2197895 2933905 2642633 2228987 2416830 2338359 1147590
38218A147590j340849k4811J038422O39706l00154n41709k13241O3341K55432
$$ 1147590 -193259 -218070 820352 1460058 1159904 618195 404954 468295 723727
38209G23727M02874K28468j72703l06863k39537m55235o44843j3996R98317Q92250
$$ 723727 1126601 1355069 1182366 875503 635966 180731 -464112 -478108 520209 1412459
38199A412459n08320j397144n11197R96783J190286r3671j283572j096538K24808
$$ 1412459 904139 -493005 -1004202 -7419 1182867 1089196 -194376 -1290914 -1066106
38190a066106J383260J315305K08404p23637o99877k35790r4254p0921K79972
$$ -1066106 317154 1632459 1840863 1117226 417349 181559 87305 16384 296356
38181B96356M62559j10064o94743k18810P30164O56201l62255q12266k87445Q5283
$$ 296356 758915 648851 -45892 -264702 465462 1121663 759408 -52858 -340303 -255020
38171b55020j30107q0574M07892L18847n27681q93428k58666L26789K49745K93070
$$ -255020 -385127 -465701 -57809 261038 -266643 -1160071 -1418737 -1091948 -842203 -549133
38161e49133P79256P23230j49972m99540K96669P92388j13711j192866r47665
$$ -549133 230123 953353 803381 303841 600510 1392898 1279187 86321 -861344
38152h61344n3991O7052k62547J24580R21504R15542J56691k86692k26190l22228
$$ -861344 -915335 -848283 -1110830 -986250 -64746 850796 1007487 720795 494605 172377
38142A72377n51523k82465L62779O12576L50279J56389K57871M25022N89792O62621
$$ 172377 -379146 -661611 -298832 313744 664023 820412 1078283 1503305 2093097 2755718
38132B755718K12023p42023j206653n22478M19908L95357l24005n80821k23779
$$ 2755718 2967741 2225718 1019065 496587 916495 1311852 987847 407026 183247
38123A83247k3253r3251J60185O68660O58865L7668l84575k16105k901k23225
$$ 183247 159994 66743 226928 895588 1554453 1592121 1207546 991441 988540 765315
38113G65315o20689p50722n15411j9338N42703Q11188N92078K49368K87370N89024
$$ 765315 144626 -606096 -1121507 -1140845 -598142 213046 805124 1054492 1341862 1930886
38103A930886N39982r9794q44102j044123n84696R207J53631n0138Q9214P19901
$$ 1930886 2470868 2371074 1526972 482849 -101847 -92640 60991 10853 100067 819968
38093H19968R02307n9790j208290j015317L37323J141582O43318j69432m78047
$$ 819968 1722275 1662485 454195 -561122 -223799 917783 1561101 1391669 913622
38084I13622o90459j071553r42481k8822Q16942J010068R80909Q77015J11626
$$ 913622 223163 -848390 -1790871 -1819693 -1002751 7317 988226 1865241 1976867
38075A976867j013148j014531L72325J288887N38751m84117j71361P08906N94125
$$ 1976867 963719 -50812 321513 1610400 2149151 1665034 1493673 2202579 2796704
38066B796704k18318m80917l04098n21952p78133k56633N03273M28369j71162
$$ 2796704 2578386 2097469 1793371 1271419 493286 236653 739926 1168295 997133
38057I97133k73375r604j55760m99575l81164j14627k67660l48947K03837O68535
$$ 997133 723758 714154 558394 58819 -322345 -436972 -704632 -1053579 -849742 -181207
38047a81207K96221j32061K80384P44305K61316l50102K3681N21398j31513j019997
$$ -181207 115014 -17047 263337 1007642 1268958 918856 942537 1463935 1332422 312425
38037C12425n48379N47470M43322m49375l08330O74460P07715k37977n09310P2857
$$ 312425 -235954 311516 754838 305463 -2867 671593 1379308 1141331 632021 704878
38027G04878J32368l36431L1684J022955Q67127n65449j396684q65432j88901
$$ 704878 837246 500815 532499 1555454 2422581 1857132 460448 -404984 -593885
38018e93885p6413N5548K48697o7676l00875N43352J470099O98240r31580q67532
$$ -593885 -670298 -614750 -366053 -433729 -734604 -191252 1278847 1977087 1045507 177975
38008A77975Q96862J785978R53013J91444L41359L92654M84635J910779L527677
$$ 177975 1074837 2860815 3813828 4005272 4346631 4739285 5223920 7134699 10662376
37999A0662376K272967j644572m087608k885680n10322N57754J065954J815053
$$ 10662376 12935343 11290771 7203163 4317483 3807161 4364915 5430869 7245922
37991G245922J379396o54301j910397j178822o61260j787314k333002n07148J491338
$$ 7245922 8625318 7971017 6060620 4881798 4220538 2433224 100222 -406926 1084412
37982A084412J122075l32589m62438J66129j37685p00877j14099P72631N18696
$$ 1084412 2206487 1873898 1411460 1577589 1439904 739027 624928 1397559 1916255
37973A916255j96878k49775l64382j140750j103656N65211J741853O59112r07612
$$ 1916255 1719377 1469602 1105220 -35530 -1139186 -573975 1167878 1826990 919378
37964I19378p01144K21342j02589p53147M9558J310121J106262J47932J66700
$$ 919378 218234 439576 336987 -416160 -366602 943519 2049781 2197713 2364413
37955B364413O14852J65413m22870n8580J46795p84975j137403M37523J767123
$$ 2364413 2979265 3144678 2721808 2663228 2810023 2025048 887645 1325168 3092291
37946C092291O21324j184954r32987K99509J08507o14537J36880J110563J50518
$$ 3092291 3713615 2528661 1595674 1895183 2003690 1389153 1526033 2636596 2787114
37937B787114j339419q97683K78015j89898j018165J62093J780991J086218m50817
$$ 2787114 1447695 550012 828027 638129 -380036 -217943 1563048 2649266 2198449
37928B198449R4681J363390M53613j114944k57218J399563N36275j159107j45314
$$ 2198449 2293130 3656520 4110133 2995189 2737971 4137534 4673809 3514702 3369388
37919C369388J844954J139439l41314J185857L318135J934719J66127K880464
$$ 3369388 5214342 6353781 6012467 7198324 10516459 12451178 12617305 15497769
37911A5497769N982814K876102k144024n39588M060397K240580j637857L975073
$$ 15497769 21480583 24356685 22212661 21673073 25733470 27974050 26336193 30311266
37903C0311266J3631119J2382814R383941L2014785P3833345Q2153550K4869579
$$ 30311266 43942385 56325199 65709140 97723925 171557270 253710820 278580399
37896B78580399n5112384q6730146n7731488j8898248q879717j4511452j0410649
$$ 278580399 223468015 136737869 79006381 60108133 51228416 36716964 26306315
37889B6306315J66603J768293l153101k743931J630570Q64545l840038m761209
$$ 26306315 26472918 28241211 25088110 22344179 23974749 24839294 20999256 16238047
37881A6238047k376873k449768l980293k219738Q70110J35956k608217j952138
$$ 16238047 13861174 11411406 7431113 5211375 6081485 6217441 3609224 1657086
37873A657086R02114P27583j759641j591464R85711J427156k88332n5390K079967
$$ 1657086 2559200 3286783 1527142 -64322 921389 2348545 2060213 2004823 4084790
37864D084790J941385p73505j876218k79733O18951l07353k52645J434738J652064
$$ 4084790 6026175 5252670 3376452 3096719 3715670 3408317 3155672 4590410 6242474
37855F242474k90555m67478L251948P043372O156774J018834m033391n877799
$$ 6242474 5951919 5484441 8736389 15779761 21936535 22955369 18921978 13044179
37847A3044179m654918k401025j083412j070733j055567j43910O58358K74727
$$ 13044179 8389261 5988236 4904824 3834091 2778524 2634614 3292972 3567699
37839C567699l48047Q9860P26176Q1847j041487r28238j63366m58163j149479
$$ 3567699 3219652 3309512 4035688 4117535 3076048 2147810 1984444 1526281 376802
37830C76802k39447J596177J632392k93566j347379k91608Q47350M48157m77102
$$ 376802 137355 1733532 3365924 3072358 1724979 1433371 2280721 2728878 2251776
37821B251776p01564o38329o93492k49139O39100P64541n6894m50245O8372K69415
$$ 2251776 1550212 911883 218391 -30748 608352 1372893 1315999 865754 934126 1203541
37811A203541l49374n44080K72094P81385P1826p59733m90824M73175J262603
$$ 1203541 854167 310087 582181 1363566 1435392 675659 184835 658010 1920613
37802A920613J778843J847544Q80247o84110j328492p38084l61316q77536j098780
$$ 1920613 3699456 5547000 6427247 5743137 4414645 3676561 3315245 2437709 1338929
37793A338929l59909J60480k42794l44952O10455J167431J41182j089593q29549
$$ 1338929 979020 1139500 896706 551754 1162209 2329640 2470822 1381229 551680
37784E51680J18051J14613l55431J52555J097527P62306o94774j451358q94589
$$ 551680 669731 784344 428913 581468 1678995 2441301 1746527 295169 -599420
37775e99420o9600M38861R45606J191932N23552m95347n94074Q0689K40071j79732
$$ -599420 -669020 -230159 715447 1907379 2430931 1935584 1341510 1422199 1662270 1482538
37765A482538L7017R12338Q94728m84934j545321r08933N82967J328638J020527
$$ 1482538 1519555 2431893 3326621 2841687 1296366 387433 970400 2299038 3319565
37756C319565L74599r0340k22378n9559P788k95017l92362L09572R82268L76098
$$ 3319565 3694164 3603824 3381446 3321887 3329675 3034658 2642296 2951868 3934136 4310234
37746D310234p88234n58341Q54758J015929o00596j370337O1871J274168L93434
$$ 4310234 3522000 2963659 3818417 4834346 4233750 2863413 2925284 4199452 4592886
37737D592886k70144J555250L249268J693000L65276N275207J3710966J4556765
$$ 4592886 4322742 5877992 9127260 10820260 11185536 16460743 30171709 44728474
37729D4728474L018145j1171398j5314910r120654k597472j611886k627953j258774
$$ 44728474 47746619 36575221 21260311 12139657 9542185 7930299 5302346 4043572
37721D043572J093691J324231L6291m46259j48618m01216r50125q41950n65469
$$ 4043572 5137263 6461494 6497785 6051526 5902908 5501692 4551567 3709617 3144148
37712C144148r31012j159214k59161Q75184Q31614R2994L9713M78771K47483m95654
$$ 3144148 2213136 1053922 794761 1669945 2501559 2594553 2634266 3113037 3360520 2864866
37702B864866o78429l84002m28911m34342M83088J513307J016356n39753r39254
$$ 2864866 2186437 1802435 1373524 939182 1422270 2935577 3951933 3412180 2472926
37693B472926K80878J108428L61254o30222n23537N881r1266m19213k92086j51002
$$ 2472926 2753804 3862232 4223486 3593264 3069727 3075608 2984342 2565129 2273043 2122041
37683B122041m60888n33438J66334P17807J62838p84404q62363k31787Q4966k4745
$$ 2122041 1661153 1127715 1294049 2011856 2174694 1390290 527927 296140 381106 356361
37673C56361J6939J21217j51583l99686N7757P74611P48579J56679R2953O65133
$$ 356361 373300 494517 342934 -56752 1005 775616 1524195 1680874 1773827 2438960
37663B438960P95519O2282o13199m91747q8015k03987p60430j123612r87127m89907
$$ 2438960 3234479 3296761 2683562 2191815 2103800 1899813 1139383 15771 -971356 -1461263
37653a461263J13110N80379P62586O83221L69363k19412q05717p41881J03463
$$ -1461263 -1348153 -767774 -5188 678033 1047396 827984 22267 -719614 -616151
37644f16151Q21243N65579j97884m29823j32886j22082m26873k49453M53298P35080
$$ -616151 205092 770671 572787 142964 10078 -112004 -538877 -788330 -335032 400048
37634D00048K90259l6184J77601K09589k99235m94199J04833M77334j96794q69876
$$ 400048 690307 654123 831724 1041313 742078 247879 352712 830046 633252 -236624
37624b36624k12092J035556J123854J68997q4803P14701R37302j16915q70516
$$ -236624 -448716 586840 1710694 1879691 1794888 2509589 3446891 3329976 2459460
37615B459460j18234R31683R34314J078344L080533N396378M354743n53428n141138
$$ 2459460 2341226 3272909 4207223 5285567 8366100 13762478 18117221 17563793 12422655
37606A2422655n552786k846679q55235r95699j445601p29361L70795P20810N27209
$$ 12422655 6869869 4023190 3167955 2172256 726655 -2706 368089 1088899 1616108
37597A616108L15464j53834r09957r98251J06423J253002J054571r3391p21340
$$ 1616108 1931572 1777738 867781 -130470 -24047 1228955 2283526 2190135 1468795
37588A468795n09802l91664o55604m78042M04804R35072K96685p51151r02879
$$ 1468795 958993 567329 -88275 -566317 -161513 773559 1070244 319093 -583786
37579e83786m6339Q00465R25989N68546K46056P8273r2722l07914m61658n16670
$$ -583786 -630125 170340 1096329 1664875 1910931 1989204 1896482 1588568 1126910 610240
37569F10240n26271m41468j19372L26687M28231j2938l77140P4171R45194R76776
$$ 610240 83969 -357499 -476871 -150184 278047 265109 -112031 -37860 907334 1884110
37559A884110j29511j071030p59010J07432K28289l00982m30460n5162J9294k06057
$$ 1884110 1754599 683569 -75441 31991 260280 -40702 -471162 -526324 -507030 -713087
37549g13087J34065R62063J030977J8712o77689o6769Q41854O21390m52506j042916
$$ -713087 -579022 383041 1414018 1432730 755041 688272 1530126 2151516 1699010 656094
37539F56094p26616j39485K78005N16262L80689k39223p34785m31962L12335O20333
$$ 656094 -70522 -210007 67998 584260 964949 725726 -9059 -441021 -128686 491647
37529D91647M77387N62047Q37810N05676n06462j172771q87781l29893k04101
$$ 491647 969034 1531081 2368891 2874567 2368105 1195334 307553 -22340 -226441
37520b26441j2022J021149K324273K368487P11072j227394j825663j124588m38719
$$ -226441 -238463 782686 3106959 5475446 6186518 4959124 3133461 2008873 1570154
37511A570154m46000n18811o7209L95379J95039k00498J27102Q81482Q03614l49257
$$ 1570154 1124154 605343 538134 933513 1128552 928054 1055156 1936638 2740252 2390995
37501B390995j296147j056241j52087N09515Q29390R01262L44547p65496j267697
$$ 2390995 1094848 38607 -113480 396035 1225425 2126687 2471234 1705738 438041
37492D38041l82640R14293J152076L70390l03459m57888m74158l43684J54990
$$ 438041 55401 969694 2121770 2492160 2188701 1730813 1256655 912971 1067961
37483A067961M85872M1745n03577q0265P98071O75829l29700o02789J92598M99865
$$ 1067961 1553833 1595578 1092001 1011736 1809807 2485636 2155936 1553147 1745745 2245610
37473B245610l64123r22147r4767Q30270K71975j069240j398651n69174N9223
$$ 2245610 1881487 959340 864573 1694843 1966818 897578 -501073 -1070247 -1011024
37464a011024j28398m65575l95392n3402L67686P41455O84867O5812m23891j20004
$$ -1011024 -1139422 -1604997 -2000389 -2053791 -1686105 -944650 -259783 -193971 -617862 -737866
37454g37866N04972N36545Q1322k5001K97519L53750N3438J11614P14322J065543
$$ -737866 -232894 303651 384973 359972 657491 1011241 1064679 1176293 1890615 2956158
37444B956158O02166k11733o85400p80059p81408o65668k53938L02140N34826
$$ 2956158 3558324 3346591 2661191 1881132 1099724 434056 180118 482258 1017084
37435A017084J06890p73161j315174p85634N55058J484887J191474K55408k31134
$$ 1017084 1123974 350813 -964361 -1749995 -1194937 289950 1481424 1736832 1505698
37426A505698r6317N8269L3844J24263K17974j51704p86943q39050j04251N54439
$$ 1505698 1409381 1467650 1501494 1625757 1843731 1692027 905084 66034 -38217 516222
37416E16222M54539K4696K3274M11516N43044J37116m02968n30547j72087J79575
$$ 516222 970761 995457 1018731 1430247 1973291 2110407 1707439 1176892 1004805 1184380
37406A184380K5249m22183l94368K82353P00040J52392o12352m10609M55074O00053
$$ 1184380 1209629 787446 393078 675431 1375471 1527863 915511 504902 959976 1560029
37396A560029j49206l93673M64789J028117O1461j398393j450649o8778J030256
$$ 1560029 1410823 1017150 1481939 2510056 2571517 1173124 -277525 -346303 683953
37387F83953Q96674K91745J04412J48281o3144l58405l35169j20795j30292m10993
$$ 683953 1580627 1872372 1976784 2125065 2061921 1703516 1368347 1247552 1117260 706267
37377G06267o58836o59207m02784L5286M72456O49200N08428L02551K48034K44739
$$ 706267 47431 -611776 -1014560 -979274 -506818 142382 650810 953361 1201395 1446134
37367A446134J24693k1187l4427m6892k88203n80756m31106K58220R20320R87057
$$ 1446134 1570827 1549640 1515213 1468321 1180118 599362 168256 426476 1346796 2333853
37357B333853N36636J4051l98660p26988p68014l05901K87880L25888j94506n16749
$$ 2333853 2870489 2884540 2485880 1758892 990878 684977 972857 1298745 1104239 587490
37347E87490k96015j21886m21953o01682m4203O50772M62968l70834o65421j99202
$$ 587490 291475 169589 -252364 -854046 -898249 -247477 215491 -155343 -820764 -1019966
37337a019966j6772n38158o93319L08475J453064J284525Q9637n55673j14023
$$ -1019966 -1036738 -1574896 -2268215 -1959740 -506676 777849 867486 311813 197790
37328A97790L63575J07170k36345J14510O81345N09825k56695o03810k29518J09073
$$ 197790 561365 668535 432190 546700 1228045 1737870 1481175 877365 647847 756920
37318G56920o0861k06064J42372M21929p8582q95827r20818p8516N18397K22548
$$ 756920 696059 489995 632367 1054296 975714 79887 -840931 -919447 -401050 -178502
37308a78502k87212j78353L38730N69901M18654K11770k3906l41172l50214K29838
$$ -178502 -465714 -644067 -305337 264564 683218 894988 871082 529910 179696 409534
37298D09534P86986N06625k94412m95429J38147N93008J77638n07044o35113l66874
$$ 409534 1196520 1703145 1408733 913304 1051451 1644459 1822097 1315053 679940 313066
37288C13066l31612m97273l17826K88449P81032P24530J99033m32293p87063o11041
$$ 313066 -18546 -515819 -833645 -545196 235836 960366 1159399 727106 -59957 -670998
37278f70998l6212L97418L20121K7903L8125K74850J87473l15553o21382l30040
$$ -670998 -707210 -309792 10329 38232 76357 351207 538680 223127 -398255 -728295
37268g28295R9172N6171k51619j63705K81959L30996k32054n89273p6251P87102
$$ -728295 -629123 -572952 -824571 -988276 -706317 -375321 -607375 -1196648 -1272899 -485797
37258d85797J066723O95458K45081j41262o72076j054710p76310j42471N7648
$$ -485797 580926 1276384 1521465 1380203 708127 -346583 -1122893 -1265364 -1207716
37249a207716p5321K85406J040299J059591J12226n57694k37531J34796k29094
$$ -1207716 -1283037 -997631 42668 1102259 1214485 656791 419260 554056 324962
37240C24962n12115J21164Q08379L85123n82287q05132m12900l55685m58536M5146
$$ 324962 -187153 -65989 742390 1127513 545226 -259906 -672806 -1028491 -1487027 -1441881
37230a441881O61631L31623m52294l16672M78961M28874l81629k24614J177022
$$ -1441881 -780250 -448627 -900921 -1217593 -738632 -309758 -691387 -916001 261021
37221B61021J927396J049020K9726K44140Q67978O38366o0128k77332k21361m92695
$$ 261021 2188417 3237437 3267163 3511303 4379281 5017647 4957519 4680187 4458826 3966131
37211C966131p80322o40377n37124q72817r48880j18611Q78438R19060J17369
$$ 3966131 3185809 2545432 2008308 1135491 186611 68000 946438 1865498 1982867
37202A982867o03516q68807q23236m48195J48492L82728k9569n17183m98964r6945
$$ 1982867 1379351 510544 -312692 -760887 -612395 -229667 -259236 -776419 -1275383 -1372328
37192a372328M58510J182340J595183Q26634q27120j679036q46125N13417J014864
$$ -1372328 -913818 268522 1863705 2690339 1863219 184183 -661942 -148525 866339
37183H66339Q07574N57922P8719p97536j267052q09639k30540j81452P6355J044622
$$ 866339 1673913 2231835 2310554 1513018 245966 -563673 -794213 -975665 -899310 145312
37173A45312J526149M98990q12504o69677M09488O19377k24264p75585n16594
$$ 145312 1671461 2170451 1357947 688270 1097758 1717135 1492871 717286 200692
37164B00692m5147M61645J147593J329693L72872p22536n29245M25582M62588
$$ 200692 155545 617190 1764783 3094476 3467348 2744812 2215567 2641149 3103737
37155C103737m47228p94423k31136L1997m31966o54854k52880l6581k71290j57593
$$ 3103737 2656509 1862086 1630950 1662947 1230981 576127 323247 286666 15376 -142217
37145a42217N03862Q02056L49206p9754K0196J90430J06201O1473Q4122j63369
$$ -142217 361645 1163701 1512907 1433153 1453349 1643779 1749980 1811453 1895575 1732206
37135A732206m29492j21625M05631K17978m53537l74238N71229J018549L14224
$$ 1732206 1302714 1181089 1586720 1804698 1351161 976923 1548152 2566701 2880925
37126B880925m63516l14116K02261J45818j06859O81174K737111M433667L586848
$$ 2880925 2417409 2103293 2305554 2451372 2344513 3025687 5762798 10196465 13783313
37117A3783313n9192l790232m405597k015006P0888j73281j067002n27956M97275
$$ 13783313 13724121 9933889 5528292 3513286 3584174 3410893 2343891 1815935 2313210
37108B313210J38306q66274o62219J77968j48356j012977l99338J064994Q38718
$$ 2313210 2451516 1585242 923023 1100991 952635 -60342 -459680 605314 1444032
37099A444032r63497j517457o4695R91856L97810j89284K83773M82443l01163
$$ 1444032 480535 -1036922 -1101617 -109761 288049 98765 382538 864981 563818
37090E63818n91675L55159J039921N59559J26676L68965R843j259353j535373
$$ 563818 -27857 327302 1367223 1926782 2053458 2422423 2432266 1172913 -362460
37081c62460m8828J102691M42663m34654O7224P38868J17492o45906J0650J092579
$$ -362460 -411288 691403 1134066 699412 766636 1505504 1622996 977090 987740 2080319
37071B080319Q04195m51328j128466j051215q15634k26495P48032J012061J40585
$$ 2080319 2884514 2433186 1304720 253505 -562129 -788624 -40592 971469 1112054
37062A112054m43817K22587Q88325L22312n42418m77796r8021k79453l15025M42779
$$ 1112054 668237 890824 1779149 2101461 1559043 1081247 983226 703773 388748 831527
37052H31527R22927K35369n57285m05491j47397o01550p76060J06292Q19285L40890
$$ 831527 1754454 1989823 1432538 1027047 879650 278100 -497960 -391668 427617 768507
37042G68507j78438L94359J126439J080082J107664J582294R04188j428246k902857
$$ 768507 590069 984428 2110867 3190949 4298613 5880907 6785095 5356849 2453992
37033B453992j735277O9898J34827m75014J49196J010436M26210m38049J92447
$$ 2453992 718715 788613 923440 448426 597622 1608058 2034268 1596219 1788666
37024A788666J120387M01537r32041r51003n26172j229417j655374J32597K361484
$$ 1788666 2909053 3310590 2378549 1427546 901374 -328043 -1983417 -1850820 510664
37015E10664J959683l18259j296045n45888j17359l60127k6411N35047R3734n92974
$$ 510664 2470347 2152088 856043 310155 192796 -167331 -193742 341305 435039 -157935
37005a57935j24086O05552J51451m47021K20566Q11197j69401r78255K15738J384755
$$ -157935 -282021 323531 474982 27961 248527 1059724 890323 -87932 127806 1512561
36995A512561J88136j300735k44824J406042L62802j753551j400781K83746N0589
$$ 1512561 1700697 399962 155138 1561180 1923982 170431 -1230350 -946604 -896015
36986h96015q64108O42140K735980J580829j095312q39108J126731K60581k340732
$$ -896015 -1760123 -1117983 1617997 3198826 2103514 1264406 2391137 2651718 310986
36977C10986j792320J174141J486618o01457k49911K262866K023370p06292q91331
$$ 310986 -1481334 -307193 1179425 577968 328057 2590923 4614293 3908001 3016670
36968C016670J219407N38554k332709j647356K083655K372938q95920j079267
$$ 3016670 4236077 4774631 2441922 794566 2878221 5251159 4355239 3275972
36960C275972K315934K659455n73467o23421K937119L271762O37389K462501P126974
$$ 3275972 5591906 8251361 7677894 7054473 9991592 13263354 13900743 16363244 23490218
36951B3490218M763346l048447l659931K961201L152692k727255J938595J6253365
$$ 23490218 28253564 25205117 21545186 24506387 27659079 24931824 26870419 43123784
36943D3123784J8325140J1109280L2850139R0547416J19603294N9240274n2448913
$$ 43123784 61448924 72558204 105408343 195955759 315559053 374799327 322350414
36936C22350414j14303336q7913895l3383154j4092651k1668446j7688175r71003
$$ 322350414 208047078 120133183 86750029 72657378 50988932 33300757 32329754
36929C2329754M387412k786582m148874K134625K219152m795830o766580k316691
$$ 32329754 36717166 33930584 29781710 31916335 34135487 29339657 22573077 20256386
36921B0256386j428871n160096m938711k57672P87736k464672k622541J030035
$$ 20256386 18827515 13667419 8728708 8471036 9258772 6794100 4171559 5201594
36913E201594J692255j400512j963326Q04413J090675j819481k283339O43486
$$ 5201594 6893849 5493337 3530011 4334424 5425099 3605618 1322279 1965765
36905A965765J661263m41994r67817J195426J677623o07253j569801m0447M19085
$$ 1965765 3627028 3185034 2217217 3412643 5090266 4483013 2913212 2872765 3291850
36896C291850j046103j084623Q11218J146834o24825j078308L28067L32376j308901
$$ 3291850 2245747 1161124 1972342 3119176 2494351 1416043 1744110 2076486 767585
36887G67585j052751J336545J845914l59168j343238K75869J060761m32118j060275
$$ 767585 -285166 1051379 2897293 2538125 1194887 1470756 2531517 2099399 1039124
36878A039124N66091J321277m18826j690826m71067R07335M43821k16410L42320
$$ 1039124 1605215 2926492 2507666 816840 345773 1253108 1696929 1480519 1822839
36869A822839N83383m33274r38821q6728K81565n48285n88905P48589J073727
$$ 1822839 2406222 1972948 1034127 947399 1228964 680679 91774 840363 1914090
36860A914090n09571j422398j87858R90677M25981j54966P23425J397133L74887
$$ 1914090 1404519 -17879 -205737 784940 1210921 1055955 1779380 3176513 3551400
36851C551400p74132l61665N44287M96640J61118L42739K06781o07439p22132
$$ 3551400 2777268 2415603 2959890 3456530 3617648 3960387 4167168 3559729 2837597
36842B837597M02730J244014J017314Q86230J087209N8259k102151k748871j011994
$$ 2837597 3240327 4484341 5501655 6387885 7475094 7533353 5431202 2682331 1670337
36833A670337M45130j18372q51723j97204K36487q08305j444949k38688P92753
$$ 1670337 2115467 1997095 1145372 948168 1184655 376350 -1068599 -1307287 -514534
36824e14534j09752r67185K90418J715409O72051j315713j085227Q32628J471004
$$ -514534 -624286 -1591471 -1301053 414356 1086407 -229306 -1314533 -481905 989099
36815I89099M89185k494L89517J58924p37109q07050l188K67479j44952j27287
$$ 989099 1478284 1475790 1865307 2024231 1287122 480072 476884 744363 599411 472124
36805D72124K90951P1486n85831n18142J61095L15281n7431k7986K96100O8737
$$ 472124 763075 834561 248730 -269412 -108317 206964 149533 121547 417647 486384
36795D86384m36103k65417L36526M23825K25629N90402J092886O88248k50565
$$ 486384 50281 -215136 121390 545215 770844 1361246 2454132 3142380 2891815
36786B891815n45344l47515o29396j072291o17011L12007L66474k53201j61142
$$ 2891815 2346471 1998956 1369560 297269 -319742 -7735 358739 105538 -55604
36777e5604N72449N02413m48122p03465K08539Q77706M95390J1334J40268J63091
$$ -55604 516845 1019258 571136 -132329 76210 953916 1449306 1460640 1600908 1763999
36767A763999m38461q66169m71013R9874J35871n229J39138J91505j48868k60416
$$ 1763999 1325538 459369 -11644 88230 224101 218872 358010 549515 400647 140231
36757A40231L66125J045997Q22167q3199o30231m27364m0055J2929j20153r1590
$$ 140231 506356 1552353 2374520 2291321 1661090 1233726 1193671 1206600 1086447 994857
36747I94857M1578l6957l17693l55980J06270O51282O59763J40944l52576n43980
$$ 994857 1036435 999478 681785 325805 432075 1083357 1743120 1884064 1531488 987508
36737I87508o06876n89841l77367k27339n02581p84754k52754Q34753J153854
$$ 987508 380632 -209209 -586576 -813915 -1316496 -2101250 -2354004 -1519251 -365397
36728c65397K37421p42592o93387p074M27347N29190N50959L32360j00950j41503
$$ -365397 -127976 -870568 -1563955 -1571029 -1143682 -614492 -63533 268827 167877 26374
36718B6374L48368N36315o250m62444j80885J82087p5095m32406k50956K391j56663
$$ 26374 374742 911057 904807 442363 261478 443565 368470 -63936 -314892 -312501 -469164
36707d69164q7182O66873J080066K19622r16142q17750J52579N17758N9593l05233
$$ -469164 -556346 110527 1190593 1410215 494073 -323677 -171098 346660 406253 101020
36697A01020l43951m47768l55350L19210Q51625M34283j77198J42707P29973K19528
$$ 101020 -242931 -690699 -1046049 -726839 124786 559069 381871 524578 1254551 1474079
36687A474079p93370n09518R26297J452269L56278p90113p93013k88852o9515
$$ 1474079 680709 171191 1097488 2549757 2906035 2115922 1322909 1034057 964542
36678I64542N5143J60734k07222p88551o35406J28307K55637m68441p82892j73820
$$ 964542 1019685 1180419 973197 184646 -450760 -322453 -66816 -535257 -1318149 -1491969
36668a491969K93142K4388p1875N27656Q25924J33698n54150k06717N68512O97304
$$ -1491969 -1198827 -1174439 -1246314 -718658 107266 240964 -313186 -519903 48609 745913
36658G45913L17825J21565L7059k83517n03852j80859L64872N90792N07689K96661
$$ 745913 1063738 1185303 1222362 938845 434993 254134 619006 1209798 1717487 2014148
36648B014148r3571m41408k32759L37265L41348l60114o94660j14821M42516J44979
$$ 2014148 1920577 1479169 1246410 1583675 1925023 1564909 870249 755428 1197944 1342923
36638A342923l75593k27398K70586L98284L25703M45620L06239n38749j318918
$$ 1342923 967330 739932 1010518 1408802 1734505 2180125 2486364 1947615 628697
36629F28697r67535K08630R24538O39325r6201o62886q23670m78495J63028M42822
$$ 628697 -338838 -130208 794330 1433655 1337454 674568 -149102 -627597 -464569 -21747
36619b1747M7006l77875j11665M98348N25714k05612r75248j113442n37695L67265
$$ -21747 25259 -352616 -464281 34067 559781 354169 -621079 -1734521 -2272216 -1904951
36609a904951R35866O60607j31473m92797j07472K83830J04581k02028r6515J24511
$$ -1904951 -969085 -308478 -439951 -932748 -1040220 -756390 -651809 -853837 -950352 -825841
36599h25841M9037r832K61466L73221j18492o63998n99718k90782l39684l33473
$$ -825841 -776804 -786636 -525170 -151949 -270441 -934439 -1534157 -1824939 -2164623 -2498096
36589b498096L95825J304361J259586L04279m62266n25451k80613K2755M04109
$$ -2498096 -2102271 -797910 461676 765955 303689 -221762 -502375 -479620 -75511
36580g5511M43143k05946p42938j25135R95960Q82221n15262j156897L4360J407698
$$ -75511 367632 161686 -581252 -706387 289573 1171794 656532 -500365 -466005 941693
36570I41693J018577n29821j180509m83915J18484k13667n80179k7578Q87979
$$ 941693 1960270 1430449 249940 -233975 -115491 -329158 -909337 -936915 -48936
36561d8936R71239J18921o29587n35931K5230K65485r265l48218l13128J32418
$$ -48936 922303 1041224 411637 -124294 -99064 166421 157156 -191062 -504190 -371772
36551c71772P15516R88538N14154o05194j414936r47136M32868J165801M06949
$$ -371772 343744 1332282 1846436 1241242 -173694 -1120830 -687962 477839 884788
36542H84788q03355r16176O6236P70783M52346j80902k52613Q8505J78056j23285
$$ 884788 81433 -834743 -768507 2276 454622 273720 21107 109612 287668 164383
36532A64383m30393m80533l07571l1017J35828r5924o60533r19377l28804P51220
$$ 164383 -266010 -746543 -1054114 -1085131 -949303 -1045227 -1705760 -2625137 -2953941 -2202721
36522b202721J359539J057928L39245j39719k62564k05912J6481L63836N02581
$$ -2202721 -843182 214746 553991 414272 151708 -54204 -37723 326113 828694
36513H28694K48064M51J47719K79254k11462q64468n58473O05411J015836j88611
$$ 828694 1076758 1077209 1224928 1504182 1292720 428252 -130221 475190 1491026 1302415
36503A302415j656666j643102m06439M93345O09852P46507J028165O47383k99965
$$ 1302415 -354251 -1997353 -2403792 -1910447 -1300595 -554088 474077 1121460 821495
36494H21495n10253L72880Q79525n7086j308607j191679P3677Q67677N27608r5767
$$ 821495 311242 684122 1563647 1506561 197954 -993725 -920048 -52371 475237 379470
36484C79470j68004J83363M32338L04254j64297o02724m44180L62265R81304O36406
$$ 379470 211466 394829 827167 1131421 967124 364400 -79780 282485 1263789 1900195
36474A900195k81148o99916l07445J86756J74559j44437k86713j71924p8553k16932
$$ 1900195 1619047 919131 611686 798442 973001 828564 541851 369927 291374 74442
36464G4442m88886n60734k19206K78382M14756P9060k72526k64968n1729O8965
$$ 74442 -414444 -975178 -1194384 -916002 -501246 -422186 -694712 -959680 -1011409 -942444
36454i42444Q0044O7726L1447O9314K90761L98061l6433p02439p34946m4803M38583
$$ -942444 -862400 -794674 -763227 -693913 -403152 -5091 -41524 -743963 -1478909 -1523712 -1085129
36443a085129K67841J67276N74056O40809k88360j226749q63978M17503J199049
$$ -1085129 -817288 -650012 -75956 564853 276493 -950256 -1814234 -1396731 -197682
36434a97682J095105P59691L54820m08386j011853n87777M04534N86603j19773
$$ -197682 897423 1657114 2011934 1603548 591695 3918 408452 995055 875282
36425H75282l04560N55949J145774L89250r03510j320362o96867J57524O97763
$$ 875282 570722 1126671 2272445 2661695 1758185 437823 -259044 -101520 596243
36416E96243P95544L82626k76810n05986n7255M25711K82724l00717p10219o70141
$$ 596243 1391787 1774413 1497603 991617 934362 1360073 1642797 1342080 631861 -38280
36406c8280k44908L74407P70644N82262J51500K07604O64660N96418k41924q71027
$$ -38280 -283188 91219 861863 1444125 1595625 1803229 2467889 3064307 2822383 1951356
36396A951356o32735k43117m85589q20782l80429M15198M93613q8501l06217Q1333
$$ 1951356 1318621 1075504 589915 -230867 -611296 -196098 297515 209014 -97203 -15870
36386a5870K10639l66409r72094r08771l59508J87707O42559R91261R14225K83032
$$ -15870 194769 -171640 -1143734 -2052505 -2412013 -2224306 -1581747 -590486 323739 606771
36376F06771l71865m40198n3775J59044J4495m4285K34504M11267R441o39416
$$ 606771 234906 -205292 -259067 -100023 -85528 -129813 104691 515958 525399 -114017
36366a14017p29666j37889L20766M2209m67948l30522M28331R64653Q13587L24801
$$ -114017 -843683 -981572 -660806 -618597 -1086545 -1417067 -988736 -24083 789504 1114305
36356A114305p5722l71259n78578n26865k46223n5669n4391r019J08653L6676
$$ 1114305 1038583 667324 88746 -438119 -684342 -740011 -794402 -803421 -694768 -658092
36346f58092j59105l0792M35513O34304L13072K3211J62366K98204K1719k45022
$$ -658092 -817197 -847989 -412476 221828 534900 558111 720477 1018681 1040400 795378
36336G95378l4582K09090j48306p36554o91540o2820K92671R1967q5032R2063
$$ 795378 760796 969886 821580 85026 -606514 -669334 -376663 -284696 -369728 -277665
36326b77665K45506J15221J086J02135J28667j05093l05639k41572j37770k26147
$$ -277665 -32159 83062 84148 186283 314950 209857 -95782 -337354 -475124 -701271
36316g01271l85767n09848p25602r27064o20201L13785J146654J132823M98232
$$ -701271 -1087038 -1596886 -2322488 -3249552 -3869753 -3555968 -2409314 -1276491 -778259
36307g78259O2938J34490L76463N98079R34576J172109O56949p05993j894850
$$ -778259 -715321 -580831 -204368 393711 1328287 2500396 3157345 2451352 556502
36298E56502j806991o35292L54111L71634j16724k66344M3830L36213L54108K40635
$$ 556502 -1250489 -1885781 -1531670 -1160036 -1276760 -1543104 -1499274 -1163061 -808953 -568318
36288e68318P9900j89888l84612j10878O00409J083609P70680p5046o45379n13450
$$ -568318 -488418 -678306 -1062918 -1173796 -573387 510222 1280902 1205856 560477 47027
36278D7027l8278J44014j34405m17296k19840K77881L45904l24941j020061p95842
$$ 47027 8749 152763 18358 -398938 -618778 -340897 5007 -319934 -1339995 -2135837
36268b135837K14579Q60036M77066k43154k63535M11248R24277Q48178N82378
$$ -2135837 -1921258 -1061222 -584156 -827310 -1090845 -679597 244680 1092858 1675236
36259A675236M81400K70226l60670j032725j033860k73222N27504O69160K10606
$$ 1675236 2156636 2426862 2066192 1033467 -393 -273615 253889 923049 1133655
36250A133655k85609m92203m97772l86652q3849K97624L99609J56194j1902J20784
$$ 1133655 848046 355843 -141929 -528581 -612430 -314806 84803 240997 229095 349879
36240C49879J34570k93297o09694j08885Q06326J019992L72943n3200M01975R78329
$$ 349879 484449 191152 -418542 -527427 278899 1298891 1671834 1618634 2020609 2998938
36230B998938O72799l66202j229591j384773q26882K38456J168756J019072k16878
$$ 2998938 3671737 3305535 2075944 691171 -135711 102745 1271501 2290573 2073695
36221B073695j085262m24029Q41336Q68240m36540j334612q67016m4136J9844
$$ 2073695 988433 564404 1405740 2273980 1837440 502828 -364188 -408324 -388480
36212c88480k52598Q485N01571L56887l20256o46250l47076O3737K94783N10313
$$ -388480 -641078 -632593 -131022 225865 -94391 -740641 -1087717 -1023980 -729197 -218884
36202b18884O24938K90594l14166n11266j43037J70801N8383k3702L82501R34712
$$ -218884 406054 696648 382482 -128784 -271821 -101020 -42637 -66339 316162 1250874
36192A250874R97621N05137j45490o83766j001524r51337n86329l01608k81176
$$ 1250874 2248495 2753632 2608142 1924376 922852 -28485 -614814 -916422 -1197598
36183a197598j35001M16471Q89299P13342J91719j8944o6039n20555j015298n38911
$$ -1197598 -1332599 -916128 -26829 686513 878232 859288 793249 272694 -742604 -1281515
36173a281515P17577J149393j3139j410520j384387j53941Q53901J060691R34227
$$ -1281515 -563938 585455 572316 -838204 -2222591 -2376532 -1522631 -461940 472287
36164D72287O87024R5952n81774p31978m37280l69562n88377m41363K32418P65611
$$ 472287 1159311 1255263 673489 -58489 -495769 -865331 -1453708 -1895071 -1662653 -897042
36154h97042P26188M43642K53656L8204k42798l27201j87744q7993L1419M52596
$$ -897042 -170854 272788 526444 564648 321850 -5351 -193095 -281088 -249669 202927
36144B02927Q84982O82968M389k62145L7136M2722n57760q94188m36098M1674
$$ 202927 1087909 1770877 1775266 1513121 1550257 1592979 1035219 141031 -295067 -253393
36134b53393j63519m40119j5186N92315M29466l04539p12208o68844o56189n78012
$$ -253393 -416912 -857031 -872217 -279902 149564 -154975 -867183 -1536027 -2192216 -2770228
36124b770228L2605Q79821J135156O93175K01427l5744k23774k91607N4513N36783
$$ -2770228 -2737623 -1857802 -722646 -29471 171956 136212 -87562 -379169 -324656 212127
36114B12127N26709O8969k04397j55011k10319l71314j53985L74165N11291J04582
$$ 212127 738836 807805 603408 448397 238078 -133236 -287221 86944 598235 702817
36104G02817j48896R3337K45660j28768n31486m16854j51762l60520p92103o29045
$$ 702817 553921 647258 892918 764150 232664 -184190 -335952 -696472 -1488575 -2117620
36094b117620K41263R62761Q43637K79086J96308P23458Q79362r5377j430471
$$ -2117620 -1876357 -913596 -69959 209127 405435 1128893 2008255 1912878 482407
36085D82407j565358k37276J034910R54106N2890m14694l39998m29125o27892
$$ 482407 -1082951 -1320227 -285317 668789 721679 306985 -33013 -462138 -1090030
36076a090030k56620M91318N81520j89188p72833m24117L64931Q03233P23628
$$ -1090030 -1346650 -855332 -273812 -463000 -1235833 -1659950 -1295019 -491786 231842
36067B31842K64917m22104q23034l79483M58226M95637m14294q91475j4305J208475
$$ 231842 496759 74655 -748379 -1127862 -669636 -173999 -588293 -1479768 -1494073 -285598
36057b85598J255993J99412o38115n90268j65078O9585J29722J62501J32922P9534
$$ -285598 970395 1169807 531692 -58576 -223654 -154069 -24347 138154 271076 350610
36047C50610J51307K92120K52711m8453m35654p06708p46594n12275j04085K41332
$$ 350610 501917 794037 1046748 998295 562641 -144067 -890661 -1402936 -1507021 -1265689
36037a265689L64581K82340M1552l05886n53630m55825n8718L49621O23326P79935
$$ -1265689 -901108 -618768 -577216 -883102 -1436732 -1892557 -1951275 -1601654 -978328 -198393
36027a98393P05271K78759k27009l56301q8904K18782M29373N89597M42946k46134
$$ -198393 506878 785637 558628 202327 113423 332205 761578 1351175 1794121 1547987
36017A547987r37517p98464j1456L81132Q8960p1100K71376L55000k69395p90572
$$ 1547987 610470 -187994 -199450 181682 270642 199542 470918 825918 556523 -234049
36007b34049m55450J74399K11610j76599l41237l31059m90691n54913j65066L00229
$$ -234049 -689499 -515100 -303490 -480089 -821326 -1152385 -1643076 -2197989 -2363055 -2062826
35997b062826L82219M07879P04975O68242k01178j002678n96842M41309N84681
$$ -2062826 -1680607 -1272728 -567753 100489 -100689 -1103367 -1700209 -1258900 -674219
35988f74219k14799n09441K39545R04581O40289N5167j01362q1366k74566l23983
$$ -674219 -889018 -1398459 -1158914 -254333 385956 441123 339761 258395 -16171 -340154
35978c40154J05357N28934L69359j51582m52152l68313k4474M84531Q43456N58074
$$ -340154 -234797 294137 663496 511914 59762 -308551 -333025 151506 994962 1553036
35968A553036k86805q69865o70273j28166J03169l2496l07588o51358q11482k94723
$$ 1553036 1266231 396366 -273907 -402073 -298904 -331400 -638988 -1290346 -2101828 -2396551
35958b396551P55295J303440P53824q8581j88919J70926k198o91361r00705k82228
$$ -2396551 -1641256 -337816 416008 327427 138508 309434 307236 -384125 -1284830 -1567058
35948a567058M01423N76775N82311P48662O90916J01263m58790k92113L15320
$$ -1567058 -1165635 -588860 -6549 742113 1433029 1534292 1075502 783389 1098709
35939A098709M41146j68837p94312p43285j05866N93586R85930Q85098K04360
$$ 1098709 1539855 1371018 576706 -166579 -272445 321141 1307071 2192169 2396529
35930B396529p60276j288249r59801k50680R2992J37474N62754J341551J441679
$$ 2396529 1636253 348004 -611797 -862477 -769485 -632011 -69257 1272294 2713973
35921B713973K99652j089547j300429l11586N95918N89441O6722l35954n97233
$$ 2713973 3013625 1924078 623649 312063 907981 1497422 1564144 1228190 630957
35912F30957q29969p28633r5467N56728N48438n1715n59092n62950k37987J19232
$$ 630957 -199012 -927645 -1023112 -466384 82054 30339 -528753 -1091703 -1329690 -1210458
35902a210458M17946O37696P21850O63954M87178J70338k07292l63824j46378
$$ -1210458 -792512 -154816 567034 1230988 1718166 1888504 1681212 1317388 1171010
35893A171010J20333m1564o01171j007954q66841l21347K45573N51521M38528
$$ 1171010 1291343 1249779 648608 -359346 -1226187 -1547534 -1301961 -750440 -311912
35884c11912k4638l75458j59728L37150L02417l72385p05531j3748R21812R18204
$$ -311912 -336550 -712008 -871736 -534586 -232169 -604554 -1310085 -1323833 -402021 516183
35874E16183J85078k6804N81512R44618M07898l17162m80119m19496n95370n44734
$$ 516183 701261 674457 1255969 2200587 2608485 2291323 1811204 1391708 796338 251604
35864B51604J61174P64321L41562o20023r19717m49535j8133J96305N56742O70107
$$ 251604 412778 1177099 1518661 898638 -21079 -470614 -488747 -292442 264300 934407
35854I34407j06096r54858l29006J340174J710331R783j576335j145028K05080
$$ 934407 828311 -126547 -455553 884621 2594952 2604735 1028400 -116628 88452
35845H8452M75816p2683J09030R26486R48360L4058n47961m17258m45472q01163
$$ 88452 564268 491585 600615 1527101 2475461 2509519 1961558 1544300 1098828 297665
35835B97665o10012J59967L61527k74548n15288K20099P51908J77223m85417P580
$$ 297665 -312347 -152380 209147 -65401 -580689 -360590 391318 568541 83124 90704
35825I0704R50110P40117n76695j360103p61169K99728O66543L53692M1905k5869
$$ 90704 1040814 1780931 1204236 -155867 -917036 -617308 49235 402927 444832 418963
35815D18963r1938k47994k97920j71633p5616j28126j20636J17891L00418K5805
$$ 418963 327025 79031 -218889 -390522 -466138 -594264 -714900 -597009 -296591 -270786
35805b70786m85923n29816M3577N13328L78814J35342L48134N45745n1912j060544
$$ -270786 -756709 -1286525 -1242948 -729620 -350806 -215464 132670 678415 626503 -434041
35795d34041j247506k79024Q19106J061187N11679k35114p40832o83636M3778
$$ -434041 -1681547 -1960571 -1141465 -80278 431401 196287 -544545 -1228181 -1184403
35786a184403Q82386R55560J83858n63025o64214m35399l52853k85318R2559O51655
$$ -1184403 -302017 653543 837401 274376 -389838 -825237 -1178090 -1463408 -1370849 -719194
35776g19194R61596P45499K3456q03588j023047l31184N37295N79085j04448m97967
$$ -719194 242402 987901 1011357 207769 -815278 -1146462 -609167 -30082 -134530 -632497
35766f32497k03107K02038L96133P36271J148480Q34555l19656j156896q31616
$$ -632497 -835604 -633566 -237433 498838 1647318 2481873 2162217 1005321 173705
35757A73705m0771J28694k62690m72803l36493j69331k3049J27156J0690l37477
$$ 173705 132934 261628 -1062 -473865 -810358 -979689 -1002738 -875582 -864892 -1202369
35747a202369j99432P46145J525171J010239m24453j320379r60527M3065P80103
$$ -1202369 -1401801 -655656 869515 1879754 1455301 134922 -825605 -782540 -2437
35738b437Q85606M71958j01292l90626k30437J24588L93407M98966L06750k91828
$$ -2437 883169 1355127 1253835 863209 632772 757360 1150767 1649733 1956483 1664655
35728A664655q56874o99212L1084M08883J96771J93436O72975P35062n2164o86391
$$ 1664655 807781 108569 139653 548536 745307 938743 1611718 2346780 2294616 1608225
35718A608225m25505j32542o47414j099175m46354M29883P0788r76970r95191
$$ 1608225 1182720 1050178 402764 -696411 -1142765 -712882 -642094 -1619064 -2614255
35709b614255M6650O22312L52765L55382Q61944P15152l56526j017467n35857
$$ -2614255 -2567605 -1945293 -1592528 -1237146 -375202 339950 -16576 -1034043 -1569900
35700a569900R2432m876k29835J28092O31579O90034N63579N27324J93469n09760
$$ -1569900 -1477468 -1482344 -1712179 -1584087 -952508 -262474 301105 828429 1021898 512138
35690E12138p83118k06375M68953N39747L47994L20148J06136m66011o60148o1894
$$ 512138 -270980 -477355 -8402 531345 879339 1199487 1305623 839612 179464 117570
35680A17570M34483l4456q16409p60403l2949K88418m1687k68413N1385N85034
$$ 117570 552053 517597 -298812 -1059215 -1092164 -803746 -845433 -1113846 -1062461 -477427
35670d77427R33129R72893O03784j55329q84368j079623o56711J16941Q63556
$$ -477427 455702 1428595 2032379 1877050 992682 -86941 -743652 -626711 236845
35661B36845J085271M85721m26167p27907l65841k13533n27817m60522L01126
$$ 236845 1322116 1807837 1381670 653763 287922 74389 -453428 -913950 -612824
35652f12824O84999J0194o14455j9473R32585O41738n57978q76177Q2402Q09702
$$ -612824 72175 82369 -532086 -551559 381026 1022764 464786 -411391 -328989 480713
35642D80713L44315m77904o23202k39859J26409M58969P58677O22121N568m12238
$$ 480713 825028 347124 -276078 -515937 -389528 69441 828118 1450239 1455807 1043569
35632A043569k55409j09604n31397j050569q56077j1668O90886Q11449O03833
$$ 1043569 788160 678556 147159 -903410 -1759487 -1771155 -1080269 -268820 335013
35623C35013M19044K65142K133l03430l43280Q0589O47038O58053j67199j208574
$$ 335013 754057 1019199 1021332 717902 374622 455211 1102249 1760302 1593103 384529
35613C84529j578528j085387k21972N57422J043496R92706L41024l44758l22732
$$ 384529 -1193999 -2279386 -2501358 -1943936 -900440 92266 433290 88532 -234200
35604b34200L31237P84977N72831O6068k29363k17820m75K21499l584q56730j521248
$$ -234200 97037 882014 1454845 1520913 1291550 1073730 1073255 1294754 1291170 434440 -1086808
35593a086808r19969O10884J444316Q77676Q5949J68553M35059k13176j169687
$$ -1086808 -2006777 -1395893 48423 926099 1012048 1180601 1615660 1402484 232797
35584B32797r58076L03277R71321M29434q3040L45007P91573J13609j074608j274694
$$ 232797 -725279 -422002 549319 978753 895713 1240720 2032293 2145902 1071294 -203400
35574b03400l21669N38618N39653J51375r2353l47123o61996m75064L88899R90380
$$ -203400 -525069 13549 553202 704577 612224 265101 -396895 -871959 -483060 507320
35564E07320M49250o31960r12344k46044K13423j10747l95743Q4155O92347M87951
$$ 507320 956570 324610 -587734 -833778 -620355 -731102 -1126845 -1042690 -350343 137608
35554A37608k09857l60303J13488L05285q9663k90107K00093O92675L42825n64895
$$ 137608 -72249 -432552 -319064 -13779 -103442 -393549 -193456 499219 842044 277149
35544B77149r99560n26730K78797O27612L17063k26972m50591j96646K00045L79046
$$ 277149 -722411 -1249141 -970344 -342732 -25669 -252641 -703232 -899878 -699833 -320787
35534c20787M08313N37200O36438L41917k51985n92428m81954l17283l17357j61475
$$ -320787 87526 624726 1261164 1603081 1351096 758668 276714 -40569 -357926 -519401
35524e19401K63807M49168J19467j58056Q2501K83875j97101p57945l40023P08756
$$ -519401 -255594 193574 313041 154985 237486 521361 324260 -433685 -773708 -64952
35514f4952R15778o4598q51357m44422L59853M47521J48887L97026R31632O88809
$$ -64952 850826 786228 -65129 -509551 -149698 297823 446710 843736 1775368 2464177
35504B464177l60557j060808p74896j40953O1296j21688k63862k11865J6268L60272
$$ 2464177 2103620 1042812 267916 126963 188259 66571 -197291 -409156 -392888 -32616
35494c2616M98917Q9846n78646p90946m20805n0696P4815L37763P04228M45837
$$ -32616 466301 556147 -22499 -813445 -1234250 -1284946 -1210131 -872368 -168140 277697
35484B77697n02240r57652j71259Q32663P42702R962p31O18032M71038o82337
$$ 277697 -224543 -1182195 -1353454 -520791 221911 231873 231142 849174 1320212 637875
35474F37875j344503n83822N65188P45781J34809k41519j43681r4792l02072m88861
$$ 637875 -706628 -1290450 -725262 20519 155328 -86191 -229872 -324664 -626736 -1115597
35464a115597m60153j79618L73763R05369Q17991P4019m70197k19484K15510p849
$$ -1115597 -1575750 -1755368 -1381605 -476236 341755 415774 -54423 -273907 -58397 -66246
35454f6246n66329n11081J39555M43448R5518j49916J87816N50448L44604p0985
$$ -66246 -632575 -1143656 -1004101 -560653 -465135 -615051 -427235 123213 467817 396832
35444C96832l053M65173O20028J79227l46287m11842j80057k35294o58264p59331
$$ 396832 393779 858952 1478980 1658207 1311920 900078 720021 484727 -173537 -932868
35434i32868j8240R64587J058712J89507m14613M4423O93023K45082j019088j563023
$$ -932868 -951108 13479 1072191 1261698 847085 891508 1584531 1829613 810525 -752498
35424g52498p46068L77243O16123J11577k06800O660K77654J67841j46696j89683
$$ -752498 -1498566 -1121323 -505200 -393623 -600423 -593763 -316109 -148268 -294964 -484647
35414d84647J43402L78129N4031n21063n03987K95240R68161P31265Q6738n51
$$ -484647 -341245 36884 90915 -430148 -934135 -638895 329266 1060531 1147269 1146718
35404A146718L14383M3674q73731j283171n62148M16995O09984K02705O746J45056
$$ 1146718 1461101 1504775 631044 -652127 -1214275 -797280 -187296 15409 22155 167211
35394A67211J38518j14159k10207O1178M53992O20713L94796j27978n61508n43418
$$ 167211 305729 191570 -18637 42541 496533 1117246 1512042 1384064 822556 279138
35384B79138k58130k56050n60922n20935J11224O09961L61112j03481M7326N31643
$$ 279138 21008 -235042 -795964 -1316899 -1205675 -595714 -234602 -338083 -290757 240886
35374B40886L68314n02654j049664o92935p1386O4725n8888K08101Q23568J103603
$$ 240886 609200 106546 -943118 -1636053 -1707439 -1642714 -1701602 -1493501 -669933 433670
35364D33670O99708L1499k75070q4311K00376J39402l04296q19386j114756j081598
$$ 433670 1133378 1164877 889807 805496 1005872 1145274 840978 21592 -1093164 -2174762
35354b174762o54874J63048J012381J252193O46512k25341n62216j92587M46241
$$ -2174762 -2829636 -2666588 -1654207 -402014 244498 19157 -543059 -735646 -289405
35345b89405R39619J091156O96450k91583j355487j713038j188929l95172Q6647
$$ -289405 650214 1741370 2437820 2146237 790750 -922288 -2111217 -2506389 -2419742
35336b419742L06239N58509P97753P42934L38926j61940m83901n54227n29944
$$ -2419742 -2113503 -1554994 -757241 -14307 324619 162679 -321222 -875449 -1405393
35327a405393o15710p13694l56354O76600J731315J781828P01128m79679q42031
$$ -1405393 -2021103 -2734797 -3091151 -2414551 -683236 1098592 1799720 1320041 478010
35318D78010n86898l75355k22490K45205P66805N88842l04885r08509m77178M80000
$$ 478010 -108888 -484243 -706733 -461528 305277 894119 589234 -319275 -796453 -316453
35308c16453R13924N40012l0115k05614L043K24438J56032k37620o75497p42068
$$ -316453 597471 1137483 1107368 901754 904797 1129235 1285267 1047647 372150 -369918
35298c69918l68616m8297k54167p16374p11189j20892K98633j4615n25366k66790
$$ -369918 -738534 -786831 -1040998 -1757372 -2468561 -2589453 -2290820 -2305435 -2830801 -3097591
35288c097591P79911J548972J231451K71730k83884j25880Q2062k42942p74397
$$ -3097591 -2317680 -768708 462743 734473 450589 324709 406771 163829 -610568
35279f10568p48651q235P89994R86068O14658J74801m1282j44499k78004l28256
$$ -610568 -1359219 -1367454 -577460 408608 1023266 1198067 1156785 1012286 734282 406026
35269D06026j17063K16655J95980m67579j303417j320849j42667J279638J615092
$$ 406026 288963 505618 701598 234019 -1069398 -2390247 -2532914 -1253276 361816
35260C61816Q09564J15602K77955N38657J6740p72204p77474j84568k9487l30865
$$ 361816 1171380 1286982 1564937 2103594 2120334 1348130 570656 386088 356601 25736
35250B5736r9267O94131P50271l95428j318505p64772M49269P75378K18035o4162
$$ 25736 -73531 620600 1370871 975443 -343062 -1107834 -658565 116813 334848 270686
35240B70686K30007L69258Q2208j51856j97377l98602o10647k61010N06012Q20105
$$ 270686 500693 869951 952159 800303 602926 204324 -406323 -667333 -161321 658784
35230F58784M01832q4659j72849j38378k04759j55084L139r9736l71102j81961
$$ 658784 1060616 975957 803108 664730 459971 304887 308026 208290 -162812 -344773
35220c44773N44914J020740P27248P6526l81135n86825n12594J2550O32993N67846
$$ -344773 200141 1220881 1948129 2024655 1643520 1056695 544101 556651 1189644 1757490
35210A757490j52926n05500m2630L71871N2086l46948l5579N07378M12252p3066
$$ 1757490 1604564 1099064 1056434 1428305 1480391 1133443 1097864 1605242 2017494 1944428
35200A944428j18389K10023J84613k43237m65682l59906l72710n82348o01449
$$ 1944428 1826039 2036062 2220675 1977438 1511756 1151850 779140 196792 -404657
35191d04657l62941k08244k46465k98749l50584m40001l18044J55250N75659O00416
$$ -404657 -767598 -975842 -1222307 -1521056 -1871640 -2311641 -2629685 -2474435 -1898776 -1298360
35181a298360N86189Q84115R90217L36351n24376o36345k04884k00044o09105
$$ -1298360 -712171 171944 1162161 1498512 974136 337791 132907 -67137 -676242
35172f76242m78689K62144M82474k76802r48016n92366J90112L01424k04869l46932
$$ -676242 -1154931 -892787 -410313 -687115 -1635131 -2227497 -2037385 -1735961 -1940830 -2287762
35162b287762L68188J405771J847992J235082K1815o86211k50629O26584P01434
$$ -2287762 -1919574 -513803 1334189 2569271 2591086 1904875 1654246 2280830 2982264
35153B982264j56842q58958p22129k99796k87369m99312m56091k50284k15400
$$ 2982264 2825422 1966464 1244335 944539 657170 157858 -298233 -548517 -763917
35144g63917k66135j24321J88556M82918O41356M86649p3357n62690k75499O08123
$$ -763917 -1030052 -1154373 -965817 -482899 158457 645106 571749 9059 -266440 341683
35134C41683J004387M24629l22058m43989l00079m77909n97067n4370O77496O75506
$$ 341683 1346070 1770699 1448641 1004652 704573 226664 -370403 -424773 252723 928229
35124I28229J22937K4154M78483M61245m70973j341143j099321k3159Q04854Q97551
$$ 928229 1051166 1075320 1553803 2015048 1544075 202932 -896389 -919548 -114694 782857
35114G82857O40012M46103K45815j28881m60728l49942J62860M73082J23918n25176
$$ 782857 1422869 1868972 2114787 1985906 1525178 1175236 1338096 1811178 1935096 1409920
35104A409920p02165k58323J62274J02796q8728N2859K94128J14116l63925m75830
$$ 1409920 707755 449432 611706 714502 625774 678633 972761 1086877 722952 247122
35094B47122j0962M32125K34083m27240p53738k46577O54379R65048L09786n00954
$$ 247122 236160 668285 902368 475128 -278610 -525187 129192 1094240 1404026 903072
35084I03072m37756L01622M71497m24357j287826r24414K49204Q10004K88825
$$ 903072 465316 766938 1238435 814078 -473748 -1398162 -1148958 -338954 -50129
35075e0129l81012l23353K23700N14799K93420j55437m92403n10083j23330M89909
$$ -50129 -431141 -754494 -530794 -15995 277425 121988 -370415 -880498 -1003828 -513919
35065e13919Q66171O26935j31028q98741j177254q31520j29356M89975O94930
$$ -513919 352252 979187 848159 -50582 -1227836 -2059356 -2188712 -1698737 -1003807
35056a003807L81839l23255j033673j193515n22481N61982J233834J077757M18855
$$ -1003807 -621968 -945223 -1978896 -3172411 -3694892 -3132910 -1899076 -821319 -402464
35047d02464j64870l29848L6495P95241J344002R72444j79977r69632n57615M34968
$$ -402464 -567334 -897182 -860687 -65446 1278556 2251000 2071023 1101391 543776 978744
35037I78744O29213l95899j580638j581216j90493J422018J766200N02545j065976
$$ 978744 1607957 1212058 -368580 -1949796 -2140289 -718271 1047929 1550474 484498
35028D84498j315444j97531P47318M86175j95219n8806P07249R67546M76498K8185
$$ 484498 -830946 -1028477 -281159 205016 9797 -49009 658240 1625786 2102284 2130469
35018B130469o6191l90905j112885j410108p41658J91211M34555J31500J51569
$$ 2130469 2064278 1673373 560488 -849620 -1591278 -1400067 -965512 -834012 -682443
35009f82443P04893J058749O31714j84907n39145k05750J50650j29893p90125
$$ -682443 22450 1081199 1712913 1528006 988861 783111 933761 803868 13743
35000A3743r78743m21713K40975M42236L98937M35898K51636m24402r62458n78305
$$ 13743 -965000 -1386713 -1145738 -703502 -304565 131333 382969 -41433 -1003891 -1582196
34990a582196L27997O13406Q4248l23892j20080J26229J7477K7865M50541P00131
$$ -1582196 -1254199 -640793 -556545 -880437 -1000517 -874288 -856811 -828946 -378405 321726
34980C21726L77435R6830L84654N66900j80862j259817j316257k16071P97764
$$ 321726 699161 795991 1180645 1747545 1566683 306866 -1009391 -1225462 -427698
34971d27698Q86009M77896K05039j4793m19567p25601n68550j32350J48106J69924
$$ -427698 458311 936207 1141246 1126453 706886 -18715 -587265 -719615 -571509 -401585
34961d01585N7435j90063n20434n75866j12377M65154M86479o1199m53227j93793
$$ -401585 -344150 -534213 -1054647 -1630513 -1742890 -1277736 -791257 -852456 -1305683 -1499476
34951a499476L46573N06904K23581k8509k082O4015k5785m9126K78803Q28815
$$ -1499476 -1152903 -645999 -422418 -450927 -453009 -388994 -414779 -463905 -185102 643713
34941F43713J158297R64083L22360l59888n64542j10159M77000L77234m89794
$$ 643713 1802010 2766093 3088453 2728565 2164023 2053864 2530864 2908098 2418304
34932B418304j208786j007637k74793Q9411J83J17641N88970P45444K33000l50806
$$ 2418304 1209518 201881 -72912 16499 16682 134323 723293 1468737 1701737 1350931
34922A350931l36071J17873M28780L83325P6459m55398j010777j040895l02596
$$ 1350931 1014860 1132733 1561513 1944838 2021297 1565899 555122 -485773 -788369
34913g88369N74840P79760L88805J41931K75145K49730l02382r74857j129919
$$ -788369 -213529 566231 955036 1096967 1372112 1621842 1319460 344603 -785316
34904g85316o15408K23700Q84158R44695L64474l15046m43536o3749J79487M9648
$$ -785316 -1400724 -1177024 -292866 651829 1016303 701257 257721 193972 373459 423107
34894D23107N4915M68806O69081P5122p56039q11123j48702J87325k20322o06679
$$ 423107 478022 946828 1615909 1691031 934992 123869 -24833 162492 -57830 -664509
34884f64509l40962J29990J67547l1891Q488J19478n9790k20589P2645L53329
$$ -664509 -1005471 -875481 -707934 -739825 -731337 -611859 -671649 -892238 -819593 -466264
34874d66264j47794j037133j062780R404R54051Q34678J58370j61650l9812J40340
$$ -466264 -614058 -1651191 -2713971 -2704567 -1750516 -915838 -757468 -919118 -958930 -818590
34864h18590K54467J95972k96298r39883q43993J63284R66429P09377O2928K0562
$$ -818590 -564123 -368151 -664449 -1604332 -2448325 -2285041 -1318612 -609235 -546307 -525745
34854e25745K99747R9164l33377k58565L3700k45086p51704m80826L85627P09127
$$ -525745 -225998 -126834 -460211 -718776 -685076 -930162 -1681866 -2162692 -1777065 -1067938
34844a067938L57807K79637O23513N54390Q5824J89455P04442J92843j383942
$$ -1067938 -710131 -430494 193019 747409 833233 1022688 1727130 1919973 536031
34835E36031j951829m91980J030051N42187r62495j106817K17175J052018N65577
$$ 536031 -1415798 -1907778 -877727 -335540 -1298035 -2404852 -2187677 -1135659 -570082
34826e70082j23065j54518k5257k29860l69435n6074M11202O40052N97270L08777
$$ -570082 -693147 -847665 -872922 -1102782 -1472217 -1528291 -1117089 -477037 120233 429010
34816D29010j73504m95831l73448j16377j22189j46833J43128L26094o8037m36019
$$ 429010 255506 -240325 -613773 -730150 -852339 -999172 -856044 -529950 -597987 -1034006
34806a034006Q6130R86989R53032j3505n28562j3641N40503L61576J95M1334L1048
$$ -1034006 -947876 39113 992145 978640 450078 436437 976940 1338516 1338711 1380045 1411093
34795A411093m75631q65605m17643M54581P91295L86535k19730n93897o40278
$$ 1411093 935462 69857 -347786 106795 898090 1284625 1064895 470998 -169280
34786a69280l79229l984J81825K08531L89931O26910M07800k15186m31936P9501
$$ -169280 -548509 -552493 -370668 -162137 227794 854704 1262504 1047318 615382 694883
34776F94883M87531K5054p81550q42654j2724Q26104Q90557J64113p88385j252546
$$ 694883 1182414 1207468 425918 -416736 -429460 396644 1287201 1451314 662929 -589617
34766e89617q97708j72323J83261J40396K95140O65554N10516k64127n80072K06858
$$ -589617 -1487325 -1659648 -1476387 -1335991 -1040851 -375297 135219 -128908 -708980 -502122
34756e02122J134491J002381J05130m30686l39251j28493R0847M68528N72453
$$ -502122 632369 1634750 1739880 1309194 969943 841450 932297 1400825 1973278
34747A973278m5883p68685o62133m9265j0965n06519m51521L15897O75516J24514
$$ 1973278 1927395 1158710 496577 447312 436347 -70172 -521693 -205796 469720 594234
34737E94234m07288j54257L52736L77758Q0338j42226l94269o77795n11976J23930
$$ 594234 186946 32689 385425 763183 843521 701295 307026 -370769 -882745 -758815
34727g58815M01773k4693k40250M61386J219533Q42693k97908q49706m83091m6916
$$ -758815 -357042 -381735 -621985 -160599 1058934 1901627 1603719 754013 270922 224006
34717B24006R887Q1185K87513J52292l54952m92446J14971P93447P35093M8208
$$ 224006 233893 315078 602591 754883 399931 -92515 22456 815903 1550996 1599204
34707A599204n02342m25176J08302N22104L36524l37720p97742n30920J10826
$$ 1599204 1096862 671686 779988 1302092 1638616 1300896 503154 -27766 83060
34698H3060M14914L03937K55127L61515K11041k59401n43583l69892l4759K40653
$$ 83060 497974 801911 1057038 1418553 1629594 1370193 826610 456718 421959 662612
34688F62612N46206O64615R4224q93839j125444j26526R29221P36540l10134q15656
$$ 662612 1208818 1873433 1967657 1073818 -51626 -178152 751069 1487609 1177475 361819
34678C61819m61345j97829n00000o75187j89114L81384K98076j78922k68350J32718
$$ 361819 -99526 -297355 -797355 -1472542 -1661656 -1280272 -982196 -1161118 -1429468 -1296750
34668a296750M21436L07636K29956O03002J053882P84068l21279j292262j118824
$$ -1296750 -875314 -567678 -337722 265280 1319162 2103230 1781951 489689 -629135
34659f29135p0383N62697J81235l27351J0995P04140N41530m57252r91334m47426
$$ -629135 -699518 -136821 44414 -282937 -271942 432198 973728 516476 -474858 -922284
34649i22284K36472J25884l10272j24939N16238O26689o1455p42683o68919M9395
$$ -922284 -685812 -559928 -870200 -995139 -478901 147788 86333 -656350 -1325269 -1275874
34639a275874Q09476J153211R65397M30731j19767n13569q08049r37235o30294
$$ -1275874 -466398 686813 1652210 2082941 1963174 1449605 641556 -295679 -925973
34630i25973K2768L70998Q7508j68389L06195R95119P94000k08887o74354L8787
$$ -925973 -903205 -532207 -444699 -613088 -306893 688226 1482226 1273339 598985 637772
34620F37772R11676P68148j44886p88120q36551o88710m44612J40315Q21456R07348
$$ 637772 1549448 2317596 2172710 1384590 548039 -140671 -585283 -444968 376488 1283836
34610A283836K83055l03954k21432K90516N67699L13764k77142q28033r64262
$$ 1283836 1566891 1262937 1041505 1332021 1899720 2213484 1936342 1108309 144047
34601A44047m85952L70303J012847J033331N40532j07518o50684q96999o92793
$$ 144047 -341905 28398 1041245 2074576 2615108 2507590 1856906 959907 267114
34592B67114j94471J08863q530j12235K68312P79745N78796m15319j197418r33841
$$ 267114 72643 181506 172976 60741 329053 1108798 1687594 1272275 74857 -858984
34582h58984r2095K00705l03947o99032k46536N96577Q35636K75973k98900k30413
$$ -858984 -951079 -750374 -1054321 -1753353 -1999889 -1403312 -567676 -291703 -590603 -821016
34572h21016K13579L35044k4794l49528j67439M13533R07226R29545M31239k86935
$$ -821016 -607437 -272393 -297187 -646715 -814154 -400621 506605 1436150 1867389 1580454
34562A580454o90084m14464K56684N68875J84176l58752l90705n3688j4282m04097
$$ 1580454 890370 475906 732590 1301465 1485641 1126889 736184 682496 668214 264117
34552B64117o67359m85123k00355j33943j02871N7473P3946k15303l95354q5782
$$ 264117 -403242 -888365 -1088720 -1222663 -1325534 -1268061 -1194115 -1409418 -1804772 -1890554
34542a890554L93683N21394L67923L08830L05523J30172k4428J06308K11082n9777
$$ -1890554 -1496871 -975477 -607554 -298724 6799 136971 112543 218851 429933 370156
34532C70156k06098M35873J279176R99704l92568j280286o99388L13360L52200
$$ 370156 164058 599931 1879107 2878811 2486243 1205957 506569 819929 1172129
34523A172129l93232p25009k34066M76588Q71193Q63415M59222j48965l84619
$$ 1172129 778897 53888 -180178 296410 1167603 2031018 2490240 2341275 1956656
34514A956656N9335N81184L91031l19443o24582j53720N23955P38832L71809k88859
$$ 1956656 2015991 2597175 2988206 2668763 2044181 1890461 2414416 3153248 3525057 3236198
34504C236198q46145r76575o79853k74316M3451L32414M50385O9300n21444m24794
$$ 3236198 2390053 1413478 733625 459309 502760 835174 1285559 1354859 833415 408621
34494D08621M47681Q43679l3280j041525o72092N51220P80784l54490j302230
$$ 408621 856302 1699981 1666701 625176 -46916 504304 1285088 930598 -371632
34485c71632j002417j73534J72053R1655N2619R7277K40871O70422J025587N08126
$$ -371632 -1374049 -1547583 -1375530 -1283875 -1231256 -1133979 -893108 -222686 802901 1311027
34475A311027p37579j384672p10787L52786O66222M17095L81656N37002M01181
$$ 1311027 573448 -811224 -1522011 -1169225 -503003 -85908 295748 832750 1233931
34466A233931Q9161K3437O1909j76283n03442n09435l39394l21088j92735M29718
$$ 1233931 1323092 1346529 1408438 1232155 728713 219278 -120116 -441204 -633939 -204221
34456b04221J104238R95573J39362n63191o07804m01110m36553o09033n54758
$$ -204221 900017 1895590 2034952 1471761 863957 462847 26294 -582739 -1137497
34447a137497k37759K8035j9293k30552j15206N14373J020859N81857n41250j085319
$$ -1137497 -1375256 -1347221 -1366514 -1597066 -1712272 -1197899 -177040 404817 -136433 -1221752
34437a221752m88524K68338J41074m12382k66708N23397Q56837L77465k5851L08654
$$ -1221752 -1710276 -1441938 -1300864 -1713246 -1979954 -1456557 -599720 -222255 -248106 60548
34427F0548Q08419N81187k78031q07135l72677N83819R91348K98520q43885j235837
$$ 60548 868967 1450154 1172123 364988 -7689 576130 1567478 1865998 1022113 -213724
34417b13724n16030M41844O77395K33307k18657l46920k52228M24L30274L90151
$$ -213724 -729754 -287910 389485 622792 404135 57215 -195013 -194589 135685 525836
34407E25836k8344n16588n17155r8830K47558L82669N24068O38771M28072j12959
$$ 525836 497492 -19096 -536251 -635081 -387523 -4854 519214 1157985 1586057 1473098
34397A473098n94551o69373k61562M49175R59749P09179j55426o81410l19862
$$ 1473098 878547 209174 -52388 396787 1356536 2065715 1910289 1228879 909017
34388I09017K11734l1048p48296q56910j51745M89077M96894K28620Q1795q0497
$$ 909017 1120751 1089703 341407 -515503 -667248 -178171 318723 547343 629138 548641
34378E48641l39963l42539R3361N41447N09356N9055l39791l08231J45364N52693
$$ 548641 208678 -133861 -40500 500947 1010303 1069358 729567 421336 566700 1119393
34368A119393L15667n15788j006231m26188O16443Q58726J14691n14964k79577
$$ 1119393 1435060 919272 -86959 -513147 103296 962022 1076713 561749 282172
34359B82172K46742K07651k52030l58013M9766L05418p5113o44044n45832L15679
$$ 282172 528914 736565 484535 126522 176288 481706 406593 -237451 -783283 -467604
34349d67604R90646O52285k07300l77313L08176O93395J06094n57585k87404M03490
$$ -467604 523042 1175327 968027 590714 898890 1592285 1698379 1140794 853390 1256880
34339A256880L78139k40242l70772J84371N38161K92233L7595J32617J29998k69685
$$ 1256880 1635019 1394777 1024005 1208376 1746537 2038770 2076365 2208982 2338980 2069295
34329B069295o47053n90429k38734J37925M16023L57281k09803q48657q68350
$$ 2069295 1422242 831813 593079 731004 1147027 1504308 1294505 445848 -422502
34320d22502k80402K85785N61238P35241O87717R5755o80368q12745k20806L33342
$$ -422502 -702904 -417119 144119 879360 1567077 1662832 982464 169719 -51087 282255
34310B82255M14266K64796K5339l75708n92832k32237K08457k1935m65811p2172
$$ 282255 696521 961317 986656 610948 18116 -214121 -5664 -27599 -493410 -565582
34300e65582P93544O92471l71609p33004J33250O38615j85463r84576m18600N95129
$$ -565582 227962 920433 548824 -184180 -50930 587685 402222 -582354 -1000954 -405825
34290d05825N96942M7216K42756R07078P86815q3209n55040l79753l73990p95690
$$ -405825 191117 238333 481089 1388167 2174982 2091773 1536733 1156980 782990 -12700
34280a2700j021249p53578l26979Q6303N08767N90677M6420n41132l52524M08987
$$ -12700 -1033949 -1787527 -2114506 -2028203 -1519436 -928759 -882339 -1423471 -1775995 -1367008
34270a367008Q11866N44342R4050j72799k44852l5377M35309O91427M26949J33417
$$ -1367008 -555142 -10800 83250 -89549 -334401 -369778 65531 756958 1183907 1317324
34260A317324K99616M35463j57197j054864j219767n64028M7267J79737K00994
$$ 1317324 1616940 2052403 1895206 840342 -379425 -943453 -896186 -716449 -515455
34251e15455L62326M59324M04899L45642K31603p1004l62186l93339l32312l82959
$$ -515455 -153129 306195 711094 1056736 1288339 1217335 855149 461810 129498 -253461
34241b53461l10148N5374L02673R5507j68703m1686K19165K84540M17860O89566
$$ -253461 -563609 -508235 -205562 -110055 -278758 -320444 -101279 183261 601121 1290687
34231A290687L84989p67253j637186j183106r1409L89328L99055P17230R13281
$$ 1290687 1675676 908423 -728763 -1911869 -2003278 -1613950 -1214895 -497665 415616
34222D15616J22755r27394p44627L53674N95663l40419q92771l10061L13539J94376
$$ 415616 538371 -389023 -1133650 -779976 -184313 -524732 -1417503 -1727564 -1414025 -1219649
34212a219649O5658M78948O94664K08905j62772K29605O06791P9108q00511q77121
$$ -1219649 -1153991 -675043 19621 228526 65754 295359 902150 981258 180747 -696374
34202f96374o0636P47266Q63108K98498n03237r32561o48709m0593J61841j97249
$$ -696374 -757010 -9744 853364 1151862 648625 -283936 -932645 -973238 -811397 -1008646
34192a008646o56257q63071p14941p3838Q29124J089646K56319o60351m94501
$$ -1008646 -1664903 -2527974 -3242915 -3316753 -2487629 -1397983 -1141664 -1802015 -2296516
34183b296516K60441L74547N0178L46989Q84896L37268q86994q89697N01506J247600
$$ -2296516 -2036075 -1661528 -1611350 -1264361 -379465 -42197 -929191 -1818888 -1317382 -69782
34173f9782M36645l88098j52064R83q12408j338292m48086P37823P78041K35701
$$ -69782 366863 -21235 -173299 -172316 -984724 -2323016 -2771102 -2033279 -1255238 -1019537
34163a019537L03764O82504N96647M35443N98707K03823j157493j855424n46859
$$ -1019537 -715773 -33269 563378 998821 1597528 1801351 643858 -1211566 -1758425
34154a758425J246715J188695l21358j038727m45998P5318N7926L40876Q35974
$$ -1758425 -511710 676985 355627 -683100 -1129098 -1053780 -995854 -654978 180996
34145A80996L96387q82451j410375n17918P11333J306086J385367J052740P8105
$$ 180996 577383 -305068 -1715443 -2233361 -1522028 -215942 1169425 2222165 2300270
34136B300270r54889q67672K37432P99777J7007j087697j293770o41487J84754
$$ 2300270 1345381 477709 715141 1514918 1531925 444228 -849542 -1491029 -1306275
34127a306275P55056P49920M2180o78530m55333M18502N89992k73056q69262l13898
$$ -1306275 -551219 198701 240881 -437649 -892982 -474480 115512 -157544 -1026806 -1340704
34117a340704M71380L04168l85626l64388L89802O97045K7643p06768m78141M20342
$$ -1340704 -869324 -565156 -950782 -1315170 -925368 -228323 -200680 -907448 -1385589 -965247
34107i65247P98044K26652l47223L8280Q91754R34847M7130n36260j90272J51743
$$ -965247 -167203 59449 -287774 -249494 642260 1577107 1624237 1087977 897705 1049448
34097A049448l26785q67878m17314N52662P71293J12807m62586m99625l60095
$$ 1049448 722663 -145215 -562529 -9867 761426 874233 411647 -87978 -448073
34088d48073k31311L4077K76577K10106K2109j7326j11009l07954m1053P26362
$$ -448073 -679384 -645307 -368730 -158624 -136515 -153841 -264850 -572804 -613857 112505
34078A12505Q12018m11642j502115q62251O65933J061704L02499N6422O05019
$$ 112505 924523 512881 -989234 -1851485 -1185552 -123848 178651 235073 840092
34069H40092N43267m10418p93920m4517N44808J95825j67194P5717Q4662n80143
$$ 840092 1383359 972941 179021 134504 679312 875137 707943 783660 868322 288179
34059B88179q24093P7968J065396R71534K07527l26780o43106q93355n60230M09684
$$ 288179 -535914 -457946 607450 1578984 1786511 1459731 816625 -76730 -636960 -227276
$$ [...]
##END NTUPLES=NMR SPECTRUM
##END=
