##TITLE=31Pdec_SA_PPh3vCl(extra-pure)
 CDCl3, 8 sc
 24.9.2019
##JCAMPDX= 6.0         $$ Bruker NMR JCAMP-DX V2.0
##DATA TYPE= NMR SPECTRUM
##DATA CLASS= NTUPLES
##ORIGIN= UXNMR, Bruker Analytische Messtechnik GmbH
##OWNER= root
$$ XWIN-NMR		Version 3.5
$$ Tue Sep 24 15:36:39 2019 Russian Standard Time (UT+4h)  she@DPX200
##.OBSERVE FREQUENCY= 81.013821
##.OBSERVE NUCLEUS= ^31P
##.ACQUISITION MODE= SIMULTANEOUS
##.ACQUISITION SCHEME= undefined
##.AVERAGES= 24
##.DIGITISER RES= 17
##SPECTROMETER/DATA SYSTEM= spect
##.PULSE SEQUENCE= zgpg30
##.SOLVENT NAME= CDCl3
##.SHIFT REFERENCE= (INTERNAL, CDCl3, 0, 182.463)
##AUDIT TRAIL= $$ (NUMBER, WHEN, WHO, WHERE, WHAT)
$$ ##TITLE= Audit trail, XWIN-NMR		Version 3.5
$$ ##JCAMPDX= 5.01
$$ ##ORIGIN= Bruker BioSpin GmbH
$$ ##OWNER= she
$$ F:/spectra/data/she/nmr/P31/1/pdata/1/auditp.txt
$$ ##AUDIT TRAIL=  $$ (NUMBER, WHEN, WHO, WHERE, WHAT)
(   1,<2019-09-24 15:35:09.17 +0400>,<she>,<DPX200>,
      <created by zg, POWCHK disabled, PULCHK disabled
       configuration hash MD5:
       00 E9 B6 7A A2 85 ED C7 34 08 36 98 17 FE 4E 26
       data hash MD5: 32K
       69 98 65 21 2A 03 03 9F C0 34 11 AA F0 A6 1A DB>)
(   2,<2019-09-24 15:35:25.34 +0400>,<she>,<DPX200>,
      <Start of raw data processing
       efp BC_mod = 2 LB = 1 FT_mod = 6 PKNL = 1 PHC0 = -290.8162 PHC1 = -159.5996 SI = 64K 
       data hash MD5: 64K
       4B 87 59 A6 D8 D8 79 9C 1B 79 84 70 C1 9F F7 59>)
(   3,<2019-09-24 15:35:39.46 +0400>,<she>,<DPX200>,
      <pk PHC0 = 12.47307 PHC1 = 0 
       data hash MD5: 64K
       24 F8 AA A0 07 C8 15 9B 5E E9 EE 15 B0 AC 94 22>)
(   4,<2019-09-24 15:35:43.87 +0400>,<she>,<DPX200>,
      <abs ABSG = 5 
       data hash MD5: 64K
       48 44 2F C8 35 62 88 2C A9 99 5D B8 F5 57 DF A9>)
$$ ##END=
$$ 
$$ hash MD5
$$ D8 7B 81 3B AF 0A 36 99 0F 85 3B D3 AA 13 50 9B
##$RELAX= 
##$RELAX= 
##$RELAX= 
##$RELAX= 
##$RELAX= 
##$RELAX= 
##$RELAX= 
##$RELAX= 
$$ Bruker specific parameters
$$ --------------------------
##$DU= <F:/spectra>
##$EXPNO= 1
##$NAME= <P31>
##$PROCNO= 1
##$TYPE= <nmr>
##$USER= <she>
##$AMP= (0..31)
100 100 100 100 100 100 100 100 100 100 100 100 100 100 100 100 100 100 
100 100 100 100 100 100 100 100 100 100 100 100 100 100 
##$AQSEQ= 0
##$AQ_mod= 1
##$AUNM= <au_zg>
##$AUTOPOS= <>
##$BF1= 81.014009
##$BF2= 200.13
##$BF3= 200.13
##$BF4= 200.13
##$BF5= 200.13
##$BF6= 200.13
##$BF7= 200.13
##$BF8= 200.13
##$BYTORDA= 1
##$CFDGTYP= 0
##$CFRGTYP= 5
##$CHEMSTR= <none>
##$CNST= (0..31)
1 1 145 1 1 1 1 1 1 1 1 1 1 1 1 1 1 1 1 1 1 1 1 1 1 1 1 1 1 1 1 1 
##$CPDPRG= <waltz16>
##$CPDPRG1= <>
##$CPDPRG2= <waltz16>
##$CPDPRG3= <>
##$CPDPRG4= <mlev>
##$CPDPRG5= <mlev>
##$CPDPRG6= <mlev>
##$CPDPRG7= <mlev>
##$CPDPRG8= <mlev>
##$CPDPRGB= <>
##$CPDPRGT= <>
##$D= (0..31)
0 1 0 0 0 0 0 0 0 0 0 0.03 2e-05 3e-06 0 0 0 0 0 0 0 0 0 0 0 0 0 0 0 0 
0 0 
##$DATE= 1569324908
##$DBL= (0..7)
120 120 120 11 120 120 24 19 
##$DBP= (0..7)
150 150 150 150 150 150 150 150 
##$DBP07= 0
##$DBPNAM0= <>
##$DBPNAM1= <>
$$ [...]
##$SUBNAM3= <"">
##$SUBNAM4= <"">
##$SUBNAM5= <"">
##$SUBNAM6= <"">
##$SUBNAM7= <"">
##$SUBNAM8= <"">
##$SUBNAM9= <"">
##$SW= 369.568048894756
##$SWIBOX= (0..15)
0 1 3 0 0 0 0 0 0 0 0 0 0 0 0 0 
##$SW_h= 29940.119760479
##$TD= 32768
##$TD0= 1
##$TE= 0
##$TE2= 300
##$TE3= 300
##$TEG= 300
##$TL= (0..7)
0 120 53 12 22 120 120 120 
##$TP= (0..7)
150 150 150 150 150 150 150 150 
##$TP07= 0
##$TPNAME0= <>
##$TPNAME1= <>
##$TPNAME2= <>
##$TPNAME3= <>
##$TPNAME4= <>
##$TPNAME5= <>
##$TPNAME6= <>
##$TPNAME7= <>
##$TPOAL= (0..7)
0.5 0.5 0.5 0.5 0.5 0.5 0.5 0.5 
##$TPOFFS= (0..7)
0 0 0 0 0 0 0 0 
##$TUNHIN= 0
##$TUNHOUT= 0
##$TUNXOUT= 0
##$USERA1= <user>
##$USERA2= <user>
##$USERA3= <user>
##$USERA4= <user>
##$USERA5= <user>
##$V9= 5
##$VALIST= <valist>
##$VCLIST= <CCCCCCCCCCCCCCC>
##$VD= 0
##$VDLIST= <DDDDDDDDDDDDDDD>
##$VPLIST= <PPPPPPPPPPPPPPP>
##$VTLIST= <TTTTTTTTTTTTTTT>
##$WBST= 1024
##$WBSW= 4
##$XGAIN= (0..3)
0 0 0 0 
##$XL= 0
##$YL= 0
##$YMAX_a= 9667
##$YMIN_a= -13621
##$ZGOPTNS= <>
##$ZL1= 120
##$ZL2= 120
##$ZL3= 120
##$ZL4= 120
##$ABSF1= 182.463
##$ABSF2= -187.1042
##$ABSG= 5
##$ABSL= 3
##$ALPHA= 0
##$AQORDER= 0
##$ASSFAC= 0
##$ASSFACI= 0
##$ASSFACX= 0
##$ASSWID= 0
##$AUNMP= <proc_1d>
##$AZFE= 0.1
##$AZFW= 0.5
##$BCFW= 0
##$BC_mod= 2
##$BYTORDP= 0
##$COROFFS= 0
##$CY= -3
##$DATMOD= 1
##$DC= 0
##$DFILT= <>
##$DTYPP= 0
##$F1P= 0
##$F2P= 0
##$FCOR= 1
##$FTSIZE= 65536
##$FT_mod= 6
##$GAMMA= 0
##$GB= 0
##$INTBC= 1
##$INTSCL= 5.30512e-09
##$ISEN= 30
##$LB= 1
##$LEV0= 0
##$LPBIN= 0
##$MAXI= 10000
##$MC2= 0
##$MEAN= 0
##$ME_mod= 0
##$MI= 50
##$NCOEF= 0
##$NC_proc= -4
##$NLEV= 6
##$NOISF1= 182.463
##$NOISF2= 159.3651
##$NSP= 0
##$NTH_PI= 0
##$NZP= 0
##$OFFSET= 182.463
##$PC= 4
##$PHC0= -278.3431
##$PHC1= -159.5996
##$PH_mod= 1
##$PKNL= yes
##$PPARMOD= 0
##$PSCAL= 0
##$PSIGN= 0
##$REVERSE= no
##$SF= 81.0140089999434
##$SI= 65536
##$SIGF1= 159.3651
##$SIGF2= -187.1042
##$SINO= 113.3802
##$SIOLD= 16384
##$SREGLST= <1H.CDCl3>
##$SSB= 0
##$STSI= 65536
##$STSR= 0
##$SW_p= 29940.119760479
##$SYMM= 0
##$S_DEV= 0
##$TDeff= 32768
##$TDoff= 0
##$TI= <>
##$TILT= no
##$TM1= 0
##$TM2= 0
##$TOPLEV= 0
##$USERP1= <user>
##$USERP2= <user>
##$USERP3= <user>
##$USERP4= <user>
##$USERP5= <user>
##$WDW= 1
##$XDIM= 65536
##$YMAX_p= 275550309
##$YMIN_p= -5361422
$$ End of Bruker specific parameters
$$ ---------------------------------
##NTUPLES= NMR SPECTRUM
##VAR_NAME=  FREQUENCY,     SPECTRUM/REAL,   SPECTRUM/IMAG
##SYMBOL=    X,             R,               I
##VAR_TYPE=  INDEPENDENT,   DEPENDENT,       DEPENDENT
##VAR_FORM=  AFFN,          ASDF,            ASDF
##VAR_DIM=   65536,         65536,           65536
##UNITS=     HZ,            ARBITRARY UNITS, ARBITRARY UNITS
##FACTOR=    0.456856943014862, 1,           1
##FIRST=     14782.0589164792, 0,            0
##LAST=      -15158.0608439998, 0,           0
##MIN=       -15158.0608439998, -5361422,    0
##MAX=       14782.0589164792, 275550309,    0
$$ Real data points
##PAGE= N=1
##DATA TABLE= (X++(R..R)), XYDATA
$$ [...]
39943c67487N05387M8068j88667J5882R9438k53678m88526r9890M74051N14119
$$ -367487 137900 185968 -2699 13183 112621 -141057 -629583 -729473 -255422 258697
39933B58697P2717k83072l61306l32342k00435N1299J19689j46859k58427K20936
$$ 258697 331414 48342 -312964 -645306 -845741 -794442 -674753 -821612 -1080039 -859103
39923h59103P95132O58646l1091l77981j25518J02842n1181k20838j52364j20538
$$ -859103 -63971 594675 563584 185603 60085 162927 111746 -109092 -261456 -381994
39913c81994k30757j13639L13469N00740J22487l40301l51283j16468j13584k65362
$$ -381994 -612751 -726390 -412921 87819 210306 -129995 -481278 -597746 -711330 -976692
39903i76692j45395K75145O04944N99550L45260K838k91750l71167j74460J06344
$$ -976692 -1122087 -846942 -241998 357552 702812 705650 413900 42733 -131727 -25383
39893b5383K05987N8028k00409l75374l21156p4383R5696n811j58434o454L28110
$$ -25383 180604 238632 38223 -337151 -658307 -732690 -636994 -642805 -801239 -807693 -479583
39882d79583L32980j13274m99242l85931O8733M71381O42741N09720M0008m42443
$$ -479583 -146603 -259877 -759119 -1145050 -1076317 -604936 37805 547525 587533 145090
39872A45090l87103J78293M74031L4056n57264n35782q2717J12882K9033K02428
$$ 145090 -242013 -63720 410311 444367 -112897 -648679 -731396 -618514 -589481 -387053
39862c87053O27963O69669J41054l36295k82070J4520J07925M0343J5394n3662
$$ -387053 240910 910579 1051633 715338 433268 447788 555713 596056 611450 557788
39852E57788k43195k80636K8689L41822K14583k17112m44573l14158r5522N5192
$$ 557788 314593 33957 62646 404468 619051 401939 -42634 -356792 -452314 -397122
39842c97122K08357K82423P9464k34060k05408J72896L19913n9730m46986k81929
$$ -397122 -188765 93658 173122 -60938 -266346 -93450 226463 166733 -280253 -562182
39832e62182J49928J77837j88209l27078l9579J98704R4121m0596N5719J37856
$$ -562182 -412254 -234417 -422626 -749704 -789283 -590579 -496458 -537054 -481335 -343479
39822c43479K538n9366K02111M60775L01527j10929l30023k84240j67673O316
$$ -343479 -340941 -400307 -198196 262579 564106 453177 123154 -161086 -328759 -322443
39812c22443K32352K14111j84272m83240k25500K09406J64858j62175l4968M92891
$$ -322443 -90091 124020 -60252 -543492 -768992 -559586 -394728 -556903 -591871 -98980
39802i8980N68464l3121m91293k71574P8884l0472k43106K9363N47836O37297
$$ -98980 469484 436363 -54930 -326504 -247620 -278092 -521198 -491835 56001 693298
39792F93298K19247k10068l45567k59356o2160J40711J67617J8965l0605R8300
$$ 693298 912545 702477 356910 97554 35394 176105 343722 362687 332082 430382
39782D30382R6186j30591j45351K67555N41694J31821n47190o83135k40479J57085
$$ 430382 526568 395977 250626 518181 1059875 1191696 644506 -38629 -279108 -122023
39772a22023K50167K68262K18534j05056m45697k56876L47427N80074J07179m89725
$$ -122023 128144 396406 614940 509884 64187 -192689 154738 734812 841991 352266
39762C52266o08172l69714k00742k04519k44341k19949k5815L69406O50601M26374
$$ 352266 -255906 -625620 -826362 -1030881 -1275222 -1495171 -1520986 -1151580 -500979 -74605
39752g4605q4607j89407K41015M84855P2740m38647l19634K22321M37069J78277
$$ -74605 -159212 -348619 -107604 377251 449991 11344 -308290 -85969 351100 529377
39742E29377n4018k7622k0132j66371k21269q8159k1341j16714r4007J66293L10052
$$ 529377 475359 447737 427605 261234 39965 -48194 -69535 -186249 -280256 -113963 196089
39731A96089O4742k50978j81883J45647K24395k6210j45277J22421M15534L00460
$$ 196089 260831 9853 -172030 -26383 198012 171802 26525 148946 564480 864940
39721H64940j11859l82572l58469k49419k08225j55832j6983J35512K12036J87553
$$ 864940 753081 370509 12040 -237379 -445604 -601436 -618419 -482907 -270871 -83318
39711h3318L7308k22708m29337m02816j88057K5254J88189L51362L86068J01101
$$ -83318 -46010 -268718 -698055 -1100871 -1288928 -1263674 -1075485 -724123 -338055 -236954
39701b36954l20133l95907j4716L34169K16562j80676l91465k86889o3871J27451
$$ -236954 -557087 -952994 -967710 -633541 -416979 -597655 -989120 -1276009 -1339880 -1212429
39691a212429K33349J77852k240p3285Q0743K52550K68052K86266M31384M29088
$$ -1212429 -979080 -801228 -803468 -876753 -796010 -543460 -275408 10858 442242 871330
39681H71330M8390l48377k40176K12073L43690k4980l67577k98486o5140N876
$$ 871330 919720 571343 331167 543240 886930 861950 494373 195887 130747 136623
39671A36623L0099K02696L20116Q8601l08042l71380J8262M03409L29319q8340
$$ 136623 166722 369418 689534 778135 470093 98713 116975 520384 849703 761363
39661G61363l35780j66566J07580Q4888j46579j68987Q2338J83348j03691m11373
$$ 761363 425583 259017 366597 451485 304906 135919 218257 401605 297914 -113459
39651a13459l13233K9796J56997J6687n4296O0275J16206l1955k17030k50496
$$ -113459 -426692 -396896 -239899 -223212 -277508 -217233 -101027 -132982 -350012 -600508
39641f00508j40631J051N1050p3694k44154j44644K63273N10148K27030k22104
$$ -600508 -741139 -740088 -689038 -762732 -1006886 -1151530 -888257 -378109 -151079 -373183
39631c73183k03927K35581M60864K35133r476L1357R7825n1744j81161l1587J89531
$$ -373183 -577110 -341529 119335 354468 344992 376349 474174 422430 241269 209682 399213
39620C99213J37108j49269l73239m11682l38652j88652N6140L34710N23892N26521
$$ 399213 536321 387052 13813 -397869 -736521 -925173 -869033 -534323 -10431 516090
39610E16090K99266q8960m16987m84231l26696j22985N1247K03881K78299K51452
$$ 516090 815356 726396 309409 -174822 -501518 -624503 -573256 -369375 -91076 160376
39600A60376K42760K73439J18600k73436m74472j57812K52445J13933m11063n57846
$$ 160376 403136 676575 795175 521739 47267 -110545 141900 255833 -155230 -713076
39590g13076j33080K54537J99594j2714q6840j50069k50479j13751K69349M31482
$$ -713076 -846156 -591619 -392025 -404739 -491579 -641648 -892127 -1005878 -736529 -305047
39580c05047J54141j56046j46034j5263n569L5168K06939K27461n0562k99759
$$ -305047 -150906 -306952 -452986 -468249 -473818 -438650 -231711 -4250 -54812 -354571
39570c54571k69992j66250j31598O0270M05271M05488j02636m88092k62266J30697
$$ -354571 -624563 -790813 -922411 -862141 -456870 -51382 -154018 -642110 -904376 -773679
39560g73679R7250j17018L9998M04776M12081O5209j79998k09187k09336j20004
$$ -773679 -676429 -793447 -753449 -348673 63408 128617 -51381 -260568 -469904 -589908
39550e89908J65163L23668M7764k96377j75136K04201K46593j1403n0579J39055
$$ -589908 -424745 -101077 -53313 -349690 -524826 -320625 -74032 -85435 -136014 3041
39540C041P1513k95237m56497k18470Q1212K36015L57393L88063J26319k27749
$$ 3041 74554 -220683 -677180 -895650 -814438 -578423 -221030 167033 293352 65603
39530F5603k25390Q4667K06420J7041j15833n6392o2639j81211j63589n7478j99773
$$ 65603 -159787 -75120 131300 148341 32508 -23884 -86523 -267734 -431323 -488801 -688574
39519f88574n21914n35122j30835K50337L62877M19643M94622L34549o0761k90812
$$ -688574 -1210488 -1745610 -1876445 -1626108 -1263231 -843588 -348966 -14417 -75178 -365990
39509c65990j61820J05432L48767N60549N14921J752n52364m85964J8023J16451
$$ -365990 -527810 -422378 -73611 486938 1001859 1003611 451247 -34717 -16694 99757
39499I9757l24845n03638m9241L82512K60667k7024m027J51828J93560K84539
$$ 99757 -225088 -728726 -777967 -395455 -134788 -161812 -165839 -14011 179549 464088
39489D64088L88880N6323o34065q24780k09901L11293M6257l67496j36785L03101
$$ 464088 852968 909291 275226 -549554 -759455 -448162 -401905 -769401 -906186 -603085
39479f03085J54049k73802j65747L09609L63097J5489p0352J09530q976l50481
$$ -603085 -449036 -722838 -888585 -578976 -215879 -200390 -270742 -161212 -170188 -520669
39469e20669k87301J38595K36479q5782k04700L5121J12348q6621o2514K32499
$$ -520669 -807970 -669375 -432896 -518678 -723378 -688257 -575909 -662530 -725044 -492545
39459d92545K03023k39031l74628J01044N32669M07488Q8408j4972j15296l65666
$$ -492545 -289522 -528553 -903181 -802137 -269468 138020 226428 211456 96160 -269506
39449b69506l71935J0696J98805j32957l41028J54851Q00142P14506M0541l89803
$$ -269506 -641441 -630745 -431940 -564897 -905925 -751074 49068 763574 804115 414312
39439D14312l23988j45965J3369L09953N13726K08037l65645m90456o9352K15928
$$ 414312 90324 -55641 -42272 267681 781407 989444 623799 133343 63991 279919
39429B79919k6243l76655l76875j84787j33293j43651L1250L16238M30042L00250
$$ 279919 253676 -122979 -499854 -684641 -817934 -961585 -930335 -614097 -184055 116195
39419A16195R6961k2250k8192J6034J2614n3772n5874P3022J43850l0646k44963
$$ 116195 213156 190906 162714 178748 191362 137590 81716 154738 298588 267942 22979
39408B2979j15938L03011N21524L19026L6907j2484o746j91459l72441k37515
$$ 22979 -92959 210052 731576 1050602 1087509 1075025 1068279 876820 504379 266864
39398B66864O6066J24454r8648k42800j42334l0580r4601j76464o0157J85327
$$ 266864 332930 457384 358736 115936 -26398 -56978 -151579 -328043 -388200 -202873
39388b02873L07427J87642l9097j16489Q5563L82244M07634O4379k82126k62673
$$ -202873 104554 292196 253099 136610 222173 604417 1012051 1076430 794304 531631
39378E31631j6808N3703q0180j02443K7136j5629k94922m27036k30911n1807j18670
$$ 531631 514823 568526 488346 385903 413039 397410 102488 -324548 -555459 -607266 -725936
39367g25936r1857K94621O11576L60649j35813j79950J86143K82570o9150l25271
$$ -725936 -817793 -523172 88404 449053 313240 133290 319433 602003 532853 207582
39357B07582k20663j63827l68931l76704J09514N66118L99489j29870l26904n2146
$$ 207582 -13081 -176908 -545839 -922543 -813029 -246911 152578 22708 -304196 -356342
39347c56342K77395L90419L00146j4844m77770o42937j75140M95704O10558J37999
$$ -356342 -78947 311472 611618 596774 119004 -523933 -699073 -203369 407189 545188
39337E45188k21297j10618N8160r1488l10890k44869j7219P6902O2944R3735R0479
$$ 545188 323891 213273 271433 179945 -130945 -375814 -393033 -316131 -253187 -159452 -68973
39326f8973m6489j41082l3621O9331o4455k14279l1373K89632J93999l52620o87275
$$ -68973 -115462 -256544 -290165 -220834 -285289 -499568 -530941 -241309 -47310 -399930 -1087205
39315a087205l53684K37328L82685N1390j42650J37681M80267L37125j80652m47942
$$ -1087205 -1440889 -1203561 -820876 -769486 -912136 -774455 -294188 42937 -137715 -585657
39305e85657j94078J38655N9641k43772j95190K78709N99534L84822P832j010
$$ -585657 -779735 -641080 -581439 -825211 -1020401 -741692 -142158 242664 250496 249486
39295B49486K18380J05623l76362n99192j83427M19488N44788J87725r7611J3596
$$ 249486 467866 573489 197127 -402065 -585492 -166004 378784 566509 468898 482494
39285D82494K98943L92757J75989k42301o44588p66563m97600p8592J29478J08724
$$ 482494 781437 1174194 1350183 1107882 463294 -303269 -800869 -879461 -749983 -641259
39275f41259J47626L03440K67224p6758l42543j93461J18883J57255p324K3449
$$ -641259 -493633 -190193 77031 273 -342270 -535731 -416848 -259593 -266917 -243468
39265b43468K46060K40761j08523l88831k78957K9674K02561J91005J11489J7879
$$ -243468 2592 243353 134830 -254001 -532958 -503284 -300723 -109718 1771 19650
39255A9650k7379N2606J37870J4723j81532l6472M32333O09550J63243l73164
$$ 19650 -7729 44877 182747 197470 15938 -20534 411799 1021349 1184592 811428
39245H11428l68856l8624k7587l57604m78111k19754K0745M5437J04242K64722
$$ 811428 442572 403948 376361 18757 -459354 -679108 -658363 -612926 -508684 -243962
39235b43962K09717r6498j63472K46218O21602M29189q1685k90162j16313Q66
$$ -243962 -34245 -130743 -294215 -47997 573605 1002794 921109 630947 514634 515500
39225E15500j36860k68750j87930l4239o467r2004j58947j13270N2292K04896
$$ 515500 378640 109890 -78040 -112279 -118746 -210750 -369697 -482967 -430675 -225779
39215b25779J34328j36878k31380J06245N25540M59845k9527k72984L4462L79276
$$ -225779 -91451 -228329 -459709 -353464 172076 631921 602394 329410 363872 743148
39205G43148K31442j47269j56788J80777K86900m6521l81069l60972j75011p3154
$$ 743148 974590 827321 670533 851310 1138210 1091689 710620 349648 174637 101483
39195A01483P8167L84434M73793p353o63288p09357o1096M94280L65146j09561
$$ 101483 179650 564084 1037877 1030524 367236 -342121 -403217 91063 456209 346648
39185C46648k83068j28681q7642k39477j81763K41080N73729L49127k35752n41942
$$ 346648 63580 -65101 -152743 -392220 -573983 -332903 240826 589953 354201 -187741
39175a87741k82376J75563L18684P5310k24662l18782k30095o4539J46816L07564
$$ -187741 -470117 -294554 24130 99440 -125222 -444004 -674099 -738638 -591822 -284258
39165b84258J99834k04052n22472l50140J77718M99738L35012j3629j48275p1455
$$ -284258 -84424 -288476 -810948 -1161088 -983370 -483632 -148620 -162249 -310524 -381979
39155c81979q622K0073J68619M04946M54379J51028k99502m96072k69561J08748
$$ -381979 -390601 -370528 -201909 203037 657416 808444 508942 12870 -256691 -147943
39145a47943K20446J6494j13780R4729L59024K57707j05608k55416r3966j0583
$$ -147943 72503 88997 -24783 69946 428970 686677 581069 325653 231687 221104
39135B21104j81009k75576p0047J33253J0374k51489k88339j16043J3877O1933
$$ 221104 40095 -235481 -305528 -172275 -161901 -413390 -701729 -817772 -803895 -741962
39125g41962J46161K43921K72212K83260L03823J88441j05976l37061l22560j97303
$$ -741962 -595801 -351880 -79668 203592 507415 695856 589880 252819 -69741 -267044
39115b67044q5404J28023M09427L90361l8515l79015k34711O9106R8969O6572
$$ -267044 -352448 -224425 185002 575363 536848 157833 -76878 -7772 91197 157769
39105A57769L13301N11577J93486k98739l04712j3172j42604o18173o39002o2589
$$ 157769 471070 982647 1176133 877394 572682 559510 416906 -201267 -840269 -902858
39095i02858L59187K61843J30528K42612J87290k00073m04138j72004K1226q0483
$$ -902858 -543671 -281828 -151300 91312 278602 78529 -325609 -497613 -476387 -556870
39085e56870r567M34066N84713j6106p37493p83399l17595M8784K29122L73847
$$ -556870 -566437 -132371 452342 436236 -301257 -1084656 -1402251 -1353467 -1124345 -750498
39075g50498K64123j78397l57510J47049P08127N34751m2197j39338K17838K57338
$$ -750498 -486375 -664772 -1022282 -875233 -167106 367645 325448 186110 403948 661286
39065F61286j56556l70842j08130J92507K25880J49450K9728k36905m28258k01066
$$ 661286 504730 133888 25758 218265 444145 593595 623323 386418 -41840 -242906
39055b42906J97380J96957j30152j92912M7261M6982k21123j51245L07327L83673
$$ -242906 -45526 151431 21279 -171633 -124372 -77390 -298513 -449758 -142431 241242
39045B41242j98278o16624k21477M48496N73000K42385K8595j7798j64710k66342
$$ 241242 42964 -573660 -795137 -346641 226359 468744 497339 479541 314831 48489
39035D8489l5117K69337J82189j45523j86754L6085j3338m31583o43316k77854
$$ 48489 13372 282709 464898 319375 132621 168706 155368 -276215 -919531 -1197385
39025a197385K74332M30971J59525j12276q4452J51743L17093K41503n052k00917
$$ -1197385 -923053 -492082 -332557 -444833 -529285 -377542 -60449 181054 176002 -24915
39015b4915k03326r0378m0015r6753j19996L3159L00918M17835J88756k11558
$$ -24915 -228241 -318619 -358634 -455387 -575383 -542224 -241306 176529 365285 153727
39005A53727l51237p8949K18042J32775j43390j00945K59881L71687k7967m58075
$$ 153727 -197510 -276459 -58417 74358 -69032 -169977 89904 461591 433624 -24451
38995b4451l89497K3501K54869J52518r349k8390M8741J39651J92623J05932j43488
$$ -24451 -413948 -390447 -135578 16940 7591 -20799 27942 167593 360216 466148 322660
38984C22660l45166k73668j2930J55229J27973L6929p945j2526J3940N9287L9743
$$ 322660 -22506 -296174 -309104 -153875 -25902 11027 3082 -9444 4496 63783 103526
38973A03526q0594j61690p2188P3907Q2105l634o036K9976r5828l24454l40615
$$ 103526 22932 -138758 -210946 -137039 -54934 -58568 -64604 -34628 -130456 -454910 -795525
38962g95525o8298J77955J84466J46872K55220K90155o53l45443k45323K24930
$$ -795525 -863823 -685868 -501402 -354530 -99310 190845 190192 -155251 -400574 -175644
38952a75644M24462Q0672k72157r3502L30169L28223j21315l80651j35751J98468
$$ -175644 248818 329490 57333 -36169 294000 622223 500908 120257 -15494 182974
38942A82974K01043K7584k5517o4771k73276l99657j12741L28119L27900j52142
$$ 182974 384017 411601 386084 321313 48037 -351620 -464361 -136242 191658 39516
38932C9516m89651k77543J57688K88549N9913j98286k53248j22558P5003K08775
$$ 39516 -450135 -727678 -569990 -281441 -221528 -419814 -673062 -795620 -720617 -511842
38922e11842J75820M25j61450j84818q4251M1135Q4382k070r7241L4244L99378
$$ -511842 -336022 -335597 -497047 -681865 -766116 -724981 -640599 -642669 -739910 -705666 -306288
38911c06288O18183L76397q4826k82610j99149k23044m03656l12543J99568O33678
$$ -306288 311895 688292 603466 320856 121707 -101337 -504993 -817536 -617968 15710
38901A5710N22831O0616k79312l84827l95755k76771M7720L29942K31915j37067
$$ 15710 538541 599157 319845 -64982 -460737 -737508 -689788 -359846 -127931 -264998
38891b64998l00619m9017K97181L04855p8512m83774m83089l1350M19680L83362
$$ -264998 -565617 -614634 -317453 -12598 -91110 -574884 -1057973 -1089323 -669643 -286281
38881b86281n0909l03149q5428K21116J75524p2508q4849J63908L06415J74163
$$ -286281 -337190 -640339 -725767 -504651 -329127 -401635 -486484 -322576 -16161 158002
38871A58002l9782j63632k18036j99851m1929J52196J36403j08382k66914q1873
$$ 158002 118220 -45412 -263448 -463299 -505228 -353032 -216629 -325011 -591925 -673798
38861f73798K99376M90083L01122o6384k49011j17465Q7748P1202j29252k34328
$$ -673798 -374422 115661 416783 350399 101388 -16077 71671 142873 13621 -220707
38851b20707j69769j52628k74546l10025r6010J91917L46594M21365M71456L15428
$$ -220707 -390476 -543104 -817650 -1127675 -1223685 -1031768 -685174 -263809 207647 523075
38841E23075j11782m44458l29091K3920J50729K5720o715J35056J90984O6827
$$ 523075 411293 -33165 -362256 -338336 -187607 -161887 -168602 -33546 157438 224265
38831B24265m8533q0586j51194k44734k16043j55883l05463n50539m62144M0539
$$ 224265 175732 95146 -56048 -300782 -516825 -672708 -978171 -1528710 -1990854 -1950315
38821a950315N04589N72541L92174K41595J54914J08315J73559K63665J14016
$$ -1950315 -1445726 -873185 -481011 -239416 -84502 23813 197372 461037 575053
38812E75053k43143l78443j10460J57148P5861q5604M8500K68301J44764j85489
$$ 575053 331910 -46533 -156993 155 76016 -9588 38912 307213 451977 266488
38802B66488k27657J5762N3816k20334l22656j6809K43172M5229k84950j80745
$$ 266488 38831 54593 108409 -111925 -434581 -451390 -208218 -162989 -447939 -628684
38792f28684K74645M67421J56394k30482k69154j03041j21687l37705l78710l1633
$$ -628684 -354039 113382 269776 39294 -229860 -332901 -454588 -792293 -1171003 -1202636
38782a202636M55132O69192M81667J12428j53831k08939j26368m3607n2647j27777
$$ -1202636 -747504 -78312 403355 515783 361952 153013 26645 -16962 -69609 -197386
38772a97386j45685m0635O7918O339j80167k30904k6250K09041K16458R7697J60397
$$ -197386 -343071 -383706 -315788 -309449 -489616 -720520 -746770 -537729 -321271 -223574 -63177
38761f3177M12312M99750K27308j35870k40822j23308n4848j16332k00803k88336
$$ -63177 349135 848885 1076193 940323 699501 576193 521345 405013 204210 -84126
38751h4126l78481k71913J50987M96532K47209l48718m17133K49378P19979K64048
$$ -84126 -462607 -734520 -583533 -87001 160208 -188510 -605643 -356265 363714 627762
38741F27762m66234l87506L16315M64598k68167q56331n08267K30888M41891J08091
$$ 627762 161528 -225978 90337 554935 286768 -569563 -1077830 -846942 -405051 -296960
38731b96960j81652k07626j36724L411K27004K86099N1310r0096K11264O01128
$$ -296960 -478612 -686238 -822962 -819551 -592547 -306448 -255138 -345234 -133970 467158
38721D67158N24529J31483o702J07918m7213n24079p40326m09142M8253J89748
$$ 467158 991687 1123170 1116468 1224386 1177173 653094 -87232 -496374 -448121 -258373
38711b58373O3720j32630l43403m17490j23878L82810O08989M26801K31037K26762
$$ -258373 -194653 -327283 -670686 -1088176 -1212054 -829244 -220255 206546 437583 664345
38701F64345J44850j02266j33998J62825K54946j76578n73689l18211K61882M02012
$$ 664345 809195 706929 572931 735756 990702 814124 240435 -77776 184106 586118
38691E86118O5132j48010k7081P3209n965l4951J6288j03020l17284k05100K31684
$$ 586118 651250 503240 476159 549368 543403 508452 524740 421720 104436 -100664 131020
38680A31020M19178J04897k00744n3646J95732J1246m06224m15699N6284M12509
$$ 131020 550198 655095 454351 400705 596437 607683 201459 -214240 -157956 254553
38670B54553K63707j08767k55176j10179R2741J41731n3773m17448o40285m25193
$$ 254553 518260 409493 154317 44138 136879 278610 224837 -192611 -832896 -1258089
38660a258089P2143L29793J57427r190K15958N16954L39694j91432l83389q471
$$ -1258089 -1185946 -856153 -698726 -707916 -491958 24996 364690 173258 -210131 -218602
38650b18602L40894J37943l21461m01404k8043L07205K67062K947j58350n6531
$$ -218602 122292 260235 -61226 -462630 -490673 -183468 83594 86541 -71809 -128340
38640a28340K25489L92808J46425m03824o93348l79053J12596J32049k28637k63555
$$ -128340 97149 489957 636382 232558 -460790 -839843 -727247 -595198 -823835 -1087390
38630a087390K36981O10137K88677l70677o04039k24272L21508O27365O32358
$$ -1087390 -850409 -240272 48405 -322272 -926311 -1150583 -829075 -201710 430648
38621D30648L88970l8363m31935n12707k61524M6652J72799J25325K8328o2918
$$ 430648 819618 781255 349320 -163387 -424911 -378259 -205460 -80135 -51807 -114725
38611a14725j62571k65307l04347j86196R1327L39982L14639K3350k21010j81893
$$ -114725 -277296 -542603 -846950 -1033146 -941819 -601837 -287198 -263848 -484858 -666751
38601f66751o690K4444n1097N4703L64051M79192J08765m42412n65667j01202
$$ -666751 -673441 -648997 -700094 -645391 -281340 197852 306617 -135795 -701462 -802664
38591h02664M41713N10534J65421q7528j1165J06790l9541l08308l59177j69859
$$ -802664 -360951 149583 315004 227476 216311 323101 283560 -24748 -383925 -553784
38581e53784j7257k2604j2072J41845K93911K47089L9725j02332l0551J69971
$$ -553784 -571041 -593645 -605717 -463872 -169961 77128 116853 14521 -16030 153941
38571A53941K63019J09921j45588k23713q0571K3179p1488j59500k0634J80554
$$ 153941 416960 526881 381293 157580 77009 100188 28700 -130800 -151434 29120
38561B9120J48105n3843j24068k6655K8631L2796J52678K76174Q8015l14446l96271
$$ 29120 177225 123382 -686 -27341 1290 34086 186764 462938 550953 236507 -159764
38550a59764K3073M17449K79104j84316m02406k01802J12354K32833J22096o4544
$$ -159764 -136691 280758 559862 375546 -26860 -228662 -116308 116525 238621 174077
38540A74077j30254j4673J02021L6936o9912L2181J93476K0924l95774m80847
$$ 174077 43823 29150 131171 168107 98195 130376 323852 344776 -50998 -531845
38530e31845q8929J89614j8973k37966L0297M07181K45383k89965n09808l01041
$$ -531845 -620774 -431160 -450133 -688099 -657802 -250621 -5238 -295203 -805011 -1106052
38520a106052j46073j76488j8970L80745N49354K89055L1564J15832K61240R3662
$$ -1106052 -1252125 -1428613 -1447583 -1066838 -517484 -228429 -196865 -81033 180207 273869
38510B73869k41483l63971k46582j49939j58210j17041L5078J42786P8476l7839
$$ 273869 32386 -331585 -578167 -728106 -886316 -1003357 -968279 -825493 -747017 -784856
38500g84856M0149L41915N44199L22928j66286l94948j44112J98344K16136L7450
$$ -784856 -744707 -402792 141407 464335 298049 -96899 -241011 -42667 173469 210919
38490B10919J6552J22013P7506p1196k6389J91799K28615l8119l44398m82104
$$ 210919 227471 349484 426990 355794 329405 521204 749819 711700 367302 -114802
38480a14802m83533l42449J650L30890K64371j49846l87155j72407J50521J87528
$$ -114802 -598335 -940784 -939134 -608244 -343873 -493719 -880874 -1053281 -902760 -715232
38470g15232L4903k7620k3819j00029j20973J41392N30830O00441K06485k62798
$$ -715232 -680329 -707949 -731768 -831797 -952770 -811378 -280548 319893 526378 263580
38460B63580l38789M432L79805M66812L30141K06930J05581j49909m79103n01960
$$ 263580 -75209 -70777 309028 775840 1105981 1312911 1418492 1268583 789480 287520
38450B87520j38572R6143k15739o70350n31518J76036O50896M29241o1901k27883
$$ 287520 148948 245091 29352 -640998 -1172516 -996480 -345584 83657 21756 -206127
38440b06127n0198J54602K53827K38642K1803l29424m49192j49899J75531L1228
$$ -206127 -256325 -101723 152104 390746 412549 83125 -366067 -515966 -340435 -309207
38430c09207m29711n32931L6838Q00448J017664M81937k94934o22375l19738J45225
$$ -309207 -738918 -1271849 -1235011 -434563 583101 1065038 770104 147729 -172009 -26784
38420b6784K30401n8788k71419j45719J29975K79608K38620K9157l10476n36845
$$ -26784 203617 144829 -126590 -272309 -142334 137274 375894 405051 94575 -442270
38410d42270l16048K39514N02363J25412l94235l60467J29625L36163m6860m83751
$$ -442270 -758318 -518804 -16441 108971 -285264 -645731 -516106 -179943 -226803 -710554
38400g10554l89083J02154M18926L28934J00017J048k1745j06643j75216o8317
$$ -710554 -1099637 -997483 -578557 -249623 -149606 -148558 -170303 -276946 -452162 -520479
38390e20479J34333J71644j2653j69430j23580m0437j34473k85899k06478R8294
$$ -520479 -386146 -214502 -227155 -396585 -520165 -560602 -695075 -980974 -1187452 -1089158
38380a089158L12668K56098R4190N1086J17288J31914K0647j24488j39515M1926
$$ -1089158 -776490 -520392 -426202 -375116 -257828 -125914 -105267 -229755 -369270 -327344
38370c27344K68281K92409Q4295j05925r8998j9062k4377l8139K3508J3635j38414
$$ -327344 -59063 233346 317641 211716 112718 93656 69279 31140 54648 68283 -70131
38359g0131j46328J91052N04145L20715j56104l13764o1962J28293O3124J9300
$$ -70131 -216459 -25407 478738 799453 643349 329585 267623 395916 459040 478340
38349D78340P7376n304j44027P3493N16731M54124k65838p72517m38762J38536
$$ 478340 555716 550412 406385 479878 996609 1450733 1184895 412378 -26384 112152
38339A12152R1935l92827m93528o4921K84347J98812p9684k56400k40545M1649
$$ 112152 204087 -188740 -682268 -747189 -462842 -264030 -343714 -600114 -840659 -799010
38329g99010N12928P25171L41220k44815l33776Q4286L32326M2764m10998n51180
$$ -799010 -286082 439089 780309 535494 201718 286004 618330 661094 250096 -301084
38319c01084l47883j1667L10012M67333L16667k8436k30618j36392P1694J77694
$$ -301084 -648967 -660634 -350622 116711 433378 404942 174324 37932 109626 287320
38309B87320J49640L1039j35376k43243j98988o9109L4204J50307L36138M41584
$$ 287320 436960 467999 332623 89380 -109608 -178717 -144513 5794 341932 783516
38299G83516K94647J3796j65339k72203m68016o25934m49558J1587L61153L88239
$$ 783516 1078163 1091959 926620 654417 186401 -439533 -889091 -877504 -516351 -128112
38289a28112K35193L4200k15565l68159j72754K66269M65380J88590k28960l76309
$$ -128112 107081 141281 -74284 -442443 -615197 -348928 116452 305042 76082 -300227
38279c00227k79655j89832j20883J00896M50862O31116L91735j79973o88262p41402
$$ -300227 -579882 -769714 -890597 -789701 -338839 292277 684012 504039 -184223 -925625
38269i25625l14662J90875L42404J26347q3502J9171L58659N95726M67235L8240
$$ -925625 -1240287 -1049412 -707008 -580661 -664163 -644992 -286333 309393 776628 814868
38259H14868l28108l29312p9688N0848k6452l6659J04565O7142k86172m98800
$$ 814868 486760 157448 77760 128608 102156 65497 170062 237204 -48968 -547768
38249e47768j87139K50915J95370j76518j42672L80533O74472L44576j17459j67168
$$ -547768 -734907 -483992 -288622 -465140 -607812 -227279 447193 791769 674310 507142
38239E07142K9553N1777o8373n7899K9056o6482l06255l84999j86413R1259K27368
$$ 507142 536695 588472 520099 462200 491256 424774 118519 -266480 -452893 -361634 -134266
38228a34266J84341M9492p9907j57735j86216j35135O5827L38485L89843P8669
$$ -134266 50075 99567 19660 -138075 -324291 -459426 -393599 -55114 334729 413398
38218D13398k64339k21673Q4024J72013j7968n5147J95532L13531Q9238n0027
$$ 413398 149059 -72614 11410 183423 165455 110308 305840 619371 708609 658582
38208F58582K09571M32956J23667l70669l44816J08250K09945k48606n52045j97470
$$ 658582 868153 1301109 1424776 1054107 709291 817541 1027486 778880 226835 29365
38198B9365L08060K46436k19306l56143N055L08896K17928O5819J64968K26898
$$ 29365 337425 583861 364555 8412 13467 322363 540291 606110 771078 997976
38188I97976j08620n58294n52599j19296J57669K9381j30487k5117J22627M9934
$$ 997976 889356 331062 -221537 -340833 -183164 -153783 -284270 -309387 -186760 -136826
38178a36826j01941j22772j04697j56246j25899M5123Q2379j17234j49813K36587
$$ -136826 -238767 -361539 -466236 -622482 -748381 -703258 -620879 -738113 -887926 -651339
38168f51339N45209K15799m01050m74435P1926N01038L94330J07218K6277O3687
$$ -651339 -106130 109669 -291381 -765816 -693890 -192852 201478 308696 334973 398660
38158C98660N7163O8123P9391q1425l32064l33699o0741J04006m988r8256K1854
$$ 398660 455823 523946 603337 521912 189848 -143851 -204592 -100586 -105574 -203830 -181976
38147a81976J59308J40688O8078J111j42247k35882j0099L94357M86902J94067
$$ -181976 -22668 118020 186098 187209 44962 -190920 -201019 193338 680240 874307
38137H74307k8328j5396j44322n16804o30844k52682J02179L8605n6558K13271
$$ 874307 845979 830583 686261 169457 -461387 -714069 -611890 -573285 -629843 -416572
38127d16572M78027K68670j09272j05655J43522J67064K3100L0261O457l74817
$$ -416572 61455 330125 220853 115198 258720 425784 448884 479145 485602 110785
38117A10785p50781m94768J82829M67155K21274J20407M30214N68206J48444l45788
$$ 110785 -639996 -1134764 -951935 -484780 -263506 -143099 287115 855321 1003765 657977
38107F57977l37352K9361K80230L12752K64218Q7465k66482n09334l19874J31324
$$ 657977 320625 349986 630216 942968 1207186 1294651 1028169 518835 198961 330285
38097C30285L37768J08561k21822k55989P698K48911K29252K1380j34945j14769
$$ 330285 668053 776614 554792 298803 306501 555412 784664 806044 671099 556330
38087E56330p61M7397o3054k98278m80212l92013m8682K15394J31111j28410k24487
$$ 556330 555569 602966 539912 241634 -238578 -630591 -679273 -463879 -332768 -461178 -685665
38076f85665j75968k07223j96056J49947N79806M82648n5285j81919L67478O87616
$$ -685665 -861633 -1068856 -1264912 -1114965 -535159 -52511 -107796 -289715 77763 765379
38066G65379Q6538p26231o87344R14L21269R7310N2529L67034L61331k17447o51454
$$ 765379 851917 125686 -561658 -560744 -239475 -142165 -89636 277398 638729 421282 -230172
38055b30172l79087J67869L13995Q3825p2021o979J03424J30159L8222j63418
$$ -230172 -609259 -441390 -127395 -43570 -115591 -122570 -19146 111013 149235 -14183
38045a4183l03974j73078J02610J59947q938l967K76322L67534l2685n10871m88651
$$ -14183 -318157 -491235 -388625 -228678 -237616 -241583 34739 402273 369588 -141283 -629934
38034f29934m975M23495M88763L04471J10840N5095J37547J72022n4437m36279
$$ -629934 -634909 -211414 277349 581820 692660 747755 885302 1057324 1002887 566608
38024E66608n72969k98354N5435J24366J068P686J85490K99091K24684O3907p1178
$$ 566608 -6361 -304715 -249280 -124914 -123846 -116160 69330 368421 593105 657012 585834
38013E85834j69671k38278k51196j67450O1080M12879O86845O39050L41339K24620
$$ 585834 416163 177885 -73311 -240761 -179681 233198 920043 1559093 1900432 2125052
38003B125052N67135J044578J019465K82410o74120j184774j085489p43478m98120
$$ 2125052 2692187 3736765 4756230 5038640 4364520 3179746 2094257 1350779 852659
37994H52659l04839l0018J52302j4305l46498l57312J5428K67099J02295j18406
$$ 852659 547820 517802 670104 655799 309301 -48011 -32583 234516 336811 218405
37984B18405l1249J03517q4860l42051j98596J60064J44851k52538m59661k76488
$$ 218405 187156 290673 205813 -136238 -334834 -174770 -29919 -282457 -742118 -1018606
37974a018606p6457R843L15986Q19545Q79118K06693n36861o18869k04192P0096
$$ -1018606 -1095063 -1085220 -769234 50311 929429 1136122 599261 -19608 -223800 -153704
37964a53704O0637P9045J90273J63363k664m6774P1188R8032n8390j67047n9201
$$ -153704 -93067 -14022 176251 339614 336950 290176 361364 459396 401006 233959 174758
37953A74758J04877Q8345p9211j53642o992K04036K31638M9864j25616j52199
$$ 174758 279635 367980 288769 135127 128135 332171 563809 613673 488057 335858
37943C35858j38615j91362j65234R5018M02040M33902K31887J44284K75293L46074
$$ 335858 197243 5881 -159353 -64335 337705 771607 1003494 1147778 1423071 1769145
37933A769145J64196j05843k44398k55151k30111j90198j57672j66469j46650
$$ 1769145 1933341 1827498 1583100 1327949 1097838 907640 749968 583499 436849
37924D36849j7700J02181L9338j06647q7343O1407O1519j29475k45172j25288
$$ 436849 419149 521330 560668 454021 366678 428085 489604 360129 114957 -10331
37914a0331J48932M90055P66978O31010o8781p46407o29444Q8276L85798j08122
$$ -10331 138601 628656 1395634 2026644 1957863 1211456 582012 670288 1056086 947964
37904I47964n70221k69266L80155N88390L46188J42160L5445k56433o53969p80432
$$ 947964 377743 108477 488632 1077022 1423210 1565370 1600815 1344382 690413 -90019
37894i0019n68062k62345K2459K89763L89280K15806J0552M2754J68689J06577
$$ -90019 -658081 -920426 -897967 -608204 -218924 -3118 7434 50188 218877 325454
37884C25454o0289p5298J3602J2810J0640J70977K86515N0419l54966m58546k16721
$$ 325454 265165 189867 203469 216279 226919 397896 684411 734830 379864 -78682 -295403
37873b95403k3762l0675M0297L27989N23543L03699k02497n38284l96697O4966
$$ -295403 -319165 -349840 -309543 18446 541989 845688 643191 104907 -291790 -226824
37863b26824L47520J38389k64824k86928J26643M09222K03807j61949k83572k59108
$$ -226824 120696 259085 -5739 -292667 -166024 243198 447005 285056 1484 -257624
37853b57624k81526j69758J74667L25395j6019l47070q3603M02381L20813k00364
$$ -257624 -539150 -708908 -534241 -208846 -224865 -571935 -655538 -253157 67656 -132708
37843a32708k84264K41250N66240K44556j40660l3994J97356k9731n22030o24486
$$ -132708 -416972 -175722 390518 635074 494414 460420 657776 628045 106015 -518471
37833e18471j57288M68251Q19864P29506K38068l67050o29654l78452R151O3486
$$ -518471 -675759 -207508 612356 1341862 1579930 1212880 583226 204774 213925 277411
37823B77411j74217k63852P492L76355M75019K45067p4255k38660j90124j0354
$$ 277411 103194 -160658 -153166 223189 698208 943275 869020 630360 440236 429882
37813D29882J92920K98909J91420p6127k14291l8499J76914L3179l07945k63800
$$ 429882 622802 921711 1113131 1037004 822713 784214 961128 994307 686362 422562
37803D22562K11979M11837l7852m87224k44013K89829K55575k51399l49317J72552
$$ 422562 634541 1046378 1008526 521302 277289 567118 822693 571294 221977 394529
37793C94529N43201K85537j04112p9032J22613K3533k93731m27555k91225o7596
$$ 394529 937730 1223267 1119155 1040123 1162736 1186269 892538 464983 173758 106162
37783A06162J59211L42028K97282m7140m04923m20227q7011K92079M22868K02134
$$ 106162 265373 607401 904683 857543 452620 32393 -54618 237461 660329 862463
37773H62463k08043m13065j47828L23131M60272J68812q9559k168J86291J48847
$$ 862463 654420 241355 93527 416658 876930 1045742 956183 954015 1140306 1289153
37763A289153m8387j98313l11593m24123l64254m3348K66385K58311J453k34930
$$ 1289153 1240766 1042453 730860 306737 -57517 -100865 165520 423831 425284 190354
37753A90354l51456l56834j80237J40513K93458O9709k36495j61048K75253N78543
$$ 190354 -161102 -517936 -698173 -557660 -264202 -194493 -430988 -592036 -316783 261760
37743B61760M19478l8224m38936n74633l88710O4473N20067N74790Q8438n35243
$$ 261760 681238 643014 204078 -370555 -759265 -694792 -174725 400065 488503 -46740
37733d6740o74169j74466M15443M44569p1409m93948l84055O863K10039J92733
$$ -46740 -720909 -895375 -479932 -35363 -106772 -600720 -984775 -977912 -767873 -575140
37723e75140K27261L31261K60495j3284k27277k44037j82098j05413N4137K16159
$$ -575140 -347879 -16618 243877 230593 3316 -240721 -422819 -528232 -474095 -257936
37713b57936J73220j4339k2182K07757L18632J03894j44858j02809R9457J51598
$$ -257936 -84716 -99055 -121237 86520 405152 509046 364188 261379 360836 512434
37703E12434O2949M6123Q6958o171k04299k50035o5109J12283Q2330l5009j7063
$$ 512434 575383 621506 708464 702293 497994 247959 182850 295133 377463 342454 325391
37692C25391R5989O3961j31358j76002R4253L10033J9103n49121o42235l4159
$$ 325391 421380 485341 353983 177981 272234 582267 601370 52249 -589986 -624145
37682f24145N71396M84390o4139l75964k64517o0856N2912J20400L2835k98004
$$ -624145 -52749 431641 367502 -8462 -272979 -333835 -280923 -160523 -127688 -425692
37672d25692n20603k27698L26170N17749K80972P3874J7646j46973k76631Q5813
$$ -425692 -946295 -1173993 -847823 -330074 -49102 24772 42418 -104555 -381186 -295373
37662b95373P10397P32254J1152n05601k25938K08934R2576j96134k4827K73713
$$ -295373 415024 1147278 1158430 652829 426891 635825 728401 532267 507440 781153
37652G81153J9863n04563m61105J00719K95589j25811l87902J3346N15037M07628
$$ 781153 801016 296453 -164652 -63933 231656 105845 -282057 -268711 246326 653954
37642F53954j09405l20931n0993K04837N5155l12363m69129k80142K8829K06221
$$ 653954 544549 223618 172625 377462 432617 120254 -348875 -629017 -600188 -393967
37632c93967K10139J15274m1732k11590k58247j13137Q0254J59389J78685K34507
$$ -393967 -183828 -68554 -110286 -321876 -580123 -693260 -613006 -453617 -274932 -40425
37622d0425J97386o5589l25406k42477R9314L42914M55165O45657P47478L44987
$$ -40425 156961 91372 -234034 -476511 -377197 -34283 420882 1066539 1814017 2159004
37612B159004l96812p40066m35603r2665j81654l54006j76372J10785J06617l3077
$$ 2159004 1762192 1022126 586523 493858 312204 -41802 -218174 -107389 -772 -33849
37602c3849J9154J25122L2289m1509J98639M77766L32131j11748l42212k48331
$$ -33849 -14695 110427 142716 101207 299846 777612 1109743 997995 655783 407452
37592D07452j34574j23183q9042n0574j07490j03858J65281N14771N77820L42820
$$ 407452 272878 149695 60653 10079 -97411 -201269 -35988 478783 1056603 1399423
37582A399423P9554j20823l19188m04391k33112K9462J06300J9437m3515q5680
$$ 1399423 1478977 1358154 1038966 634575 401463 430925 537225 556662 513147 427467
37572D27467j64540j30294J02742K63242J18703r0087n1118O1049p4852l01559
$$ 427467 262927 132633 235375 498617 617320 527233 476115 537164 462312 160753
37562A60753k50849p186P0213n114L9222J41528K5790k12656k29682m4515K8144
$$ 160753 -90096 -97282 -27069 -32183 7039 148567 174357 -38299 -267981 -312496 -284352
37551b84352m2964l7247K8905o485j6890J79712L23414Q2861k42244r8173L63752
$$ -284352 -327316 -364563 -335658 -342143 -359033 -179321 144093 226954 -15290 -113463 250289
37540B50289M74241J39645o8696M0671n619m03397o45310l49589J50964L82540
$$ 250289 724530 864175 795479 836150 830531 427134 -218176 -567765 -416801 -34261
37530c4261L36870K05401K0670j43212p7431J69919K20634o4144l23349k32347
$$ -34261 302609 508010 528680 385468 308037 477956 698590 634446 311097 78750
37520G8750N0733J76586L5013k49783m66814l90781m595L51670L78917K69241
$$ 78750 129483 306069 341082 91299 -375515 -766296 -770891 -419221 -40304 228937
37510B28937L36942L64519p6640p41192q73553l17328K61428L92494L12238K64493
$$ 228937 565879 930398 853758 112566 -760987 -1078315 -816887 -424393 -112155 152338
37500A52338O4316l10027m13065n4839K87404K21513L2524O8606J06369j33229
$$ 152338 216654 -93373 -506438 -561277 -273873 -52360 -19836 48770 155139 21910
37490B1910l45672j37579K33337K57912L7345R0622M42399N41228J26568l43894
$$ 21910 -323762 -461341 -228004 29908 67253 157875 600274 1141502 1268070 924176
37480I24176l16367J24996L73053N8120m77308n79605j35107K40873O2673k82887
$$ 924176 607809 732805 1105858 1163978 686670 107065 -28042 212831 275504 -7383
37470g383j04667M85967O78940J70988m29112n68296m30400l37687j46154K68930
$$ -7383 -112050 373917 1052857 1223845 794733 226437 -203963 -541650 -687804 -418874
37460d18874M89060J49798l13860j98471L80929N98806J07539m76328m46804P7341
$$ -418874 70186 219984 -93876 -292347 88582 687388 794927 318599 -128205 -50864
37450e0864M19277K84803N9462J41622L17367J06798m05270n63655j10822L29105
$$ -50864 368413 653216 712678 854300 1171667 1278465 873195 309540 198718 527823
37440E27823J21601m25053n36715j31370J65925M4948j57038j62738j06814n9714
$$ 527823 649424 224371 -312344 -443714 -277789 -232841 -389879 -552617 -659431 -719145
37430g19145J49361M37140L97509j9290k96905r4287K80531L93158K31293k237
$$ -719145 -569784 -132644 264865 245575 -51330 -145617 134914 528072 759365 757128
37420G57128k01697k42421M404L31505L20386n902j49219M7206J10177k52758
$$ 757128 555431 313010 317414 648919 969305 963403 814184 861390 971567 718809
37410G18809o18739n09342r8488J56221J84181J91916K15560J64384N6594p0791
$$ 718809 100070 -409272 -507760 -351539 -167358 24558 240118 404502 461096 390305
37400C90305k37612l24942j25299K58374M39105L11527J68920J33942j9563l11735
$$ 390305 152693 -172249 -297548 -39174 399931 711458 880378 1014320 994757 683022
37390F83022l86208j34200N8141m8040j87733j33881m1640M411J89495M36125
$$ 683022 296814 162614 220755 172715 -15018 -148899 -190539 -186128 3367 439492
37380D39492L13991j89297m70106k52193m0321k08279l54387q4847K64069K86404
$$ 439492 753483 564186 94080 -158113 -198434 -406713 -761100 -845947 -581878 -295474
37370b95474K27533L86880M18218m4575n87370n84735j41226K17843L71897M51656
$$ -295474 -67941 318939 737157 692582 105212 -479523 -620749 -402906 -31009 420647
37360D20647K98000k01386n95468l99514J41638M29422L38039J13953j55955l95574
$$ 420647 718647 517261 -78207 -477721 -336083 93339 431378 545331 389376 -6198
37350f198k89834J97070M85987J86554k34039k24946m6169j54504k81018m28L17615
$$ -6198 -296032 -98962 387025 573579 339540 114594 68425 -86079 -367097 -367525 -49910
37339d9910J18094k38151n3629M02693L22748j74386k20105K71219M77459J22508
$$ -49910 68184 -169967 -223596 179097 501845 327459 107354 378573 856032 978540
37329I78540j43881j0710q226m05828o37437k89838J93200K85781J41206R8421
$$ 978540 834659 823949 815723 409895 -227542 -517380 -324180 -38399 102807 201228
37319B01228N4227j66298l12133q7673L01862M14593J71637j16390j75301j4525
$$ 201228 255455 89157 -222976 -310649 -8787 405806 577443 461053 285752 271227
37309B71227J53572J42101r317r9479p7744r8515j63694m2585K40655K60563j22620
$$ 271227 424799 566900 557583 458104 380360 281845 118151 75566 316221 576784 454164
37298D54164l81347r8334L19302K81824n1536j64591j23132l25219n97306m09681
$$ 454164 72817 -25517 293785 575609 524073 359482 236350 -88869 -686175 -1095856
37288a095856J45673M41864L30714K57690L62173K68100j26426l82591k18346
$$ -1095856 -950183 -508319 -177605 80085 442258 710358 583932 201341 -17005
37279a7005J17180L05152K97740J37525j03927k10238o9240N9323m6631j15187
$$ -17005 100175 405327 703067 840592 736665 526427 457187 516510 469879 354692
37269C54692J42558L80159R5882m79874o99179m88632k67387q4294L10902O79150
$$ 354692 497250 877409 973291 493417 -205762 -694394 -961781 -1046075 -735173 -56023
37259e6023M97034p1167k98534l4056J39695m9690k22552j67197j61024k86072
$$ -56023 441011 369844 71310 37254 176949 127259 -95293 -262490 -423514 -709586
37249g09586k01292J74786M36547L56309J80937J22762J12008J24732K09453J92583
$$ -709586 -910878 -736092 -299545 56764 237701 360463 472471 597203 806656 999239
37239I99239q7875l47342k45588k4763p8698j58364J54346M63480P6723o75194
$$ 999239 911364 564022 318434 293671 214973 56609 210955 674435 751158 75964
37229G5964p81526j70000K10565o67j20129K06278M01274J12023j63114p1146
$$ 75964 -705562 -875562 -664997 -665664 -785793 -579515 -178241 -66218 -229332 -300478
37219c00478K828j64864j18722L48054O44601L50119n6825k1754K19434J55423
$$ -300478 -297650 -462514 -581236 -233182 411419 761538 704713 682959 902393 1057816
37209A057816j98927m97124n62526l48181J14156M97183M42404J66892J91710
$$ 1057816 858889 361765 -200761 -548942 -434786 62397 504801 671693 863403
37200H63403M21879K66187k57697m36530n6277K40633N5029k14518k18995j75373
$$ 863403 1285282 1551469 1293772 857242 800965 1041598 1096627 882109 663114 487741
37190D87741k05254k3282L58489M41476J00263j62300j11207j09357k86845k56407
$$ 487741 282487 259205 617694 1059170 1159433 997133 885926 776569 489724 233317
37180B33317M6027J23455j62861l05126p8066J12086O5844P8223J71015K024k64597
$$ 233317 279344 402799 239938 -65188 -143254 -31168 34676 112899 283914 285938 21341
37169B1341n5527M42160L78621k33906l75782K23025N30872l4987o32213m60535
$$ 21341 -34186 407974 786595 552689 176907 399932 930804 895817 263604 -196931
37159a96931K1538J10157k8011j7521k4816j32622M2550M57476L94035k68525
$$ -196931 -175393 -65236 -93247 -110768 -135584 -268206 -225656 231820 625855 357330
37149C57330o12623j63518L04063J33701j68692j4411K36100J04154j57688k58757
$$ 357330 -255293 -418811 -114748 18953 -149739 -164150 71950 176104 18416 -240341
37139b40341m08130n55162j94315N11019O37229R0773q6490L98674M71381k80949
$$ -240341 -648471 -1203633 -1397948 -886929 -249700 -158927 -245417 153257 624638 343689
37129C43689o60559L7355O67979K26051m18025j77196L50349J64509k96784j79267
$$ 343689 -316870 -279515 388464 614515 196490 19294 369643 534152 237368 58101
37119E8101J28030q0493l45690j0617L90337J80759r4718J83704L35930l09177
$$ 58101 186131 105638 -240052 -250669 139668 320427 225709 409413 745343 436166
37109D36166q67504l11623O23284O40491K7619r4761K18862J64850j81918k64215
$$ 436166 -431338 -742961 -119677 520814 548433 453672 672534 837384 655466 391251
37099C91251k76098n19428m23708L36781P80130J86885m16149K5017O31980J84031
$$ 391251 115153 -404275 -827983 -491202 288928 475813 59664 84681 716661 900692
37089I00692n75603k70600N91639O01786l1410j46159Q3638k29473o05999n2899
$$ 900692 325089 54489 646128 1247914 1216504 1070345 1153983 924510 318511 265612
37079B65612P33689L67953o55658p52932m7856K2948n57195m93547K69280M97323
$$ 265612 999301 1367254 711596 -41336 -89192 -66244 -623439 -1116986 -847706 -350383
37069c50383K6267q4425L28851L77418p856m5175K03527R604l91743k00740K71244
$$ -350383 -324116 -408541 -79690 297728 289872 244697 448224 457828 66085 -134655 136589
37058A36589J63394j79702J19628O62494N71494L38623P97957J117049J09171
$$ 136589 299983 120281 239909 902403 1473897 1812520 2610477 3727526 3836697
37049C836697j293798j327334l56678l5334l31076n2343M85265J48528m25410
$$ 3836697 2542899 1215565 858887 823553 492477 440134 925399 1073927 648517
37040F48517J32395J033329N33095p04259o58434L15779K05114q05998p57512
$$ 648517 780912 1814241 2347336 1643077 984643 1300422 1505536 699538 -57974
37031e7974K62620L81354l24693j17816O67992J06867j279657j052365N75838
$$ -57974 204646 586000 261307 143491 811483 918350 -361307 -1413672 -837834
37022h37834R01577l74420p29098L64000O25538m39480o09926N76611Q45887l31518
$$ -837834 63743 -310677 -1039775 -675775 -50237 -489717 -1099643 -523032 322855 -8663
37012h663o58772M85276Q06844m31561r90298K4957O35601K2531j20034N97785
$$ -8663 -667435 -182159 624685 193124 -797174 -772217 -136616 -114085 -234119 363666
37002C63666M01632o38164k53377J348626J247443o87344j146036N64713J190502
$$ 363666 765298 127134 -126243 1222383 2469826 1782482 636446 1201159 2391661
36993B391661l39843j065865Q8836L57867j063633j223077N66327J044467n48161
$$ 2391661 2051818 985953 1074789 1432656 369023 -854054 -287727 756740 208579
36984B08579p58020J152350J394945q32490j312982J043270J773356m50888j011192
$$ 208579 -549441 602909 1997854 1165364 -147618 895652 2669008 2218120 1206928
36975A206928J453445J977340p92804j232812K331341L775569J194837J197433
$$ 1206928 2660373 4637713 3844909 2612097 4943438 8719007 9913844 11111277
36967A1111277N353248N330503j137958l813522J449995L749915j724731j946453
$$ 11111277 16464525 21795028 20657070 16843548 18293543 22043458 20318727 18372274
36959A8372274R125892J4980357Q232309J5432079N5728048R0948877O2730473
$$ 18372274 27498166 42478523 50710832 66142911 121870959 212819836 275550309
36952B75550309k1252584q4380072p6584983l1429185p742700j2786666j4944204
$$ 275550309 254297725 169917653 93332670 61903485 54160785 41374119 26429915
36945B6429915l689867L115365j433081l969265R34442K724977k649455n671275
$$ 26429915 22740048 25855413 24422332 20453067 21387509 24112486 21463031 15791756
36937A5791756k234454k47268l312862m542253q35122J361747j095912k454218
$$ 15791756 13557302 13310034 9997172 5454919 4619797 5981544 4885632 2431414
36929B431414L20737K002591l95730k092645Q567J747109L0809j678695n14786
$$ 2431414 2752151 4754742 4359012 2266367 2274934 4022043 4052852 2374157 1859371
36920A859371P02918l81224j221660Q9156J030335r4800q35706L10506R09605
$$ 1859371 2562289 2181065 959405 1048561 2078896 1984096 1148390 1458896 2368501
36911B368501m00769j145176K5312O83686m72412j053634J70701P69966m77255
$$ 2368501 1967732 822556 847868 1531554 1059142 5508 176209 946175 468920
36902D68920j050891L84265J260818J2210r09399K52663J241542J51346j045280
$$ 468920 -581971 -197706 1063112 1075322 165923 418586 1660128 1811474 766194
36893G66194l93420M83173j98709r84557k71261N24572j04187p45390Q4644R77202
$$ 766194 372774 855947 657238 -327319 -598580 -74008 -178195 -923585 -838941 138261
36883A38261L59203n33307j49719M92874O0308m60392O5025N27131j46638o98736
$$ 138261 497464 -35843 -185562 307312 367620 -92772 -27747 499384 352746 -345990
36873c45990L334N79767k77313j130589l19886R80560Q86683M5065R1794O07621
$$ -345990 -342656 237111 -40202 -1170791 -1490677 -510117 376566 421631 513425 1121046
36863A121046K44753n80212o09398j02042l4379j21200L60818R49186R70985Q68937
$$ 1121046 1365799 785587 176189 74147 39768 -81432 279386 1228572 2199557 3068494
36853C068494R60718L89026j054801j742992o62431O10938L16209p23846p63700
$$ 3068494 4029212 4418238 3363437 1620445 958014 1568952 1885161 1161315 397615
36844C97615m2836J04786k67377k52156m738j58687l29561K5651K94105j06573
$$ 397615 354779 459565 192188 -59968 -64706 -223393 -552954 -527303 -233198 -339771
36834c39771l81163J88357P01622K29081l67718K5724P12934N13069q4650l84
$$ -339771 -720934 -532577 169045 398126 30408 56132 769066 1282135 1197485 1197101
36824A197101L61374N0867m84159l19075Q4122j79070o15525k98899K77021J49907
$$ 1197101 1558475 1609342 1125183 806108 890230 711160 95635 -203264 73757 223664
36814B23664k59573p7909K30239j22156m53908J78326R57312N65623m15548n01350
$$ 223664 -35909 -113818 116421 -5735 -459643 -281317 675995 1241618 826070 324720
36804C24720J02915R4759m36321l65115J66723N6992n37241m78026J43759K05322
$$ 324720 427635 522394 86073 -279042 -112319 -55327 -592568 -1070594 -926835 -721513
36794g21513k67430k06395L74685M21669q9813j44095K99063K70075k25505j67860
$$ -721513 -988943 -1195338 -820653 -398984 -488797 -632892 -333829 -63754 -289259 -457119
36784d57119M64045O06046J60253J56843O56810N05756m40374q30706j40190L91139
$$ -457119 6926 612972 773225 930068 1586878 2092634 1652260 821554 681364 1072503
36774A072503j07293p47368n15107J43722L08586J679k36477k59163j09000K82849
$$ 1072503 965210 217842 -297265 -153543 155043 156722 -79755 -338918 -447918 -165069
36764a65069O65277N13946r7157m54305l09550j74050k75045j66721L09531O03683
$$ -165069 500208 1014154 916997 462692 153142 -20908 -295953 -462674 -153143 450540
36754D50540L65900m0827k51163l46229l48413o5270L23087L07863r0205k72695
$$ 450540 816440 775613 524450 178221 -170192 -235462 87625 395488 305283 32588
36744C2588o2012M1411k05738l95742k40555J1779J46107K59752L11179J01708
$$ 32588 -29424 11987 -193751 -589493 -830048 -818269 -672162 -412410 -101231 477
36734D77j64235m0432L24978K92534j97406m68404k05136J09748R7986K4260J15970
$$ 477 -163758 -204190 120788 413322 215916 -252488 -457624 -347876 -249890 -225630 -109660
36723a09660R4937k04883l74846l3280N46555P82181M70339q7718m23494k95761
$$ -109660 -14723 -219606 -594452 -627732 -81177 701004 1171343 1083625 660131 364370
36713C64370M4537O7297l30430n81078k44133L07561M71968L00618K04799J68289
$$ 364370 408907 476204 145774 -435304 -679437 -371876 100092 400710 605509 773798
36703G73798m0348k12789l6489J97363J7911l50125l47041o1463r476j73744j41453
$$ 773798 733450 520661 484172 681535 699446 349321 2280 -59183 -68659 -242403 -383856
36692c83856K6509k7889j35767J02948M17467K51804j55907j35425J64110L3786
$$ -383856 -357347 -385236 -521003 -418055 -588 251216 95309 -40116 123994 157780
36682A57780m06333l20540L23979O15402K32901j00650K9294R4511k74393o05921
$$ 157780 -248553 -569093 -245114 370288 603189 502539 531833 626344 351951 -253970
36672b53970m55869o6905K34586M93641O53295M14527j21430l96556k24114J1917
$$ -253970 -709839 -776744 -542158 -48517 604778 1019305 897875 501319 277205 289122
36662B89122J06343K33308L29743J01323k88317l81649k93001m81233o94695k51574
$$ 289122 395465 628773 958516 1059839 771522 389873 96872 -384361 -1079056 -1330630
36652a330630N77796P12195O2m51716n3768M20054K66691q0601o5717J7635j90581
$$ -1330630 -752834 -40639 -40577 -492293 -546061 -126007 140684 60083 -5634 12001 -178580
36641a78580l17932j2398L15911K27697J3058O5418J75538N7439o9431J3407O3254
$$ -178580 -496512 -508910 -192999 34698 47756 113174 288712 346151 276720 290127 353381
36630C53381o7819n6248K31727L52480K9217l55114m32497l54147k45893R0393
$$ 353381 285562 229314 461041 813521 842738 487624 55127 -299020 -544913 -454520
36620d54520N24167M50119k22699p13639m94656j056K49949M09379O35316N57302
$$ -454520 69647 519766 297067 -416572 -911228 -912284 -662335 -252956 382360 939662
36610I39662L4998l63013k83936j89913l87908l35646L08804P93448L52840n10989
$$ 939662 974660 611647 327711 137798 -250110 -585756 -276952 516496 869336 358347
36600C58347p74613l58732N9286K05896K91324L25486J88945P7272J69382J82871
$$ 358347 -416266 -774998 -715712 -509816 -218492 106994 295939 373211 542593 725464
36590G25464j19707l84852k45626o08p4857k51401j04081K26628L47617L02255
$$ 725464 605757 220905 -24721 -25329 -100186 -351587 -455668 -229040 118577 420832
36580D20832L22496K96266P4646j08987p9121j04052l12166k94396J27322L79369
$$ 420832 743328 1039594 1114240 1005253 926132 822080 509914 215518 342840 722209
36570G22209O6718k42793M4950M77132L15351k10712l82010k23361k42976l60906
$$ 722209 788927 546134 591084 1068216 1383567 1172855 790845 567484 324508 -36398
36560c6398j56936J29382p8297n67874n72469k3945L95839L94483L30046L48652
$$ -36398 -193334 -63952 -142249 -710123 -1282592 -1306537 -910698 -516215 -186169 162483
36550A62483J67294k01623l17453m3586K41040K56723R8329j10062l15368l42098
$$ 162483 329777 128154 -189299 -232885 8155 264878 363207 253145 -62223 -404321
36540d04321r3877J58224J50612Q1736K03437K70681j269k64811m3650L67588
$$ -404321 -498198 -339974 -189362 -107626 95811 366492 365223 100412 56762 424350
36530D24350K90357k41619n58925l98668j04896J08692L28995M35236J77043k29901
$$ 424350 714707 473088 -85837 -484505 -589401 -480709 -151714 283522 460565 230664
36520B30664k68144R8418L99098L79609J92625k9221k21640j71485J49420K50637
$$ 230664 -37480 60938 460036 839645 1032270 1003049 781409 609924 759344 1009981
36510A009981k10651o84877m32539K52905M20909n6421l45056k7282L31888K02680
$$ 1009981 799330 114453 -318086 -65181 355728 299307 -45749 -73031 258857 461537
36500D61537j53473k47622l8325K32886L82083K80885o4014l61552l50998k01940
$$ 461537 308064 60442 22117 255003 637086 917971 853957 492405 141407 -60533
36490f0533j96848k15616m1567R3309j01059l22377j45471J41395J830l12160
$$ -60533 -257381 -472997 -514564 -421255 -522314 -844691 -990162 -848767 -846937 -1159097
36480a159097j41474L59474M36954P8339J5064L59158M05404k7669k19451J61552
$$ -1159097 -1300571 -941097 -504143 -425804 -410740 -51582 353822 326153 106702 268254
36470B68254M69297K10581k11552l42853l61154m40862k97272J23774K97530j9661
$$ 268254 737551 948132 736580 393727 32573 -408289 -705561 -581787 -284257 -303918
36460c03918l15429j95218o024r5427j72736N6631K96769K42011J22758J64257
$$ -303918 -619347 -814565 -820589 -916016 -1088752 -1032121 -735352 -493341 -370583 -206326
36450b06326J32336q8076j26608J42981K05733j83295m07820R590N02332L45314
$$ -206326 -73990 -162066 -288674 -145693 60040 -123255 -531075 -521485 -19153 326161
36440C26161j54011k26663P2865Q5322k65894m33857k42621o5886m2496J15970
$$ 326161 172150 -54513 18352 103674 -162220 -596077 -838698 -904584 -947080 -831110
36430h31110M57992N89820L07784n6888j12383R6278K09084q651m08196n75688
$$ -831110 -373118 216702 524486 467598 355215 451493 660577 651926 243730 -331958
36420c31958k79000J92877L44523J36153l839J24155K26194Q1969j16886k04287
$$ -331958 -610958 -418081 -73558 62595 58756 182911 409105 491074 374188 169901
36410A69901k99163l73786j29306L65114N07889P0591l28770j72801J36102L3057
$$ 169901 -129262 -503048 -632354 -267240 240649 311240 -17530 -190331 -54229 -21172
36400b1172k10365k4676L82871L72536n629j24614J41803L08034J80767O2053
$$ -21172 -231537 -256213 126658 499194 493565 368951 510754 818788 999555 1061608
36390A061608M3429j24147l86822l56919m6300P2340j11752j60720P4920J43831
$$ 1061608 1105037 980890 594068 237149 190849 263189 151437 -9283 65637 209468
36380B09468j70367l74224n9947L93235M22621J34216K431O8086K9607q9976Q608
$$ 209468 39101 -335123 -395070 -1835 420786 555002 557433 625519 655126 565150 573758
36369E73758K50721J86710k63439n83311l95672j0607O7461j24751j50540J12479
$$ 573758 824479 1011189 747750 164439 -231233 -241840 -174379 -299130 -449670 -337191
36359c37191L15733J98192o6070j88357j41407n5456K6712J04371J15309O0872
$$ -337191 -21458 176734 110664 -77693 -219100 -274556 -247844 -143473 -28164 32708
36349C2708O2170J23324N5365j58337j93556J06503L32392O4886l77820l10118
$$ 32708 94878 218202 273567 115230 -78326 28177 360569 425455 47635 -262483
36339b62483K79721O66443M36687R643q8764N7115O0476j58282l94617m89343
$$ -262483 17238 683681 1120368 1130011 1041247 1098362 1158838 1000556 605939 116596
36329A16596l64970n880L66334L78185l597l34091k63226K7516J75456J25398
$$ 116596 -248374 -254254 112080 490265 486668 152577 -110649 -83133 92323 217721
36319B17721J9497j10469k53323k66583r9429M0751j592o6795K8738J62640J30592
$$ 217721 237218 126749 -126574 -393157 -492586 -451835 -453427 -520222 -491484 -328844 -198252
36308a98252o821o3171k4902K8780J10057J98655J48365m7868j33683J4693J23026
$$ -198252 -205073 -268244 -293146 -264366 -154309 44346 192711 144843 11160 25853 148879
36297A48879m5557k43983j11893K01820K30994p0034k24708O3546M63159M42946
$$ 148879 103322 -140661 -252554 -50734 180260 110226 -114482 -50936 412223 855169
36287H55169m4348m98714m67755p3101J68471K5202j68152n1865J93401J64608
$$ 855169 810821 312107 -155648 -228749 -60278 -35076 -203228 -255093 -61692 102916
36277A02916o9874q9237J26394J40758j45607k45352J17220M88110L30520k11790
$$ 102916 33042 -56195 70199 210957 65350 -180002 -62782 425328 755848 544058
36267E44058n68565m57113l6809L61007M03292k3898n25742m91962P5664M50001
$$ 544058 -24507 -481620 -518429 -157422 245870 221972 -303770 -795732 -720068 -270067
36257b70067J87649k20766j17930L45243N17750K04156k15646l97831k93782J4436
$$ -270067 -82418 -303184 -421114 -75871 441879 646035 430389 32558 -261224 -246788
36247b46788L14271K76692j42847m95392l76026L5421K93380K90594J99344Q9729
$$ -246788 67483 344175 201328 -294064 -670090 -634669 -341289 -50695 148649 238378
36237B38378j2041M9580K88496L91177J66652j08177j54355j46613k85451l11229
$$ 238378 226337 275917 564413 955590 1122242 1014065 859710 713097 427646 116417
36227A16417K6759L70673K28430k12331l45026k5905L57613N11769M06372L6893
$$ 116417 143176 513849 742279 529948 184922 159017 516630 1028399 1434771 1471664
36217A471664m42490n70467j23212M07174M32061J08616l6215k9349k74559o71035
$$ 1471664 1029174 458707 335495 742669 1174730 1283346 1247131 1217782 943223 272188
36207B72188p05874l38812l7814L0307J22085K63023K07985N8062J70367M06229
$$ 272188 -433686 -772498 -810312 -780005 -657920 -394897 -186912 -128850 41517 447746
36197D47746K29840l29396n70967j88998K51279J87589j76657k97543k4930L61223
$$ 447746 677586 348190 -222777 -411775 -160496 27093 -149564 -447107 -472037 -110814
36187a10814N21449L11448p0580k04920k227O1827l11590n83082j23693O43471
$$ -110814 410635 722083 651503 446583 444356 506183 194593 -388489 -512182 131289
36177A31289P19997L9520m57485k93123K401o44O246K33516K70255q8768l16295
$$ 131289 851286 890806 433321 140198 142599 141955 148201 381717 651972 563204 246909
36166B46909l6948K72665R3452k42253j44391K29545K63756j28819m47690l77689
$$ 246909 209961 482626 576078 333825 189434 418979 682735 553916 106226 -271463
36156b71463j12103L4853q201p0311N1802L12874L77077P6543k17860q9239K05347
$$ -271463 -383566 -348713 -356914 -427225 -375423 -62549 314528 391071 173211 83972 289319
36145B89319Q8730l54982m81121j67653M2763j324J94792O86029P37682O1601
$$ 289319 378049 23067 -458054 -625707 -582944 -584268 -389476 296553 1034235 1095836
36135A095836n22218l18181J62637J04796l31313m59566k26112n8380P881K14090
$$ 1095836 573618 255437 418074 522870 191557 -268009 -494121 -552501 -544620 -330530
36125c30530M18519L31348J49802K39752M17270K35029k11991m14274k24179N8145
$$ -330530 87989 419337 569139 808891 1226161 1461190 1249199 834925 610746 668891
36115F68891K01002J56225r4926l51753j95038L33312M98009r2277p18920n57335
$$ 668891 869893 1026118 931192 579439 384401 717713 1215722 1123445 404525 -152810
36105a52810N2667K23517m0566o2909J72820Q6644k36309r1018M62067M97313
$$ -152810 -100143 123374 82808 19899 192719 279363 43054 -47964 414103 911416
36095I11416k00325o42250k05872L77916K66103j94901k15633J17329J71504p3050
$$ 911416 711091 68841 -137031 240885 506988 312087 96454 213783 385287 312237
36085C12237j14237P7718J7982l85374o19606l72476K4762J43475K0474m2169
$$ 312237 198000 275718 293700 -91674 -711280 -1083756 -1058994 -915519 -895045 -937214
36075i37214N8162J92691K65241K95749K95855K23366Q7138l352K7680Q2448L031
$$ -937214 -879052 -686361 -421120 -125371 170484 393850 480988 477636 505316 587764 590795
36064E90795j65254j83949J8094J70338K6238k39205k47882M2279K97136K97467
$$ 590795 425541 241592 259686 430024 456262 217057 -30825 11454 308590 606057
36054F06057J87463J69148J98711J10901j24419l86747n32996m69365k08176Q3592
$$ 606057 793520 962668 1161379 1272280 1147861 761114 228118 -241247 -449423 -365831
36044c65831J95381Q8741q4956k06136k99498l65233k39771K12935P95688J032061
$$ -365831 -170450 -81709 -166665 -372801 -672299 -1037532 -1277303 -1064368 -268680 763381
36034G63381O45849o4612m87603l78695j17820j62365m23727m45870r1462L02567
$$ 763381 1409230 1344618 857015 478320 360500 198135 -225592 -671462 -762924 -460357
36024d60357M53239M35539L63646J55554j78170l49995j88305L3486l2698k84979
$$ -460357 -7118 428421 792067 947621 769451 419456 231151 264637 231939 -53040
36014e3040l21566j6010L25278L50843L4922l15785l45626r428L38779L49428
$$ -53040 -374606 -390616 -65338 285505 320427 4642 -340984 -350412 -11633 337795
36004C37795J19080j2033j8113j41045l13299j72845K34872L74540Q2776j13877
$$ 337795 456875 444842 426729 285684 -27615 -200460 34412 408952 491728 377851
35994C77851R6635K37440j08859m91157l13795J29557J40811k13679k64025J22825
$$ 377851 474486 711926 603067 111910 -201885 -72328 68483 -145196 -409221 -286396
35984b86396L88274K15449j19386l29559l91666k37842J91063N76529N12121J57535
$$ -286396 101878 317327 197941 -131618 -523284 -761126 -570063 6466 518587 676122
35974F76122J3050R9132K1676k00247j37036J81724K02262j99883m80350l51522
$$ 676122 689172 788304 809980 609733 472697 654421 856683 656800 176450 -175072
35964a75072j78145j81276l7618L46082M25234r6693o22345m84333R6522M43068
$$ -175072 -353217 -534493 -572111 -226029 199205 102512 -519833 -1004166 -907644 -464576
35954d64576L74316J72011j9823k00421k23622l0969P9225j17108l32565k12041
$$ -464576 -90260 81751 61928 -138493 -362115 -393084 -313859 -430967 -763532 -975573
35944i75573P3928J60122J18498K17397L08826P4091k84319k51470J45055L28292
$$ -975573 -901645 -741523 -623025 -405628 -96802 -22711 -307030 -558500 -413445 -85153
35934h5153P7508j68667p7923O8027p8056l16921k24903J73704M35577K98802
$$ -85153 -7645 -176312 -254235 -186208 -264264 -581185 -806088 -632384 -196807 101995
35924A01995m7406k84545l27865k97314k55773j03197K41041O15166O96427L68106
$$ 101995 54589 -229956 -557821 -855135 -1110908 -1214105 -973064 -357898 338529 706635
35914G06635q7383k82892j65520j7117l4171r7559l6873N8026j5525j93991j67242
$$ 706635 619252 336360 170840 153723 119552 21993 -14880 43146 27621 -166370 -333612
35903c33612J64836M78687M24814P2071k45145l75972l84868k64948J3621K26755
$$ -333612 -168776 309911 734725 806796 561651 185679 -199189 -464137 -450516 -223761
35893b23761J10466j22497J2193M36348M79939m9417m27505j19919L14651J24646
$$ -223761 -113295 -235792 -223599 212749 692688 643271 215766 95847 410498 535144
35883E35144l79517l74988M9697R0408k99855l03528K58325M86958q8630o16558
$$ 535144 155627 -219361 -169664 -79256 -379111 -682639 -424314 62644 -25986 -642544
35873f42544k27839N83855P26244R5320m61945m44898j49978L6662R1312R4259
$$ -642544 -870383 -286528 439716 535036 73091 -371807 -521785 -485123 -393811 -299552
35863b99552N9960O5190J59207J73446l8739k60968j78102J06480K07895N8368
$$ -299552 -239592 -174402 -15195 158251 119512 -141456 -319558 -213078 -5183 53185
35853E3185l5453O5233J32810J494j55017j32199k5943n7124k02297j97574Q8535
$$ 53185 17732 82965 215775 217269 62252 -69947 -95890 -153014 -355311 -552885 -464350
35842d64350M13052L95648k351l73027l47288n0456J35656J39424J94593L21673
$$ -464350 -51298 344350 341999 -31028 -378316 -428772 -293116 -153692 40901 362574
35832C62574K48997o1795k56556j52309l9059j39527j73803J41101M87846L46172
$$ 362574 611571 549776 293220 140911 101852 -37675 -211478 -70377 417469 763641
35822G63641j81036m55188k00081J45523R0522k38794l11718P8708N17366M44370
$$ 763641 582605 127417 -72664 72859 163381 -75413 -387131 -308423 208943 653313
35812F53313j50284o56369n55653n3856K28803R0804q7330j9149P8815p1861l29347
$$ 653313 503029 -153340 -708993 -762849 -534046 -443242 -530572 -549721 -470906 -542767 -872114
35801h72114l55035o8736L47441O78577P18377L33973k81103o40182m81957p3566
$$ -872114 -1227149 -1295885 -948444 -269867 448510 782483 501380 -138802 -620759 -694325
35791f94325J83239K24618K08005J65360K5187j83128l54740m18885l23261q9960
$$ -694325 -511086 -286468 -78463 86897 112084 -71044 -425784 -844669 -1167930 -1257890
35781a257890O9529k9476j69709O6116O35092R89527Q16570L78624j7082l67029
$$ -1257890 -1188361 -1217837 -1387546 -1321430 -686338 303189 1119759 1498383 1481301 1114272
35771A114272o04280m78927r2822M9844j40235j26077K52654L32946k26059o41963
$$ 1114272 509992 31065 -61757 -11913 -152148 -278225 -25571 307375 81316 -560647
35761e60647j84858N32235M61544j96759l75752R8502L54017K0634k73751j27489
$$ -560647 -745505 -213270 248274 51515 -324237 -225735 128282 148916 -124835 -252324
35751b52324J3041j93512l48050q6397K65565K87132J07309J8681k4541j06259
$$ -252324 -239283 -432795 -780845 -867242 -601677 -314545 -207236 -188555 -213096 -319355
35741c19355k1430L18709N40358K94527j84427l82398j81734O2422N007l21478
$$ -319355 -340785 -22076 518282 812809 628382 245984 64250 126672 131679 -189799
35731a89799n49546l39702J94711N08421K72239j54982k23592J8290R1114r7253
$$ -189799 -739345 -1079047 -884336 -375915 -103676 -258658 -482250 -463960 -372846 -470099
35721d70099j72167r044Q0193k8765m2719J79170L43800K29879L6264J3024J11174
$$ -470099 -642266 -651310 -571117 -599882 -642601 -463431 -119631 110248 146512 159536 270710
35710B70710J64240J02929q3132k78141j77268K98673O33266L04960l50975n39163
$$ 270710 434950 537879 454747 176606 -662 298011 931277 1236237 885262 346099
35700C46099k05459m6619k85867l55856j1064J96564n4976k53268J0588L22683
$$ 346099 140640 94021 -191846 -547702 -558766 -362202 -417178 -670446 -659858 -337175
35690c37175K52477J08845K38913L03326j5377k60774K4327L83076J94727j97456
$$ -337175 -84698 24147 263060 566386 551009 290235 314562 697638 892365 694909
35680F94909r1688K68757Q0005n77808p85306k40119L51803M41663K74292J73099
$$ 694909 603221 871978 951983 374175 -411131 -651250 -299447 142216 416508 589607
35670E89607K6369k29515l16952j27617K5579o7763k12631k21322j68067q3412
$$ 589607 615976 386461 69509 -58108 -32529 -100292 -312923 -534245 -702312 -785724
35660g85724J25811L13637J61153k29662l26247M6814M16218L85749J48215L035
$$ -785724 -659913 -346276 -185123 -414785 -741032 -694218 -278000 107749 255964 258999
35650B58999j24908l29712l54022j2413L66945L67175R1537n6149J8568R6780
$$ 258999 134091 -195621 -549643 -562056 -195111 172064 263601 207452 226020 322800
35640C22800O8446j7550j79918m20720n27362l03770P8317K70732K17693J35028
$$ 322800 391246 373696 193778 -226942 -754304 -1058074 -979757 -709025 -491332 -356304
35630c56304J04969K4427q3877n5781R5069J56940P2526J9461O5184L6320j39681
$$ -356304 -251335 -226908 -310785 -366566 -271497 -114557 -42031 -22570 42614 78934 -60747
35619f0747k35284n8779K13646K60185L8495k15002l20833k93741j97875o1528
$$ -60747 -296031 -354810 -141164 119021 157516 -57486 -378319 -672060 -869935 -931463
35609i31463O3560J18735J36037J90250K33715J13453j86425m23456l20882J01359
$$ -931463 -867903 -749168 -613131 -422881 -189166 -75713 -262138 -685594 -1006476 -905117
35599i05117M89419N04112K17262P5951L51849O94659M99979k21094p01098m09375
$$ -905117 -415698 88414 305676 381627 733476 1428135 1928114 1707020 1005922 596547
35589E96547J56430J47534l92741o15282j78335K70993J75778q8028N5725L93480
$$ 596547 752977 900511 507770 -107512 -285847 -14854 160924 72896 128621 522101
35579E22101L44237j4250j06416J36071K02590p0844k42514p6330N4694j50551
$$ 522101 866338 852088 745672 881743 1084333 1013489 770975 694645 749339 598788
35569E98788l90903k68348R0274K81392J97666K5349j04989j75958j61884q5115
$$ 598788 207885 -60463 29811 311203 508869 534218 429229 253271 91387 6272
35559F272n5182q6610l9390J23290K11676Q8867j18284k29463k43186k26601j66812
$$ 6272 -48910 -135520 -174910 -51620 160056 248923 130639 -98824 -342010 -568611 -735423
35548g35423o4932N005M2345J33177K31052J57140p3601j72662L6426L64754N10727
$$ -735423 -800355 -795350 -753005 -619828 -388776 -231636 -305237 -477899 -441473 -76719 434008
35537D34008L75244O2318k10377j85197J52678L57940k0057p15276r40808m33762
$$ 434008 809252 871570 661193 475996 628674 986614 966557 251281 -689527 -1123289
35527a123289J93968L52525J97090J51433K20585J91131R3864K7932j18974l55482
$$ -1123289 -929321 -576796 -379706 -228273 -7688 183443 277307 305239 186265 -169217
35517a69217l50603M5063L95820K80222l8480o1029J37949J25260j11213k05460
$$ -169217 -519820 -474757 -78937 201285 162805 101776 239725 364985 253772 48312
35507D8312p6348L1762N2810R4103M4744k49889n18170l48146J07408K90730Q6683
$$ 48312 -28036 3726 56536 150639 195383 -54506 -572676 -920822 -813414 -522684 -436001
35496d36001p1190L6800J41747O8618L0503J77344L33036L53403L28544K89960
$$ -436001 -507191 -470391 -328644 -260026 -229523 -52179 280857 634260 962804 1252764
35486A252764J18869j29183k07259j06351j09424k98460m05069k82251j26845
$$ 1252764 1371633 1242450 1035191 928840 819416 520956 115887 -166364 -293209
35477b93209q2969j5465J47140K14014P5122p7364n6548O8614J67613K10760J36566
$$ -293209 -376178 -391643 -244503 -30489 44633 -32731 -89279 -20665 146948 357708 494274
35466D94274j27832m16793m36286k19969j07058j69175r0091K33060M41842L12320
$$ 494274 366442 -50351 -486637 -706606 -813664 -982839 -1072930 -839870 -398028 -85708
35456h5708J39640K04202K77143O0739k34687k23361j930J5903k16555l32781
$$ -85708 53932 258134 535277 596016 361329 137968 136038 151941 -64614 -397395
35446c97395j57206O0469O2927r2077k09066k05122r7097O6554J74673J07771
$$ -397395 -554601 -494132 -431205 -523282 -732348 -937470 -1034567 -968013 -793340 -685569
35436f85569q1859j57742K1926K73786K66403n6873l57890l09805k7392J03296
$$ -685569 -767428 -925170 -903244 -629458 -363055 -419928 -777818 -1087623 -1115015 -1011719
35426a011719r085n2025J51330L23989J85045p7497j15803L3165J09564J43967
$$ -1011719 -1020804 -1072829 -921499 -597510 -412465 -489962 -605765 -572600 -463036 -319069
35416c19069L33475N22934L47371j13241l56862k09403l3632p1393j12176j0917
$$ -319069 14406 537340 884711 771470 414608 205205 171573 100180 -11996 -22913
35406b2913N383j56242j52650J89535M05258L3822n73213o38273j7054O31021
$$ -22913 -17530 -173772 -326422 -136887 268371 302193 -271020 -909293 -926347 -295326
35396b95326P11849L08079j30106l36738l29947k15757r1080n1853j46425k94793
$$ -295326 416523 724602 594496 257758 -72189 -287946 -379026 -430879 -577304 -872097
35386h72097l07887n5885L49517O02571N09124J92864q1672j96447j72926k4911
$$ -872097 -1179984 -1235869 -886352 -283781 225343 418207 336535 140088 -32838 -57749
35376e7749J66166J63639j34360l98871k20471K59333M50198J06183l54729m37237
$$ -57749 108417 272056 137696 -261175 -481646 -222313 227885 334068 -20661 -457898
35366d57898j29819K61234N03536M77991J30303l75872o64884n23712j40744J53642
$$ -457898 -587717 -326483 177053 655044 785347 409475 -255409 -779121 -919865 -766223
35356g66223K37744K03610J75597K03405K10651N4474k19689k94238o777K82164
$$ -766223 -528479 -324869 -149272 54133 264784 319258 99569 -194669 -201446 80718
35346H0718J31261k83981l96599j11757J22764J24202J97687M09829L38268j42651
$$ 80718 211979 -72002 -468601 -580358 -457594 -333392 -135705 274124 612392 469741
35336D69741m74779k48957J33398J31864q7841n6052J44098P2861k33547k68838
$$ 469741 -5038 -253995 -120597 11267 -76574 -132626 11472 84333 -149214 -418052
35326d18052J37906N43872N03723J14237j62968n8623J92316J14243l58176o43516
$$ -418052 -280146 263726 767449 881686 718718 660095 852411 966654 608478 -35038
35316c5038k49483L94004M02762k54915o46601k87590J39610m8780m19578k03899
$$ -35038 -284521 109483 512245 257330 -389271 -676861 -537251 -586031 -1005609 -1209508
35306a209508L89719N36359J36961j11685J12835L55454K30224k8136n8207Q9443
$$ -1209508 -819789 -283430 -146469 -258154 -145319 210135 440359 412223 354016 443459
35296D43459J29702n2406l13851l90950j29848K71740L84103Q2418k52688k84572
$$ 443459 573161 520755 206904 -184046 -313894 -42154 341949 424367 171679 -112893
35286a12893j71154j74914j76140J2670J76350M7367j32749M4140M23564M59512
$$ -112893 -284047 -458961 -635101 -622431 -446081 -398714 -531463 -487323 -63759 395753
35276C95753K6743m42447n84215m25457j35390J41687K55426J89687J50720K51978
$$ 395753 422496 -19951 -604166 -1029623 -1165013 -1023326 -767900 -578213 -427493 -175515
35266a75515L02024J68110N0322Q0591L3639j78425j90343J40960K67859j87523
$$ -175515 126509 294619 344941 425532 459171 280746 90403 231363 499222 311699
35256C11699o20941l13527L34726M01876n3936j64115K43323M34172Q9740k54863
$$ 311699 -309242 -622769 -288043 113833 59897 -104218 139105 573277 663017 408154
35246D08154k61797k58382l95294k97148J00803K47111q4632l32750o7920L12658
$$ 408154 146357 -112025 -507319 -804467 -703664 -456553 -541185 -873935 -941855 -629197
35236f29197K69113q3412k91615k05849L9703K79029L20191R8813q8186L4742
$$ -629197 -360084 -443496 -735111 -940960 -901257 -622228 -302037 -203224 -291410 -256668
35226b56668J59777j44082n09706j83521O37784R14698L76809q6154L0632R8552
$$ -256668 -96891 -240973 -750679 -934200 -296416 618282 995091 908937 939569 1038121
35216A038121l09641n36113q7627L15587n6400n89511l08292M69432O49919Q5768
$$ 1038121 728480 192367 104740 420327 363927 -225584 -533876 -64444 585475 671243
35206F71243l73551k93250m8987O4255J58428K12469L5385k12384j54869J49131
$$ 671243 297692 4442 -44545 19710 178138 390607 425992 213608 58739 207870
35196B07870K94549J97666R7209J1478k00341l58675j75253J45445J37794j55607
$$ 207870 502419 700085 797294 808772 608431 249756 74503 219948 357742 202135
35186B02135k51532j7830J95382J93940J34323Q0362q0320k47815j54353J49943
$$ 202135 -49397 -67227 128155 322095 456418 536780 456460 208645 54292 204235
35176B04235L06279J75961l8992j89234l01330l46474k63230j54717j29143p2286
$$ 204235 510514 686475 647483 458249 156919 -189555 -452785 -607502 -736645 -808931
35166h08931R6868J76615O3698N1368K63457K06287m34058r47716m66104N68257
$$ -808931 -712063 -535448 -471750 -420382 -156925 49362 -384696 -1332412 -1798516 -1230259
35156a230259Q55223J46584m09185n9929N04765L99573j09953k24426J06179L08563
$$ -1230259 -375036 -228452 -637637 -697566 -192801 206772 96819 -127607 -21428 287135
35146B87135J84542L6007n997j27283l46155l92332j35823J96299L11979J70090
$$ 287135 471677 507684 501687 374404 28249 -364083 -499906 -303607 8372 178462
35136A78462m4620j55817j67080k01312k63265j67253J78207N35650N90765L41309
$$ 178462 133842 -21975 -189055 -390367 -653632 -820885 -642678 -107028 483737 825046
35126H25046K1286k26369l45292k27766N7615J00089l15703o72683l18023M81893
$$ 825046 846332 619963 274671 46905 104520 204609 -111094 -783777 -1101800 -619907
35116f19907P79390L01122j76135l6525L12605K04164k66348n13035l35409k417
$$ -619907 159483 460605 284470 247945 560550 764714 498366 -14669 -350078 -352495
35106c52495K50714L54628K59092L9769n4061K8147j8128l20854m78495j52364
$$ -352495 -101781 252847 511939 551708 497647 525794 507666 186812 -291683 -444047
35096d44047L10125L57577Q5989J8031J92044J40652k14117l25361J05662N87758
$$ -444047 -133922 223655 309644 327675 519719 660371 446254 120893 226555 814313
35086H14313N15869j5837m48833n05095l01515M7862M73558O86212L73020k53885
$$ 814313 1330182 1314345 865512 360417 58902 106764 580322 1266534 1639554 1385669
35076A385669n49055k74737M6574p2578l16463r4307M15967M41185j55806n53707
$$ 1385669 836614 561877 608451 535873 219410 125103 541070 982255 826449 272742
35066B72742j78795M16725L99862j16901l66682j44032K7337j33263k69761r9664
$$ 272742 93947 510672 910534 793633 426951 282919 310256 176993 -92768 -192432
35056a92432J24405J21295L2400N5848N2744j29556k71378j00646K19470K93578
$$ -192432 -68027 53268 85668 141516 194260 64704 -206674 -307320 -87850 205728
35046B05728O5756j40332j06098M0022Q4117N714q5699j50496k27424k72200j27420
$$ 205728 271484 131152 25054 65076 149193 154907 69208 -81288 -308712 -580912 -708332
35035g08332K35402N16962L49060j99296o06027n14354j35723J37979K50696L35985
$$ -708332 -472930 44032 393092 193796 -412231 -926585 -1062308 -924329 -673633 -337648
35025c37648L25974J01226j52146j63924l7322o0235j75527j05658Q9130R6742
$$ -337648 -11674 89552 -62594 -226518 -263840 -324075 -499602 -605260 -516130 -419388
35015d19388n1243k7737J46980J12022j18779r2767K57040L67183p8271n89297
$$ -419388 -470631 -498368 -351388 -239366 -358145 -450912 -193872 173311 95040 -494257
35005d94257n53778k3876N20189P74822O67851K34109k30932k98812j5033L7363
$$ -494257 -1048035 -1071911 -551722 223100 890951 1125060 894128 595316 580283 617646
34995F17646l90950p46924m84184J17240M25342L41343J75877M769k54180l96241
$$ 617646 226696 -520228 -1004412 -887172 -461830 -120487 55390 60159 -194021 -590262
34985e90262j82788J34789J31336p7119r374L62327N38664K54218j89025m09381
$$ -590262 -773050 -638261 -506925 -584044 -593418 -231091 307573 561791 372766 -36615
34975c6615l47207j23658J31089K53433J62345K3693L3601R1010j5565j85120
$$ -36615 -383822 -507480 -376391 -122958 39387 63080 96681 187691 172126 -12994
34965a2994j37314Q4206J45293k9480j38970j6784J00728k7561k44845j83432
$$ -12994 -150308 -66102 79191 49711 -89259 -106043 -5315 -32876 -277721 -461153
34955d61153K49995O91637O43316L0138n98734o36679j99930J1454k58377m31094
$$ -461153 -211158 480479 1123795 1153933 555199 -81480 -281410 -269956 -528333 -959427
34945i59427n0925M11076K89212j66652j77295K97453N17949J72644k04461j85929
$$ -959427 -1010352 -599276 -310064 -476716 -654011 -356558 161391 334035 129574 -56355
34935e6355n2808j28461j68488J38660N35067N31533J03172l30708m35769k09430
$$ -56355 -109163 -237624 -406112 -267452 267615 799148 902320 571612 135843 -73587
34925g3587J17011K26684l3872m00106m05710K1296M36612M67592K15548o0753
$$ -73587 43424 270108 236236 -163870 -569580 -548284 -111672 355920 571468 510715
34915E10715k94298m30582k74622J69760N03752M10980R8635n1099l6793r8978
$$ 510715 216417 -214165 -488787 -319027 184725 595705 694340 643241 606448 507470
34905E07470k34320k42687j26171n2343q481J20609J94738l1215l86354l72521
$$ 507470 273150 30463 -95708 -148051 -156532 -35923 158815 127600 -258754 -631275
34895f31275Q6733M14937J69568k85973k82674J91357M94473K78217m5407J8106
$$ -631275 -544542 -129605 39963 -246010 -528684 -337327 157146 435363 389956 408062
34885D08062K81965J85271l04061n60934j67851M64862N96892P2283n49835p06495
$$ 408062 690027 875298 571237 10303 -157548 307314 904206 976489 426654 -279841
34875b79841m01307k5655J62895K23586K80630K88044J49232k7910j2292J58954
$$ -279841 -681148 -706803 -543908 -320322 -39692 248352 397584 369674 357382 516336
34865E16336J16876l01221o69420m88709M7097K76876N5901m7943K93793O03699
$$ 516336 633212 331991 -337429 -826138 -779041 -502165 -446264 -494207 -200414 403285
34855D03285L48046k31642n13950l62811r1975J40721L57717L99783J13761k19418
$$ 403285 751331 519689 5739 -357072 -449047 -308326 49391 449174 562935 343517
34845C43517j81194J45729L35543L02231K78841K23252j19512n74625o21463k17727
$$ 343517 162323 308052 643595 945826 1224667 1447919 1328407 753782 132319 -85408
34835h5408Q4410k678j27606J4979K08414J93480J00646J00315Q0974k5768k5908
$$ -85408 -998 -3676 -131282 -116303 92111 285591 386237 486552 567526 541758 515850
34824E15850J36232J64337j04398l77363l55179j43564L4798J58944K00049J4179
$$ 515850 652082 816419 712021 334658 -20521 -164085 -129287 29657 229706 243885
34814B43885k94484l48048j05243k626j78045j34352L81841P65392M28587k16017
$$ 243885 -50599 -398647 -503890 -506516 -684561 -818913 -437072 328320 756907 540890
34804E40890l68207m3943J19336j4760o123K15793J80393k50990n70585l97560
$$ 540890 172683 128740 248076 233316 227193 442986 623379 372389 -198196 -595756
34794e95756K449J98141J39222J5716n3843j1253J59209L03558K15372m5504k04007
$$ -595756 -593307 -395166 -255944 -240228 -294071 -305324 -146115 157443 372815 327311 123304
34783A23304j59821n5757K5674J20075J52960K91k15291k34464p5850J2154R580
$$ 123304 -36517 -92274 -66600 53475 206435 206726 -8565 -243029 -318879 -306725 -297145
34772b97145J32836L53239L45993L1335k40823k04138j7136O9019N2452K2159
$$ -297145 -164309 188930 534923 566258 325435 121297 104161 173180 225632 247791
34762B47791l8022j12372q2953N3493J34413R7875N0988J8868o5243p3227K20647
$$ 247791 209769 97397 14444 67937 202350 300225 351213 370081 304838 231611 452258
34751D52258O44662O65348J26457m45193n26364k30133J4245N8036K286j01931
$$ 452258 1096920 1762268 1888725 1443532 917168 687035 701280 759316 761602 659671
34741F59671j88940j04612Q3292J5323l66630n09174L573O95495P58553J72209
$$ 659671 470731 366119 449411 464734 98104 -411070 -407497 287998 1046551 1218760
34731A218760l35570l42539j20585K5870J54754K69658J12132l42420o56558n22170
$$ 1218760 883190 540651 420066 445936 600690 870348 982480 640060 -16498 -538668
34721e38668j99497n2330j1747J24945J92698o6056m23925l80599Q7944M54038
$$ -538668 -738165 -790495 -802242 -677297 -484599 -550655 -974580 -1355179 -1267235 -813197
34711h13197L71020Q2525k4530P1615J59809J65299J45401R0705k7081j05726
$$ -813197 -442177 -359652 -384182 -312567 -152758 12541 157942 248647 221566 115840
34701A15840l0656J02465P7854j32312l13851k88900j21502o732m0939j37725
$$ 115840 85184 187649 265503 133191 -180660 -469560 -591062 -597794 -638733 -776458
34691g76458j31086L5667K07837J78985m499m2466J83773L47177J06994l14552
$$ -776458 -907544 -871877 -664040 -485055 -489554 -532020 -348247 -1070 105924 -208628
34681b08628l61950M9064L86146K91818P3583J17586K28954J5795l62531m08203
$$ -208628 -570578 -521514 -135368 156450 230033 347619 576573 592368 229837 -178366
34671a78366j23785k0430k42651l01979R4833N05350M11907o029k16108j41964
$$ -178366 -302151 -322581 -565232 -867211 -772378 -267028 144879 138850 -77258 -219222
34661b19222j17230k15056j71509N1988J47936j776j16825q906J09692L1421p1436
$$ -219222 -336452 -551508 -723017 -671029 -523093 -524869 -641694 -650600 -540908 -509487 -580923
34650e80923L5390K18000J92368l62p3737M2739J40265Q7242m4155j89768l38617
$$ -580923 -545533 -327533 -135165 -135527 -209264 -166525 -26260 60982 16827 -172941 -511558
34639e11558l55425o9025L83362N86924L57315j2516j48306l1118R4029M5482
$$ -511558 -866983 -936008 -552646 34278 391593 379077 230771 199653 293682 339164
34629C39164j93018m94448n81890k36750L26625N64499K93687k0706M7314K44367
$$ 339164 146146 -348302 -930192 -1166942 -840317 -275818 17869 -2837 44477 288844
34619B88844J16991j65683q0728K83602K39569m06437r29710o75015L8436M15471
$$ 288844 405835 240152 159424 443026 682595 276158 -653552 -1328567 -1290131 -874660
34609h74660K40195j8339L3154K80285M09937L26988J72542Q1037K4360q9232
$$ -874660 -634465 -652804 -619650 -339365 70572 397560 570102 651139 675499 586267
34599E86267k02707j45785L7659L2084k48857l79614m8928K98905O3073m50793
$$ 586267 383560 237775 275434 307518 58661 -320953 -369881 -70976 -7903 -458696
34589d58696l79312K82367N66056Q0760l33144j7651M15090J89211l03259k73435
$$ -458696 -838008 -555641 10415 91175 -241969 -259620 155470 344681 41422 -232013
34579b32013N2619n2394l85530j63576M66113N79846Q4700j45994J31555J28503
$$ -232013 -179394 -231788 -617318 -780894 -314781 265065 349765 203771 335326 463829
34569D63829m38346o92201p3827O54235O27762J57158l0932p725k03903m25303
$$ 463829 25483 -666718 -740545 -86310 541452 698610 667678 659953 456050 30747
34559C0747k47376J03895J69205J40150M26381O97023L23835m29581o45390j39892
$$ 30747 -216629 -112734 56471 196621 623002 1320025 1643860 1214279 568889 428997
34549D28997L01393J58124j96302k84261j89430j53838j30822o1017j11501l34055
$$ 428997 730390 888514 692212 407951 218521 64683 -66139 -127156 -238657 -572712
34539e72712m55893k64086R4911L69999M80599M25728K11840l3123j48337j82673
$$ -572712 -1028605 -1292691 -1197780 -827781 -347182 78546 290386 257263 108926 -73747
34529g3747k62537k63577j1436K41304P2203l40444l35649J57835L50817k08271
$$ -73747 -336284 -599861 -611297 -369993 -297790 -638234 -973883 -816048 -465231 -673502
34519f73502p94936m89993M33689Q49071L26405l80728m52861K0838M08484L98331
$$ -673502 -1468438 -1958431 -1524742 -675671 -349266 -729994 -1182855 -1162017 -753533 -355202
34509c55202J63854m6342j34203p9474P5735J76830Q4419j27454k43174j94590
$$ -355202 -191348 -237690 -371893 -451367 -375632 -198802 -114383 -241837 -485011 -679601
34499f79601j26341j16902j4948K79520N07094L04352k32619n45590l04296J67327
$$ -679601 -805942 -922844 -937792 -658272 -151178 153174 -79445 -625035 -929331 -762004
34489g62004L62445K48758J52447J63180N8461k06903l40249j53372J41179K32416
$$ -762004 -399559 -150801 1646 164826 223287 16384 -323865 -477237 -336058 -103642
34479a03642Q6682j22418k68326l07962k22638p4109m878n4416o9288R4039L56742
$$ -103642 -16960 -139378 -407704 -715666 -938304 -1012413 -1017291 -1071707 -1140995 -1046956 -690214
34468f90214N03628M27851K28133R7365J24388J75643M4225k14805k67593j4778
$$ -690214 -186586 241265 469398 566763 691151 866794 911019 696214 428621 413843
34458D13843R5350l37906q97644p56137P9462N89400J37591n68178m83037K70395
$$ 413843 509193 171287 -726357 -1482494 -1403032 -813632 -676041 -1244219 -1727256 -1456861
34448a456861O68490L41561L65K11388N52980L83052j48639l97475j86904P7253
$$ -1456861 -788371 -446810 -446445 -235057 317923 700975 552336 154861 -32043 45210
34438D5210R7905j6037j19228k41388l37802k01654J97172N40868N18540J92163
$$ 45210 143115 127078 7850 -233538 -571340 -772994 -575822 -34954 483586 675749
34428F75749j25321k04962j0094L32042N17134K41609l75585p42122m63892Q5659
$$ 675749 550428 345466 335372 667414 1184548 1426157 1050572 308450 -155442 -69783
34418f9783K38084l7863j57150J18752L15652O9853k35101j01386K26874J31305
$$ -69783 168301 130438 -26712 92040 407692 477545 242444 141058 367932 499237
34408D99237l72374o28298l21757J24390K49056J26195L2248m400l6302N0942
$$ 499237 126863 -501435 -823192 -698802 -449746 -323551 -291303 -295703 -332005 -281063
34398b81063K85621L87925J47212j87313k38612o1508r143j52771k25787j18526
$$ -281063 4558 392483 539695 352382 113770 52262 43119 -109652 -335439 -453965
34388d53965l4011q3609r5410K0583M5041j63294l09049l8562M45391N50033J21683
$$ -453965 -487976 -571585 -666995 -646412 -601371 -764665 -1073714 -1112276 -666885 -116852 4831
34377D831k76631j27481L14789M16535R1012j43626j9791R8703j01977l14633
$$ 4831 -271800 -399281 -84492 332043 423055 279429 259638 358341 256364 -58269
34367e8269j27820K45079K77985l1696k09509j07244n9404j88387j66424J30725
$$ -58269 -186089 58990 336975 305279 95770 -11474 -70878 -259265 -425689 -294964
34357b94964L00361O9573j97902n4932L33260M73385K53555l9316j93261j81451
$$ -294964 5397 74970 -122932 -177864 155396 628781 882336 843020 649759 468308
34347D68308l503K12393J61716j96537l87194n0739M06064L25460k16305n44888
$$ 468308 464805 677198 838914 642377 255183 204444 610508 935968 719663 174775
34337A74775l97264j24481Q1894M02008P01277M42355l65872q58408m66370K15579
$$ 174775 -222489 -346970 -265076 136932 838209 1280564 914692 56284 -410086 -194507
34327a94507L11214q7784k54930l4850R5817L30O9039L78439M40790L5819l53079
$$ -194507 116707 28923 -226007 -260857 -165040 -164710 -95671 282768 723558 759377 406298
34316D06298k81409p119n844k23065k61417m3606J60524K07113J68910N6809j62430
$$ 406298 124889 117770 111926 -111139 -372556 -416162 -255638 -48525 120385 177194 14764
34305A4764l25812k20351M5385J62946J11522J50621K92831K08374j98513n25324
$$ 14764 -311048 -531399 -486014 -323068 -211546 -60925 231906 440280 241767 -283557
34295b83557m33938j33799O514K9289J77889L41725J84988k42628m77784k65859
$$ -283557 -717495 -851294 -844780 -815491 -637602 -295877 -110889 -353517 -831301 -1097160
34285a097160J63621M97326O49774N96490K82616j36635l07859j46899n057j45783
$$ -1097160 -933539 -436213 213561 810051 1092667 956032 648173 501274 496217 350434
34275C50434l37824k40819N4043J91455Q2892n4702p0189J5912J80384L75507
$$ 350434 12610 -228209 -174166 17289 100181 45479 -24710 -8798 171586 547093
34265E47093M12477J56765k08318l74637l06595j95636j17368l1851k2033j69007
$$ 547093 959570 1116335 908017 533380 226785 31149 -86219 -118070 -140103 -309110
34255c09110k55690m888M01455M84217J88624l5780J1519k3433l50791n49130
$$ -309110 -564800 -569688 -168233 315984 504608 468828 480347 456914 106123 -443007
34245d43007k01471L61016M65770M2268l40889k96207j2562J78436K15402J79883
$$ -443007 -644478 -283462 182308 224576 -116313 -412520 -425082 -246646 -31244 148639
34235A48639P7848q6647k10326k01972r8047k485J8361k5433m0457Q0857K92921
$$ 148639 226487 139840 -70486 -272458 -370505 -372990 -354629 -380062 -420519 -339662 -46741
34224d6741L66624J53325j86755l62448k88286q9599J31825L21066L36561P8115
$$ -46741 319883 473208 286453 -75995 -364281 -453880 -322055 -989 335572 413687
34214D13687k43077k49151J01266L94867K75178j18420l61557k45633O8427K79912
$$ 413687 170610 -78541 22725 417592 692770 574350 212793 -32840 35587 315499
34204C15499K06454r2510l43693k98781k8444J32696J8633j42708p6212J26994
$$ 315499 521953 429443 85750 -213031 -241475 -108779 -90146 -232854 -309066 -182072
34194a82072J66845N953r5206r360Q2416M1433K6371J92523L34672J30969l18928
$$ -182072 -15227 -9274 -104480 -113840 -31424 10009 36380 228903 563575 694544 375616
34183C75616n23267k48015J36251J43072j88572l95603k33366P2824K22992K02319
$$ 375616 -147651 -395666 -259415 -116343 -304915 -700518 -933884 -861060 -638068 -435749
34173d35749J38344L9284j34978k86038k61364o2013J77858L50030L85519K16878
$$ -435749 -297405 -258121 -393099 -679137 -940501 -1002514 -824656 -474626 -89107 127771
34163A27771r5433k90614j80211O0610J10800k4163m4888J20334J73074l8501
$$ 127771 32338 -258276 -438487 -377877 -267077 -291240 -336128 -215794 -42720 -81221
34153h1221k03675k7767K38719J42103k31375l11304J01983M71838K54706l18410
$$ -81221 -284896 -312663 -73944 68159 -163216 -474520 -372537 99301 354007 35597
34143C5597n48120k09741K02628J99065j00440k57796j46784j0406j3746m8481
$$ 35597 -512523 -722264 -519636 -320571 -421011 -678807 -825591 -835997 -849743 -898224
34133h98224o95M8400M9o3857l987J58281K76677K73872J94786J14478Q5433J36927
$$ -898224 -898919 -850519 -850470 -914327 -918314 -760033 -483356 -209484 -14698 99780 185213 322140
34121C22140K42790L14685K81422J40067q7411l50257m90712l33810L3802K39624
$$ 322140 564930 879615 1161037 1301104 1213693 863436 372724 38914 72716 312340
34111C12340N9381k56612l06937p6967J11853J13845R3268J38753R4786j04850
$$ 312340 371721 115109 -191828 -268795 -156942 -43097 50171 188924 283710 178860
34101A78860k46190j68248l9070p1648j59677n7898K02883L55990K97927J88143
$$ 178860 -67330 -235578 -274648 -346296 -505973 -563871 -360988 -4998 292929 481072
34091D81072J47759R4547o1251k46673l51965l93130m27913l89025j46073K54824
$$ 481072 628831 723378 662127 415454 63489 -329641 -757554 -1146579 -1292652 -1037828
34081a037828N31744M45258J05048j16782j4822K17793K66373Q3846j41791k96902
$$ -1037828 -506084 -60826 44222 -72560 -87382 130411 396784 480630 338839 41937
34071D1937l89609l45075n3126L30458M30146J35911k13153k99195k31668k62730
$$ 41937 -347672 -692747 -745873 -415415 14731 150642 -62511 -361706 -593374 -856104
34061h56104l32913k09540O9396K25136J60741N7986N9952J16186J55374J78992
$$ -856104 -1189017 -1398557 -1329161 -1104025 -943284 -885298 -825346 -709160 -553786 -374794
34051c74794J58591M4006j03952j67809j58827j71432j79318p7121J03913K35883
$$ -374794 -216203 -172197 -276149 -443958 -602785 -774217 -953535 -1030656 -926743 -690860
34041f90860L09414L73155L25125O9482j71919r1470J55426Q6573l27082n20051
$$ -690860 -381446 -8291 316834 386316 214397 122927 278353 364926 37844 -482207
34031d82207j94769J80723J07335j68830j27257J28845P8956k83515m05606q3547
$$ -482207 -676976 -496253 -388918 -557748 -685005 -556160 -477204 -760719 -1166325 -1249872
34021a249872K17676J33965n2843O4130L71977M73986K84889L1243j57534l17264
$$ -1249872 -1032196 -898231 -951074 -886944 -514967 -40981 243908 275151 117617 -199647
34011a99647m10509l28280j08376P2445J14890N5393l1836m7867J10372L63136
$$ -199647 -610156 -938436 -1046812 -974367 -859477 -804084 -835920 -883787 -773415 -410279
34001d10279M06406R5519k43039j89370J48583K61888k39k22288j09547N0524
$$ -410279 -3873 91646 -151393 -340763 -192180 69708 69469 -152819 -262366 -211842
33991b11842q9144l08020j45397L40576O05200L66434q6411l59500l63114j92633
$$ -211842 -300986 -609006 -754403 -413827 191373 557807 471396 111896 -251218 -443851
33981d43851L9925J41224n9870l88093m13453m7529K67932J97060J0314J29193
$$ -443851 -403926 -262702 -322572 -710665 -1124118 -1171647 -903715 -706655 -696341 -567148
33971e67148M53307N52631L46233J40806P5736k2862k24268l37711k50774q9617
$$ -567148 -113841 438790 785023 925829 1001565 978703 754435 416724 165950 76333
33961G6333K8129R9037N7431j70730l88694k72244J21897L72602L22590K56597
$$ 76333 104462 203499 260930 90200 -298494 -570738 -448841 -76239 246351 502948
33951E02948K94165J15750l90787p04020l70447K37750M21582J54927j5794Q4719
$$ 502948 797113 912863 522076 -181944 -552391 -314641 106941 261868 246074 330793
$$ [...]
##END NTUPLES=NMR SPECTRUM
##END=
