##TITLE=31Pdec_SA_PPh3vCl(H2O')
 CDCl3, 88 sc
 19.9.2019
##JCAMPDX= 6.0         $$ Bruker NMR JCAMP-DX V2.0
##DATA TYPE= NMR SPECTRUM
##DATA CLASS= NTUPLES
##ORIGIN= UXNMR, Bruker Analytische Messtechnik GmbH
##OWNER= root
$$ XWIN-NMR		Version 3.5
$$ Thu Sep 19 14:51:10 2019 Russian Standard Time (UT+4h)  she@DPX200
##.OBSERVE FREQUENCY= 81.013821
##.OBSERVE NUCLEUS= ^31P
##.ACQUISITION MODE= SIMULTANEOUS
##.ACQUISITION SCHEME= undefined
##.AVERAGES= 24
##.DIGITISER RES= 17
##SPECTROMETER/DATA SYSTEM= spect
##.PULSE SEQUENCE= zgpg30
##.SOLVENT NAME= CDCl3
##.SHIFT REFERENCE= (INTERNAL, CDCl3, 0, 182.463)
##AUDIT TRAIL= $$ (NUMBER, WHEN, WHO, WHERE, WHAT)
$$ ##TITLE= Audit trail, XWIN-NMR		Version 3.5
$$ ##JCAMPDX= 5.01
$$ ##ORIGIN= Bruker BioSpin GmbH
$$ ##OWNER= she
$$ F:/spectra/data/she/nmr/P31/1/pdata/1/auditp.txt
$$ ##AUDIT TRAIL=  $$ (NUMBER, WHEN, WHO, WHERE, WHAT)
(   1,<2019-09-19 14:50:07.18 +0400>,<she>,<DPX200>,
      <created by zg, POWCHK disabled, PULCHK disabled
       configuration hash MD5:
       00 E9 B6 7A A2 85 ED C7 34 08 36 98 17 FE 4E 26
       data hash MD5: 32K
       F5 DC EC 82 13 81 AD 13 C1 46 4D FC FE F2 D8 FC>)
(   2,<2019-09-19 14:50:09.90 +0400>,<she>,<DPX200>,
      <Start of raw data processing
       efp BC_mod = 2 LB = 1 FT_mod = 6 PKNL = 1 PHC0 = -393.3278 PHC1 = 103.8003 SI = 64K 
       data hash MD5: 64K
       1B E3 F3 FC 5F 48 77 33 A9 C9 BE 82 7C 4D 86 50>)
(   3,<2019-09-19 14:50:24.06 +0400>,<she>,<DPX200>,
      <pk PHC0 = -20.86573 PHC1 = 0 
       data hash MD5: 64K
       81 9E CC 29 85 45 A2 E6 F3 4B 4B 3C DA 15 A3 49>)
(   4,<2019-09-19 14:50:26.20 +0400>,<she>,<DPX200>,
      <abs ABSG = 5 
       data hash MD5: 64K
       2E AD 55 44 B4 CB 50 81 11 ED 75 E3 F7 42 67 D4>)
$$ ##END=
$$ 
$$ hash MD5
$$ 0C DC 40 8B 36 61 BF AD 46 CC C5 C7 13 36 D8 E5
##$RELAX= 
##$RELAX= 
##$RELAX= 
##$RELAX= 
##$RELAX= 
##$RELAX= 
##$RELAX= 
##$RELAX= 
$$ Bruker specific parameters
$$ --------------------------
##$DU= <F:/spectra>
##$EXPNO= 1
##$NAME= <P31>
##$PROCNO= 1
##$TYPE= <nmr>
##$USER= <she>
##$AMP= (0..31)
100 100 100 100 100 100 100 100 100 100 100 100 100 100 100 100 100 100 
100 100 100 100 100 100 100 100 100 100 100 100 100 100 
##$AQSEQ= 0
##$AQ_mod= 1
##$AUNM= <au_zg>
##$AUTOPOS= <>
##$BF1= 81.014009
##$BF2= 200.13
##$BF3= 200.13
##$BF4= 200.13
##$BF5= 200.13
##$BF6= 200.13
##$BF7= 200.13
##$BF8= 200.13
##$BYTORDA= 1
##$CFDGTYP= 0
##$CFRGTYP= 5
##$CHEMSTR= <none>
##$CNST= (0..31)
1 1 145 1 1 1 1 1 1 1 1 1 1 1 1 1 1 1 1 1 1 1 1 1 1 1 1 1 1 1 1 1 
##$CPDPRG= <waltz16>
##$CPDPRG1= <>
##$CPDPRG2= <waltz16>
##$CPDPRG3= <>
##$CPDPRG4= <mlev>
##$CPDPRG5= <mlev>
##$CPDPRG6= <mlev>
##$CPDPRG7= <mlev>
##$CPDPRG8= <mlev>
##$CPDPRGB= <>
##$CPDPRGT= <>
##$D= (0..31)
0 1 0 0 0 0 0 0 0 0 0 0.03 2e-05 3e-06 0 0 0 0 0 0 0 0 0 0 0 0 0 0 0 0 
0 0 
##$DATE= 1568890206
##$DBL= (0..7)
120 120 120 11 120 120 24 19 
##$DBP= (0..7)
150 150 150 150 150 150 150 150 
##$DBP07= 0
##$DBPNAM0= <>
##$DBPNAM1= <>
$$ [...]
##$SUBNAM3= <"">
##$SUBNAM4= <"">
##$SUBNAM5= <"">
##$SUBNAM6= <"">
##$SUBNAM7= <"">
##$SUBNAM8= <"">
##$SUBNAM9= <"">
##$SW= 369.568048894756
##$SWIBOX= (0..15)
0 1 3 0 0 0 0 0 0 0 0 0 0 0 0 0 
##$SW_h= 29940.119760479
##$TD= 32768
##$TD0= 1
##$TE= 0
##$TE2= 300
##$TE3= 300
##$TEG= 300
##$TL= (0..7)
0 120 53 12 22 120 120 120 
##$TP= (0..7)
150 150 150 150 150 150 150 150 
##$TP07= 0
##$TPNAME0= <>
##$TPNAME1= <>
##$TPNAME2= <>
##$TPNAME3= <>
##$TPNAME4= <>
##$TPNAME5= <>
##$TPNAME6= <>
##$TPNAME7= <>
##$TPOAL= (0..7)
0.5 0.5 0.5 0.5 0.5 0.5 0.5 0.5 
##$TPOFFS= (0..7)
0 0 0 0 0 0 0 0 
##$TUNHIN= 0
##$TUNHOUT= 0
##$TUNXOUT= 0
##$USERA1= <user>
##$USERA2= <user>
##$USERA3= <user>
##$USERA4= <user>
##$USERA5= <user>
##$V9= 5
##$VALIST= <valist>
##$VCLIST= <CCCCCCCCCCCCCCC>
##$VD= 0
##$VDLIST= <DDDDDDDDDDDDDDD>
##$VPLIST= <PPPPPPPPPPPPPPP>
##$VTLIST= <TTTTTTTTTTTTTTT>
##$WBST= 1024
##$WBSW= 4
##$XGAIN= (0..3)
0 0 0 0 
##$XL= 0
##$YL= 0
##$YMAX_a= 125213
##$YMIN_a= -141397
##$ZGOPTNS= <>
##$ZL1= 120
##$ZL2= 120
##$ZL3= 120
##$ZL4= 120
##$ABSF1= 182.463
##$ABSF2= -187.1042
##$ABSG= 5
##$ABSL= 3
##$ALPHA= 0
##$AQORDER= 0
##$ASSFAC= 0
##$ASSFACI= 0
##$ASSFACX= 0
##$ASSWID= 0
##$AUNMP= <proc_1d>
##$AZFE= 0.1
##$AZFW= 0.5
##$BCFW= 0
##$BC_mod= 2
##$BYTORDP= 0
##$COROFFS= 0
##$CY= -3
##$DATMOD= 1
##$DC= 0
##$DFILT= <>
##$DTYPP= 0
##$F1P= 0
##$F2P= 0
##$FCOR= 1
##$FTSIZE= 65536
##$FT_mod= 6
##$GAMMA= 0
##$GB= 0
##$INTBC= 1
##$INTSCL= 5.30512e-09
##$ISEN= 30
##$LB= 1
##$LEV0= 0
##$LPBIN= 0
##$MAXI= 10000
##$MC2= 0
##$MEAN= 0
##$ME_mod= 0
##$MI= 50
##$NCOEF= 0
##$NC_proc= -2
##$NLEV= 6
##$NOISF1= 182.463
##$NOISF2= 159.3651
##$NSP= 0
##$NTH_PI= 0
##$NZP= 0
##$OFFSET= 182.463
##$PC= 4
##$PHC0= -414.1935
##$PHC1= 103.8003
##$PH_mod= 1
##$PKNL= yes
##$PPARMOD= 0
##$PSCAL= 0
##$PSIGN= 0
##$REVERSE= no
##$SF= 81.0140089999434
##$SI= 65536
##$SIGF1= 159.3651
##$SIGF2= -187.1042
##$SINO= 113.3802
##$SIOLD= 16384
##$SREGLST= <1H.CDCl3>
##$SSB= 0
##$STSI= 65536
##$STSR= 0
##$SW_p= 29940.119760479
##$SYMM= 0
##$S_DEV= 0
##$TDeff= 32768
##$TDoff= 0
##$TI= <>
##$TILT= no
##$TM1= 0
##$TM2= 0
##$TOPLEV= 0
##$USERP1= <user>
##$USERP2= <user>
##$USERP3= <user>
##$USERP4= <user>
##$USERP5= <user>
##$WDW= 1
##$XDIM= 65536
##$YMAX_p= 541986545
##$YMIN_p= -1337998
$$ End of Bruker specific parameters
$$ ---------------------------------
##NTUPLES= NMR SPECTRUM
##VAR_NAME=  FREQUENCY,     SPECTRUM/REAL,   SPECTRUM/IMAG
##SYMBOL=    X,             R,               I
##VAR_TYPE=  INDEPENDENT,   DEPENDENT,       DEPENDENT
##VAR_FORM=  AFFN,          ASDF,            ASDF
##VAR_DIM=   65536,         65536,           65536
##UNITS=     HZ,            ARBITRARY UNITS, ARBITRARY UNITS
##FACTOR=    0.456856943014862, 1,           1
##FIRST=     14782.0589164792, 0,            0
##LAST=      -15158.0608439998, 0,           0
##MIN=       -15158.0608439998, -1337998,    0
##MAX=       14782.0589164792, 541986545,    0
$$ Real data points
##PAGE= N=1
##DATA TABLE= (X++(R..R)), XYDATA
$$ [...]
39922e7527Q159j14976j12961m260N5469L5461M0516Q9948Q6793J0749l8097r266
39910i992L3688L6377J4533j2715l7434k4598L1726M9052k8987j09483p5740K2194
39898a11379N5369L3923O0359J15546R1212R672K602P0681O9726m1404j32316
39887B23991j15534n2649r764K5098M4153L191o1006n4575L540J03n9816m3441
39875i6709O6945J19949N0221j0456K9943O7395L790p0843m7219K231l7091r7924
39863a9768l7308J01917J29243o965j42009j34024m3887j3935o1997q3080j7815
39852c29628O6775Q0875L6234J6043M6762O7876L6342q608j7840q057j8257m0395
39840g1878m3040k3029O982L8216M5005O905k5432K2542J05063Q3220m6238j01451
$$ plain form
39922 -57527 -49368 -164344 -277305 -281565 -226096 -190635 -150119 -60171 26622 37371 -726 -9992
39910 -9992 23696 60073 74606 61891 24457 -141 31585 80637 51650 -57833 -133573 -111379
39898 -111379 -56010 -22087 38272 153818 245030 254702 257304 327985 397711 356307 223991
39887 223991 108457 55808 46044 71142 115295 118486 57480 2905 6445 6548 -53268 -96709
39875 -96709 -29764 90185 140406 129950 159893 227288 231078 160235 113016 115247 78156 -19768
39863 -19768 -57076 44841 174084 167119 25110 -108914 -152801 -166736 -228733 -311813 -329628
39852 -329628 -262853 -181978 -145744 -129701 -82939 -15063 21279 12671 -5169 -13226 -31483 -71878
39840 -71878 -114918 -137947 -130965 -92749 -47744 -40839 -66271 -43729 61334 144554 98316 -3135
39828c135L869R5778J3286j10750o0174R1362Q5169r5378j86767o0339Q8018N4169
39816h4892q2043j12987n079R7168R1990K6522K162M4072P7490K5953p8346j26051
39804a24041q1223k1629K002L5244Q6344O2144n4106j06475n41J04690L0190j22016
39792a89417j27170L807P8449O1303P8824J23671N3522j01395j25033K9009J37458
39781B3028N1747r6638j35910q3199k5395L4202R4417Q9719J5816k2051K3143
39770c1121O2294L2984o280j5097n0716j29084j54705p5192K6517O9625P7467
39759a93308P9577M7469q221j2107M0934N6289O03m1951k4538q962l2703m6178
39747a43096k9040k6500l2438J2821Q0510P6550K8578N6473J27960O9371j21324
$$ plain form
39828 -3135 734 96512 109798 -952 -61126 30236 115405 20027 -166740 -227079 -139061 -84892
39816 -84892 -166935 -279922 -285001 -187833 -95843 -69321 -67159 -23087 54403 80356 2010 -124041
39804 -124041 -205264 -226893 -224891 -189647 -103303 -41159 -95265 -201740 -202281 -97591 -67401 -189417
39792 -189417 -316587 -312780 -234331 -173028 -94204 29467 82989 -18406 -143439 -114430 23028
39781 23028 74775 -21863 -157773 -240972 -266367 -232165 -137748 -48029 -32213 -54264 -31121
39770 -31121 31173 64157 57877 42780 -7936 -137020 -291725 -366917 -340400 -270775 -193308
39759 -193308 -113731 -66262 -74483 -86590 -45656 10633 11236 -30715 -55253 -64215 -96918 -143096
39747 -143096 -172136 -198636 -231074 -218253 -137743 -61193 -32615 23858 151818 221189 99865
39736I9865k13828r5456N3334O1126J9999P7680J69581J42969P979j02827j21368
39725I9054o3591L3836R6048M0788r1911j60129j23647p7748m6602N4535J89417
39714d9950J72397k0265j48952o2407P8297Q7996L8311N6923O7133l7855j42373
39703C9255q2436O1594Q9676o77m7908k389L6282P869n0818r5049r6420l7643
39691a78664K9924J7206m8057l5547N7447P8624J627l400J01497R8467r9710k24723
39679b05309o4964J58568J31840n9194j13570j4601J8602m6476m9112K0778J9551
39668b03887m5842k9223O0240O9481j0346m6515l2914p6717j37801o8071R3577
39657d28018J49309P4208M1316R5648Q4512m1486j26165p6530K212J3605L219
$$ plain form
39736 99865 -113963 -209419 -156085 -94959 -74960 2720 172301 315270 323249 220422 99054
39725 99054 35463 69299 165347 206135 114224 -45905 -169552 -247300 -293902 -239367 -49950
39714 -49950 122447 102182 -46770 -109177 -30880 57116 95427 152350 219483 181628 39255
39703 39255 -43181 18413 108089 107412 59504 57115 93397 101266 50448 -44601 -141021 -178664
39691 -178664 -148740 -131534 -179591 -215138 -157691 -79067 -77440 -80840 20657 119124 19414 -205309
39679 -205309 -270273 -111705 20135 -39059 -152629 -167230 -148628 -195104 -244216 -223438 -203887
39668 -203887 -249729 -278952 -218712 -149231 -159577 -206092 -239006 -315723 -453524 -521595 -428018
39657 -428018 -278709 -204501 -163185 -67537 16975 -24511 -150676 -227206 -224994 -211389 -208170
39646b08170J9692L2191L9819Q6609J30932P6178m2714q2321j9765K2362o595
39635D8218k9625j5825j9008l0479J3820O8764K0766r6590j29112n2234J2301
39624b09004L0129P6907J22373M5188j06132j29210J054Q0358K5043L03R4164
39613C1173J40001J9467j04828n2527P6591P4443n1768j27475q3855p840J9271
39602f7347k931l6796l4431K8837R7008Q1780J23l7743o519l981o9859j08996
39590a60855n6765J7160M0059L8677M1671J4544l5018k2976O1725J09023O8131
39579A15376L3352O1321N5659n0073j39519q8150K6235M4789k6260n0775P919
39568a0126M6827p73p6811r9804o5685k5327j4881k8266l7639l0680j8974j154
$$ plain form
39646 -208170 -188478 -156287 -116468 -29859 101073 177251 134537 52216 32451 54813 48218
39635 48218 18593 2768 -16240 -46719 -32899 35865 56631 -39959 -169071 -221305 -209004
39624 -209004 -178875 -101968 20405 65593 -40539 -169749 -168695 -88337 -63294 -62991 31173
39613 31173 171174 190641 85813 33286 109877 184320 132552 5077 -78778 -86618 -67347
39602 -67347 -70278 -107074 -141505 -112668 -15660 66120 66243 28500 21981 18000 -51859 -160855
39590 -160855 -217620 -200460 -160401 -121724 -80053 -65509 -100527 -123503 -61778 47245 115376
39579 115376 148728 210049 265708 215635 76116 -12034 14201 58990 32730 -18045 -10126
39568 -10126 36701 35928 -40883 -140687 -206372 -231699 -246580 -274846 -312485 -343165 -362139 -363293
39556c63293M8967J20020J33310M4165o5825q5809l2403p650k8545j8286M3874
39545b11475Q9082P9502M6988Q303m3984o6910m014J00474J41283J01334M2977
39534B83560k5896j30996j98264j18265M8614J11497K1236p1071o1765k0695j9306
39523a81351j2653L3515N8970L1488J1040K3564J1744k7451q984O6985O8685m9840
39511B5712j38937p3603M9241O1023l2164q4311k9731M7928N0155q528k3074N9724
39499i6565J38142O4643j16313j68060L767J69674J02983o3742o0208O7904N2302
39488I4527j12190j47247K1179J28870K1371j11367q6380L138L2359O4001J40164
39477D8425J28204k4498j28811n2097N2224J8446n6982l4227J072o6577j21235
$$ plain form
39556 -363293 -314326 -194306 -60996 -16831 -82656 -168465 -200868 -208518 -237063 -255349 -211475
39545 -211475 -122393 -42891 4097 12400 -31584 -98494 -102508 -2034 139249 240583 283560
39534 283560 257664 126668 -71596 -189861 -141247 -29750 -8514 -79585 -141350 -162045 -181351
39523 -181351 -194004 -160489 -101519 -70031 -58991 -35427 -23683 -51134 -60118 6867 75552 25712
39511 25712 -113225 -186828 -137587 -76564 -108728 -193039 -222770 -174842 -124687 -133215 -156289 -96565
39499 -96565 41577 106220 -10093 -178153 -174386 -4712 98271 34529 -25679 42225 94527
39488 94527 -17663 -164910 -143731 -14861 6510 -104857 -191237 -188099 -155740 -91739 48425
39477 48425 176629 152131 23320 -28777 23447 41893 -15089 -49316 -48244 -114821 -236056
39466b36056j6957J28436J13567q921m1949K1191L3775j8629k1288L7126N8940
39455D9235K2733j4460m9245r7898r7883q196O8227K7837m8595k2309P2450R4294
39443c810J9938n8074r0326q0263j2529Q9162J19460L8278m0632l0574j0049m7022
39431a06441m7148N4872J22296L5913p5369m6234L8970J7080m6556M354J01986
39420E3723P3029l0814k8751M4126Q886r7634p3349N8952N8576j08488j88926
39409b30670n9353Q6767P7471R320K1657O4016M3198R419L7692O9090J6284p7348
39397F7543j05207m8347K9396P3559O5057J2582l9717m7076k0444K396K4957O1466
39385G6165O9109K671q8207j10912n5048K1164Q7945J31729J01208j7520j19876
$$ plain form
39466 -236056 -253013 -124577 -11010 -19931 -61880 -40689 -6914 -25543 -46831 -9705 49235
39455 49235 71968 57508 8263 -89635 -187518 -195714 -127487 -99650 -148245 -170554 -98104 -3810
39443 -3810 16128 -41946 -132272 -212535 -225064 -135902 -16442 21836 -18796 -49370 -59419 -106441
39431 -106441 -153589 -98717 23579 59492 -15877 -62111 -23141 -6061 -52617 -48263 53723
39420 53723 126752 95938 67187 111313 120199 22565 -50784 8168 66744 -41744 -230670
39409 -230670 -290023 -203256 -125785 -116465 -94808 -30792 12406 21825 59517 128607 144891 67543
39397 67543 -37664 -86011 -56615 16944 82001 94583 54866 7790 -12654 -10258 14699 76165
39385 76165 145274 147945 59738 -51174 -106222 -85058 2887 134616 235824 218304 98428
39374I8428r8569K278O3111O2084M9601J8377n6795j10969p4437j2671k7754p7048
39362a64364n2152J8488K0449m1276o4614l5625j7061R51N9214R2047K4208m9510
39350b09245J0071J34066J44939N8823L5491O3074j7297j68014j50224O8839K03617
39339A74140P0023j42373j74391n5231K2731J6008K2041O5042O9579N258p0516
39328B311r7981o8125r120L8042N0904M5781M3676L6159K2652L4619O4280L6123
39316A99321o7305j30140o3582L9129L9416l3746n6349j8537L956J7079O8799
39305a959J05451N3125j8044j604M0829j0082q9694n3044M3839K7495p3403p2868
39293d9959L0249N0813l6134n1177N0450R6943K2472j9251M8330R0250K6280k7373
$$ plain form
39374 98428 -141 2137 65248 127332 176933 195310 138515 27546 -46891 -59562 -87316 -164364
39362 -164364 -216516 -198028 -177579 -218855 -283469 -319094 -336155 -335204 -275990 -183943 -159735 -209245
39350 -209245 -199174 -65108 79831 138654 174145 237219 219922 51908 -98316 -29477 174140
39339 174140 244163 101790 -72601 -127832 -105101 -89093 -67052 -2010 67569 72827 2311
39328 2311 -95670 -163795 -172915 -134873 -83969 -38188 5488 41647 64299 98918 163198 199321
39316 199321 132016 1876 -61706 -22577 16839 -16907 -73256 -91793 -87837 -70758 -1959
39305 -1959 103492 156617 138573 136969 177798 167716 78022 24978 68817 96312 22909 -49959
39293 -49959 -19710 31103 -5031 -56208 -5758 91185 113657 94406 142736 232986 259266 231893
39281B31893N345K6407j8985k7903L8384M9489n0212j17187o2913j4346p3561
39270a3589j24534m2975Q2291J03920M0002p722k3728l1935o010N3106O9238K0691
39258A18755l761L8195O1711Q270n6097o5457m0283Q37O4185Q2331k5363j59367
39246B3956j19000P5028J68695N4659q1663q6627m9786o8018n7870L6203Q3526
39235b0897k019q0797j8766Q7264Q9973K0310k8866p0754j15204p3765N9708J17084
39223c6729J7145o7015J4296J27951Q1907n9731j04743l6310K6174N2313Q3612
39212I8870Q9207K0950p1189j22450j51407j59140p2974Q3171J31278K285j16816
39201b68215o3156N4624P0467L5095O4671R2212J0312q6060m8890N1429M9895
$$ plain form
39281 231893 237238 263645 244660 216757 255141 304630 254418 137231 74318 59972 -13589
39270 -13589 -138123 -181098 -98807 5113 45115 37393 13665 -18270 -24280 28826 98064 118755
39258 118755 114994 153189 214900 223170 167073 101616 61333 62170 126355 208686 183323 23956
39246 23956 -95044 -20016 148679 203338 121675 35048 -14738 -82756 -140626 -104423 -20897
39235 -20897 -22916 -103713 -122479 -35215 54758 75068 46202 -24552 -139756 -213521 -153813 -36729
39223 -36729 -19584 -86599 -72303 55648 137555 77824 -26919 -63229 -37055 15258 98870
39212 98870 188077 209027 137838 15388 -136019 -295159 -368133 -284962 -153684 -151399 -268215
39201 -268215 -331371 -276747 -206280 -171185 -106514 -14302 -3990 -90050 -138940 -87511 -37616
39190c7616k1446j2125O0047M7159n5670j02613l7326M8540P6419N0042o41k4274
39178i504L8421J40650J30131k5424j43697q7477K8191L8371j8919k7700j8845
39167D4198p0871j19133o8070J9634L5885J4627K7892K4298m5074p9628j032P4845
39155a42429L8605k33P7597J49079O1472o2731k1063J01557O9927r3214j50634
39144B7933m5750M6647L7501J3197J7685k416l4293l975N6671M3886l2437p4076
39132E0573p0280p9411q6447m2918J4256L5089N8864J00816O6388o1304j12149
39121a26523K325R7219J8559o4454M7758J96693J07471j35409k16398q5408L2671
39110a25496M5114N6004Q0607L2361m6555m9133l6540j08080j35478M0180K49216
$$ plain form
39190 -37616 -59062 -71187 -11140 36019 -19651 -122264 -159590 -111050 -34631 15411 14770 -9504
39178 -9504 28917 169567 299698 274274 130577 43100 71291 109662 90743 63043 44198
39167 44198 -26673 -145806 -213876 -194242 -158357 -143730 -115838 -91540 -136614 -216242 -217274 -142429
39155 -142429 -103824 -104057 -26460 122619 184091 121360 100297 201854 271781 178567 27933
39144 27933 -17817 28830 66331 79528 97213 94797 60504 56529 113200 157086 124649 50573
39132 50573 -19707 -99118 -185565 -228483 -214227 -179138 -120274 -19458 46930 -14374 -126523
39121 -126523 -124198 -26979 -8420 -72874 -25116 171577 279048 143639 -72759 -158167 -125496
39110 -125496 -80382 -24378 56229 88590 42035 -7098 -43638 -151718 -287196 -247016 2200
39099B200K01669k9265j20185k2597L1811o721K7855J15388N8106j01884j12153
39088D4224K1547L6947q5035q2060P4283J03428m9733q8832Q6986J85639N4018
39077C01412m8282O9525J95115J13663l1027l6712K5324K5508K0798N7030J8559
39066G10913j14008j50218l4692K444j51525k57730j26841N7556O8969m025P794
39055H637M2573J037j2756Q0495J16753k5562j61215r8146L1420K4365l6756J8820
39043a0335J06978N9045m4462k4228O5609N6283k0675k5283J0729k5777p8957
39032F8927l5944K5287l1657j29005j00364J1387M4558J3126M5709J11453P3556
39021I7033m1496q1433l2483j2342l7123j7765M0019M0366j6582l5461N697M1597
$$ plain form
39099 2200 203869 174604 54419 31822 63633 56912 84767 200155 258261 156377 44224
39088 44224 65771 102718 17683 -64377 9906 113334 63601 -25231 61755 247394 301412
39077 301412 253130 322655 517770 631433 600406 563694 589018 614526 635324 692354 710913
39066 710913 596905 446687 411995 414439 262914 5184 -121657 -64101 4868 843 8637
39055 8637 51210 52247 39491 119986 236739 211177 49962 -48184 -16764 7601 -29155 -10335
39043 -10335 96643 155688 111226 86998 152607 208890 188215 162932 173661 147884 68927
39032 68927 32983 58270 26613 -102392 -202756 -191369 -146811 -133685 -87976 23477 97033
39021 97033 55537 -25896 -58379 -70721 -107844 -125609 -85590 -45224 -61806 -97267 -91570 -49973
39009d9973M2367J9096l6284r6463p1601L8451Q0081k2764j08292k2125J15429
38998a12078R7328l3672p0621J9681Q1969M7189J494M643K8035N2876P2473L6902
38986B26219n9289r9847j1154P7917J5228j17345j24236r955M1672k8415q1503
38975a70708j9441Q3124J12614M9818m8762j06251p0002K3187O4700K2223o952
38964f6450L4377N3526k2543r0688l0117Q9351J18966O0910K0862J0255l2476
38953A45973q5548p7328l0593k0394l0727M082N8265N2284n638l8947k7167o931
38941f2669N183L745k8444o2248l3372K0940l0456j79384k17229l8527J63076
38930d59385J72770P0140O1951J34533J10554l0585j24221p9260K8748J03820
$$ plain form
39009 -49973 -7606 11490 -24794 -121257 -192858 -154407 -74326 -97090 -205382 -227507 -112078
38998 -112078 -14750 -48422 -119043 -99362 -17393 29796 31290 35933 63968 116844 189317 226219
38986 226219 166930 67083 55929 133846 149074 31729 -92507 -102462 -60790 -89205 -170708
38975 -170708 -190149 -107025 5589 55407 6645 -99606 -169608 -146421 -81721 -59498 -66450
38964 -66450 -32073 21453 -1090 -91778 -121895 -32544 86422 147332 168194 178449 145973
38953 145973 60425 -16903 -47496 -67890 -98617 -94535 -36270 16014 10376 -28571 -55738 -62669
38941 -62669 -57486 -53741 -82185 -144433 -177805 -156865 -187321 -366705 -583934 -622461 -459385
38930 -459385 -286615 -216475 -154524 -19991 90563 59978 -64243 -143503 -114755 -10935
38920a0935J12617N0358m2511p0180k219N6882K2550l4475j9569K3758R099m0330
38908E5045n9994n7718m4757J8741R7025N6513j01006j67517m6440O4035r51p8733
38896b65757L6778K14421J89457M69r4332l9534r017o6999r7169m9162J2J9715
38884a61118M4825M7954j3476o9195l7025J8877Q990m103N6822R4004Q110o8783
38872g4118K7980J79688J47587l9699j45545r7253k0713K5795P4602P4431k7883
38861A24872j01678j0553J03811J9128j65538j60906L2093J27255K3900p9870
38851h7486o4579m0518p0186n0983N1464J19106R5288N3861K2614m2498j01625
38840a15542p0542J438J5499L1948J44806K25573R2538j30752j61404j5900L4175
$$ plain form
38920 -10935 101682 152040 109529 39349 37130 94012 116562 82087 62518 86276 95375 55045
38908 55045 -4949 -62667 -107424 -88683 8342 64855 -36151 -203668 -250108 -186073 -187024 -265757
38896 -265757 -228979 -14558 174899 175368 81036 41502 32485 -34514 -131683 -180845 -180833 -161118
38884 -161118 -116293 -68339 -81815 -151010 -188035 -169158 -160168 -164271 -107449 -13445 -5335 -74118
38872 -74118 -46138 133550 281137 241438 95893 -1360 -22073 3722 78324 152755 124872
38861 124872 23194 12641 116452 135580 -29958 -190864 -158771 -31516 -7616 -87486
38851 -87486 -152065 -192583 -262769 -313752 -262288 -143182 -47894 5967 28581 -13917 -115542
38840 -115542 -186084 -184646 -169147 -137199 7607 233180 325718 194966 33562 17662 51837
38829E1837o2219q8012O884K1868r0079j22420m787P3520K9551K4602J24320J59709
38817A24774N2447l9393k4955k3638q4904p0290N8572J29986O6627J3244M2987
38806B45457K9619o7205q9317J6276P7328J4317j9896M2536L6555j04474j76201
38795D995n1959Q0131L3153q2277q4345j1281J5186J1187K9941K6779j6052j2524
38783e7066M8948M5770m8974r3825m0975k9291j01838r2068O9652J94704J36199
38772C1236Q027m4455n2614o2891j6510O6743M0828q6394r2796Q6540K07228J03849
38760A88791n2841p2761l7666o9686q3527M268O9632J1296m4968J5173Q2806N3923
38748F4440K7577P3935N9994p7648j48298k8766R0263K7081p8259l7171N2341
$$ plain form
38829 51837 -10382 -98394 -91510 -69642 -159721 -282141 -286928 -213408 -183857 -159255 -34935 124774
38817 124774 177221 137828 112873 89235 4331 -65959 -7387 122599 189226 202470 245457
38806 245457 275076 207871 118554 134830 212158 226475 206579 249115 285670 181196 4995
38795 4995 -46964 33167 66320 -15957 -100302 -111583 -96397 -85210 -55269 -28490 -44542 -57066
38783 -57066 -8118 37652 -11322 -105147 -146122 -175413 -277251 -369319 -299667 -104963 31236
38772 31236 39263 -5192 -57806 -120697 -137207 -70464 -29636 -116030 -208826 -122286 84942 188791
38760 188791 135950 63189 25523 -44163 -127690 -123422 -53790 -42494 -87462 -72289 10517 64440
38748 64440 92017 165952 225946 148298 0 -28766 61497 88578 10319 -26852 25489
38737B5489K6372k5948L6383J01655J2801j08078n4742R9005J27592J6024p5482
38726A81071q7744o3705l17Q5746Q5615j6336n5630L2644O3731o6200j51874k7228
38714b0227J17589N7708p4254m2916O3577J4763j34340j53424l6808M1126M9636
38703a17570P0123O2048m0205j15659k7586J15386J34118O9830L9905j6593j62953
38692A0844k30326q0321Q7421L2974j03305m5120J30017J42109K025n6401j6396
38681a26479l7016p4657L3986J89660J50792k2692n8232M7614N3092o1820q0009
38670A4239J4160R006j06458j06204M3503J18971N1450J6709O0306K2237r6795
38659D1124q2394Q7607J57396K4655r4765n3145J6288J331m60O2125N6118o2536
$$ plain form
38737 25489 51861 25913 62296 163951 176752 68674 13932 112937 240529 256553 181071
38726 181071 93327 29622 29305 115051 200666 184330 128700 161344 225075 158875 7001 -20227
38714 -20227 97362 155070 80816 37900 101477 116240 -18100 -171524 -208332 -167206 -117570
38703 -117570 -47447 14601 -25604 -141263 -168849 -53463 80655 150485 190390 173797 10844
38692 10844 -219482 -299803 -212382 -179408 -282713 -327833 -197816 -55707 -53682 -110083 -126479
38681 -126479 -163495 -238152 -204166 -14506 136286 113594 55362 102976 156068 94248 14239
38670 14239 28399 37405 -69053 -175257 -131754 -12783 38667 55376 115682 137919 41124
38659 41124 -41270 46337 203733 228388 133623 80478 96766 98097 97637 159762 215880 153344
38647A53344j19471k2404O7892K1149n1222k4398K6351R98l5534L474O1426N5994
38635A37599J7728j590k3882n7731m8786J0376N0643N7058Q9985J38853J12361
38624D82614K0317L704J19334K34469K02944L8117j35567k14551j78712r6208
38614D76461n9468o4063j2089J07799J65411J05637N7761R3098O6869j06174k25406
38603F05836j09492O5296L7354j01304q6699M0217K8992j04086j09728K4383N0328
38592C41097q4474j52263n8317K6033L444j4521K3036J6193m6292n0405j789k1472
38580a9730p8942k8260Q5456P6646k2688j575J23823J13704n4357j32565m7046
38569A4466m491p7088p6971M8077Q5669l9111j07299l108Q9634M6084Q348O8497
$$ plain form
38647 153344 33873 11469 79361 100510 49288 24890 51241 52239 16705 20179 81605 137599
38635 137599 155327 153737 129855 72124 23338 33714 84357 141415 231400 370253 482614
38624 482614 502931 506635 625969 860438 1063382 1101499 965932 751381 572669 476461
38614 476461 416993 352930 340841 448640 614051 719688 777449 870547 937416 831242 605836
38603 605836 496344 561640 598994 497690 410991 451208 480200 376114 266386 290769 341097
38592 341097 256623 104360 46043 72076 75520 60999 84035 100228 53936 3531 1742 -19730
38580 -19730 -98672 -126932 -41476 35170 12482 10907 134730 248434 194077 61512 14466
38569 14466 9975 -67113 -144084 -96007 -10338 -49449 -156748 -159856 -70222 -24138 -15790 52707
38557E2707Q2348k2049p3840J9617R1185L3742n126O8466R8844j0209r0010j9809
38545B25866M1708m2027j24225m7548O9690N7825j3332j568M1597m093r6372j21976
38533a4455q4156m2343K305M2061K7400j4213J5061R5184R3115J584m2385j3943
38521F5215k8448p9695l2607P8828O0900o9632o6474J03584J61215r857j51037
38510C1992o5999P3297N7949l1463l6449J8176O2470J20625J55832M7203j42575
38499B91058j71354j6532N3857o2039j32111l0581M2297l0873n4715P4313J30893
38488I4213j2741j12574O899J15977J225j35884m9126J10783Q8661k9533k7146
38477E0754M2766K0057k8815K6193R2219L7135m4722k6820N696m1333o5853p014
$$ plain form
38557 52707 135055 113006 39166 58783 149968 183710 178584 247050 345894 335685 245675 225866
38545 225866 267574 225547 101322 53774 123464 181289 167957 166389 207986 203893 107521 -14455
38533 -14455 -98611 -140954 -138649 -96588 -69188 -83401 -68340 26844 119959 121543 79158 65215
38521 65215 36767 -42928 -75535 3293 64193 -5439 -71913 31671 192886 183029 31992
38510 31992 -34007 39290 97239 65776 29327 47503 109973 230598 386430 433633 291058
38499 291058 119704 103172 157029 94990 -37121 -67702 -25405 -56278 -110993 -36680 94213
38488 94213 81472 -31102 -24203 91774 92999 -42885 -92011 18772 107433 77900 50754
38477 50754 93520 113577 84762 110955 203174 240309 195587 168767 174463 133130 67277 60263
38465F0263j2196j22612j06151J23244K57980Q2689j33233p9685Q9570P9295l4356
38454B04808k2339N1108J8302j7084Q9659J67642J8481j78359j58705l2963m2314
38443I8236j03940k4986P8448J9174m8553Q6746K36858J19217j11745j34085l4239
38432A81131r2238k04592q0517J60852J66251j3261l5487R1241O2966j04206j05506
38421B6634M6758L7211j38035j48698M9625J35474J9493k3025R6382J20053m5841
38410A76031j50106o0319L6476K4699L3793J02914P7297m4144m9270Q5394J13875
38399C46640m4342j58648r3365l759r037j0894M3025L7670n1257p7040r92L0522
38387H523l1435n4835R821N0379K2415k168k7532j04824j31654J7679J94582J43611
$$ plain form
38465 60263 48067 -74545 -180696 -57452 200528 283217 149984 70299 159869 239164 204808
38454 204808 182469 233577 251879 234795 324454 492096 510577 332218 173513 140550 98236
38443 98236 -5704 -30690 47758 66932 18379 105125 341983 461200 349455 215370 181131
38432 181131 88893 -115699 -196216 -35364 130887 117626 82139 173380 236346 132140 26634
38421 26634 73392 110603 -27432 -176130 -126505 8969 28462 5437 101819 221872 176031
38410 176031 25925 -34394 2082 26781 60574 163488 240785 196641 147371 232765 346640
38399 346640 302298 143650 50285 46526 37489 26595 69620 107290 56033 -21007 -21999 8523
38387 8523 -22912 -77747 -67926 -17547 4868 2700 -24832 -129656 -261310 -243631 -49049 94562
38375I4562o2938j19897M287M7018o2293j04674N783J02620J18422J62342J98852
38364C84084N4579j89750k25293j8892J12334K5160n7772N358M4958n3347j31466
38353e0047p6415j3670k4608P540J20899J54516M8769k7260K0507O1540Q569m0646
38341A89694k5461j5950j6369M5368R4300j4374j71559j20884Q0627J03235r5004
38330E3623j73924J3996J83634J12027l0920l9501P192j0747j6826N0382P7113
38319B26049N442m1585q534r823o6763l3882R9827J39881K8735m9494j2519n124
38307B72210p3808n6631P6464J13692k7264j43260r8645j8217l408K2822P1677
38296A35632K1646r0143n2204J31086J85504J9631j29078j16761q5340j10555
$$ plain form
38375 94562 31624 -88273 -83986 -36968 -99261 -203935 -198152 -95532 22890 185232 384084
38364 384084 438663 248913 23620 4728 117062 142222 84450 89808 134766 81419 -50047
38353 -50047 -126462 -140132 -164740 -157200 -36301 118215 166984 139724 160231 221771 230340 189694
38341 189694 164233 148283 131914 177282 271582 257208 85649 -35235 45392 148627 53623
38330 53623 -120301 -106305 77329 189356 158436 118935 126127 115380 98554 148936 226049
38319 226049 231491 189906 181372 171549 104786 70904 170731 310612 339347 289853 277334 272210
38307 272210 198402 141771 218235 331927 304663 161403 62758 44541 41133 63955 135632
38296 135632 157278 67135 14931 146017 331521 351152 222074 105313 19973 -90582
38286i0582n3288R3622J08159m9615j18469Q854J01927K7660l0837L6603O3683
38275I7717k3173l5639Q8287J29209L970p1099j0014j4354j21921p4219J53062
38264A21826J91151q5978k72168q9318J51956J06285n5297l7135O2348L1668l1212
38253I4126K2064N1900o9606j50705l0829R0768K2396o5171O643P1741k4042p9747
38241f0462P2659J99823P7101q9131n0364L0112o5942j54127j038J89912J18137
38230B66680p7311q7462K5872J8711n6834j7034M8052k1170p6643O7407K16470
38219C06738R8432j29170j27865N6522J20260K0314n8491r0712j57851j69327
38209a31150k2488J21073Q0435q016N1381J36323N3378o9818k7467N9437j6314
$$ plain form
38286 -90582 -143870 -50248 57911 8296 -110173 -101319 608 28268 -2569 34034 97717
38275 97717 74544 38905 127192 256401 260371 189272 179258 164904 42983 -31236 121826
38264 121826 312977 226999 -45169 -134487 17469 123754 68457 31322 93670 125338 94126
38253 94126 116190 168090 98484 -52221 -83050 7718 30114 -35057 -28414 43327 19285 -60462
38241 -60462 12197 212020 289121 199990 149626 179738 113796 -40331 -41369 148543 266680
38230 266680 189369 101907 127779 146490 89656 72622 120674 99504 22861 90268 306738
38219 306738 405170 276000 148135 204657 324917 345231 286740 196028 38177 -131150
38209 -131150 -153638 -32565 47870 39854 91235 227558 280936 211118 183651 243088 226774
38198B26774j26572m1579J24239J15857p945k6698K7988N93m5741P216M0552o1470
38186B33214j19158K1070J42155K6230j23252n0195P2872q884j20404M783J75297
38175B53728P3258j38986j07715O4251L6734j24112j09094K7089J2740p1349L5169
38164d8287J99894J02803j36933j45752K8818L8551r3399m4785J57233J83826
38154B41969L3337M090R5185L6523j28045q8625J23223J57813l3420j57356j33938
38143A50756j46447j77804m8591J26020P2337j00562n5436J44135J42383m1102
38133F5689o5517O7310M1805j15093o6295J53292J55645p4981j42658K7942Q6816
38122A33955m7612o1049R6031Q9525j28703j84499L1461J66392N8072k2330N3132
$$ plain form
38198 226774 100202 58623 182862 298719 290774 264076 292064 292657 246916 254132 294684 233214
38186 233214 114056 135126 277281 303511 180259 130064 202936 194052 73648 78431 253728
38175 253728 326986 188000 80285 144536 181270 57158 -51936 -24847 -12107 -83456 -48287
38164 -48287 151607 254410 117477 -28275 543 39094 -54305 -99090 58143 241969
38154 241969 275306 279396 374581 411104 283059 194434 317657 475470 442050 284694 150756
38143 150756 4309 -173495 -222086 -96066 -23729 -124291 -179727 -35592 106791 65689
38133 65689 172 67482 109287 -5806 -72101 81191 236836 161855 19197 47139 133955
38122 133955 86343 25294 121325 210850 82147 -102352 -70891 95501 153573 131243 184375
38111A84375M7310j09113j43933J2324O9353n6597p3036J12823J96821M3403q2593
38100B01137l0982M848n8718l2124R6900O9497j31762j95509m9978J1105r4714
38089b10300q8581R9002J74235N4600K6004J60075J56166n5662j43358R47N6828
38078B29956r4138j35181N7458J54070l501j05080K4922J02560m8945j63910n9967
38067d1756L7379j8086j3666J34545J51696n2061j44223L2247J58455L0738q5655
38056A89613M252P2014l5577q2072N3181R1457r2658j72330L1132J81612K7068
38045B67692j53402p8966N7348K5463j4987Q7401J18513p0516k16618j04173N2824
38034b9421L6040L78R1613J26405j0502q5944L7668J13298k3553j41084o5257
$$ plain form
38111 184375 231685 122572 -21361 -9037 60316 3719 -69317 43506 240327 283730 201137
38100 201137 170155 175003 116285 84161 181061 250558 118796 -76713 -126691 -115586 -210300
38089 -210300 -298881 -199879 -25644 28956 54960 215035 371201 315539 172181 173128 229956
38078 229956 135818 637 58095 212165 208664 103584 128506 231066 182121 18211 -41756
38067 -41756 -4377 -22463 -36129 98416 250112 198051 53828 86075 244530 275268 189613
38056 189613 193865 265879 230302 148230 201411 292868 200210 27880 59012 240624 267692
38045 267692 114290 35324 92672 118135 103148 190549 309062 238546 21928 -82245 -29421
38034 -29421 6619 6997 98610 225015 214513 128569 166237 279535 255982 114898 49641
38023D9641N766o7429q6554M8525J04043j4426m9568Q9589J27356j0507n904K07857
38011C98389K30916p4310k79639j42181J024o7058m6404J91532K43142n5543k21483
38000A78385K3393K19042J5787j75112L2285K74074J37531q9608l6020L9543j58750
37989D60550k92020l1080K30667N4039k27761j24663J27301P3638r4641J9384
37979A95414K05555P5965j48312p2078R4634k0265j72960K3187K79045J17693
37969E77878k20950k06275L0437K1158j21092J4469K54424J32510j96690k04932
37959H0937O5672J40766j454O879J53966J21200l7289k1296Q3474m590j48573
37948D39692m9969J21809M0233j11658J5227K23867J29378p7601K0309K60036
$$ plain form
38023 49641 55407 -12022 -98576 -50051 53992 39566 -10002 79587 206943 196436 190532 398389
38011 398389 629305 554995 275356 133175 134199 67141 20737 212269 455411 399868 178385
38000 178385 201778 420820 436607 261495 293780 567854 705385 615777 579757 619300 460550
37989 460550 168530 137450 368117 422156 194395 69732 197033 270671 176030 195414
37979 195414 400969 476934 328622 256544 351178 330913 157953 181140 460185 577878
37969 577878 356928 150653 181090 202248 81156 95625 350049 482559 285869 80937
37959 80937 146609 287375 285921 292800 446766 567966 530677 509381 592855 588265 439692
37948 439692 389723 511532 551765 440107 455334 679201 808579 730978 751287 1011323
37938A011323K13112Q878N8143K48760K02902L3092N4491Q0585j80053l97014
37928A334219j55164J73825K8439k74645q4074L58775L46302L1113J30425N36644
37918B425859M69366r9185m08594k67238k29006l96497k67576J34185J80427j60106
37908A381635k13057J29606K06841j17558j57523K87659N23335K64486J78056
37899B483480O12758R28030P16287N98344J034277J393338J218383J515974L394640
37890A3895511N746713N742750K094094l024334n981071n325650k869157j241099
37882I037757j121487j340202j043641o37144n97737n84033k72677r5722l94090
37873B951024o42349l42381L6755r7699l71288j74043J68734L4182k78629j22897
$$ plain form
37938 1011323 1224435 1233313 1291456 1540216 1743118 1776210 1830701 1911286 1731233 1334219
37928 1334219 1179055 1352880 1381319 1106674 1022600 1381375 1727677 1758790 1889215 2425859
37918 2425859 2895225 2796040 2387446 2120208 1891202 1494705 1227129 1361314 1541741 1381635
37908 1381635 1168578 1298184 1505025 1387467 1229944 1517603 2040938 2305424 2483480
37899 2483480 3096238 4024268 4740555 5338899 6373176 7766514 8984897 10500871 13895511
37890 13895511 19642224 25384974 27479068 24454734 18473663 13148013 10278856 9037757
37882 9037757 7916270 6576068 5532427 4895283 4297546 3713513 3440836 3345114 2951024
37873 2951024 2308675 1966294 2003049 1905350 1534062 1360019 1528753 1562935 1284306 1161409
37863A161409K24104Q3288k88055j58640K60410J86555k53079k65452J14856J42630
37853A208026j92099k03457J12643J01032k16530j77831J80441J61108k26626
37844G46707k71329P0715J39770r8482l5732K72349J60875k71644k48405K00640
37834F65464K63045j11019j45787K24301K48679j26250j50843K17385K25077j47731
37824A162321j25602K88151K72037j69456j63161L31353M81426L11332O30296
37815C018697J131636N85250q12625j379458o50947m3158l03285m52481O5849
37806A159478L37787r2574k98905J31726K48295l25174n47791L3198L75461m3639
37796I77862k60070J96910L49080k30143m72797J05366M08682j12461l97728R3743
$$ plain form
37863 1161409 1385513 1468801 1180746 1022106 1282516 1469071 1215992 950540 1065396 1208026
37853 1208026 1015927 812470 925113 1026145 809615 631784 812225 973333 746707
37844 746707 475378 546093 685863 587381 551649 823998 984873 713229 464824 665464
37834 665464 928509 817490 671703 896004 1144683 1018433 867590 1084975 1310052 1162321
37824 1162321 1036719 1324870 1596907 1427451 1264290 1595643 2077069 2388401 3018697
37815 3018697 4150333 4735583 3922958 2543500 1892553 1849395 1546110 1093629 1159478
37806 1159478 1497265 1404691 1105786 1237512 1485807 1160633 612842 646040 1021501 977862
37796 977862 717792 914702 1263782 1033639 560842 666208 1074890 962429 564701 658444
37786F58444L06389k46338m19111K84862O07340m2688l57468L47646P40263L2575
37776A911914m69739Q0766M19728k83722p11687J0658N14359j56869o23717J29570
37766H21261P05880K0532n34432J63873P15051j3671n55013K72733R17256Q9507
37756B602977o22206J73188Q96240J29327n10184L67601R63392j87063j041885
37747B771387J19634J162401J37724p87386M72152J644865N19475m22177J256490
37738F874565K878140J806761J018257L293757M882992K203202m82730J493757
37730B3968701L870482J629100K37596O147619J2648673J1890017J5334889L8910703
37722A14637780O7144270N9717429N570826n2989300o8615543m4058295j8415477
$$ plain form
37786 658444 964833 718495 299384 584246 1191586 1148898 791430 1139076 1879339 1911914
37776 1911914 1442175 1522941 1942669 1658947 947260 957918 1472277 1315408 691691 821261
37766 821261 1527141 1547673 1013241 1177114 1892165 1878494 1323481 1596214 2513470 2602977
37756 2602977 1980771 2153959 3050199 3179526 2669342 3036943 4000335 3813272 2771387
37747 2771387 2891021 4053422 4191146 3403760 3875912 5520777 6040252 5618075 6874565
37738 6874565 9752705 11559466 12577723 15871480 20754472 22957674 22474944 23968701
37730 23968701 27839183 29468283 29705879 35853498 48502171 60392188 75727077 114637780
37722 114637780 181782050 241499479 247070305 194081005 125465462 81407167 62991690
37715F2991690j2438872j3301230p429044n91617q37578l308785j509059R43722
37707B4519227r91471l927841l059388q20838j285328k572646j411399K91310
37699A0741626n09014k039537j332412J68619k75994j443027q04993N48492K06479
37690E260239q94322m23742Q67856P83326N8220J076382L336190L882080J726733
37681A5672962j150893k844345l115555k368339j152537l97320n14036o84652
37673C445285k18952K29512m6372m22878j51495K00691j02727m94655j94160K83313
37663B527562J22807k71217j49482J27326j08236m52373k19557K04821J28741
37654A910392j00729J72863N57600K95394l18292m60259j89586j38806k77299
$$ plain form
37715 62991690 50552818 37251588 29822544 29230927 28393349 25084564 23575505 24519227
37707 24519227 23527756 19599915 16540527 15719689 14434361 11861715 10450316 10741626
37699 10741626 10232612 8193075 6860663 7029282 6753288 5310261 4505268 5053760 5260239
37690 5260239 4365917 3942175 4810031 5593357 5651577 6727959 10064149 13946229 15672962
37681 15672962 14522069 11677724 8562169 6193830 5041293 4643973 4129937 3445285
37673 3445285 3226333 3455845 3409473 2986595 2835100 3035791 2933064 2438409 2244249 2527562
37663 2527562 2650369 2379152 2229670 2356996 2248760 1796387 1576830 1781651 1910392
37654 1910392 1809663 1982526 2540126 2835520 2517228 2056969 1867383 1728577 1451278
37645A451278j26486J96141K13616L0268Q4426K84235K45070N9421M9025R1338
37635B578332q3712k75357j58024J08741K14103K57166M35246N95028N87041N86009
37625D844573N97975K26837n58031j046933p70674k57939j91936l88366k79152
37616B176354J09376L52060L61558K82479M1322l93702o64855m97707j87644j21527
37606A457714j73424n0981J32004J18655O519J7560P2865J2234n2567K3305J10070
37595A673954O4703J6476R7270J69686R4143N887Q9217K92628M35914M23650K83381
37584C646909J40022J03675P8542p5815j03728L95717J109336J318880J497808
37575H111346L184720O077672O782488K688325l721894p069764n523555k438191
$$ plain form
37645 1451278 1324792 1520933 1734549 1764817 1849243 2133478 2378548 2437969 2486994 2578332
37635 2578332 2494620 2219263 2061239 2169980 2384083 2641249 3076495 3671523 4258564 4844573
37625 4844573 5442548 5669385 5111354 4064421 3293747 3035808 2843872 2455506 2176354
37616 2176354 2285730 2637790 2999348 3281827 3323149 2929447 2264592 1766885 1579241 1457714
37606 1457714 1284290 1233309 1365313 1483968 1490487 1508047 1580912 1593146 1540579 1563884 1673954
37595 1673954 1738657 1755133 1852403 2022089 2116232 2122119 2211336 2503964 2939878 3363528 3646909
37584 3646909 3786931 3890606 3969148 3893333 3789605 4185322 5294658 6613538 8111346
37575 8111346 11296066 17373738 24156226 26844551 23122657 16052893 10529338 8091147
37567H091147j235289j481648j184015l15044m9892k93166j27155L07428K24640
37558C937006k16140k86537q3476j94961m84223m14312j11741l3756n8057J32999
37548B186802L03375K07966K63962P48207R87367L46685n90706q39282m37157
37539C177219r1952K4136J60459K18426L4002p7835J15883K33188K8258n7340
37529C764444K01605K83865M5947K32696J012755J457042J595549L120793O156924
37520A7871620P196250L143694l610488p337305n957148k845576j489574j534019
37512E437454j132703k99558o2851k56859j04823J81321k0367m25473m15754k04726
37502B695661l05537m86359k77708O1291L1256j62425k8750K84617K91865K2134
$$ plain form
37567 8091147 6855858 5374210 4190195 3875151 3825259 3532093 3404938 3712366 3937006
37558 3937006 3720866 3434329 3350853 3155892 2671669 2257357 2145616 2111860 2053803 2186802
37548 2186802 2490177 2698143 2962105 3710312 4697679 5044364 4453658 3614376 3177219
37539 3177219 3085267 3109403 3269862 3488288 3522290 3444455 3560338 3793526 3821784 3764444
37529 3764444 3966049 4249914 4295861 4528557 5541312 6998354 8593903 11714696 17871620
37520 17871620 25067870 28211564 24601076 17263771 11306623 8461047 6971473 5437454
37512 5437454 4304751 4005193 3942342 3685483 3580660 3761981 3741614 3316141 2900387 2695661
37502 2695661 2390124 1903765 1626057 1687348 1718604 1556179 1527429 1812046 2103911 2126045
37492B126045j46304j72571k38489k65509j19369P158p7298j67836n1472O6236
37482I60591k5391q3081J50682M08567L09331q5j16940l4142l0753j30761j41535
37471A266483o8075o3914r6325k8926P6184N9667m1096p4312l6627j9317j9328
37460I54414q041m3038j27890j27553J259Q1545k999r5510k7724R7294R3010p590
37448G87177n0069k7168m6386j17742j42247o3722P0687J60376J27688P677n6873
37437F49398j010N2156J216l1681Q5430K12293J46151q558j1362Q9148R4839J17420
37425A395440M06461P46604N91635q9701o43263o09057k83169j47729k00872j87850
37415I78499j13063j29809j82006j20904l744K3758l959K5920P2426L5345m3353
$$ plain form
37492 2126045 1979741 1807170 1568681 1303172 1183803 1190961 1113663 945827 894355 960591
37482 960591 935200 852119 1002801 1411368 1720699 1720614 1603674 1569532 1538779 1408018 1266483
37471 1266483 1198408 1134494 1038169 1009243 1085427 1145094 1103998 1029686 993059 973742 954414
37460 954414 946373 903335 775445 647892 649151 730696 727697 632187 604463 701757 794767 787177
37448 787177 737108 709940 663554 545812 403565 339843 410530 570906 698594 706271 649398
37437 649398 648388 700544 701760 670079 755509 967802 1113953 1105395 1094033 1183181 1278020 1395440
37425 1395440 1801901 2548505 3140140 3050439 2407176 1798119 1514950 1367221 1166349 978499
37415 978499 865436 735627 553621 432717 428973 452731 448772 474692 547118 582463 539110
37404E39110o6613m9681l7285J2831J10533J36496J7315j29166j59089r2101k4011
37393B58339J8998L8706J5001j3513L6807J28490J16415m684n8705K3219Q1266
37382F40339J530r6674p9282q687Q035N171M2532O0859P40p0734q1863p1471o9513
37369B80982j1442J09901J61479P0708l7986m1705p174l4531n9477J4922J08393
37358E54070P5546m9706j03358m1089K4562J7499j5271j5061O375J7240J6737
37347D87544J2701K075o453J5097P6754J38228J42787J06441J44858L32531N24003
37336A976566M36341L2m71481n99795l68675q3791M3905P8196J18721J12607J2220
37325A254846o2084Q187J15578P6243m0752L0022L25300N54056N91920P94613
$$ plain form
37404 539110 472497 422816 385531 398362 508895 645391 662706 533540 374451 282350 258339
37393 258339 277337 316043 331044 317531 354338 482828 599243 594559 535854 559073 640339
37382 640339 641869 545195 465913 457226 465261 470432 512964 573823 574563 503829 421966 350495 280982
37369 280982 269540 379441 540920 611628 573642 531937 524763 490232 430755 445677 554070
37358 554070 629616 579910 476552 435463 460025 477524 462253 447192 453567 470807 487544
37347 487544 500245 502320 495867 510964 587718 725946 868733 975174 1120032 1452563 1976566
37336 1976566 2412907 2412939 1941458 1341663 972988 889197 933102 1011298 1130019 1242626 1254846
37325 1254846 1192762 1200949 1316527 1392770 1352018 1382040 1707340 2261396 2853316 3647929
37315C647929J432031J956853J420871k11937j715123j963941j234534o26779
37307B705370n49593m98631j74966L9413j19714k96369j66471J6308n6670j85717
37297G12960p6553J03159N7134r2668o7068N0142K0416p1154r533R8705L3623
37286G59163p2215M7932K68475K46203J1797q5815L7082J17139J9503j09757j61773
37275A077734j80729j69552q8882j9236n0601q4382p936N9495k0506j09210k9346
37264C76849P7576k962j31595m0682J68817J92226N4662K5597J01868M7122j16510
37253G52968j29612J5868O1621m6755j03309n5392n6853j05897m1194R2249P7436
37242D61130o2663q3776L7434P3917k3830o2514Q242K9123k3476J9Q9695P6169
$$ plain form
37315 3647929 5079960 7036813 8457684 8245747 6530624 4566683 3332149 2705370
37307 2705370 2155777 1657146 1482180 1521593 1401879 1105510 939039 955347 898677 712960
37297 712960 636407 739566 796700 704032 636964 687106 707522 636368 626835 725540 759163
37286 759163 686948 734880 1003355 1249558 1261355 1175540 1212622 1329761 1349264 1239507 1077734
37275 1077734 897005 727453 638571 619335 568734 484352 476416 535911 515405 406195 376849
37264 376849 454425 451463 319868 279186 448003 640229 694891 720488 822356 869478 752968
37253 752968 623356 639224 700845 654090 550781 495389 438536 332639 291445 383694 461130
37242 461130 398467 314691 352125 426042 402212 339698 347940 377063 353587 353606 443301 519470
37230E19470j3441L0404J99451K44963R3757n7897j00354j29105j78850j56255
37220D52143o3803o143J8740O8356O0663q0684j85757o6283J27945J26925j1017
37209D41085m0296K0492j5886r3462k8569Q8539M9000n0267P069R8495j5560j72388
37197B88252n4450J89573J60774p1722r4706R3210J10134o3442m8410K01631L01054
37186A011898J29091j1825q922q2539k33655j75861P5128J53268r857q6975K954
37175G62705k6835k07370k04100L6273J53797L3175k3523P6419M5593j70070k36115
37164B39949o0642L6014n0649l5417J37531J44111p0992j44241J9404O9034q6791
37153A97311q3006J69332K54203J8026j30134K1563J18112m9656j42996N6088
$$ plain form
37230 519470 506029 536433 735884 980847 1074604 1016707 916353 787248 608398 452143
37220 452143 388340 382197 400937 469293 529956 449272 263515 197232 325177 452102 441085
37209 441085 400789 421281 405395 311933 283364 371903 420903 370636 377705 476200 460640 288252
37197 288252 233802 423375 584149 512427 417721 510931 621065 557623 509213 710844 1011898
37186 1011898 1140989 1129164 1120242 1037703 804048 628187 703315 856583 846726 759751 762705
37175 762705 735870 528500 324400 360673 514470 547645 524122 600541 646134 476064 239949
37164 239949 179307 215321 164672 129255 266786 410897 339905 195664 215068 284102 197311
37153 197311 114305 283637 537840 555866 425732 447295 565407 515751 372755 428843
37143D28843K21259J00213m9523J466P0997M7974J51238L81143L40750n2803l10027
37132A331530j71333k4734j60628k73522j10100M1131n7187j35230J0887J03003
37122E53817l2488q1439J20860K03934l0634j59567J11132L73647K19220q4667
37112A193815j44245r0343j55036j63350K5746J20157n1726j41108P1322K08960
37102H74192m140j87683J21K18837R3872p2697J32530M89267N79152M62565L40005
37091B926021O5455m12936o63775m30830j51772k23322l12309l3590K69320J32692
37081A164954j73163j42611Q4296P8046p1584k6391J09812O0558l1712P6028J96605
37070A324838R9776J1880J44711J95481q0684l09880j48194N0149j01009k48791
$$ plain form
37143 428843 650102 750315 700792 702258 773255 821229 972467 1353610 1694360 1641557 1331530
37132 1331530 1160197 1135463 974835 701313 591213 632344 575157 439927 450814 553817
37122 553817 521329 439890 560750 764684 734050 574483 685615 1059262 1278482 1193815
37112 1193815 1049570 959227 804191 640841 666587 786744 735018 593910 665232 874192
37102 874192 870052 682369 682490 901327 995199 922502 1055032 1544299 2123451 2586016 2926021
37091 2926021 2991476 2578540 1914765 1483935 1332163 1108841 796532 762942 1032262 1164954
37081 1164954 991791 849180 933476 1011522 939938 913547 1023359 1083917 1052205 1128233 1324838
37070 1324838 1424614 1436494 1581205 1776686 1696002 1386122 1237928 1288077 1187068 938277
37060I38277M3601M23260L73329K15854N69913J184911J237506N51222k95318
37051E242555q58181j089635r52273m92394j02971r2926k14674j27917K2554M799
37041A338937J2023K04336K49644n3425k42287L7507L00440J5630m35504m15218
37031A012083j01800m2793j47519k6791J32422m3919k77732j07716J98375J07086
37021G01696j91793j65403P0133M5595j35975p1348R7062o759j88206n8046J61181
37010B58137O4924j05507O0172K76705Q6182k08560q1452K00749Q1866k13299
37000D19917j24896J60386J06611j14619r773K13553P0466j72976J9911L59005
36990I27585K18255j68960j24574K35718K89099O6982M2222J35068m095j32608
$$ plain form
37060 938277 981878 1405138 1778467 1994321 2564234 3749145 4986651 5537873 5242555
37051 5242555 4384374 3294739 2342466 1850072 1747101 1654175 1439501 1311584 1334138 1338937
37041 1338937 1350960 1555296 1804940 1751515 1509228 1546735 1847175 1862805 1427301 1012083
37031 1012083 910283 867490 719971 693180 825602 781683 503951 396235 594610 701696
37021 701696 509903 344500 414633 460228 324253 252905 349967 343208 155002 96956 258137
37010 258137 323061 217554 277726 554431 640613 432053 350601 551350 633216 419917
37000 419917 295021 455407 562018 447399 437626 651179 721645 548669 568580 927585
36990 927585 1145840 976880 852306 1088024 1377123 1444105 1486327 1621395 1617300 1484692
36980A484692J38775N42731P89763J284839K070269J952296J67997j876693k234542
36971D320127j154195m23351n42557m97724J4733J88473j25880j70266J20435
36962A729795J6967m25994l73550J34396J86550k69039l40989Q2924J75834j73027
36952G43867j89574J86616J76774k38492k34480K10013K24068k54588l42987P2621
36942C53838J52376k07720j90925K56367K64497k29205l06160J52717K37971j98247
36932B85509k65397J94496L12847n7943p1087L61521L36095k28330l56097R9822
36922F11436J80726k61997k68650K75352L34032k45406l69990J96303L67881j51301
36912F68386l17569J72837L00070k18571l43517K05839L55710j97534l57164K05642
$$ plain form
36980 1484692 1623467 2166198 2955961 4240800 6311069 8263365 8431362 6554669 4320127
36971 4320127 3165932 2742581 2200024 1702300 1717033 1905506 1779626 1609360 1729795
36962 1729795 1746762 1320768 947218 1081614 1268164 999125 658136 741060 916894 743867
36952 743867 554293 740909 917683 679191 444711 654724 878792 624204 281217 353838
36942 353838 506214 298494 107569 363936 628433 399228 93068 245785 483756 285509
36932 285509 20112 214608 527455 469512 398425 759946 1096041 867711 511614 611436
36922 611436 792162 530165 261515 536867 870899 625493 255503 451806 819687 668386
36912 668386 350817 523654 823724 605153 261636 467475 823185 625651 268487 474129
36902D74129L67582k42771m85657P9986L60424j04246k81862K20967L43149k58015
36892D73686m15826K64071N46051p5206l94203J50986M08550j76919m61764J14286
36882D33712M16874j11377l45912K42650N05234p3288l10679K97607N18897j61729
36872A411989m56812K00689N33499k7893k15618N30693J041845R86666J542432
36863E547490K409378J436658j362343k856861j592354r3605m37829j059012k39696
36854A751826P05061L39382p3065O08886Q66736m24670j426875o17327L34188
36845B064142k30137q85871j28472O04825j07679p39555J12479P98267j32053
36836A355946q90236J10339R98481L75j028105j60161Q31588k7643r95472p5374
$$ plain form
36902 474129 841711 598940 113283 193269 553693 449447 167585 388552 731701 473686
36892 473686 57860 321931 867982 792776 398573 549559 958109 781190 319426 433712
36882 433712 850586 739209 393297 635947 1141181 1067893 757214 1054821 1573718 1411989
36872 1411989 955177 1155866 1689365 1661472 1445854 1976547 3018392 4005058 5547490
36863 5547490 7956868 9393526 8031183 5174322 3581968 3488363 3050534 1991522 1751826
36854 1751826 2456887 2796269 2723204 3332090 4198826 3774156 2347281 1729954 2064142
36845 2064142 1834005 948134 819662 1424487 1316808 577253 689732 1487999 1355946
36836 1355946 465710 576049 1574530 1574905 546800 386639 1218227 1190584 195112 119738
36826A19738R60135N7735r76846k4558J069667J20169r66035Q1931J268676J79555
36816A890167j135767j00203J230002J62592j200977l5001J491242L59839j250076
36807A411818j53224J481128L63834j269156n897J773326M27384j546721k17794
36798B264698J867992N22706j632250j38943K263067P71433j785171k48837K450551
36789F335246Q03049k045003o7312L419007J820948j326985J301901O100270N151975
36780B1493096K306402N786107J0210860N312831k688786n30433O420494L790793
36772E2101364j289307R207202K6360418K7167927K7434239O9749601J39302425
36765C50033869J47624478M4328198r6064794j54481115j10182993m6034714k5619111
$$ plain form
36826 119738 1079873 1137608 160762 136204 1205871 1326040 360005 441936 1710612 1890167
36816 1890167 754400 654197 1884199 2046791 845814 810813 2302055 2661894 1411818
36807 1411818 1258594 2739722 3103556 1834400 1828503 3601829 4029213 2482492 2264698
36798 2264698 4132690 4655396 3023146 2884203 5147270 5918703 4133532 3884695 6335246
36789 6335246 7138295 5093292 5025980 8444987 10265935 8938950 10240851 16341121 21493096
36780 21493096 23799498 29585605 39796465 45109296 42420510 41890077 48310571 52101364
36772 52101364 50812057 60019259 86379677 113547604 140981843 210731444 350033869
36765 350033869 497658347 541986545 445921751 291440636 181257643 135222929 109603818
36758A09603818k9788032k0236611k805940j42628o461550l979132K877425o1161
36750D9006189q367598q747038l529968l418737o557963m364254N65057r815l723091
36741A0852782k714770J165372O91544k611514k087546J003116N80500k180154
36733D699330j601524J207449Q37592j739176j363707J153805R10002j442270
36725B661501j264727R28359P91068j216442r85412J037289Q98382r99903q41924
36716A008191J016187Q64200j007756r68911Q09891Q16269q99156r71022O58516
36707A326409Q05626o50293p18636P04066P44470o86462p73837O11773P20852
36698B083968o51989q64246L64404N64826n17534n36962O76008P65407m63614
$$ plain form
36758 109603818 79815786 59579175 56773235 56630607 50169057 46189925 49067350 49006189
36750 49006189 40638591 31891553 28361585 24942848 18384885 14020631 14585688 14575873 10852782
36741 10852782 8138012 9303384 9994928 7383414 5295868 6298984 6879484 4699330
36733 4699330 3097806 4305255 5142847 3403671 2039964 3193769 4103771 2661501
36725 2661501 1396774 2325133 3116201 1899759 914347 1951636 2850018 1850115 1008191
36716 1008191 2024378 2888578 1880822 911911 1721802 2538071 1638915 667893 1326409
36707 1326409 2132035 1481742 763106 1467172 2211642 1525180 751343 1363116 2083968
36698 2083968 1431979 567733 932137 1496963 979429 442467 1118475 1883882 1420268
36689A420268o62015M59917O55949m00508n74896M44886O01576l80219m65532
36680A099426O09133P97643j98700l21407P97536J054624j43494q16958j24021
36671B753782L52697j43923k63448O68746J527774J656680J521866Q66060r41915
36662G998319k658532k300259n61211J5424p75714p79274L71852O99266k39112
36653A770759n63697K52628M66019m36517p41934J10105M55731l22786o39102
36644C51206J52912N30756j86728n55305J32101N30999n5219l84685J68118M04302
36634A088457k16806m58194K02553M81690j78396m66651K50546O70580L2894m95043
36624I11630j10980K15636j80342l89149R4187K78902k82023m86794J54859M74003
$$ plain form
36689 1420268 758253 1218170 1874119 1473611 898715 1343601 1945177 1564958 1099426
36680 1099426 1708559 2506202 2307502 1986095 2783631 3838255 3694761 2877803 2753782
36671 2753782 3106479 2962556 2699108 3367854 4895628 6552308 8074174 8940234 7998319
36662 7998319 5339787 3039528 2478317 2493741 1718027 938753 1310605 2009871 1770759
36653 1770759 1207062 1459690 1925709 1489192 747258 857363 1313094 990308 351206
36644 351206 504118 1034874 848146 292841 424942 955941 900722 516037 684155 1088457
36634 1088457 871651 413457 616010 1097700 919304 452653 703199 1373779 1406673 911630
36624 911630 800650 1016286 835944 446795 540982 819884 537861 51067 205926 679929
36614F79929j21799m83845O0229M33924n7143m02058Q1207M21251m4498l64600
36604B02597J04552M11254q2090m07982R6311M59676k9252m33322p028L66407
36594F81123o2335m50008m3301L60944J8794l24092K9733L42223m5957l70431
36584A36693K7554L59933n4638m07987M2092N10005J78366k72668l6195L07073
36574G90228M2679k62081J6738K56891r9161k67977M07536J012106N55259k98727
36564B153491m58721k01417k92741m46690j23208J89058q5329l80098n3575L20531
36554F21301M5064l45668j39244J85018l2822k94408L3148L84837O5053l57502
36544A64777j10517L09789J26322k27976k7583K84695L622l82908j14101L37473
$$ plain form
36614 679929 558130 74285 134514 568438 511295 109237 190444 611695 567197 202597
36604 202597 307149 718403 636313 228331 324642 784318 755066 321744 314716 681123
36594 681123 618788 168780 125479 486423 505217 181125 210858 553081 507124 136693
36584 136693 164247 524180 469542 61555 103647 613652 792018 519350 483155 790228
36574 790228 832907 570826 587564 844455 745294 477317 884853 1896959 2452218 2153491
36564 2153491 1694770 1493353 1200612 753922 630714 819772 734443 354345 300770 621301
36554 621301 666365 320697 181453 366471 333649 39241 72389 457226 522279 164777
36544 164777 54260 364049 490371 262395 234812 519507 523129 140221 26120 363593
36534C63593J59612k36329m3773L47124J12739l84626k77453J69933J25164k17317
36524A18667j05004K62381J66871j83949q4446K58250J38016k54221k02182J68885
36514B83268J96575m1313k161J73044k029k89192j66162J09315J5273j58633J03298
36503B21283M42297K97766Q1131M17483Q13486M27123l73263n99753l07179k71726
36493A148648m62133k63847J50066J06908k12485j02199K67067J52525l09941
36484D74609l35755M0798Q8750k06071j89406J38272J58369j11094o8223K51933
36474B42182K39947q5100j27917J14402R8599j53040j33192Q0771j9848k92560
36464c5756j68389J90117J29668k37994k14986J72079K45146m0948r3042J20896
$$ plain form
36534 363593 523205 286876 243103 590227 702966 318340 40887 210820 335984 118667
36524 118667 13663 276044 442915 258966 174520 432770 570786 316565 114383 283268
36514 283268 479843 438530 436369 609413 607384 318192 152030 261345 276618 117985 221283
36503 221283 663580 961346 1042477 1459960 2273446 2700569 2327306 1727553 1420374 1148648
36493 1148648 686515 422668 572734 679642 467157 364958 632025 784550 474609
36484 474609 138854 179652 268402 62331 -127075 11197 169566 58472 -9751 242182
36474 242182 482129 397029 269112 383514 482113 329073 195881 276652 256804 -35756
36464 -35756 -204145 -14028 115640 -122354 -337340 -165261 79885 38937 -54105 66791
36454F6791P1026j95548j15698K30641K11982j35374j62682J46023J74185j01191
36444A90155q4690K33375K50917m4400m8874K42658K01924j89585k67836N1818
36434E35462J32470j55455k43251j8625M439k08277j19400K33203J98440k20100
36424A38906k72135J65777L41470o248k37415m9541N7937j26451j30915J61710
36414D3095K07700j10417j92237J28433K37372q3178k29807O5023K35275j8534
36404B82725j85411L2348J68978m7463j67922N5897J67685q2915k37752k4610
36394c8440J29301m7954j68400P232J07851n8584j02850J30353K01520m9272j40062
36383b9305J17571K15995p1503k23579L8760K09158l5845k28171k6445J39525
$$ plain form
36454 66791 137817 -57731 -173429 57212 269194 133820 -28862 117161 291346 190155
36444 190155 105465 338840 589757 545357 496483 739141 941065 751480 483644 535462
36434 535462 667932 512477 269226 250601 255040 46763 -72637 160566 359006 138906
36424 138906 -133229 32548 374018 367770 130355 80814 138751 12300 -118615 43095
36414 43095 250795 140378 -51859 76574 313946 230768 961 65984 301259 282725
36404 282725 97314 129662 298640 251177 83255 139152 306837 223922 -13830 -38440
36394 -38440 90861 42907 -125493 -118261 -10410 -68994 -171844 -41491 160029 110757 -29305
36383 -29305 88266 304261 232758 9179 47939 257097 221252 -6919 -33364 106161
36373A06161o2202k04986N8132L02859J29694j06237j1056J23403l6740j84179
36363A14849J0958K31673J05318j19662r1173J3649n9850j12814M4419J43412
36353B80779j4609j25027M1795J82788M6747r3587n785N3439j01052j78886j4722
36342G1880N3169j47831k27514L0863K07778J3776j61313R263J76884J0169j62020
36331a24896N152K11563R9991q7651l6201L7286j10857k09497j6049J61643N1335
36320a8181n2199R8461J65728j05839l04739o9072K16990J07033j15033j8970
36310i5821J61560L0566j79937o6084J67971J17858o2783k1036R1403k9504j81447
36299f7254l8997J79679R9748j18619j19516j3484o8352j19368P2432K50332R2952
$$ plain form
36373 106161 43959 -161027 -102895 199964 329658 223421 212365 335768 299028 114849
36363 114849 125807 357480 462798 343136 251963 265612 205762 92948 137367 280779
36353 280779 266170 141143 182938 365726 412473 318886 313101 366540 265488 86602 71880
36342 71880 125049 -22782 -250296 -219433 -11655 2121 -159192 -149929 26955 37124 -124896
36331 -124896 -119744 91819 191810 104159 67958 105244 -5613 -215110 -231159 -69516 -18181
36320 -18181 -70380 28081 193809 87970 -216769 -285841 -68851 38182 -76851 -95821
36310 -95821 65739 96305 -83632 -149716 18255 136113 73330 52294 143697 114193 -67254
36299 -67254 -106251 73428 173176 54557 -64959 -78443 -146795 -266163 -193731 56601 149553
36288A49553j53282j04491P3432L8440n8169O9886K03821J8736k38395j56229
36278a56698R1858Q5746p9510m8567Q9755L1957r8791p743J55018Q1025p7944
36267F6106j4529J08637j8469k06945j01713J31768J11223n9366m5904M9544n5190
36256c4838j90947m1860J96753J47188l7768K3594K03350J29572p5859m3274J10074
36245C85985J7794j95527j43843O5266L7651j45291j03309R1991P4337q7091m3606
36234d5643J20228O1380j06496j8273J87018Q3302k09904j95659J01411J85809
36224A63173k3849j25126j0481K3354p3113m7266P5542K8989j15258o0915R4229
36213g0721K1478j57537n7013K09523J94953m0976l4733J97754J89005q4105j54190
$$ plain form
36288 149553 -3729 -108220 -34788 3652 -54517 15369 219190 237926 -469 -156698
36278 -156698 -64840 20906 -58604 -107171 -17416 14541 -84250 -91993 63025 144050 66106
36267 66106 51577 160214 141745 -65200 -166913 -35145 76078 16712 -29192 20352 -34838
36256 -34838 -225785 -267645 -70892 76296 38528 62122 265472 395044 319185 275911 385985
36245 385985 403779 208252 64409 129675 167326 22035 -81274 10717 85054 -2037 -45643
36234 -45643 74585 135965 29469 11196 198214 281516 71612 -124047 -22636 163173
36224 163173 139324 14198 3717 27071 -46042 -93308 -17766 11223 -104035 -164950 -70721
36213 -70721 -49243 -206780 -263793 -54270 140683 99707 64974 262728 451733 367628 213438
36202B13438M9851Q5522j50046k44866p0018J5166j00964q4428J43855K26287
36192H3797O2597m590J24961J15913j21966k22493l9667R5087R68o9927K0561
36181D5241N2311n5152o6268O6441P5738p8256r5317Q1231J33637k2464p4989
36170F2153P3085J09733p9448j80530l8028P1753k6298j11969k3280P5367P1145
36159C683R0141J46536O1363j32111j60412P8O6518l5782q2570k7747n7458j28807
36147b56568q225J92910J16910j60420j85595P2852J60952k6516p2114J45846
36137a9968K05652n3865k09851k9521J22934j6304j57751n4203O4750J2317J1851
36126a23959J80937K15120l6536k17003o2426J46880J05650l0008l2763j1364
$$ plain form
36202 213438 263289 348811 198765 -46101 -116119 -100953 -201917 -286345 -142490 83797
36192 83797 146394 141804 266765 382678 260712 38219 -1448 93639 94607 24680 45241
36181 45241 97552 42400 -23868 42573 118311 40055 -55262 25969 159606 137142 62153
36170 62153 135238 244971 165523 -15007 -53035 18718 -7580 -119549 -142829 -67462 3683
36159 3683 93824 240360 301723 169612 9200 9278 75796 40014 -42556 -70303 -127761 -256568
36147 -256568 -264793 -71883 45027 -115393 -300988 -228136 -67184 -93700 -165814 -19968
36137 -19968 185684 131819 -78032 -107553 15381 -923 -158674 -212877 -148127 -135810 -123959
36126 -123959 56978 272098 235562 18559 -43867 103013 208663 178655 145892 134528
36116A34528p9470o9861Q8411J47287j268q9452K3263Q3376m3879r6056N6559
36105A53438J16436q4279k39326j15720N0882M0912K7760J31272J12610j19700
36095G4285k15252J6058K11751P3508j20332m8860Q7775L52j38733n4046J13210
36084b84J01694k137o317J4224m1821l8652Q2752J02308n5826j14338L9345R7509
36072A78457q1488j53729O8327K05293j6620k31360p4651J64439Q6330j11244
36062C3754n6107J08644O2765o0242J3517J18869j1044j71107n2327J41876N8056
36051A86654j36769p1162J25636P2926j47686j65064o385J0029r6248m8311J15795
36040a60585J26240J6424L0181J14328L3337j27349r4956O2911N5630q5621q1262
$$ plain form
36116 134528 55058 -14803 73608 220895 219627 130175 153438 236814 192935 96879 153438
36105 153438 269874 185595 -53731 -169451 -118569 -77657 -49897 81375 193985 74285
36095 74285 -140967 -124909 86842 160350 40018 -8842 78933 79285 -59448 -113494 -284
36084 -284 101410 99273 92956 107180 65359 26707 109459 211767 155941 41603 80948 178457
36072 178457 96969 -56760 11567 216860 200240 -31120 -105771 58668 144998 33754
36062 33754 -22353 86291 149056 88814 102331 221200 210156 39049 -13278 128598 186654
36051 186654 49885 -21277 104359 177285 29599 -135465 -141850 -131821 -228069 -276380 -160585
36040 -160585 -34345 -17921 12260 126588 159925 32576 -62380 531 56161 -29460 -110722
36029a10722O6826J04732R638j9079K2502k4611j09205n2312P7791P3741k2369
36018A6932k1157M1689J3470l6035L4222J05092Q961j02956j3916J24610M6232
36007B17144j28728j02680N9842P6428k2548Q660J31136R9857n9909j13545n7961
35996A07696o6910j06525l3815M7224l9697j50938m7342J37660J12504m2481l8473
35985a21097P7689M5983p3767j4826J55226J33655n3246j00396K2669O8337J367
35974A41594R64L5900o8258k00330j02534J18829J26067n8131j02303L3609O9807
35963d786m3648o5286M9141Q9533K4568K1802N4915l9320j54998n7912J22108
35952c883N9422j57777j39747J11478J99953L3950o1860K5834M6056o6091o2498
$$ plain form
36029 -110722 -43896 60836 70474 51395 73897 49286 -59919 -112231 -34440 39301 16932
36018 16932 -4225 37464 50934 14899 49121 154213 163174 60218 46302 170912 217144
36007 217144 88416 -14264 45578 122006 99458 108118 239254 339111 279202 165657 107696
35996 107696 40786 -65739 -99554 -52330 -92027 -242965 -290307 -152647 -40143 -82624 -121097
35985 -121097 -43408 2575 -71192 -86018 69208 202863 149617 49221 71890 140227 141594
35974 141594 142558 178458 110200 -90130 -192664 -73835 52232 -5899 -108202 -74593 -4786
35963 -4786 -48434 -113720 -64579 24954 49522 71324 126239 86919 -68079 -125991 -3883
35952 -3883 55539 -102238 -241985 -130507 69446 103396 41536 67370 113426 47335 -15163
35941a5163Q8374R8749q7952j70940m0115O0715L2527O8183J85213J36326q0786
35930B75131j48097o036K0032j66773k31636j8216J60292P7079m8405r0P6084
35919a0635K2246l6904M19j609r6850r7981M9938J11908j2678q4021M6700J69338
35907E9871R8903k4237l6720k0163n7673m5971M9442O4947m7621q6351M4685J50336
35895A49448Q5768j5303j4259J8725P713O789J7142m7660j29728o3998R3914J10370
35883B18921j3572m2113M7236L1033r6580q2750Q6683J28072l391k2434J15584
35872C66689Q9442j66550k65881l2831J70030O2044j10502o6476M2029o365r7538
35861a5909q1006p8715j68672j45823P9213K24049J00490m2160L1799J31862L0609
$$ plain form
35941 -15163 73211 171960 84008 -86932 -127047 -66332 -33805 34378 219591 355917 275131
35930 275131 127034 120998 141030 -25743 -257379 -275595 -115303 -38224 -86629 -86719 -10635
35919 -10635 11611 -25293 -24874 -26483 -123333 -221314 -171376 -59468 -72146 -156167 -109467 59871
35907 59871 158774 134537 97817 77654 19981 -25990 23452 88399 40778 -45573 -888 149448
35895 149448 235216 219913 205654 224379 232092 238881 256023 208363 78635 14637 108551 218921
35883 218921 205349 163236 210472 241505 144925 62175 148858 276930 273539 251105 366689
35872 366689 456131 289581 23700 -9131 160899 222943 112441 45965 87994 81629 -15909
35861 -15909 -96915 -175630 -344302 -490125 -410912 -186863 -86373 -128533 -96734 35128 65737
35850F5737j03216l7085R2667N8742m5012l1558J8873k8504n9713M7666J42893
35839A21490P3237k6730j1004o707j28273j99055o4585J00856J00894M2362O3761
35828F6246M8420q6332j34282L7803J85901Q2836q9169p7048K1944K0199K381
35817G8899P1621N8607j38088k46071n2358J79427J41879N918N7836J42311j8610
35806B81371k36474j47380J21882J46744q1939j87744n8401N6014M3325M2763
35796a9839P8532K0045r6010r4195J057Q115o4493n1564L5974M3148j6593j006
35784a56829O6630M9178k5853l1898p70k7670l1325R1352J98452J10918m3311
35773A98874l0938O9905J7740j38477j36954L6823J40267Q3129M122k7317o7599
$$ plain form
35850 65737 -37479 -74564 18103 76845 31833 275 19148 -9356 -69069 -21403 121490
35839 121490 194727 167997 156993 150286 22013 -177042 -241627 -140771 -39877 2485 66246
35828 66246 114666 28334 -105948 -68145 117756 200592 111423 34375 56319 76518 78899
35817 78899 150520 209127 71039 -175032 -227390 -47963 93916 99834 157670 299981 281371
35806 281371 44897 -102483 19399 166143 84204 -103540 -161941 -105927 -62602 -19839
35796 -19839 58693 78738 -17272 -111467 -110410 -102295 -166788 -218352 -182378 -139230 -155823 -156829
35784 -156829 -90199 -41021 -66874 -98772 -99542 -127212 -158537 -67185 131267 242185 198874
35773 198874 167936 237841 255581 117104 -19850 16973 157240 240369 244491 217174 149575
35762A49575r3524l6162K5500k1007q3727j2157J13207J15039L3448J8531L2069
35751B40792l9318j04272k4780P6231P611j17507o5335Q1494N9366r6233j09254
35740i1205N3291J50827R6932M4478N3397K3896m1480l3885J2815k6682r7250
35729A45134m4706P1536N5224p6572j25297n4586o096j5970k710J6074k7111n6521
35717a21601J7926Q0816L050p9097J1972J41521Q0677p1612o4548M8004L2524
35706G9632p2249n5312L1647j6123j19027m9940R0755L1454j22187k8781K41497
35695A1366K64602j4652j82864n7265O3592k4014j18125m8040L8990J4781r164
35684f0793L2701K1200n9483m8639N9695O4565o4970j18063k9927K5947K984N0607
$$ plain form
35762 149575 56051 19889 45389 24382 -59345 -71502 41705 156744 190192 208723 240792
35751 240792 201474 97202 72422 148653 156264 38757 -26578 54916 114282 18049 -91205
35740 -91205 -37914 112913 209845 254323 307720 331616 290136 256251 269066 242384 145134
35729 145134 100428 171964 227188 150616 25319 -29267 -35363 -51333 -54043 -37969 -65080 -121601
35717 -121601 -103675 -22859 -19809 -98906 -86934 54587 135264 63652 -896 47108 79632
35706 79632 7383 -47929 -16282 -32405 -151432 -201372 -110617 -79163 -201350 -230131 11366
35695 11366 275968 261316 78452 21187 84779 60765 -57360 -105400 -66410 -51629 -60793
35684 -60793 -28092 -6892 -66375 -115014 -55319 9246 -55724 -173787 -203714 -177767 -174783 -124176
35672a24176J50847R7934q1191j13782K5607N7750o8187o6366J26119J85086j5205
35661A74436j50987k3591R5108k2767j52726n3123R5182M1866q4818m5470Q2240
35650d4650R0124J3423k62J5230l0930o3057J801N7653L338n5925j1847L7739
35638A2637j4553p6410l8594K5238K4011K2970Q3078J19414P4110L5607N2694
35627C20202L9282k1540j5865N1179J2794j36712j72748k7496O9814n372o3979
35616D9559K0029O8045m4725j25570j7516R8532L4534o4907r097Q3537K6033q3688
35604C4766o2850J7354j156n2983l630O6412K1549n2885j2599O8727N1491k746
35592G1450K1121M2911m4349j18871k3979J27619J26517J5736j4261L2049N44
$$ plain form
35672 -124176 26671 124605 43414 -70368 -44761 12989 -55198 -121564 4555 189641 174436
35661 174436 23449 -142 94966 72199 -80527 -133650 -38468 3398 -81420 -126890 -44650
35650 -44650 45474 58897 58635 73865 42935 -20122 -18321 39332 42670 -13255 -25102 12637
35638 12637 -1916 -78326 -116920 -91682 -67671 -44701 38377 157791 231901 267508 320202
35627 320202 359484 337944 322079 373258 386052 249340 76592 49096 118910 113538 49559
35616 49559 69588 137633 92908 -32662 -50178 48354 82888 17981 8884 92421 118454 34766
35604 34766 -28084 -10730 -11886 -64869 -68499 -2087 19462 -33423 -46022 22705 74196 71450
35592 71450 92571 135482 91133 -27738 -51717 75902 202419 218155 203894 235943 236487
35581B36487j07467j44496p9260j5978O519L5481O8038O4363M7855N5394N5582
35570B22518K6320J6884L7789J6825m7552n1422P134j4330j31483j52467o397
35559g6181R7538J5108q2625j7848P8334J1322j24585j09733M6181J64655J78018
35548A80184J29185L0554p7912p9445K6118M9584q7835j82929p6592O9470N3523
35537C3905k8546R035R7276O2199m8513p4630l7200n0742p1709L703J08372J13328
35525A16478N2012J9265j7492r7597j17876j9534N0401j3339n9442M7174J48787
35514A08837O5250o6876l1114Q2565N4708o5140p3207J2914K5440k4458q752L5274
35502A15441o923o5552j2651O5042J6206p7217n4304J1036l0682p9084L2233J66295
$$ plain form
35581 236487 129020 -15476 -94736 -110714 -104195 -68714 -676 63687 111542 166936 222518
35570 222518 248838 265722 303511 320336 272784 221362 228496 214166 82683 -69784 -76181
35559 -76181 21357 36465 -46160 -64008 14326 25648 -98937 -208670 -162489 2166 180184
35548 180184 309369 339923 262011 182566 208684 258268 170433 -12496 -89088 -19618 33905
35537 33905 5359 14394 111670 173869 125356 50726 13526 -37216 -108925 -105222 3150 116478
35525 116478 168490 187755 170263 72666 -45210 -64744 -14343 -27682 -87124 -39950 108837
35514 108837 174087 107211 76097 158662 213370 148230 75023 87937 113377 88919 80167 115441
35502 115441 108518 42966 30315 95357 111563 34346 -19958 -8922 -39604 -118688 -86455 79840
35490G9840Q0379j20266j29847L8444R6432k887k0203R7807J21219k9501j34238
35479G7179n5675N2196K6701p6596j33869j14859l4111P6416J27589P2610J4634
35468C2215M5340O3501l7589j23374k5561J21736P0507j06462j18496N6125J48176
35457A26118N2630n0823n5999o4245j06585n7290Q9708J45138K4556j14354j21024
35446a32170l4604M6082R1160R2931N1440K5321N8322Q1475K6197l7146k8477
35435B40531j6358o6562p4147L4538R4809l6248j79555j03203O9395P1195l7916
35424c521r105J08420N7732j20412j32198L7170R4367l2146q2654M4145J21905
35413H3703K5638o3864j5732M3072J1361r346M8899Q6640M9692K3311L6566J4702
$$ plain form
35490 79840 160219 39953 -89894 -51450 44982 42095 21892 119699 240918 211417 77179
35479 77179 21504 73700 100401 23805 -110064 -224923 -259034 -182618 -55029 17581 32215
35468 32215 77555 141056 103467 -19907 -45468 76268 146775 40313 -78183 -22058 126118
35457 126118 178748 127925 71926 7681 -98904 -156194 -66486 78652 103208 -11146 -132170
35446 -132170 -166774 -120692 -29532 63399 114839 140160 198482 279957 306154 269008 240531
35435 240531 224173 157611 83464 118002 212811 176563 -2992 -106195 -36800 34395 -3521
35424 -3521 -12626 95794 153526 33114 -99084 -61914 32453 307 -82347 -38202 83703
35413 83703 109341 45477 29745 72817 84178 74832 123731 210371 260063 283374 319940 334642
35401C34642l1636j9007k194r9855k18783j57005K8346Q6511K02q481R4274J00798
35389A07812k7474q0184P943N2923j8017n9050k4169l8160r3761m0108Q0018O1883
35377g0344n1370o33J95524K19731R620j21025k5361O9471K9729K4492J08675
35366C88509O4357j49006k39873r0272K6731m7894q6579N2455J34425O693q8598
35355b9052L5393J59430P3733m9302k2070L931j08792j52273L7100K05449Q4495
35344B38042j41949j58962k6229J5480j7291J9332O1915n882p5531j7541N0294
35333e8322q50m2486M6504J06263k617r5979N475J21679L9958p9549n245J23614
35321A58445O1812p7903n0488N1766l583j14883k7202J64645J54213m2334j32777
$$ plain form
35401 334642 303006 283999 281805 181950 -36833 -193838 -165492 -78981 -78779 -87260 7014 107812
35389 107812 80338 154 8097 61020 43003 -16047 -40216 -78376 -172137 -212245 -132227 -70344
35377 -70344 -121714 -122347 73177 292908 302528 181503 156142 225613 255342 279834 388509
35366 388509 452866 303860 63987 -26285 446 -47448 -134027 -81572 52853 59546 -29052
35355 -29052 6341 165771 239504 190202 168132 172063 63271 -89002 -51902 153547 238042
35344 238042 96093 -62869 -89098 -73618 -90909 -71577 -9662 -15544 -91075 -108616 -58322
35333 -58322 -59172 -101658 -55154 51109 48492 -47487 -42012 79667 119625 40076 34831 158445
35321 158445 220257 142354 91866 143632 140049 25166 -2036 162609 316822 274488 141711
35310A41711n4237j0293n3610l2773O5620Q5471M379m6635m3694o7058q6736k3197
35298a21052M6986J1582m2627J6447R1180J8683j08752r0000L1000O5078K0399
35287f1076L3693P0516J3454n8205j7R3394M2692o7797l3997Q4858P8623k2109
35275A74029l1187J4201n6614j61786p4304J35183J68746m848j18581o5950q132
35264b9243j3439L0677J14172P7449o3425j01580K435O4524J6022j3914J2999
35253I6677j4047q9222p3055K4439M4150j3175J4235J17919J08397k6976q1356
35242A07986J227L5976n0080r1627m789O2748R606n6725m2233j4606l3528m4847
35230a20892j8907k798N213M4232N3864m0560j31063n7272R9806J24878L3193
$$ plain form
35310 141711 87474 77181 23571 -9202 56418 141889 146268 99633 55939 -11119 -97855 -121052
35298 -121052 -74066 -62484 -105111 -88664 2516 21199 -87553 -177553 -146553 -81475 -61076
35287 -61076 -27383 43133 56587 -1618 -1635 91759 134451 66654 32657 117515 196138 174029
35275 174029 142842 157043 100429 -61357 -135661 -478 168268 163420 44839 -21111 -29243
35264 -29243 -42682 -12005 102167 179616 116191 14611 17046 81570 97592 83678 96677
35253 96677 82630 -6592 -79647 -55208 -11058 -24233 -9998 107921 216318 189342 107986
35242 107986 109213 145189 95109 3482 -1307 61441 71047 14322 -27911 -42517 -76045 -120892
35230 -120892 -139799 -142597 -137384 -93152 -39288 -79848 -210911 -268183 -168377 -43499 -10306
35219a0306K4126R7295N6515r6314j29328J2391J17105Q6430O0051Q7069K5941
35208C30975j27380j61831k8164M3191n5457j16687N460J38802J05312J0868J8669
35197A63758P5055O1814J3821J370j8915p6372q6537j6590K7021m415n883O6104
35185B00231Q4289j6015r2093k3722Q6516Q1678k7050j21666j31431m5976R2942
35174H7703J66194R0129l0875l8855O998p5752k41262k45087n2394R3313P3336
35163a66552M6423J04218J02631k4894j00911k1746M5269l3400j20819o9291K8603
35152b10469M2495L0614P3060R2465K6574k2212J6405L5651l2274o5940J1954
35141a677O8400N279m7405K4204R1995J1821j17644j33484p2399n0328l9647L1761
$$ plain form
35219 -10306 13820 111115 167630 71316 -58012 -45621 71484 157914 217965 305034 330975
35208 330975 203595 41764 13600 56791 1334 -115353 -109893 28909 134221 145089 163758
35197 163758 238813 300627 314448 315818 296903 220531 133994 117404 144425 140010 134127 200231
35185 200231 284520 268505 176412 152690 239206 320884 293834 172168 40737 -5239 87703
35174 87703 253897 344026 313151 274296 281294 205542 -35720 -280807 -333201 -239888 -166552
35163 -166552 -120129 -15911 86720 61826 -39085 -60831 -15562 -48962 -169781 -239072 -210469
35152 -210469 -167974 -137360 -64300 28165 54739 32527 48932 84583 52309 -13631 -1677
35141 -1677 66723 72002 24597 48801 140796 152617 34973 -98511 -170910 -221238 -260885 -229124
35129b29124J03581R3169N0581M2227J9751m9855p8523k1531J7880j8144k6402
35118i6390M6213P6953l485o8056l1563p039o2012o1082O2452J29527K2710q0445
35106g2217j8033O3220q889j00446k3550J03280P4262j9919K4682J25117O2313
35095B09820r5206r6396M4639P9799l1541p1454M0024J26569P3567k0285o0018
35084A99518p6434q1799k1689P9801J12731N7295R339J5838L1021L0558K6811
35073C82990p866r1137j40803q0669J2149J7285l1528k3634K0042P20n3031l3513
35061b8995L0882J2252q2896j13169l5400M4315O1173O3604P7579N4198j7467
35050F6076o9847n6101j063M7569M8873j7226r7167q7076J7050Q1912L6420r765
$$ plain form
35129 -229124 -125543 -32374 18207 60434 80185 30330 -48193 -69724 -51844 -69988 -96390
35118 -96390 -50177 26776 23291 -44765 -76328 -83367 -145379 -206461 -144009 -14482 8228 -72217
35106 -72217 -90250 -27030 -35919 -136365 -159915 -56635 17627 -2292 22390 147507 209820
35095 209820 114614 18218 62857 142656 111115 39661 79685 206254 279821 259536 199518
35084 199518 123084 41285 19596 99397 212128 269423 278762 294600 325621 356179 382990
35073 382990 375124 283987 143184 62515 74664 91949 60421 36787 56829 57549 4518 -28995
35061 -28995 1887 14139 -68757 -181926 -217326 -173011 -111838 -48234 29345 83543 66076
35050 66076 -3771 -59872 -60935 -13366 35507 18281 -78886 -165962 -148912 -67000 -30580 -40345
35038d0345L6414P3386j2203j12869n6450R6392J32873J5024q9124p8905k5368
35027f1175l282J884M385j5103l7597j8424K8927N7947P0388Q0189M9677l4279
35015A23537q5419l5173M2556M3575k091m635K2232R267k6371k4082j191m347
35003E7858j0756K280k2236j04502j35636m3632N8395M6962l155L7175J09934
34992g313P4819l3051o2161M64L4986K286l3689n1748p0075n0297L0321P6013
34980h9445R255o5969j6002Q7238P6241l8619j06137q3896n1830l0265J9722O2831
34968b26876M2740J5875N4014Q3436R368p9422l8737P3597R1355K6233K4842Q5042
34956A61467N7924p9329j74958j35478k5864N9438P3931Q50j00533r3447M7814
$$ plain form
35038 -40345 -3931 69455 57252 -55617 -112067 -15675 117198 132222 43098 -35807 -61175
35027 -61175 -64457 -62573 -58188 -73291 -110888 -129312 -100385 -42438 27950 108139 157816 123537
35015 123537 38118 2945 45501 89076 86985 82350 104582 113849 87478 63396 62205 57858
35003 57858 47102 49382 27146 -77356 -212992 -256624 -198229 -151267 -154422 -117247 -7313
34992 -7313 67506 34455 -27706 -27242 7744 10030 -23659 -75407 -145482 -195779 -165458 -89445
34980 -89445 -80190 -146159 -162161 -74923 1318 -37301 -143438 -227334 -279164 -309429 -289707 -226876
34968 -226876 -184136 -168261 -114247 -30811 -21443 -100865 -139602 -66005 25350 51583 76425 161467
34956 161467 219391 140062 -34896 -170374 -196238 -136800 -62869 -62019 -162552 -255999 -208185
34945b08185J40588M1382j25526j61377p8757K331Q7704K05487K29239P3251q2389
34934A23748m5809N6308O736j04390n9443N9136J8825j03749m7108J27623J11149
34923A43026r7179j69952j3331J03906M4915o569N4761P9039k794m6029p513l2603
34911D9677j26660j04330L6201O4849n1584o4350R3924J66774M1797m9432K5156
34900H2022O5785m1676q4011N9276J47197P900j30729m9069O7973j9164j63501
34889e7997j03332P6373J20166L8305J4967M4520m882r1574p1943K7407P2815
34878F4825N9689N4804K0977p5937j13248N764J38297R9340m2783q9861k2640
34867I9227K9800K6289J1703k5275r9611j27958n2039L7194N1385N2864R8381
$$ plain form
34945 -208185 -67597 -26215 -151741 -313118 -391875 -389544 -301840 -96353 132886 206137 123748
34934 123748 77939 134247 140983 36593 -22850 36286 55111 -48638 -95746 31877 143026
34923 143026 45847 -124105 -137436 -33530 11385 4816 59577 138616 135822 89793 82280 49677
34911 49677 -76983 -181313 -145112 -80263 -131847 -196197 -102273 64501 106298 56866 82022
34900 82022 147807 106131 22120 81396 228593 236493 105764 56695 124668 105504 -57997
34889 -57997 -161329 -84956 35210 73515 88482 133002 128120 36546 -35397 -7990 64825
34878 64825 124514 179318 200295 124358 11110 16874 155171 254511 211728 121867 99227
34867 99227 129027 155316 167019 141744 42133 -85825 -137864 -100670 -49285 3579 101960
34856A01960R0790l5377j38147p4866O0131R9530N8907L4125M85p5584q3953M0265
34844G8266J26882J4590j55644j48230n637N8235K5992M8549J25560J07457j3833
34833B62187q2983m6163r718l4784p0547q3740q2093l6811N6050Q7314k2719j52616
34821b16623j27522K1373J22396J21327Q8124L7622n2884j05240k9803Q8433R5596
34810D2799K0481J5199Q0938P1621m0721j19577r6729n5765n5352m4020J0474
34799a70652N4292M9121K3752J370k5074l9543j6079K0355K5654P784k907j1720
34787h3647k0606O220O7498R4490O6019N4147P9338M8397o4685j22846m1113N0547
34775A33759J5738o0728l4123M3910L2177m7566p3776m9497n6942o9249j4451
$$ plain form
34856 101960 192750 157373 19226 -55640 4491 104021 162928 197053 197538 121954 38001 78266
34844 78266 205148 219738 64094 -84136 -89773 -31538 -5546 43003 168563 276020 262187
34833 262187 179204 133041 123323 88539 17992 -65748 -147841 -184652 -128602 -41288 -64007 -216623
34821 -216623 -344145 -322772 -200376 -79049 9075 46697 -6187 -111427 -141230 -52797 42799
34810 42799 63280 78479 159417 231038 190317 70740 -25989 -81754 -137106 -181126 -170652
34799 -170652 -116360 -67239 -43487 -42117 -67191 -106734 -122813 -102458 -76804 -69020 -71927 -83647
34787 -83647 -104253 -98033 -30535 63955 129974 184121 263459 311856 247171 124325 83212 133759
34775 133759 149497 88769 54646 98556 130733 83167 9391 -40106 -97048 -166297 -180748
34764a80748M4311j021r4053r3998p286N3677P9324J29700J53646N4318j03628
34753C4242j54849p4012K4976Q8188J37522J36017L2318r3716j14538n3671l0932
34742f8455n3076l2640L1151O4626O5941P4086N2342l1417q5061k9266L5168j1578
34730A1821p9537j7444J07288J16373K4527j6135j758m2460j03574n7048N0574
34719g373N7236j9596k3646L4688M516r1012p3891M4447N1311q9398j50403j1091
34707b74212J57844J73737P0563l5632r5823p5403M1159J40990Q4251n0582m4747
34696I2145J07606J70915M2339j01716j09745n8331n3321n6217k0751l557l1932
34685b2565l4624J0662K6495n473o680L1643K8937j203M6485J42429J20974l7439
$$ plain form
34764 -180748 -136437 -137458 -231511 -325509 -332795 -279118 -199794 -70094 83552 137870 34242
34753 34242 -120607 -194619 -169643 -81455 56067 192084 224402 130686 16148 -37523 -68455
34742 -68455 -121531 -154171 -123020 -58394 7547 81633 133975 102558 17497 -11769 23399 11821
34730 11821 -67716 -85160 22128 138501 163028 146893 145135 102675 -899 -57947 -7373
34719 -7373 49863 30267 6621 41309 45825 -45187 -119078 -74631 -23320 -112718 -263121 -274212
34707 -274212 -116368 57369 127932 92300 -3523 -78926 -37767 103223 187474 136892 92145
34696 92145 199751 370666 413005 311289 201544 143213 89892 33675 12924 9367 -22565
34685 -22565 -57189 -46527 -20032 -25505 -32185 -542 28395 27192 73677 216106 337080 299641
34673B99641j47444j09350l6055k0480n790L3333J2644o6731p2847J3840M2223
34662e7016k8882l8285P2734J19232r582j32651o4122Q9606J21216M0138k992
34651A09396K4833M4009K3795j9621r5335j77367j66549k9691J14043J43679Q0063
34640E1255M916m9806o1269O292J05043J12818J3130o3303m1338l167k0351l6375
34628A7845M141N2726N9687M4750R312p5053j47224r5387L9370Q4932J3315j2760
34616d346O9359J11631K6214n9252l2856K5541K0483p154k1223q0482j69940j51357
34604b73382o969Q1070K5278j7142O6292J37348O3878m1521l4042J8206M140j0049
34592A3107N7175J03200K5637n9593j0567Q1401N4594l7637l9885K1136K263q9983
$$ plain form
34673 299641 152197 42847 6792 -13688 -19478 13855 26499 -40232 -113079 -99239 -57016
34662 -57016 -85898 -124183 -51449 67783 58201 -74450 -138572 -48966 72250 112388 109396
34651 109396 134229 178238 202033 182412 87077 -90290 -256839 -286530 -172487 -28808 51255
34640 51255 56171 6365 -54904 -48612 56431 169249 182379 119076 77738 74571 54220 17845
34628 17845 21986 74712 134399 179149 188461 113408 -33816 -129203 -89833 -4901 8414 -4346
34616 -4346 65013 176644 202858 143606 110750 136291 156774 149620 128397 47915 -122025 -273382
34604 -273382 -280351 -199281 -174003 -191145 -124853 12495 76373 34852 810 19016 23156 13107
34592 13107 70282 173482 199119 139526 128959 210360 264954 227317 187432 208568 210831 120848
34580A20848j21076o0573j390R636N246O378J6189M5645O0955L88r0979q2550
34568i1283J8972M9785k4955k7559J10167J87974O8497p6592n8360K1920r194
34557A69372q5869o4483l755j9476l7351M0386R5441L538q4047K4791J95586J60733
34545C94866l7555j29909n7759K41k2660k7382n072m0738q5356j4511J04906Q7964
34533A67035m4322r1196j2706L0820j8883m6247q496K368l0379j3939N3414O9716
34521E7185L2051L4286N8405l896j12320r8306M6082J28063M9356o5516q5773
34510C9617l2596K3940N6304L3678n7749j29792q1323K4171L0305o4580r9737
34499b57762J405J36911J88056J34500J3535j03691j19467k2055N3698O025o8785
$$ plain form
34580 120848 -228 -60801 -62191 -52555 -47309 -40931 -24742 20903 81858 82246 -8733 -91283
34568 -91283 -72311 -22526 -47481 -75040 35127 223101 291598 215006 156646 178566 169372
34557 169372 83503 19020 15265 -4211 -41562 -1176 94265 97803 13756 38547 234133 394866
34545 394866 357311 227402 169643 169884 147224 119842 114770 74032 -11324 -25835 79071 167035
34533 167035 122713 31517 18811 49631 30748 -15499 -23995 -21627 -52006 -65945 -12531 57185
34521 57185 89236 123522 181927 178031 65711 -32595 13487 141550 190906 125390 39617
34510 39617 7021 30961 87265 120943 63194 -66598 -147921 -123750 -93445 -158025 -257762
34499 -257762 -256357 -119446 68610 203110 216645 112954 -6513 -28568 25130 31155 -37630
34488c7630l6650M9066O0901L0595O0514R9297L4789p3425q9064m3586m6535m8835
34476d0563M0397J04490r838j61198r0051J34462K01738O0628m1033j3614k9187
34465A56231j28065j19426L3977J07294J2063m7533M3449J08200K0695o2971j752
34454A22162P9486K9110q0938j22224j10748q5585j643J13067J11862k0182r2210
34443e7843j6198M8072l342k7081Q2317J68773Q2723n3976p1720l6969q0351j24566
34431i0161l4714J01365R3734m1424j15625m7438P3298J45020J29728K6346j08496
34420A31633j71431j30953n8521Q959J08366J98263J45457m1304j50152o5456
34410b5139N0374K0534p4725o3321L2421O4415L258o1429p9587n2573K9188J32067
$$ plain form
34488 -37630 -74280 -25214 35687 66282 126796 226093 260882 187457 98393 54807 8272 -40563
34476 -40563 -166 104324 94486 -66712 -156763 -22301 179437 240065 199032 185418 156231
34465 156231 28166 -91260 -57283 50011 62074 14541 57990 166190 186885 123914 122162
34454 122162 201648 230758 149820 27596 -83152 -168737 -170380 -57313 54549 34367 -57843
34443 -57843 -74041 -25969 -29311 -56392 25925 194698 277421 223445 151725 114756 34405 -90161
34431 -90161 -124875 -23510 70224 28800 -86825 -134263 -60965 84055 213783 240129 131633
34420 131633 -39798 -170751 -229272 -220313 -111947 86316 231773 190469 40317 -25139
34410 -25139 25235 45769 -28956 -92277 -59856 4559 7817 -53612 -133199 -185772 -156584 -24517
34398b4517J52302N9641k7258j3645L1512J1407m1927n4273l3967p881M3457R3077
34386A87928M9713p3171j25786n5933O18l1757l4298N7118R0515l3496j45096
34375a13645p7479L6493q704j29563r5722Q2802J90061J51757Q4477M4867k0611
34364A44733r6116r2447k0712J8142O292M208K640n0151j05320p0098J9618N0015
34352a89196K4584M1797J03135J12885N6341J7580K5141K6332P999O836J1942
34341B45376j4155l9229j3876J1840l8520j10315q2146L2089R4827N1615j5427
34330A22079m0935m8948o4136p0755o9668p3188m6499M5186J43188J53123Q3036
34319A32483K1460l286l1352n7020k9797K7593K1110p0973j52345j34647l6120
$$ plain form
34398 -24517 127785 187426 160168 146523 178035 189442 147515 93242 59275 51394 94851 187928
34386 187928 237641 164470 38684 -17249 -16631 -48388 -82686 -25568 64947 31451 -113645
34375 -113645 -191124 -154631 -163335 -292898 -388620 -305818 -115757 36000 120477 165344 144733
34364 144733 48617 -43830 -64542 -46400 -40108 -35900 -33260 -83411 -188731 -258829 -239211 -189196
34352 -189196 -164612 -122815 -19680 93205 149546 167126 192267 218599 226598 233434 245376
34341 245376 231221 191992 178116 189956 151436 41121 -41025 -8936 85891 137506 122079
34330 122079 81144 32196 -31940 -102695 -172363 -245551 -292050 -246864 -103676 49447 132483
34319 132483 153943 150657 119305 62285 32488 60081 81191 10218 -142127 -276774 -312894
34308c12894O4249J07818P8394J541n9823m9961K2248Q8215Q6751K4600k3173
34297B7965R712Q2994P4199m7664j39998p9066L5979K6321p2670o7204N9703J11149
34285B1420J3011o5751j6435L5909j0816m5365K7945R0736K9148m8446j6586K7428
34273D2198m9139j49118j04093L4250R6614P7089Q1698R7567M3367l4624l6831
34262I8978k998k4389n0163R530P9976M1886l6227j7617L8488j8047j32232j18889
34250a31704J1784O9707N731m0755j3270p864n1513m3523M1439R3971N8504J2053
34238D560K0041N6095Q0418P4136Q932r9988j52145r2420j3666k853R957R4228
34226a2705J41010M2459p7182m3670O6665O1592l5904o4269l5718p5132j25900
$$ plain form
34308 -312894 -248645 -140827 -62433 -60892 -120715 -170676 -148428 -60213 26538 51138 27965
34297 27965 37677 120671 194870 147206 7208 -71858 -35879 -9558 -82228 -149432 -89729 21420
34285 21420 34431 -31320 -47755 -11846 -22662 -68027 -40082 50654 79802 31356 14770 42198
34273 42198 -6941 -156059 -260152 -225902 -129288 -52199 29499 127066 170433 135809 98978
34262 98978 95980 71591 21428 30958 110934 152820 116593 98976 137464 119417 -12815 -131704
34250 -131704 -119920 -50213 -44482 -85237 -98507 -106371 -157884 -201407 -159968 -65997 -7493 4560
34238 4560 24601 80696 161114 235250 244182 144194 -7951 -100371 -114037 -116890 -106933 -12705
34226 -12705 128305 170764 93582 49912 116577 178169 142265 77996 42278 -32854 -158754
34215a58754l5364J19631J19975j6055o9848j3614j9329q7598l6965J11824J18921
34204C2824m5423j25582k3217M9693k4278o9398K8472J07421M3366l1164k158
34193e9444K1870l7651n5237L1217N6326o5656j39476j8681J18027O5633o2421
34182a45493n0795N4696P1358N413j2133J3224p346l6951J1241P9792O1709M529
34170D9244J8822O4711K7647o2276p6418J079P6203J05545J02186M4736o8070
34159B83409j35042p6476J7668J1755n9646n3735M4913J05881N5220l8078p9932
34148G5937n1173J3439O7388P3562L6255J081p339j5368m5504p6902p9281m1219
34136d9124L1610Q9478M4008j05992j99993j03129P1081R6738l1416j04523l4854
$$ plain form
34215 -158754 -194118 -74487 45488 29433 -40415 -54029 -73358 -160956 -197921 -86097 32824
34204 32824 -12599 -138181 -161398 -111705 -135983 -205381 -176909 -69488 -26122 -57286 -59444
34193 -59444 -37574 -75225 -130462 -99245 -42919 -108575 -248051 -266732 -148705 -83072 -145493
34182 -145493 -196288 -141592 -70234 -64821 -76954 -63730 -71076 -108027 -96786 -16994 44715 49244
34170 49244 68066 132777 160424 98148 21730 22809 99012 204557 306743 351479 283409
34159 283409 148367 71891 89559 101314 41668 -12067 32846 138727 193947 155869 75937
34148 75937 24764 38203 105591 179153 215408 216489 209150 193782 148278 71376 -7905 -49124
34136 -49124 -17514 71964 115972 9980 -190013 -293142 -222061 -125323 -156739 -261262 -296116
34125b96116M8188O4884R5708J57277J23750k1199r7023k0648M3866k3829q9060
34114a4202j4463R1982P9886J6841L2247O5114q045j24877j38014o4247k8853
34103a06631m2155j8753M4895P6351N8066K4678q804k1301K1808P2811K5024r0299
34091C5690r5357M8264J37622M1786q6128p0458J6786L2267P214J0077l6332j65180
34079a23749j88085K1509K38883J80331n4501j45739m8333O154o5734j08250m5029
34068c32543K0552M1453Q8749J48255J05751k5900q9579l4337J7673j1257n5929
34057a27112n6879l6396m215N4568Q8922L2284n9573p2106j6741L887j3024J3720
34045a92665O8089N6063o695j1351M3004M6320k0039n4790k1885L459j1303j2639
$$ plain form
34125 -296116 -247928 -183044 -87336 69941 193691 172492 75469 54821 98687 74858 -14202
34114 -14202 -28665 63317 143203 160044 192291 257405 249360 124483 -13531 -77778 -106631
34103 -106631 -148786 -167539 -122644 -46293 11773 36451 27647 6346 28154 100965 125989 35690
34091 35690 -59667 -11403 126219 168005 81877 11419 28205 60472 67686 77763 41431 -123749
34079 -123749 -311834 -290325 -51442 128889 74388 -71351 -119684 -113530 -179264 -287514 -332543
34068 -332543 -311991 -270538 -181789 -33534 72217 46317 -43262 -77599 -59926 -71183 -127112
34057 -127112 -183991 -220387 -224602 -170034 -81112 -48828 -108401 -180507 -197248 -193361 -206385 -192665
34045 -192665 -124576 -68513 -75208 -86559 -43555 2765 -17274 -72064 -93949 -90490 -101793 -114432
34033a14432J5028K6976K5914N5232R0856P6298M6707P3485J10162N0732p7121
34022C79837j37722r5062m0647k6935k5251l4481p8759j10369o2717J6513K6521
34011a89072j8938k4982J9324M8709M7840L3793j8880r3946p3384P1774J53670
34000d4092L7380r6665j7967J55492J39744l1048o8547O2026R1483o6941j71251
33989a0386q3090J7873j1201m0134M3715J05331K2127p5489l2222O8437P0728
33978G5689M368j7273j1237n1305r4988n5293L6287P8453N0293J0792M027L0600
33966F0413N6778K8080n2471p7342J9600J10356L2402j36098j72040n8184R830
33955a78676k8307k3184O8004R0016o32l5202M1005M6592q1289j22121L7998J54635
$$ plain form
34033 -114432 -99404 -72428 -46514 8718 99574 175872 222579 296064 406226 456958 379837
34022 379837 242115 147053 106406 79471 54220 19739 -59020 -169389 -232106 -215593 -189072
34011 -189072 -208010 -232992 -213668 -164959 -117119 -83326 -102206 -196152 -269536 -197762 -44092
34000 -44092 -6712 -103377 -121344 34148 173892 142844 74297 136323 227806 160865 -10386
33989 -10386 -93476 -75603 -86804 -126938 -83223 22108 44235 -31254 -63476 4961 75689
33978 75689 80057 62784 51547 242 -94746 -150039 -113752 -35299 14994 25786 29813 60413
33966 60413 117191 145271 92800 15458 35058 145414 177816 41718 -130322 -188506 -178676
33955 -178676 -206983 -230167 -162163 -72147 -72779 -107981 -66976 -20384 -101673 -223794 -185796 -31161
33943c1161K0341j59180r1180J19934J54826n895r9113k8830L8958J1211p694
33932g7783M1406O1714k857n8415k1168N7508Q6952N3722J352k9048j8895R389
33920A03877K18n8809r7404n2808L9502R7954R1517L7561l7347q7752o9917j7825
33908e1233j8231o7699n7724M2054J06301M2801n6642n7414K4938Q2010P8181
33897F7342M9983J0741m0063o5975l5843L0355J06949J81429J95158P8546j04368
33886D74254j80189j07116m8338j12627j75552q8421P4652J36693P7774J2223
33876F3353j3590m0182o5242m3639Q460K5268r896n4369o2292l472J10590J82958
33864I7947J11281m4905j00658o568P2500J7082p1984o7947k2551l3984n9179
$$ plain form
33943 -31161 -10820 -170000 -261180 -141246 13580 7685 -91428 -120258 -81300 -70089 -77783
33932 -77783 -36377 25337 22480 -35935 -57103 405 87357 141079 142431 113383 94488 103877
33920 103877 104095 45286 -52118 -104926 -65424 32530 124047 161608 124261 36509 -33408 -51233
33908 -51233 -69464 -137163 -194887 -152833 -46532 -3731 -60373 -117787 -92849 -10839 67342
33897 67342 117325 128066 88003 22028 -13815 16540 123489 304918 500076 578622 474254
33886 474254 294065 186949 138611 25984 -149568 -237989 -163337 -26644 51130 63353
33876 63353 49763 9581 -55661 -99300 -90840 -65572 -75468 -129837 -192129 -195601 -85011 97947
33864 97947 209228 164323 63665 57097 129597 146679 74695 6748 -15803 -49787 -108966
33853a08966j8601L8739L8085L1665Q6227J28470O8852k4793m5281l4422p8903
33842H1072j19280n2527N8644P1962l044m1400j2104K0443M4052P8716P0586k4798
33830A72322j13967q6686j094J7537j3277k765J4561m9919j36460j14912j2994
33819c27654L9651M3008Q6499J28557N5043p0940o8338N2442Q8804j9210r8318
33808i0456m1193L4778J2305m4317l4469J7799N1388Q2521J33158J48175P1474
33797C41163o0126j50235j27339L24J18082P9649j01010k01797o7524J42785J59872
33786A33844o875j04317l2964L9722o394o4482k3243M3476L0289k1241k2800P160
33774b7825N943j1784N385N1603Q1987O8507l50j09342j84770j50932l4285O5759
$$ plain form
33853 -108966 -127567 -88828 -50743 -19078 67149 195619 264471 239678 194397 159975 81072
33842 81072 -38208 -90735 -32091 39871 36827 -4573 -16677 3766 47818 126534 197120 172322
33830 172322 58355 -28331 -29425 -11888 -25165 -27930 -13369 -63288 -199748 -314660 -327654
33819 -327654 -288003 -244995 -158496 -29939 25104 -45836 -114174 -61732 27072 7862 -90456
33808 -90456 -131649 -96871 -84566 -128883 -163352 -145553 -94165 -11644 121514 269689 341163
33797 341163 281037 130802 3463 3787 121869 201518 100508 -101289 -168813 -26028 133844
33786 133844 126969 22652 -10312 29410 23016 -41466 -64709 -21233 9056 -12185 -34985 -27825
33774 -27825 -21882 -33666 -28281 23322 105309 173816 173466 64124 -120646 -271578 -305863 -240104
33762b40104J07930J22964J15043O2642L670n433l040n9815j21191p2084M8407
33751d1011P7488j2063p2644l5263l943l8074m1684L8612R3677M6116n087L2100
33739C8224O6751j2954j25130j13292P44N2566j3913q1476m3945O1386J27143
33728d3896J08007N3406L7453O7041O6743j9877j30353j42435l0786J00573J45197
33717B11073Q7601k5774j27978j43781n2285N0932M4792n0302r0107r385R1313
33706a3901R3269M972p7746q4370j3478P4427R4878K8803l4379j0397N1794M7688
33694A61560j0738j9593M0808Q4299O4325J1225o2365j50663j66148l2136J36084
33683E6658J33083k7529j06622K878J19763P0765n3987p9135j6102O251k9459
$$ plain form
33762 -240104 -132174 -9210 105833 168475 172145 166712 163672 103857 -17334 -89418 -41011
33751 -41011 36477 24414 -48230 -83493 -87436 -125510 -167194 -128582 -34905 11211 6124 38224
33739 38224 104975 92021 -33109 -146401 -145657 -93091 -107004 -188480 -232425 -171039 -43896
33728 -43896 64111 117517 154970 222011 288754 268877 138524 -3911 -34697 65876 211073
33717 211073 298674 272900 144922 1141 -51144 -212 44580 -5722 -95829 -105214 -13901
33706 -13901 79368 84340 6594 -77776 -91254 -16827 78051 106854 72475 62078 113872 161560
33694 161560 150822 131229 172037 256336 320661 331886 269521 118858 -47290 -79426 56658
33683 56658 189741 162212 55590 58468 178231 248996 195009 115874 99772 106023 76564
33672G6564l5275P931K4265l0419j10576j38204p0983N4945J28690O9899n3984
33661g7147r3523j4474O6326O1427J7521M049R716J283j2089k1187l7270l8755
33649a34123J3182Q7932J12855R1527P9934N4293m8327j59259j30521J5105Q0695
33638F3293m973q3073l7170L1910J1574l2649p876K9991k724n5850m5129J557
33626a31119K0104K0827J8454k4064q2343m5083Q8245J43259L5591o6408n075
33615b7612J02078N8140q8247j36026n5600P525j498L761N2386O3338N973m5158
33603f0940m1065k1131k3216k6889n390L2075N8319N3245K6106K2549N9197N6709
33591A29569o3353k09838j91077Q640J76485J59337M4915k4055m3088m8431l472
$$ plain form
33672 76564 41289 49220 73485 43066 -67510 -205714 -276697 -221752 -93062 -23163 -77147
33661 -77147 -170670 -185144 -118818 -57391 -39870 -35821 -26105 -24822 -36911 -58098 -95368 -134123
33649 -134123 -120941 -33009 79846 171373 251307 305600 257273 98014 -32507 -17402 63293
33638 63293 58320 -24753 -61923 -30013 -18439 -51088 -58964 -28973 -31697 -87547 -132676 -131119
33626 -131119 -111015 -90188 -71734 -95798 -178141 -223224 -134979 8280 43871 -22537 -27612
33615 -27612 74466 132606 44359 -91667 -147267 -139742 -141240 -137479 -85093 -21755 -15782 -60940
33603 -60940 -102005 -123136 -146352 -173241 -178631 -146556 -88237 -34992 -8886 13663 72860 129569
33591 129569 66216 -143622 -334699 -326059 -149574 9763 54678 30623 -12465 -60896 -64368
33580f4368Q4386R8178M566n0437J3817N0654n5951j56000p4361P6485P5154m5733
33568d3610q1673q997J5462m4895o4429L793P0258Q4315P5426M1176k9714o3019
33556d5907j713N7424J2246m1254L4864J46655J00107n6888r7349J1465P5688
33545A95338J1579o0630p3643q9805r1242K6827J97568J97079L904j23383l9538
33534A54054P2731K3473q6267o7908M2835P7968J2456l9751k6777j400p678l6032
33522A17704n8906m5976J1183N4955J1682q9191j32449p6746o17K9570K8758J2327
33510a37706l1056o0621p534R0722J14163N1448K0100N2714K8252j06345k05919
33499a91782j32358L3522J08680N0921k6452k5973L8781Q5273M6275n5140j02852
$$ plain form
33580 -64368 20018 118196 122762 72325 86142 136796 80845 -75155 -149516 -73031 2123 -43610
33568 -43610 -125283 -134280 -118818 -163713 -228142 -224349 -154091 -69776 5650 46826 17112 -45907
33556 -45907 -47620 9804 22050 -19204 15660 162315 262422 205534 108185 119650 195338
33545 195338 206917 146287 72644 -17161 -108403 -81576 115992 313071 316975 193592 154054
33534 154054 226785 250258 163991 96083 138918 216886 229342 189591 162814 161414 153736 117704
33522 117704 58798 12822 24005 78960 90642 1451 -130998 -207744 -208361 -178791 -150033 -137706
33510 -137706 -168762 -229383 -236917 -146195 -32032 19416 39516 92230 120482 14137 -191782
33499 -191782 -324140 -290618 -181938 -131017 -157469 -183442 -144661 -59388 -13113 -68253 -171105
$$ [...]
##END NTUPLES=NMR SPECTRUM
##END=
