##TITLE=31Pdec_SA_PPh3vCl(EtOAc)
 CDCl3, 8 sc
 19.9.2019
##JCAMPDX= 6.0         $$ Bruker NMR JCAMP-DX V2.0
##DATA TYPE= NMR SPECTRUM
##DATA CLASS= NTUPLES
##ORIGIN= UXNMR, Bruker Analytische Messtechnik GmbH
##OWNER= root
$$ XWIN-NMR		Version 3.5
$$ Thu Sep 19 15:38:51 2019 Russian Standard Time (UT+4h)  she@DPX200
##.OBSERVE FREQUENCY= 81.013821
##.OBSERVE NUCLEUS= ^31P
##.ACQUISITION MODE= SIMULTANEOUS
##.ACQUISITION SCHEME= undefined
##.AVERAGES= 24
##.DIGITISER RES= 17
##SPECTROMETER/DATA SYSTEM= spect
##.PULSE SEQUENCE= zgpg30
##.SOLVENT NAME= CDCl3
##.SHIFT REFERENCE= (INTERNAL, CDCl3, 0, 182.463)
##AUDIT TRAIL= $$ (NUMBER, WHEN, WHO, WHERE, WHAT)
$$ ##TITLE= Audit trail, XWIN-NMR		Version 3.5
$$ ##JCAMPDX= 5.01
$$ ##ORIGIN= Bruker BioSpin GmbH
$$ ##OWNER= she
$$ F:/spectra/data/she/nmr/P31/1/pdata/1/auditp.txt
$$ ##AUDIT TRAIL=  $$ (NUMBER, WHEN, WHO, WHERE, WHAT)
(   1,<2019-09-19 15:37:39.15 +0400>,<she>,<DPX200>,
      <created by zg, POWCHK disabled, PULCHK disabled
       configuration hash MD5:
       00 E9 B6 7A A2 85 ED C7 34 08 36 98 17 FE 4E 26
       data hash MD5: 32K
       B7 A9 45 33 5E 09 3B B8 C9 A1 23 38 4F 20 A2 80>)
(   2,<2019-09-19 15:37:41.67 +0400>,<she>,<DPX200>,
      <Start of raw data processing
       efp BC_mod = 2 LB = 1 FT_mod = 6 PKNL = 1 PHC0 = -415.8702 PHC1 = 108.6003 SI = 64K 
       data hash MD5: 64K
       59 C4 B6 26 FC 8B BA C2 5F 3E 91 3C BB 94 88 6B>)
(   3,<2019-09-19 15:37:57.17 +0400>,<she>,<DPX200>,
      <pk PHC0 = 7.966686 PHC1 = 0 
       data hash MD5: 64K
       91 83 33 5F 3D 43 3D 1B 5B E3 7A 15 DB F7 20 FD>)
(   4,<2019-09-19 15:38:00.73 +0400>,<she>,<DPX200>,
      <abs ABSG = 5 
       data hash MD5: 64K
       C7 A1 23 70 30 10 22 D9 F4 CC 6B CE A0 3E 3A A0>)
$$ ##END=
$$ 
$$ hash MD5
$$ 3F 14 EC 35 3B 72 AF F0 0E 76 9D 42 79 D8 59 04
##$RELAX= 
##$RELAX= 
##$RELAX= 
##$RELAX= 
##$RELAX= 
##$RELAX= 
##$RELAX= 
##$RELAX= 
$$ Bruker specific parameters
$$ --------------------------
##$DU= <F:/spectra>
##$EXPNO= 1
##$NAME= <P31>
##$PROCNO= 1
##$TYPE= <nmr>
##$USER= <she>
##$AMP= (0..31)
100 100 100 100 100 100 100 100 100 100 100 100 100 100 100 100 100 100 
100 100 100 100 100 100 100 100 100 100 100 100 100 100 
##$AQSEQ= 0
##$AQ_mod= 1
##$AUNM= <au_zg>
##$AUTOPOS= <>
##$BF1= 81.014009
##$BF2= 200.13
##$BF3= 200.13
##$BF4= 200.13
##$BF5= 200.13
##$BF6= 200.13
##$BF7= 200.13
##$BF8= 200.13
##$BYTORDA= 1
##$CFDGTYP= 0
##$CFRGTYP= 5
##$CHEMSTR= <none>
##$CNST= (0..31)
1 1 145 1 1 1 1 1 1 1 1 1 1 1 1 1 1 1 1 1 1 1 1 1 1 1 1 1 1 1 1 1 
##$CPDPRG= <waltz16>
##$CPDPRG1= <>
##$CPDPRG2= <waltz16>
##$CPDPRG3= <>
##$CPDPRG4= <mlev>
##$CPDPRG5= <mlev>
##$CPDPRG6= <mlev>
##$CPDPRG7= <mlev>
##$CPDPRG8= <mlev>
##$CPDPRGB= <>
##$CPDPRGT= <>
##$D= (0..31)
0 1 0 0 0 0 0 0 0 0 0 0.03 2e-05 3e-06 0 0 0 0 0 0 0 0 0 0 0 0 0 0 0 0 
0 0 
##$DATE= 1568893058
##$DBL= (0..7)
120 120 120 11 120 120 24 19 
##$DBP= (0..7)
150 150 150 150 150 150 150 150 
##$DBP07= 0
##$DBPNAM0= <>
##$DBPNAM1= <>
##$DBPNAM2= <>
$$ [...]
##$SUBNAM3= <"">
##$SUBNAM4= <"">
##$SUBNAM5= <"">
##$SUBNAM6= <"">
##$SUBNAM7= <"">
##$SUBNAM8= <"">
##$SUBNAM9= <"">
##$SW= 369.568048894756
##$SWIBOX= (0..15)
0 1 3 0 0 0 0 0 0 0 0 0 0 0 0 0 
##$SW_h= 29940.119760479
##$TD= 32768
##$TD0= 1
##$TE= 0
##$TE2= 300
##$TE3= 300
##$TEG= 300
##$TL= (0..7)
0 120 53 12 22 120 120 120 
##$TP= (0..7)
150 150 150 150 150 150 150 150 
##$TP07= 0
##$TPNAME0= <>
##$TPNAME1= <>
##$TPNAME2= <>
##$TPNAME3= <>
##$TPNAME4= <>
##$TPNAME5= <>
##$TPNAME6= <>
##$TPNAME7= <>
##$TPOAL= (0..7)
0.5 0.5 0.5 0.5 0.5 0.5 0.5 0.5 
##$TPOFFS= (0..7)
0 0 0 0 0 0 0 0 
##$TUNHIN= 0
##$TUNHOUT= 0
##$TUNXOUT= 0
##$USERA1= <user>
##$USERA2= <user>
##$USERA3= <user>
##$USERA4= <user>
##$USERA5= <user>
##$V9= 5
##$VALIST= <valist>
##$VCLIST= <CCCCCCCCCCCCCCC>
##$VD= 0
##$VDLIST= <DDDDDDDDDDDDDDD>
##$VPLIST= <PPPPPPPPPPPPPPP>
##$VTLIST= <TTTTTTTTTTTTTTT>
##$WBST= 1024
##$WBSW= 4
##$XGAIN= (0..3)
0 0 0 0 
##$XL= 0
##$YL= 0
##$YMAX_a= 15471
##$YMIN_a= -17667
##$ZGOPTNS= <>
##$ZL1= 120
##$ZL2= 120
##$ZL3= 120
##$ZL4= 120
##$ABSF1= 182.463
##$ABSF2= -187.1042
##$ABSG= 5
##$ABSL= 3
##$ALPHA= 0
##$AQORDER= 0
##$ASSFAC= 0
##$ASSFACI= 0
##$ASSFACX= 0
##$ASSWID= 0
##$AUNMP= <proc_1d>
##$AZFE= 0.1
##$AZFW= 0.5
##$BCFW= 0
##$BC_mod= 2
##$BYTORDP= 0
##$COROFFS= 0
##$CY= -3
##$DATMOD= 1
##$DC= 0
##$DFILT= <>
##$DTYPP= 0
##$F1P= 0
##$F2P= 0
##$FCOR= 1
##$FTSIZE= 65536
##$FT_mod= 6
##$GAMMA= 0
##$GB= 0
##$INTBC= 1
##$INTSCL= 5.30512e-09
##$ISEN= 30
##$LB= 1
##$LEV0= 0
##$LPBIN= 0
##$MAXI= 10000
##$MC2= 0
##$MEAN= 0
##$ME_mod= 0
##$MI= 50
##$NCOEF= 0
##$NC_proc= -5
##$NLEV= 6
##$NOISF1= 182.463
##$NOISF2= 159.3651
##$NSP= 0
##$NTH_PI= 0
##$NZP= 0
##$OFFSET= 182.463
##$PC= 4
##$PHC0= -407.9035
##$PHC1= 108.6003
##$PH_mod= 1
##$PKNL= yes
##$PPARMOD= 0
##$PSCAL= 0
##$PSIGN= 0
##$REVERSE= no
##$SF= 81.0140089999434
##$SI= 65536
##$SIGF1= 159.3651
##$SIGF2= -187.1042
##$SINO= 113.3802
##$SIOLD= 16384
##$SREGLST= <1H.CDCl3>
##$SSB= 0
##$STSI= 65536
##$STSR= 0
##$SW_p= 29940.119760479
##$SYMM= 0
##$S_DEV= 0
##$TDeff= 32768
##$TDoff= 0
##$TI= <>
##$TILT= no
##$TM1= 0
##$TM2= 0
##$TOPLEV= 0
##$USERP1= <user>
##$USERP2= <user>
##$USERP3= <user>
##$USERP4= <user>
##$USERP5= <user>
##$WDW= 1
##$XDIM= 65536
##$YMAX_p= 359400549
##$YMIN_p= -8225174
$$ End of Bruker specific parameters
$$ ---------------------------------
##NTUPLES= NMR SPECTRUM
##VAR_NAME=  FREQUENCY,     SPECTRUM/REAL,   SPECTRUM/IMAG
##SYMBOL=    X,             R,               I
##VAR_TYPE=  INDEPENDENT,   DEPENDENT,       DEPENDENT
##VAR_FORM=  AFFN,          ASDF,            ASDF
##VAR_DIM=   65536,         65536,           65536
##UNITS=     HZ,            ARBITRARY UNITS, ARBITRARY UNITS
##FACTOR=    0.456856943014862, 1,           1
##FIRST=     14782.0589164792, 0,            0
##LAST=      -15158.0608439998, 0,           0
##MIN=       -15158.0608439998, -8225174,    0
##MAX=       14782.0589164792, 359400549,    0
$$ Real data points
##PAGE= N=1
##DATA TABLE= (X++(R..R)), XYDATA
$$ [...]
39735G72530j097423j155439j93440R32291J122035L53481n32568r20691p76845
$$ 772530 -324893 -1480332 -1673772 -741481 380554 734035 201467 -719224 -1496069
39726a496069k95243K20412L53651N134l22320j49461K46886K59685m8843k6873
$$ -1496069 -1791312 -1570900 -1217249 -1212115 -1534435 -1683896 -1437010 -1177325 -1226168 -1253041
39716a253041M83019Q18593M72918j70904m22479j85797J14988K30165K81409
$$ -1253041 -770022 48571 521489 350585 -71894 -257691 -142703 87462 368871
39707C68871L72809L64296P1449m80447j002990j089939n56656K53212O81874
$$ 368871 741680 1105976 1177425 696978 -306012 -1395951 -1952607 -1699395 -1017521
39698a017521M50577l7823k72129k57386k68919k67813o7606Q7790k15959o90734
$$ -1017521 -566944 -604767 -876896 -1134282 -1403201 -1671014 -1738620 -1650830 -1866789 -2557523
39688b557523m83620N25115J286414R65112J29421j52455J14101J09052k80867
$$ -2557523 -3041143 -2516028 -1229614 -264502 -135081 -287536 -173435 -64383 -345250
39679c45250l17735J74306L78758j56991p08422m91995J95435O16924O88543O66663
$$ -345250 -662985 -488679 -109921 -266912 -975334 -1467329 -1271894 -654970 33573 700236
39669G00236L35257n57104j406617j290400l00362N28544O25655M03533K97277
$$ 700236 1035493 478389 -928228 -2218628 -2518990 -1990446 -1364791 -961258 -663981
39660f63981J29594k77192n61435l36984J91571N16045M56903K40634J43143K24302
$$ -663981 -534387 -811579 -1373014 -1709998 -1518427 -1002382 -545479 -304845 -161702 62600
39650F2600K83695O4621l50381m99767j71313J75803O2724j97402J9580N35406
$$ 62600 346295 410916 60535 -439232 -610545 -434742 -372018 -569420 -549840 -14434
39640a4434N45814q0211n28809k58313L01155N34944L90161L9257m50165p62142
$$ -14434 531380 451169 -77640 -335953 -34798 500146 890307 929564 479399 -282743
39630b82743m28053K95191M37157k71160q08889l57516M22159M67330k9391r6187
$$ -282743 -710796 -415605 21552 -249608 -1058497 -1416013 -993854 -526524 -555915 -652102
39620f52102L45768M33994j52445o94066n04613K70268J025830J272713Q20632
$$ -652102 -306334 127660 -24785 -718851 -1223464 -953196 72634 1345347 2165979
39611B165979p7734p75504q48681n44049k66789J6661L81894M51397O638l71781
$$ 2165979 2088245 1312741 464060 -79989 -346778 -330117 51777 503174 509812 138031
39601A38031j26744K53189J8971m63721l20901J88464P1705m92456k92274O84474
$$ 138031 11287 264476 283447 -180274 -501175 -312711 -241006 -733462 -1025736 -341262
39591c41262R22237r9902p78709J45626J462658J270578j75680j003782m99528
$$ -341262 580975 481073 -297636 -152010 1310648 2581226 2405546 1401764 902236
39582I02236K60071L37649K8133j01761n3337K8798J93558K76735r2080p70443
$$ 902236 1162307 1499956 1528089 1426328 1372991 1401789 1595347 1872082 1780002 1009559
39572A009559j033397n37548J87845N24043N45883O51218Q04662O21741M3265
$$ 1009559 -23838 -561386 -373541 150502 696385 1347603 2152265 2774006 2817271
39563B817271n00170o39817n02535m39197m76888l18983O9350K21039j77506o46136
$$ 2817271 2317101 1677284 1174749 735552 258664 -60319 9031 230070 52564 -593572
39553e93572m41438L50239Q53673O18873J45350l2330r2894l33583m59344q8249
$$ -593572 -1035010 -684771 168902 787775 933125 900795 807901 474318 14974 -73275
39543g3275M72951O10683K76711r5379k80552l22975j95215J8790j05329p13619
$$ -73275 399676 1010359 1287070 1191691 911139 588164 392949 411739 306410 -407209
39533d07209j082899m19607Q73980J531268J043826K05268q6567J29600K76172
$$ -407209 -1490108 -1909715 -1035735 495533 1539359 1744627 1658060 1787660 2063832
39524B063832R9225j87417k72045n2484K02534O247p30594j341417j083477r5335
$$ 2063832 2163057 1975640 1703595 1651111 1853645 1859892 1129298 -212119 -1295596 -1390931
39514a390931P71238R68053O13188J6799n15286n34622J28002P99640O10742k39865
$$ -1390931 -619693 348360 961548 978347 463061 -71561 56441 856081 1466823 1226958
39504A226958o89468l76485o6777k86751n47292l76012j31578j53927k4445N20701
$$ 1226958 537490 161005 94228 -192523 -739815 -1115827 -1247405 -1401332 -1425777 -905076
39494i05076P66278J00568p21039n24008M67360R22518L64693k88086k19831K60885
$$ -905076 -138798 -38230 -759269 -1283277 -815917 106601 471294 183208 -36623 224262
39484B24262M62198K49119j02173l61173l46291M209L18535N9298o57884j028840
$$ 224262 686460 935579 833406 472233 125942 130151 448686 507984 -149900 -1178740
39474a178740o13147R0253M40749N05202O51799P44224L72932k97452n39456j1133
$$ -1178740 -1791887 -1701634 -1260885 -755683 -103884 640340 1013272 715820 176364 165231
39464A65231P24707Q22433J11179p13132q24444j60212M74043K94899n23427j039147
$$ 165231 889938 1712371 1823550 1110418 285974 125762 599805 894704 371277 -667870
39454f67870o74757J78198Q06709J019114J020008Q02507K02947n45027q45439
$$ -667870 -1342627 -1164429 -357720 661394 1681402 2483909 2686856 2141829 1296390
39445A296390m41637K62564O78247N60726N0410m76452n50631K947O79616O76676
$$ 1296390 854753 1117317 1795564 2356290 2406700 1930248 1379617 1382564 2062180 2738856
39435B738856j23277q89525q19185o9169N65368N99835J61450l63901n91571k89909
$$ 2738856 2615579 1726054 906869 837700 1403068 2002903 2164353 1800452 1208881 918972
39425I18972K97451M80253q7430q33649r45015m02935J80121N04714O77883N73309
$$ 918972 1216423 1696676 1609246 775597 -169418 -572353 -392232 112482 790365 1363674
39415A363674j2673n87851l37295N35976Q51795K08933l41288K717M36805j45688
$$ 1363674 1351001 763150 425855 961831 1813626 2022559 1681271 1683988 2120793 1975105
39405A975105j282091j561389p01605J89914L22959Q7650P5428J82169M5357k62704
$$ 1975105 693014 -868375 -1569980 -1380066 -1057107 -969457 -894029 -711860 -666503 -929207
39395i29207l70727j19626K78734M40193J71285k46766l27076n1569J12681M5713
$$ -929207 -1299934 -1419560 -1140826 -700633 -529348 -776114 -1103190 -1154759 -1042078 -996365
39385i96365J95510O11848N80796j24316n23391N5121O04588p6506j227736j097016
$$ -996365 -800855 -189007 391789 267473 -255918 -200797 403791 327285 -900451 -1997467
39375a997467L27539J347067J187055P22002M73218q4861p97636n31896N70852
$$ -1997467 -1669928 -322861 864194 1586196 2059414 1974553 1176917 645021 1215873
39366A215873O26547r82536k095493r08140J093400J345959K3681o40917J4415
$$ 1215873 1842420 859884 -1235609 -2143749 -1050349 295610 319291 -321626 -307211
39357c07211N61839K82604J05889N07629N69806k18055q98664o07520Q0399J90908
$$ -307211 254628 537232 643121 1150750 1720556 1502501 603837 -3683 76716 267624
39347B67624k21662m55282k73036J2439Q7118j61069n78173o65780m8204Q46163
$$ 267624 45962 -409320 -682356 -669917 -582799 -743868 -1322041 -1987821 -2036025 -1189862
39337a189862J121408N61656j16018k52383Q9228N08063O83258L50760m48112
$$ -1189862 -68454 493202 377184 124801 214029 722092 1405350 1756110 1307998
39328A307998j017685o48010K77291O01575K760n62285l16189K94625M74484K21453
$$ 1307998 290313 -357697 -80406 521169 523929 -38356 -354545 -59920 414564 636017
39318F36017j029j17970l06189m25144k16348J68200L43028K46935J55508K53054
$$ 636017 634988 517018 210829 -214315 -430663 -262463 80565 327500 483008 736062
39308G36062M37255M44975Q3752m76883o78803j93092M71292M80664j58655n56174
$$ 736062 1173317 1618292 1702044 1225161 546358 353266 824558 1305222 1146567 590393
39298E90393k33003J91073k7146o51657q45423k99885M83353Q31654M67807l71670
$$ 590393 357390 548463 521317 -130340 -975763 -1275648 -792295 39359 507166 135496
39288A35496j069450j036267k90022M29712L42171n42896j328917j037790L39044
$$ 135496 -933954 -1970221 -2260243 -1830531 -1488360 -2031256 -3360173 -4397963 -4058919
39279d058919J609092J539763L52482m64522j04935N25572L34648k22272k0944
$$ -4058919 -2449827 -910064 -557582 -1022104 -1127039 -601467 -266819 -489091 -510035
39270e10035P27531P94059K9670m10775o5244J71562k03749l90677J81190P36658
$$ -510035 217496 1011555 1041225 630450 565206 736768 533019 142342 323532 1060190
39260A060190M60337j85646l74944k02191j47224j18581P2018R1398j98766k40999
$$ 1060190 1520527 1334881 959937 757746 610522 491941 563959 655357 456591 215592
39250B15592J52675J79356n38596r46657j82574P79257N77789k70857k40655O68091
$$ 215592 368267 547623 9027 -937630 -1120204 -340947 236842 -34015 -274670 393421
39240C93421J084716O54114L80383N76738L33584o20090j215178p95700j50129
$$ 393421 1478137 2132251 2512634 3089372 3422956 2802866 1587688 791988 641859
39231F41859j17002l77361l36905j50597j45943j13029J54957L55855K59962R9846
$$ 641859 524857 147496 -189409 -340006 -485949 -598978 -444021 -88166 171796 271642
39221B71642j2915k64937m15965J08199R76747R63102j56464r20193l20484N45272
$$ 271642 258727 -6210 -422175 -313976 662771 1625873 1469409 549216 228732 774004
39211G74004K11795p63561p24966L84350R91138M10433k97581k49594N258k42933
$$ 774004 985799 222238 -502728 -118378 872760 1283193 985612 736018 741276 498343
39201D98343n89645l73572Q0865M2497l40188k81327L33754P34392M09248k01898
$$ 498343 -91302 -464874 -384009 -341512 -681700 -963027 -629273 105119 514367 312469
39191C12469l88810r3634J69183R2924o5199P1650M37403N89510K82237k35076
$$ 312469 -76341 -169975 -792 92132 26933 98583 535986 1125496 1407733 1172657
39181A172657n65487o17072n41759l90504j01857K37460M16645L89439K73615
$$ 1172657 607170 -9902 -551661 -942165 -1044022 -806562 -389917 -478 273137
39172B73137P6531k54535n02760l31278J21648K76722j3441j37891L19219Q03411
$$ 273137 349668 95133 -407627 -738905 -617257 -340535 -353976 -491867 -172648 630763
39162F30763N76890j24426m84958l76180l26056l76373n1445M50524K36857p15973
$$ 630763 1207653 1083227 598269 222089 -103967 -480340 -531785 -81261 155596 -560377
39152e60377j174556m92561L04411J96249j76498K18792Q45337N10168l88114
$$ -560377 -1734933 -2227494 -1923083 -1726834 -1903332 -1684540 -839203 -329035 -717149
39143g17149l54514O67578J128645M03453l25463j80859J33542q5524k49147K56652
$$ -717149 -1071663 -404085 724560 1128013 802550 621691 755233 669709 420562 677214
39133F77214Q36692P81436M58408L51849O122r14583j530008j003548n5875R9502
$$ 677214 1513906 2295342 2753750 3105599 3111721 2197138 667130 -336418 -392293 -292791
39123b92791l93624n65997l09954j41317Q0185O73702R27192L8671j090204p99368
$$ -292791 -686415 -1252412 -1562366 -1703683 -1623498 -949796 -22604 16067 -1074137 -1873505
39113a873505O74142J313507L14253p98653n65190M68137R56899O22097K9323
$$ -1873505 -1199363 114144 428397 -370256 -935446 -467309 489590 1111687 1141010
39104A141010n24157j012682j194836q47854j49359N38082R27702P88803J81204
$$ 1141010 616853 -395829 -1590665 -2438519 -2587878 -2049796 -1122094 -333291 -152087
39095a52087l16946k35456M9112o7786l00358M1634O55164N68305j52170l58460
$$ -152087 -469033 -704489 -655377 -723163 -1023521 -981887 -326723 241582 89412 -269048
39085b69048L30550R76281R13104N55067K32272l82424j149289j160078k72611
$$ -269048 61502 1037783 1950887 2505954 2738226 2355802 1206513 46435 -226176
39076b26176L41260l9186n90905m25949N9755K09338K75141N70763N92578N0173
$$ -226176 115084 75898 -515007 -940956 -881201 -671863 -396722 174041 766619 816792
39066H16792l07915J0839K16635l23010p50907j91448N17970J42375p97252q88816
$$ 816792 508877 519716 736351 413341 -337566 -529014 -11044 131331 -665921 -1554737
39056a554737j58124K29183Q8177K23449O15199M22367k59292l79430K18500N52227
$$ -1554737 -1712861 -1483678 -1395501 -1172052 -556853 -134486 -393778 -773208 -554708 -2481
39046b481K87434J85532M80428L93204k58975m90857J26894N38105j33110j120982
$$ -2481 284953 470485 950913 1344117 1085142 594285 721179 1259284 1126174 5192
39036E192j202152m65388J18367K64160M65764Q27787P78856M2221p47218p07918
$$ 5192 -1196960 -1662348 -1543981 -1279821 -814057 13730 792586 834807 87589 -620329
39026f20329J84085R09383N09249o74308j270048n82815N01509P70773K75950
$$ -620329 -436244 473139 982388 308080 -961968 -1544783 -1043274 -272501 3449
39017C449p9508n1032j31389l53522j50726N13227Q96550N82599k9928n25729
$$ 3449 -76059 -127091 -258480 -612002 -762728 -249501 647049 1229648 1199720 673991
39007F73991r06040j030202n48734K68044N15625o1199n35640j01489P14154P54720
$$ 673991 -232049 -1262251 -1810985 -1542941 -1027316 -1088515 -1624155 -1725644 -1011490 -256770
38997b56770k40396j349728j524229o07866N75464J045079O91472L50619O30669
$$ -256770 -497166 -1846894 -3371123 -3978989 -3403525 -2358446 -1666974 -1316355 -685686
38988f85686J046830Q42276K17373j03030j73020n94568j140671q84868J67580
$$ -685686 361144 1203420 1420793 1317763 1144743 550175 -590496 -1475364 -1307784
38979a307784Q65566O71794L86890O09583P16013J25907n18620l89030J61846
$$ -1307784 -442218 229576 616466 1226049 1942062 2067969 1549349 1160319 1322165
38970A322165K43766j88814n04621m49715k25961N4775K91533K01379j75909k81138
$$ 1322165 1565931 1377117 872496 422781 196820 251595 543128 744507 568598 287460
38960B87460O8643K19458k02510m54971J13116P07856J53560j097420j347563
$$ 287460 356103 575561 373051 -81920 31196 739052 892612 -204808 -1552371
38951a552371k8565J491553J710327O65706n00829r12776n37093O8015K51689
$$ -1552371 -1580936 -89383 1620944 2286650 1785821 873045 335952 403967 655656
38942F55656j75290p32415q32060m76940r0705J52872L54879M09359J09099k78455
$$ 655656 480366 -252049 -1084109 -1561049 -1651754 -1498882 -1144003 -734644 -625545 -904000
38932i04000j60158N13018J030758P90577K1538n38335m25871J96913P52012P38198
$$ -904000 -1064158 -551140 479618 1270195 1291733 753398 327527 524440 1276452 2014650
38922B014650J95568l16013l41058k1607K08451K04944Q5742j48761n17712p11448
$$ 2014650 2210218 1894205 1553147 1531540 1739991 1944935 2030677 1881916 1364204 652756
38912F52756l62707L11800O24406K93538k02900l21404j27723j4151k4560J52940
$$ 652756 290049 601849 1226255 1519793 1316893 995489 867766 853615 829055 981995
38902I81995N66828P45404K81522m91401p68020l08201J58393j17073q43098j091434
$$ 981995 1548823 2294227 2575749 2084348 1316328 1008127 1166520 1049447 206349 -885085
38892h85085o00133k6983J12823N8820J76736M16267O85243J064901J283992P49725
$$ -885085 -1485218 -1512201 -1399378 -1340558 -1163822 -747555 -62312 1002589 2286581 3036306
38882C036306l57483q24605k6564R09413N66076o85856j254864o52731N6060J00992
$$ 3036306 2678823 1854218 1827654 2737067 3303143 2617287 1362423 709692 765752 866744
38872H66744l8337J69501L75452J98794J1473J51388J44127m75852j160630j038466
$$ 866744 828407 997908 1373360 1572154 1583627 1735015 1879142 1403290 242660 -795806
38862g95806k31562L68853M17002L38733L19921k482o14695p36837R9078J143094
$$ -795806 -1027368 -658515 -241513 97220 417141 414659 -200036 -936873 -837795 305299
38852C05299J273876M68129k74076l90850l80476p44856j038234n51301M89955
$$ 305299 1579175 2047304 1773228 1382378 1001902 257046 -781188 -1332489 -842534
38843h42534J122730R01925K92266j71548m27674m70941j26600M02217L98353
$$ -842534 280196 1182121 1474387 1302839 875165 404224 277624 679841 1078194
38834A078194m10913j209520j026812l9016O93890O49570L45658L70796N28257
$$ 1078194 667281 -542239 -1569051 -1608067 -914177 -264607 81051 451847 980104
38825I80104K57553m41760q99560n56839L73799J129369J189492O88092M1246
$$ 980104 1237657 795897 -103663 -660502 -286703 842666 2032158 2720250 2761496
38816B761496n33848r15700q37882k51077K63335Q8408m51027m41912J84734M44221
$$ 2761496 2227648 1311948 474066 222989 486324 574732 123705 -318207 -133473 310748
38806C10748j25528n96998p2350P82771O34218m70238j031763j36731J320215
$$ 310748 185220 -411778 -484128 298643 932861 462623 -569140 -705871 614344
38797F14344J783146Q65239l72925p76425l83017j95758p36945j243367p35782
$$ 614344 2397490 3262729 2889804 2113379 1730362 1534604 797659 -445708 -1181490
38788a181490M30126R21496L34005k84858j48578J30400j80183n33899o4888P67960
$$ -1181490 -751364 170132 504137 219279 70701 201101 20918 -512981 -577869 190091
38778A90091P58017j55382p78230m14735K96701M44203l8379n08982l85282K97420
$$ 190091 948108 792726 14496 -400239 -103538 340665 302286 -206696 -591978 -294558
38768b94558Q33183N52370k17079m11887K37261P26151L63444j35436J87J87056
$$ -294558 538625 1090995 873916 462029 699290 1425441 1788885 1653449 1653636 1840692
38758A840692l36866q65747l22746O88348O93192k07741n48096L1487L98408N2934
$$ 1840692 1503826 638079 315333 1003681 1696873 1489132 941036 972523 1370931 1423865
38748A423865k28896j00165j65981m39748p6280Q45811J031172R7149o85218m93305
$$ 1423865 1194969 1094804 928823 489075 412795 1258606 2289778 2386927 1701709 1208404
38738A208404j36465l29481m45381K8461L66364M9306j18354M71872R30363L45046
$$ 1208404 1071939 742458 297077 325538 691902 741208 622854 1094726 2025089 2370135
38728B370135o08803p68573j73359M36377P81808P42291L9132q33983o62775N21211
$$ 2370135 1761332 992759 819400 1255777 2037585 2779876 2819008 1985025 1322250 1843461
38718A843461J001735J4725q44060k23859P33911M80022k98708j30413O53380
$$ 1843461 2845196 2859921 2015861 1792002 2525913 3005935 2707227 2576814 3230194
38709C230194R09492Q49659J015435N57454j049103k071687r85088O45987P00641
$$ 3230194 4139686 4989345 6004780 6562234 5513131 3441444 2456356 3102343 3802984
38700C802984K33448J194094K348646K077598L475566J0247267J7646095J5079269
$$ 3802984 4036432 5230526 7579172 9656770 13132336 23379603 41025698 56104967
38692E6104967N03650j4336783j7496023j0566796l813562k043630j875870m79611
$$ 56104967 56608617 42271834 24775811 14209015 10395453 8351823 6475953 5996342
38684E996342M01959n49017j312390m20727N19616O6168n96093j99847L10260
$$ 5996342 6398301 5849284 4536894 4116167 4635783 4701951 4105858 3906011 4216271
38675D216271k10805r96379r45025n29542n76183o16791O4177R03910R18089K14335
$$ 4216271 4005466 3009087 2064062 1534520 958337 341546 405723 1309633 2227722 2442057
38665B442057m04088n83828l64420K22825P90881O28392k77512j010654r85446
$$ 2442057 2037969 1454141 1089721 1312546 2103427 2731819 2454307 1443653 458207
38656D58207n90476k24536K53113O92504M72983k75882m95243R6544L89254k41207
$$ 458207 -132269 -356805 -103692 588812 1061795 785913 290670 387214 776468 535261
38646E35261p78827k99254M46555M03361k7883M593J16905m01077q76884k15315
$$ 535261 -243566 -542820 -96265 307096 279213 283806 400711 -366 -877250 -1092565
38636a092565J026905J311867N21308n5265M7991O497m92589o93260l00033k3305
$$ -1092565 -65660 1246207 1767515 1712250 1760241 1766738 1274149 580889 280856 257551
38626B57551j93134k15913J41100K35527j70471l51520Q0236M53378K31510j23966
$$ 257551 64417 -151496 -10396 225131 54660 -296860 -216624 236754 468264 344298
38616C44298j16127m3878k20973k92899K0675L69490N24748P59724R52327M10145
$$ 344298 228171 184293 -36680 -329579 -308904 60586 585334 1345058 2297385 2707530
38606B707530p43654j219950m79138K27493j75291q02214l74735N37615N41382
$$ 2707530 1963876 743926 264788 492281 316990 -485224 -859959 -322344 219038
38597B19038j43639j66410N14349O29173r3914n29633k23318n8602m63228o09549
$$ 219038 75399 -91011 423338 1052511 958597 428964 205646 147044 -316184 -925733
38587i25733j0838N40709L50591j00016j70290n8034r4043n2709J76149J97389
$$ -925733 -936571 -395862 -45271 -145287 -315577 -373611 -467654 -520363 -344214 -146825
38577a46825q742J63598P25369P70096P3177k56158L48566P12935j32144j055222
$$ -146825 -155567 8031 733400 1503496 1576673 1320515 1669081 2382016 2249872 1194650
38567A194650n29697P28534P78859m22691j007641k51760M19455o4891p68113
$$ 1194650 664953 1393487 2172346 1749655 742014 490254 909709 844818 76705
38558G6705m84327L32665N03929l0208m60030n32599n96614n86275l9695Q89554
$$ 76705 -407622 -74957 428972 398764 -61266 -593865 -1190479 -1776754 -1816449 -926895
38548i26895J315613P45110k42805p27678n35791l01094n46037r75910q50591
$$ -926895 388718 1133828 891023 163345 -372446 -673540 -1219577 -2195487 -3046078
38539c046078J0012Q71580R27933K99805j41114J19809O83049Q54223M85674J8720
$$ -3046078 -3036066 -2164486 -1236553 -936748 -1077862 -958053 -275004 579219 1064893 1083613
38529A083613j08431J04196L17167K73754Q1651J7360P4367p8693n79951j063642
$$ 1083613 975182 1079378 1396545 1670299 1751950 1769310 1843677 1764984 1185033 121391
38519A21391j088735o68222j30572L03668N01512K53901m10721r20704o71961
$$ 121391 -967344 -1635566 -1766138 -1462470 -960958 -707057 -1117778 -2038482 -2710443
38510b710443J98881R66310J167293Q93363L76794j76171m08615p8823M40772
$$ -2710443 -2511562 -1545252 -377959 515404 892198 716027 307412 228589 669361
38501F69361M99919R1813j46049K7009P7669l48406p31865m29111L13155O33395
$$ 669361 1169280 1261093 1115044 1142053 1219722 871316 139451 -289660 23495 656890
38491F56890J50895o26924r00070l26504O95229J304985R01988k38477j191169
$$ 656890 807785 180861 -719209 -1045713 -350484 954501 1856489 1618012 426843
38482D26843j288572o27478K77070R55266J060821M95054l13572o80848m84782
$$ 426843 -861729 -1489207 -1212137 -256871 803950 1299004 985432 304584 -180198
38473a80198l15221n48727p52127m02933K44964N40045L47852L6905j85029l25191
$$ -180198 -495419 -1044146 -1796273 -2199206 -1954242 -1414197 -1066345 -1029440 -1214469 -1539660
38463a539660j94179L79009R55251P95336q5755p57664n27915K14039O28463N15096
$$ -1539660 -1733839 -1354830 -399579 395757 310002 -447662 -975577 -761538 -133075 382021
38453C82021L41361L93528L94214M0318m32957m96088m0448M30343M40915J60474
$$ 382021 723382 1116910 1511124 1551442 1118485 622397 581949 1012292 1453207 1613681
38443A613681R8114K96185K69979j58050m75996k78472M844k53966q00317p75890
$$ 1613681 1711795 2007980 2277959 2119909 1643913 1365441 1370285 1116319 316002 -459888
38433d59888l1292N95383M87089K7847j64284j28379j75520j77982P6827K29231
$$ -459888 -491180 104203 591292 619139 454855 326476 150956 -27026 49801 279032
38423B79032j61693o97670n72470J29200M75468J68479K5581N79260J103980P21312
$$ 279032 117339 -580331 -1152801 -1023601 -548133 -379654 -354073 225187 1329167 2050479
38413B050479k46038q64903r84732j067054j004943k72843P86493J005049N2278
$$ 2050479 1804441 939538 -45194 -1112248 -2117191 -2390034 -1603541 -598492 -546214
38404e46214r09839p39751K62103R83443R19312L74382k17684n20977k38861M92473
$$ -546214 -1456053 -2195804 -1933701 -950258 -30946 343436 125752 -395225 -634086 -141613
38394a41613Q95443L69598o18707j025856n20193K35212N36011L68312J45627
$$ -141613 753830 1123428 504721 -521135 -1041328 -806116 -270105 98207 243834
38385B43834J34965K63877K57360p8892n76705q01191n73676k07050j9555J31172
$$ 243834 378799 642676 900036 821144 244439 -556752 -1130428 -1337478 -1357033 -1225861
38375a225861N21962R85530J024416M26105m66560j007172p00983K94238J042529
$$ -1225861 -703899 281631 1306047 1732152 1265592 258420 -442563 -148325 894204
38366H94204O83561m07505r19546l50777L22849K36596k2828M11396R89379N47158
$$ 894204 1577765 1170260 250714 -100063 222786 459382 436554 847950 1837329 2384487
38356B384487o39302j100161m37963J19242k62461p94592m76182L44833O22215
$$ 2384487 1745185 645024 207061 326303 63842 -730750 -1206932 -862099 -239884
38347b39884J07721n63363q26130n98333m8047N52601R16795R68417Q18632M77208
$$ -239884 -132163 -695526 -1521656 -2119989 -2168036 -1615435 -698640 269777 1088409 1565617
38337A565617p8903n68252o16102l20359r4344K1290K71690M74596J86790l76892
$$ 1565617 1486714 918462 302360 -17999 -112343 -91053 180637 655233 842023 465131
38327D65131m74351k8649K43728J03732J45880N35672N26320j85018p36329n17859
$$ 465131 -9220 -37869 205859 309591 455471 991143 1517463 1332445 596116 78257
38317G8257k42402o00286q23982J13679J556600J867414P68958l96600p04280
$$ 78257 -164145 -764431 -1588413 -1474734 81866 1949280 2718238 2321638 1617358
38308A617358o25395p44399p04509k8173Q20738R22205J26378p30860p84398n3808
$$ 1617358 991963 247564 -456945 -485118 335620 1257825 1384203 653343 -131055 -184863
38298a84863O32827N79724J0543k62069P2026M44625K81214k00665m09422k13371
$$ -184863 447964 1027688 1038231 776162 848188 1292813 1574027 1373362 963940 750569
38288G50569P8123K70346L54781K41928j17643m71284m95020j79663K63944O68718
$$ 750569 828692 1099038 1453819 1695747 1578104 1106820 611800 432137 696081 1364799
38278A364799Q33321M99855k38620p83896o50103k2502N50631P16364L63692l98513
$$ 1364799 2198120 2697975 2459355 1675459 1025356 1002854 1553485 2269849 2633541 2235028
38268B235028r87900o56274M50609J105691N05047n58596p76973j22129L42029
$$ 2235028 1247128 590854 1041463 2147154 2652201 2093605 1316632 1194503 1536532
38259A536532J39378j51235p8960J2120k51258n92381n46131j38523K08011K01709
$$ 1536532 1675910 1524675 1445715 1457835 1206577 614196 68065 -70458 137553 339262
38249C39262m1847j18546K24891O49185M73066l82018j051975p70765O5142M27776
$$ 339262 297415 178869 403760 1052945 1526011 1143993 92018 -678747 -613605 -185829
38239a85829K5102m78351m93873j40630J72801K68245J99273J00799J03024J75541
$$ -185829 -160727 -639078 -1132951 -1273581 -1100780 -832535 -633262 -532463 -429439 -253898
38229b53898J35785j6606k9103J08663k352m56014o02904R1831J087726J331359
$$ -253898 -118113 -134719 -163822 -55159 -57511 -513525 -1116429 -1024598 63128 1394487
38219A394487N91383l83624q93987q77877n79061k10494O2168K34897M94889Q20451
$$ 1394487 1985870 1602246 708259 -169618 -748679 -959173 -897005 -662108 -167219 653232
38209F53232Q05404K67913l02023l74392j08443M1003K4989m3258l14533o87903
$$ 653232 1458636 1726549 1424526 1050134 941691 982694 1007683 964425 649892 -38011
38199c8011m43888O76195J527050Q58662p17353j322279l53023Q11628Q55266
$$ -38011 -481899 194296 1721346 2580008 1862655 540376 187353 998981 1854247
38190A854247J09723l47398k19772k988q2099l77182n86636m78263j20967J42149
$$ 1854247 1963970 1616572 1396800 1393812 1311713 934531 347895 -130368 -251335 -109186
38180a09186J51574J49308K33613L8899m87990n49046L81596J369532J110650
$$ -109186 42388 191696 425309 464208 -23782 -572828 -191232 1178300 2288950
38171B288950n9679n58693P7962O24187K09623m44162m00484O1939J53986j83120
$$ 2288950 2229271 1670578 1748540 2372727 2582350 2138188 1737704 1799643 1953629 1770509
38161A770509n05622o56782o44995k97889L37729P20797M93197L7242r0932J11103
$$ 1770509 1264887 608105 -36890 -334779 2950 723747 1216944 1254186 1163254 1274357
38151A274357L19599M12294L61328O27o54714j143982j010873l49600L31870O12536
$$ 1274357 1593956 2006250 2367578 2368205 1713491 569509 -441364 -790964 -459094 153442
38141A53442M03380n6069l39734k09997J03912K18462J02977j8778j08382k36355
$$ 153442 556822 500753 161019 -48978 54934 273396 376373 357595 249213 12858
38131A2858k24526J23499N21211M45252j42179p43902r25180o03214M8384N99749
$$ 12858 -211668 -88169 433042 878294 736115 -7787 -932967 -1536181 -1487797 -888048
38121h88048N90142J73266Q2932M74909M79991l56338r79596k76027J041111J352394
$$ -888048 -297906 -124640 -41708 433201 913192 556854 -422742 -698769 342342 1694736
38111A694736N07886j87288j32571m0958l82917p01396o67944n13351k31226M06866
$$ 1694736 2202622 2015334 1882763 1841805 1458888 757492 89548 -423803 -655029 -248163
38101b48163R36466N94713k60620m63894J11540M28384J42832N2105M22268M62479
$$ -248163 688303 1283016 1022396 558502 670042 1098426 1241258 1293363 1715631 2178110
38091B178110r8987m46848j82788Q5261J28681N06049J050329O34974p98194j634073
$$ 2178110 2079123 1632275 1449487 1534748 1663429 2169478 3219807 3854781 3056587 1422514
38081A422514r35998J43551L09214k6053K1646J38960k84274p40785m36446L36798
$$ 1422514 486516 630067 939281 913228 934874 1073834 789560 48775 -387671 -50873
38071e0873Q01109Q66892P48738K84700m29272o24488j4280M97659J45752n14204
$$ -50873 750236 1617128 2365866 2650566 2221294 1596806 1582526 2080185 2225937 1711733
38061A711733n76294q5369L83776N75871L52071l82893j006200n85883N09923
$$ 1711733 1135439 1050070 1433846 2009717 2361788 1978895 972695 386812 896735
38052H96735P78068p0128n40038J08817N89111n8735p17877k49061M67147K46515
$$ 896735 1674803 1604675 1064637 1173454 1762565 1703830 985953 736892 1204039 1450554
38042A450554k26849J67934P80571M40434k66070q5877M93448J07767r10121r97040
$$ 1450554 1223705 1391639 2172210 2612644 2346574 2260697 2754145 2861912 1951791 954751
38032I54751L518P09760N19971K18599L18613M34756L38011K44049O7725l98371
$$ 954751 958269 1668029 2188000 2406599 2725212 3159968 3497979 3742028 3809753 3411382
38022C411382o95920k48039M97879N99275Q0517k23596p2850J0582j58376j76720
$$ 3411382 2715462 2467423 2965302 3564577 3645094 3421498 3348648 3359230 3200854 3024134
38012C024134J01067K88435J31288p0589J88944R73019J584236J265165N86388
$$ 3024134 3125201 3413636 3544924 3474335 3663279 4636298 6220534 7485699 8072087
38003H072087J263297L479737M463207J799573k536766m202368k374218m94101
$$ 8072087 9335384 12815121 17278328 19077901 16541135 12338767 9964549 9470448
37995I470448p82076j526989r57737k23445n99047r22722j31493M33709l61091
$$ 9470448 8688372 7161383 6203646 5980201 5381154 4458432 4326939 4760648 4399557
37986D399557j102943m69683L43070K23219M76229J925647K446025M09428j993157
$$ 4399557 3296614 2826931 3170001 3393220 3869449 5795096 8241121 8650549 6657392
37977F657392k090743r38620q51193j190490k70364Q16289J93910r31681l58269
$$ 6657392 4566649 3628029 2776836 1586346 1315982 2132271 2326181 1394500 1036231
37968A036231R18907N39707q34534r13123m630O6392k64452M70908J327045O49916
$$ 1036231 1955138 2494845 1660311 747188 742558 808950 544498 1015406 2342451 2992367
37958B992367m14224l7463N47929m77335j471711k49164J274667L34002j138353
$$ 2992367 2578143 2540680 3088609 2611274 1139563 890399 2165066 2499068 1360715
37949A360715K34228K671771K017769p25238j173901N67750O41211j031796j011940
$$ 1360715 1594943 4266714 6284483 5559245 4385344 4953094 5594305 4562509 3550569
37940C550569N33451J92679j534864q17152J794909J778802q94912j411871J028714
$$ 3550569 4084020 4276699 2741835 1924683 3719592 5498394 4603482 3191611 4220325
37931D220325J797610n28498j838919l65465O30251k35026k24799J147963Q24896
$$ 4220325 6017935 5489437 3650518 3285053 3915304 3680278 3455479 4603442 5428338
37922E428338j124974r31241J367899J502265p39161r41383J126946R49366j378414
$$ 5428338 4303364 3372123 4740022 6242287 5503126 4561743 5688689 6638055 5259641
37913E259641q12299K313031K031465j571557j705949K103603K619341r80705
$$ 5259641 4447342 6760373 8791838 7220281 5514332 7617935 10237276 9256571
37905I256571r68874L714655M698938P23904R90142O773642P201761M4313k480713
$$ 9256571 8287697 12002352 16701290 17425194 18415336 25188978 32390739 32435052 29954339
37896B9954339L077124L960122k490205q889J4570448J9683653J1586752K5431699
$$ 29954339 33031463 36991585 34501380 34492491 49062939 68746592 80333344 105765043
37888A05765043P6991333J11780478O4863695m0092622j07450313q9076688l4870063
$$ 105765043 182756376 294536854 359400549 319307927 211857614 122780926 87910863
37881H7910863j0619731j6769224j6487582j673540Q496717Q889866R400618Q137056
$$ 87910863 77291132 60521908 44034326 42360786 50857503 59747369 69147987 77285043
37873G7285043l670084j7914367j8386281p887550k850007n789680n365103J07118
$$ 77285043 73614959 55700592 37314311 29426761 26576754 20787074 15421971 15529089
37865A5529089J013517l526481m211667J08628R23694k787762k897296J580307
$$ 15529089 16542606 13016125 8804458 8913086 9836780 7049018 4151722 5732029
37857E732029K611426j133179j973734J601800K174198j882849l111669O64140
$$ 5732029 8343455 7210276 5236542 6838342 9012540 7129691 4018022 4682162
37849D682162K336974o25645j562568K014844L480640O57561J499598R328674
$$ 4682162 7019136 6393491 4830923 6845767 10326407 10983968 12483566 21812240
37841B1812240J4059257O821672n891275j1692003q812754m549825k848091j988096
$$ 21812240 35871497 42693169 36801894 25109891 16297137 11747312 8899221 6911125
37833F911125j023403q85148q98232J80579J164808N06094o39331o88500n32036
$$ 6911125 5887722 5002574 4104342 4284921 5449729 5955823 5316492 4627992 4095956
37824D095956j195272j342372k4043Q88927r4665j181592l93649J051073J161340
$$ 4095956 2900684 1558312 1534269 2423196 2328531 1146939 753290 1804363 2965703
37815B965703M69790L14972K18800n39405r75306l27030K21181j90592l21347
$$ 2965703 3435493 3750465 3969265 3429860 2454554 2127524 2348705 2158113 1836766
37806A836766O94444J371972M24941q67690q70284j71709m6253k19759K1672K44718
$$ 1836766 2531210 3903182 4328123 3460433 2590149 2418440 2372187 2152428 2174100 2418818
37796B418818K2278K8958O20244R77660P53786P26717R08258J51006j393979j806414
$$ 2418818 2441096 2470054 3090298 4067958 4821744 5548461 6456719 6607725 5213746 3407332
37786C407332n42435L85726k88877j043729l60896P72999Q83589M09271L00297
$$ 3407332 2864897 3250623 2961746 1918017 1557121 2330120 3213709 3622980 3923277
37777C923277J10867p22041j341563r07863j53422k7251j29332J97797N43992
$$ 3923277 4034144 3312103 1970540 1062677 909255 882004 752672 950469 1494461
37768A494461M09976K60112N26044P33919M95533K01026O8637k52919o55189n04920
$$ 1494461 1904437 2164549 2690593 3424512 3920045 4121071 4189708 3936789 3281600 2776680
37758B776680L5359R2013k77585j43044M49594M86243j3210M5846O84926P17534
$$ 2776680 2812039 2904052 2626467 2483423 2933017 3419260 3406050 3451896 4136822 4854356
37748D854356J563k79095J34579J63005m79505q28444n88393m46808l55121L96734
$$ 4854356 4855919 4576824 4711403 4874408 4394903 3566459 2978066 2531258 2176137 2572871
37738B572871J379259J422338O76743J95089n3929n57349n86236L59134Q47413
$$ 2572871 3952130 5374468 6051211 6246300 6192371 5635022 5048786 5407920 6255333
37729F255333J53531N09216L038842M390947K759697L824121J2465674K0659051
$$ 6255333 6408864 6918080 9956922 14347869 17107566 20931687 33397361 54056412
37721E4056412J4538746n042257k0156233j8395888p696605k301374l480354l273291
$$ 54056412 68595158 63552901 43396668 25000780 17304175 15002801 11522447 8249156
37713H249156j9584J027859j030809j504469P25360J638663j54991j517464j134471
$$ 8249156 8229572 9257431 8226622 6722153 7447513 9086176 8931185 7413721 6279250
37704F279250j196251k087591j428190P39759J376580M3194j65198J562665K044906
$$ 6279250 5082999 2995408 1567218 2306977 3683557 3726751 3561553 5124218 7169124
37695G169124k31965k382964j983109o13341m60977q42938l00201O49965R11438
$$ 7169124 6937159 4554195 2571086 1957745 1496768 653830 353629 1003594 1915032
37686A915032P66421P57087M39924m27625j039817q49147l41975J5975K51366
$$ 1915032 2681453 3438540 3878464 3450839 2411022 1561875 1219900 1235875 1487241
37677A487241J77213l11337m18633M33081J125218M03872p13433l90749P90962
$$ 1487241 1664454 1353117 934484 1367565 2492783 2896655 2183222 1792473 2583435
37668B583435P17516n83247j078444l67700j09776o91156o02576M06482O29588
$$ 2583435 3300951 2717704 1639260 1271560 1161784 470628 -131948 274534 904122
37659I04122l82156q07948K58426J265838R41452J71875M7900K08858J75135L05141
$$ 904122 521966 -285982 -27556 1238282 2179734 2351609 2399509 2608367 2783502 3088643
37649C088643M95876j09031j289216j581355o77399J8259j05439K4683P98874
$$ 3088643 3584519 3475488 2186272 604917 -72482 -54223 -159662 -134979 663895
37640F63895R80320J18231l81393K14293N65165k60464j007985m77541L88647
$$ 663895 1644215 1762446 1381053 1595346 2160511 1900047 892062 414521 803168
37631H03168L46950N9852O50794J492871J297664K91000m32513p54354j063271
$$ 803168 1150118 1209970 1860764 3353635 4651299 4942299 4509786 3755432 2692161
37622B692161q58556L76307J587511J393075O47484J705361M655664O089970K974344
$$ 2692161 1833605 2209912 3797423 5190498 5837982 7543343 12199007 18288977 21263321
37613B1263321l072008o959848n793938k022955m2994p92731j516528m16912J002446
$$ 21263321 18191313 11231465 5437527 3414572 3371578 2578847 1062319 645407 1647853
37604A647853R46715J75402J56183L92526k30018r89630o33713Q7894k61207r89144
$$ 1647853 2594568 2769970 2926153 3318679 3088661 2099031 1465318 1553212 1292005 302861
37594C02861n02147N33567K59948p68298l41970J272465J458187k30177j198230
$$ 302861 -199286 334281 594229 -174069 -516039 756426 2214613 1984436 786206
37585G86206k23479O85526L8237p47423k90708L12618j39791o46240l4894Q05431
$$ 786206 562727 1248253 1286490 539067 248359 560977 421186 -225054 -259948 545483
37575E45483O53747P1909j4705j13288p58440r62274Q0805J185316Q95593k23864
$$ 545483 1199230 1271139 1256434 1143146 384706 -577568 -496763 688553 1584146 1360282
37565A360282p16323m96122l54683k80052J27740M80581L02678P2222K96095M43830
$$ 1360282 643959 147837 -206846 -486898 -359158 121423 424101 496323 792418 1236248
37555A236248m821m22913j51964K23056o3933n56101m43357K9108J72623O0047
$$ 1236248 1231427 808514 656550 879606 815673 259572 -183785 -154677 17946 77993
37545G7993O5098J2030k46277k32626K89083P08888N85036L00918P6560m70968
$$ 77993 143091 155121 -91156 -323782 -34699 674189 1259225 1560143 1636703 1165735
37535A165735j102198p28603O93684J529337Q00534k86224l22275K36714K89625
$$ 1165735 63537 -665066 28618 1557955 2358489 2072265 1749990 1986704 2276329
37526B276329k0729p9368j95716p29114r41308k01231O85878P56246M71129O36637
$$ 2276329 2255600 2176232 1980516 1251402 310094 108863 794741 1550987 2022116 2658753
37516B658753P89153J36309q18165j051869o37756k87196q2107J81471K79200
$$ 2658753 3447906 3584215 2766050 1714181 1076425 789229 707122 888593 1167793
37507A167793K39223O72974J419374J185061l20024j413036r72925k99667p80447
$$ 1167793 1407016 2079990 3499364 4684425 4364401 2951365 1978440 1678773 898326
37498H98326j393125o06506P37245Q23626j5592p6774O64893P69479M4604l42226
$$ 898326 -494799 -1101305 -364060 459566 443974 367200 1032093 1801572 1846176 1503950
37488A503950j19903o8067j88345J80779O78452L93433k38700n6806N67036K31253
$$ 1503950 1384047 1315980 1127635 1308414 1986866 2380299 2141599 2084793 2651829 2883082
37478B883082q83580j132927k01274M27504O8343k19049K27871N59986J52404
$$ 2883082 1999502 866575 665301 1092805 1161148 942099 1169970 1729956 1882360
37469A882360k35235J47565Q10681R15445L80697l87363r77169r45495k19629
$$ 1882360 1647125 1794690 2605371 3520816 3901513 3514150 2536981 1591486 1371857
37460A371857L98469R4897o33971n89610K92331R07159P41879M04056L10278R5391
$$ 1371857 1770326 1865223 1231252 641642 933973 1841132 2583011 2987067 3297345 3392736
37450C392736m29428p85622n55643J71762J086272J664049J173541m19553j877973
$$ 3392736 2963308 2177686 1622043 1793805 2880077 4544126 5717667 5298114 3420141
37441C420141k001167j124512l01841M21308J584312K657781K411813Q19596q20516
$$ 3420141 1418974 294462 -7379 413929 1998241 4656022 7067835 7887431 7066915
37432G066915j612063j665900j185281k98173L27653K8885p55733j068600q45441
$$ 7066915 5454852 3788952 2603671 2305498 2633151 2662036 1906303 837703 -7738
37423g738n96942j99680N87423R62692J18066j002657q06363M09622R53555N38908
$$ -7738 -604680 -804360 -216937 745755 863821 -138836 -945199 -535577 417978 956886
37413I56886M59916R79206Q24039l08819r21612j35187R11710R32857K16824l17276
$$ 956886 1416802 2396008 3220047 2911228 1989616 1854429 2766139 3698996 3915820 3598544
37403C598544m40142k87023R5904L33566l1429n32931k28070O15310O45803m60955
$$ 3598544 3158402 2871379 2967283 3300849 3269420 2736489 2508419 3123729 3769532 3308577
37393C308577j437992j334426n82982J90607R52130J421551R53104j65773o68521
$$ 3308577 1870585 536159 -46823 143784 1095914 2517465 3470569 3304796 2636275
37384B636275j56649K84565j34349p79939q32420m60740j60931M1323K10945K18761
$$ 2636275 2479626 2764191 2629842 1849903 1017483 556743 395812 437135 648080 866841
37374H66841J55300K20469J93218r5183q3215N42183P32112m43736j762264j352261
$$ 866841 1022141 1242610 1435828 1340645 1257430 1799613 2531725 2087989 325725 -1026536
37364a026536J67813N04566m90718o22314P09287J372288K19761r58870n81629
$$ -1026536 -858723 -354157 -844875 -1467189 -757902 614386 834147 -124723 -706352
37355g06352K71174K21199K5928P18346J362493P42339l57931n60459j74293j94521
$$ -706352 -435178 -213979 -188051 530295 1892788 2635127 2277196 1716737 1542444 1347923
37345A347923l23405J56275O82079L78741k70642l54404j65313l83984o35176
$$ 1347923 1024518 1180793 1862872 2241613 1970971 1616567 1451254 1067270 432094
37336D32094l42191J361j45669j75153L89222O17755k23933j018904n12665M54912
$$ 432094 89903 91264 -54405 -229558 159664 777419 553486 -465418 -978083 -523171
37326e23171L40488m85595n30013K36716O29304M32266L19977J48821o26146j255508
$$ -523171 -182683 -668278 -1198291 -961575 -332271 99995 419972 568793 -57353 -1312861
37316a312861n16564R65902J262933L1014j034118p96979P992L51952K35924N4373
$$ -1312861 -1829425 -863523 399410 430424 -603694 -1400673 -1392681 -1040729 -804805 -750432
37306g50432p5919j0897L53058N63496J23487n41696o38012l19501l05706m38123
$$ -750432 -826351 -837248 -484190 79306 202793 -338903 -976915 -1296416 -1602122 -2040245
37296b040245K8072Q24759Q51016M7302l83685O8445M35482o3693p97095q22263
$$ -2040245 -2012173 -1187414 -336398 -289096 -672781 -604336 -168854 -232547 -1029642 -1851905
37286a851905k55811J60807J75705P4460Q4078K25262M36760N22408K59221k20705
$$ -1851905 -2107716 -1946909 -1771204 -1696744 -1612666 -1387404 -950644 -428236 -169015 -389720
37276c89720m25598p1860N28942P85215M48699j18454l24555o3298J21500j37076
$$ -389720 -815318 -887178 -358236 426979 875678 757224 432669 369371 490871 353795
37266C53795l15787K62778J163961J221906K52128o28409o58717l59192l67916
$$ 353795 38008 300786 1464747 2686653 2938781 2310372 1651655 1292463 924547
37257I24547m27376j66900Q4955J5475J0579L90689P30607O07639K74816K1230
$$ 924547 497171 330271 415226 430701 441280 831969 1562576 2170215 2445031 2466261
37247B466261l01728o17563m82551r9504k88862r02445p03768M34351Q90572o1379
$$ 2466261 2164533 1546970 1064419 964915 676053 -226392 -930160 -495809 394763 333384
37237C33384p61281J43351J228291N46011j044019j174390K95463J308229R47268
$$ 333384 -427897 -284546 943745 1489756 445737 -728653 -433190 875039 1822307
37228A822307L54779L28626K14786m29403r06335o77030k03377k233N8942J74100
$$ 1822307 2177086 2505712 2720498 2291095 1384760 707730 504353 502120 561062 735162
37218G35162K03155R1796j6846j22930k48637j92747M4372M2587k42600j56937
$$ 735162 938317 1030113 1013267 890337 641700 448953 493325 535912 293312 136375
37208A36375M52442N92300l50152j344174j148281j56939M45786N39128O94444
$$ 136375 588817 1181117 830965 -513209 -1661490 -1818429 -1372643 -833515 -139071
37199a39071P46257K32110l80674l47936O5760K51094M25947Q10652O26237n16991
$$ -139071 607186 839296 458622 110686 176446 427540 853487 1664139 2290376 1773385
37189A773385j292992n42247N57368K60696p69843n88699O94351J219406N50008
$$ 1773385 480393 -61854 495514 756210 -13633 -602332 92019 1311425 1861433
37180A861433o607l925k49544o75439l27147M41480K26107p89984q91919J87410
$$ 1861433 1854826 1850901 1601357 925918 598771 1040251 1266358 476374 -415545 -228135
37170b28135P85716K42277j09486M92285R78632N36121j32998m18670p38557j153900
$$ -228135 557581 799858 690372 1182657 2161289 2697410 2564412 2145742 1407185 253285
37160B53285r28615j39232J20846k59504j11531P40134R49471J00308m07260J83402
$$ 253285 -675330 -814562 -693716 -953220 -1064751 -324617 624854 725162 317902 501304
37150E01304O73386J10066o15217n42201k45111m08591m09566L39241R88863N36086
$$ 501304 1174690 1284756 669539 127338 -117773 -526364 -935930 -596689 392174 928260
37140I28260n33943j024890o17723J57308P45232P70480K14357k61241m584N63589
$$ 928260 394317 -630573 -1248296 -1090988 -345756 424724 639081 377840 373256 936845
37130I36845N99411L26229N02548P15775r203j069237q09604P16048J609238J002482
$$ 936845 1536256 1862485 2365033 3080808 3071605 2002368 1192764 1908812 3518050 4520532
37120D520532L7112k81789j84958P1698M81673M37919j52354N96069L873300O485247
$$ 4520532 4557644 4275855 4090897 4162595 4644268 5082187 4929833 5525902 9399202 15884449
37110A5884449L880505k705771o580040m462253o46346j34092j900703k141088
$$ 15884449 19764954 17059183 10479143 6016890 5370544 5236452 3335749 1194661
37102A194661n50540N07123M98719N34896M76769l12310p62875K36150J319554
$$ 1194661 644121 1151244 1649963 2184859 2661628 2349318 1586443 1822593 3142147
37093C142147P27993m70488k16802Q13336M73594r39190j287097l98904q6576
$$ 3142147 3870140 3399652 3182850 3996186 4469780 3530590 2243493 1844589 1758013
37084A758013p19554q12781K3208N01215J77673O4552M59601M04450l22051o34101
$$ 1758013 1038459 225678 248886 750101 927774 992326 1451927 1856377 1534326 900225
37074I00225j7100O32457M74430k02204o46768m80963J36773N18790j2092j024380
$$ 900225 883125 1515582 1990012 1787808 1141040 660077 796850 1315640 1303548 279168
37064B79168j183326j84732O18881L26698j41137J52635M93751K1464n65596l77856
$$ 279168 -904158 -1088890 -470009 -143311 -284448 -131813 361938 383402 -182194 -560050
37054e60050l4776l41683n92308Q1073R27603Q82912M04809L10214J36409n78177
$$ -560050 -594826 -936509 -1528817 -1447744 -520141 362771 767580 1077794 1214203 636026
37044F36026q50872l795O60313j8342q23584k84722N85419J95287n26906K08831
$$ 636026 -214846 -218641 441672 423330 -400254 -684976 -99557 95730 -431176 -222345
37034b22345J579625J403346m0867n52529J87698L95894m50835q79983j63815
$$ -222345 1357280 2760626 2719759 2167230 2354928 2750822 2299987 1420004 1256189
37025A256189O50958O78220K17550j82618j30168P42312J871334J598945m62095
$$ 1256189 1907147 2585367 2802917 2620299 2490131 3232443 5103777 6702722 6240627
37016F240627k078394j328824M08478N98694o22228j218905o84337j11228J70565
$$ 6240627 4162233 2833409 3241887 3840581 3218353 1999448 1315111 1203883 1374448
37007A374448N00747L77940n53468j071982k65300M98204p7033n72707N97900
$$ 1374448 1875195 2253135 1699667 627685 362385 860589 783556 210849 808749
36998H08749J819382P95140j198655j274765K01178N75307l59963n58748J79438
$$ 808749 2628131 3423271 2224616 949851 1151029 1726336 1366373 807625 987063
36989I87063K39510l08236k9203O65298L18600l04717M95397J666406R33956q60699
$$ 987063 1226573 918337 889134 1554432 1873032 1568315 2063712 3730118 4664074 3803375
36979C803375j056775O0314N1515r69659q63113J03688p7631q34786p5395J237900
$$ 3803375 2746600 2806914 2858429 1888770 1025657 1129345 1051714 216928 141533 1379433
36969A379433N00594j344722j179114N24573O78638n00936k43816R41549K75672
$$ 1379433 1880027 535305 -643809 -119236 559402 58466 -185350 756199 1031871
36960A031871j210791j25328K353195J915332q97206j442055N15014P58215r43711
$$ 1031871 -178920 -304248 2048947 3964279 3067073 1625018 2140032 2898247 1954536
36951A954536n81295J646729J316118j201422q51700K100749J936937j414732
$$ 1954536 1373241 3019970 4336088 3134666 2282966 4383715 6320652 4905920
36943D905920j588269K135064L073102j26919p76477K795229L942615J114113
$$ 4905920 3317651 5452715 8525817 8398898 7622421 10417650 14360265 15474378
36935A5474378J159745M874124L902507k506869l823380J994321L227342k488733
$$ 15474378 16634123 21508247 25410754 22903885 19080505 21074826 24302168 21813435
36927B1813435q04313J1554854J6289600R458709K0211882O2563272R1881112
$$ 21813435 21009122 32563976 48853576 58312285 78524167 141087439 232968551
36920B32968551N3622474l3459776q9636959p3972734k8177155q159776j4179676
$$ 232968551 286591025 253131249 163494290 89521556 61344401 53184625 39004949
36913C9004949j4159368j861382L778323j659867l956634J009552K520105k681984
$$ 39004949 24845581 22984199 26762522 25102655 21146021 22155573 24675678 21993694
36905B1993694n690214l222408j839969l612651l124123K26599O36826k279403
$$ 21993694 16303480 13081072 11241103 7628452 4504329 4730928 5367754 3088351
36897C088351k382569J126996K084798j050305k581932k54450J272026l11101
$$ 3088351 705782 1832778 3917576 2867271 285339 30889 1302915 991814
36889I91814j230288M56513J371234k01616j135802K08048J061060L2293l01284
$$ 991814 -238474 218039 1589273 1387657 251855 459903 1520963 1553256 1251972
36880A251972J084266J292670r18474k444069j170529O72222Q08601L05569N00717
$$ 1251972 2336238 3628908 2710434 266365 -904164 -231942 576659 882228 1382945
36871A382945M63617l99222p03927J10736N16323r3643k18697O66791R42651n4911
$$ 1382945 1846562 1447340 743413 854149 1370472 1276829 1058132 1724923 2667574 2612663
36861B612663p73466m05738j83369o73201o68563J92420N03350k02732m99390
$$ 2612663 1839197 1433459 1250090 576889 -91674 100746 604096 401364 -98026
36852i8026K23831O70954J55669k47808J21469N07306N18437O25073N05598o54210
$$ -98026 125805 796759 952428 704620 826089 1333395 1851832 2476905 2982503 2328293
36842B328293j944592j478899L18316R67147j00966p31053K20727J274193J222633
$$ 2328293 383701 -1095198 -776882 190265 89299 -641754 -421027 853166 2075799
36833B075799P95335N39177j99773j214853j036424L72896J058791K18440n59361
$$ 2075799 2871134 3410311 3210538 1995685 959261 1332157 2390948 2609388 2050027
36824B050027j34904N87654Q19114J080442J291749L26329j443961j858407m54614
$$ 2050027 1915123 2502777 3321891 4402333 5694082 6020411 4576450 2718043 2263429
36815B263429M57904m23590j308201o28084L11658n810n33522J49962J037599
$$ 2263429 2721333 2297743 989542 361458 673116 667306 133784 283746 1321345
36806A321345N36625o23778p61193j29642j06283n96702m84151J41621K44823
$$ 1321345 1857970 1234192 472999 343357 237074 -359628 -843779 -702158 -457335
36797d57335k29910m41672k21838r1259j17297L0839K96421M47450N55106N61411
$$ -457335 -687245 -1128917 -1350755 -1442014 -1559311 -1528472 -1232051 -784601 -229495 331916
36787C31916J27687m83385l97962L44208M78602m80425j257752p98462J26479
$$ 331916 459603 -23782 -421744 -77536 401066 -79359 -1337111 -2135573 -2009094
36778b009094M09460L58522O70078Q88671L36011m29677m95773r1145P4592J10496
$$ -2009094 -1599634 -1241112 -571034 317637 653648 223971 -271802 -362947 -288355 -177859
36768a77859L46433L29353k92396p37913k70727M03781K62238l03621k89525J17611
$$ -177859 168574 497927 205531 -532382 -803109 -399328 -137090 -440711 -730236 -612625
36758f12625M9855l20624j39607M51424N41414J29516J05137O21046Q60116M80689
$$ -612625 -562770 -883394 -1023001 -571577 -30163 99353 204490 825536 1685652 2166341
36748B166341M0506j62654n04979j028417j073049l51360M24960N04924J36867
$$ 2166341 2206847 2044193 1539214 510797 -562252 -913612 -488652 16272 153139
36739A53139J31508O71686J041329N75459m27676j026291q14201l45938j71651
$$ 153139 284647 956333 1997662 2573121 2145445 1119154 304953 -40985 -212636
36730b12636j0622N31920R53883N01513m79709r34621p10977n97251p65712n18969
$$ -212636 -223258 308662 1262545 1764058 1284349 349728 -361249 -958500 -1724212 -2243181
36720b243181K11067N24804J57457M7530O73999J118293N80621l09835n69166
$$ -2243181 -2032114 -1507310 -1349853 -1302323 -628324 489969 1070590 760755 191589
36711A91589k69297l4482J5031N2640N7184J41556N46835Q70185L48184o51742
$$ 191589 -77708 -112190 -97159 -44519 12665 154221 701056 1571241 1919425 1267683
36701A267683p34890L13455R04540J00291q60173o64607m5968k84554q95653n84358
$$ 1267683 532793 846248 1750788 1851079 990906 326299 280331 -4223 -899876 -1484234
36691a484234M29319Q43925M17805J2351m2250q9330n7663L13650N36110O2387
$$ -1484234 -1054915 -210990 206815 219166 176916 87586 29923 343573 879683 942070
36681I42070m66093q8623P25866P11267q4322m11046N0570K87257j71167n19909
$$ 942070 475977 387354 1113220 1824487 1740165 1329119 1379689 1666946 1495779 975870
36671I75870k21232P7234k37330o67394m35453L20840P92287N29125j69777o51650
$$ 975870 754638 831872 594542 -72852 -508305 -187465 604822 1133947 964170 312520
36661C12520n04397P9887N25934N42953L46199J24692k30768o25958n91306k6183
$$ 312520 -191877 -111990 413944 956897 1303096 1427788 1197020 571062 -20244 -46427
36651d6427M58263L84425J3744k89203n77179p71153m67511J54337K15751l95477
$$ -46427 411836 796261 810005 520802 -56377 -827530 -1295041 -1140704 -924953 -1320430
36641a320430n47536K98201R96251N93167M3008N64944J396985R88168l67558
$$ -1320430 -1867966 -1569765 -573514 19653 62661 627605 2024590 3012758 2645200
36632B645200j023386o12095k40925l02835m2940O36887P59522l5427q94354j139778
$$ 2645200 1621814 1009719 768794 465959 423019 1059906 1819428 1784001 889647 -250131
36622b50131r35703m01332N78231J460484J331638L79115j74986J16906M11497
$$ -250131 -1185834 -1587166 -1008935 451549 1783187 2162302 1987316 2104222 2515719
36613B515719J27752k48469k75057k54299l65519k02083L09857M91791n7572p87981
$$ 2515719 2643471 2395002 2119945 1865646 1500127 1298044 1607901 2099692 2042120 1254139
36603A254139r91780o40024j45035J36766L5031k57767j92073L93236Q02323M56221
$$ 1254139 262359 -377665 -522700 -385934 -350903 -608670 -800743 -407507 394816 851037
36593H51037j09478j32656L2328l56552q87570o38778M4768P8298l09947J01243
$$ 851037 741559 608903 641231 284679 -602891 -1241669 -1196901 -1118603 -1428550 -1327307
36583a327307J177794J369167K67364p07975o62107l79315m91225l66959L07234
$$ -1327307 -149513 1219654 1487018 779043 116936 -262379 -753604 -1120563 -813329
36574h13329O14472J17462j41606M96729R65807K86378o52279n74648O9665K7082
$$ -813329 -198857 -81395 -223001 273728 1239535 1525913 873634 298986 368651 395733
36564C95733o02435p04206r1014L64204K67974J16007K29876K89480J3555l53770
$$ 395733 -206702 -910908 -1001922 -637718 -369744 -253737 -23861 265619 279174 -74596
36554g4596l59282J05343N28853J83257q06227j140532K0785J439991J197528
$$ -74596 -433878 -328535 200318 383575 -422652 -1563184 -1542399 -102408 1095120
36545A095120l73413r27285L57942J466842O88516q28112j081582k03400K73884
$$ 1095120 721707 -205578 152364 1619206 2307722 1479610 398028 194628 468512
36536D68512m1557l76914m88858o63135o03713P8104P17738M40636k48439j92453
$$ 468512 426955 50041 -438817 -1101952 -1705665 -1627561 -909823 -469187 -717626 -910079
36526i10079M54609N25947r7086l01352L06843P37172K43899n83757q40237n23808
$$ -910079 -455470 70477 -26609 -327961 -21118 716054 959953 376196 -464041 -987849
36516i87849k32243k02595r6343M43494J177047J279390K79956j030452j310752
$$ -987849 -1220092 -1422687 -1519030 -1075536 101511 1380901 1660857 630405 -680347
36507f80347m60119K04073p8363m78379j84703K08011r846j56599O15886J509199
$$ -680347 -1140466 -936393 -1014756 -1493135 -1677838 -1469827 -1479673 -1636272 -1020386 488813
36497D88813J149293j22051p26054k86519P8432k12732m83718k02302L09654P14785
$$ 488813 1638106 1516055 790001 503482 581914 369182 -114536 -316838 -7184 707601
36487G07601R60868O87177l93902j452318j205474J82633J124695P49979j95336
$$ 707601 1668469 2355646 1961744 509426 -696048 -513415 611280 1361259 1165923
36478A165923p81587r32479p32880m3140P03492N64022m38278j005920l83270
$$ 1165923 384336 -548143 -1281023 -1324163 -620671 -56649 -494927 -1500847 -1884117
36469a884117N45724O74007K17884L4104K17799K96768K34812L32716M74846K74369
$$ -1884117 -1338393 -664386 -446502 -412398 -194599 102169 336981 669697 1144543 1418912
36459A418912j81156l57572l0500L98433L82487j63016p64750r15057o95610o25365
$$ 1418912 1237756 880184 849684 1248117 1630604 1467588 702838 -212219 -907829 -1533194
36449a533194p58764m52400N19511J220388P52332k53776m20663L49420Q40322
$$ -1533194 -2291958 -2744358 -2224847 -1004459 -252127 -505903 -926566 -577146 263176
36440B63176M82479M2601J05705J54960k85941o90311m33718J57847L76136J32402
$$ 263176 745655 788256 893961 1048921 762980 72669 -361049 -203202 172934 305336
36430C05336k04949m31191m47526j00295M37940N90269J01578n70744q89438p89509
$$ 305336 100387 -330804 -778330 -878625 -440685 149584 251162 -319582 -1209020 -1998529
36420a998529l79483L02095R39353R83698M20204o5437r848K92447M32439M22041
$$ -1998529 -2378012 -2075917 -1136564 -152866 267338 201901 192053 484500 916939 1338980
36410A338980L07749m5406m56609m50297j26378k13798q44340j141339n62229
$$ 1338980 1646729 1601323 1144714 694417 568039 354241 -490099 -1631438 -2193667
36401b193667K40325N46434O40981R44811R85066K97352l95475j62315M83658
$$ -2193667 -1953342 -1406908 -765927 178884 1163950 1461302 1065827 903512 1387170
36392A387170K64456p66636j206577m72087L42480K10924l40758k20108N29864
$$ 1387170 1651626 884990 -321587 -793674 -451194 -240270 -581028 -801136 -271272
36383b71272Q91425M05269k73670m02839j26487j13151n37212q49521n46931K14022
$$ -271272 620153 1025422 751752 348913 222426 109275 -427937 -1277458 -1824389 -1610367
36373a610367R22627J273942J145296M06966p16129j363963q38219L46220R05239
$$ -1610367 -687740 586202 1731498 2138464 1422335 58372 -779847 -433627 471612
36364D71612L77452m00219n60986k35292j4594o1602j89684l21737m41540m42833
$$ 471612 849064 448845 -112141 -347433 -362027 -423629 -613313 -935050 -1376590 -1819423
36354a819423l08658j14436K24586P18963Q48099J15660q61828q26102K53788
$$ -1819423 -2128081 -2242517 -2017931 -1298968 -450869 -335209 -1197037 -2023139 -1769351
36345a769351Q92949K40845o19779l96069M45433O01807M289l93156l60317m79965
$$ -1769351 -876402 -635557 -1255336 -1651405 -1205972 -604165 -599876 -993032 -1353349 -1833314
36335a833314p21846l65785N67038J095221P73860L07424L00690M08459K28856
$$ -1833314 -2555160 -2920945 -2353907 -1258686 -484826 -177402 123288 531747 760603
36326G60603J34366N15963Q75742M96408l50528o92043k82402J2435m99428j257270
$$ 760603 894969 1410932 2286674 2783082 2432554 1740511 1458109 1470544 971116 -286154
36316b86154j197368l09250K75426j18037p31730n01447M10398R82642Q61721
$$ -286154 -1483522 -1792772 -1517346 -1635383 -2367113 -2868560 -2458162 -1475520 -613799
36307f13799N58968L06359j49108n44799j52213Q00648R99570l5082j063610r62156
$$ -613799 -54831 251528 102420 -442379 -594592 206056 1205626 1170544 106934 -855222
36297h55222l03424r3777l6371O16702J358163J123214J62687l24060j13860o013
$$ -855222 -1158646 -1252423 -1288794 -672092 686071 1809285 1971972 1647912 1534052 1528039
36287A528039j44656J08792N96916K92553q47531j455815p71588K13366L59637
$$ 1528039 1383383 1492175 2089091 2381644 1534113 78298 -693290 -479924 -120287
36278a20287J244O3860M52643L72610k36731n88886k57882K57863K95715j00418
$$ -120287 -119043 -55183 397460 770070 533339 -55547 -313429 -55566 240149 139731
36268A39731k96581P2796N90091N99809J72705L9002L97997M59854l06714j119583
$$ 139731 -156850 -84054 506037 1105846 1278551 1317553 1715550 2175404 1868690 749107
36258G49107r16523K0794M83004J16579k68837j00383K84596M18668K19755l25129
$$ 749107 -167416 -146622 336382 452961 184124 83741 368337 787005 1006760 681631
36248F81631j078768j351309n73645N88743Q60432J82725k25590K11616O99230
$$ 681631 -397137 -1748446 -2322091 -1733348 -872916 -690191 -915781 -704165 -4935
36239d935N73287K30125N5635k94188q69322q87980m0399P46124P04468L57670
$$ -4935 568352 798477 854112 559924 -309398 -1197378 -1237777 -491653 212815 570485
36229E70485L41466J84916n71981j024386j27780J335993J547253J85159j198345
$$ 570485 911951 1096867 524886 -499500 -627280 708713 2255966 2441125 1242780
36220A242780j349926o39776l2879J82777K28588J85916M1955j5840K23608O23292
$$ 1242780 -107146 -746922 -779801 -597024 -368436 -182520 -140565 -156405 67203 690495
36210F90495P11618J59470o90702r42183j54832Q69013R04623p4455q57969p23108
$$ 690495 1402113 1561583 870881 -71302 -226134 642879 1547502 1473047 615078 -108030
36200a08030k52545p2360J32553O27871P07995j68434j124102r84192j23205R4292
$$ -108030 -360575 -432935 -300382 327489 1035484 867050 -257052 -1241244 -1364449 -1270157
36190a270157n74078r78256l76857O50390J226272J153499O96459J86914j766
$$ -1270157 -1844235 -2822491 -3199348 -2548958 -1322686 -169187 527272 714186 712420
36181G12420K41433M27585N5028n26444n27902Q5770N67589M97095J46280k04520
$$ 712420 953853 1381438 1436466 910022 382120 467890 1035479 1532574 1678854 1474334
36171A474334m92876m53323J34555P40776N59319k06100n03458o7013J63206l65994
$$ 1474334 981458 528135 662690 1403466 1962785 1756685 1253227 1186214 1349420 983426
36161I83426q72198n35099J47871J67673m15304o09499K4419Q07183Q87403K36502
$$ 983426 111228 -423871 -276000 -108327 -523631 -1133130 -1108711 -301528 585875 822377
36151H22377m50120o09854m07085l96510o26696m54431M13763J127034O84723
$$ 822377 372257 -237597 -644682 -1041192 -1667888 -2122319 -1708556 -581522 103201
36142A03201m68935q11526J56632J159056R27232j26677o89665l54378J49162
$$ 103201 -365734 -1177260 -1020628 138428 1065660 938983 249318 -105060 44102
36133D4102J64646k13277n55385n87548k65575K13367M66856K91035o4004k02439
$$ 44102 208748 -4529 -559914 -1147462 -1413037 -1199670 -732814 -441779 -505783 -708222
36123g08222p6623L5013n8351k69284l83928k65567J8755K09565J14822j18020
$$ -708222 -784845 -749832 -808183 -1077467 -1461395 -1726962 -1708207 -1498642 -1383820 -1501840
36113a501840j65900L2008K30492K68539K23401J71336J13410J48598L61899N26592
$$ -1501840 -1667740 -1635732 -1405240 -1136701 -913300 -741964 -628554 -479956 -118057 408535
36103D08535L28767p9454k13722J530J57360J22577K44964N56298M71725k53213
$$ 408535 737302 657848 444126 445656 603016 725593 970557 1526855 1998580 1745367
36093A745367q62684n48003L14561N72721j67787j022254r38900N0012Q76227
$$ 1745367 882683 334680 649241 1221962 1054175 31921 -906979 -856967 19260
36084A9260O37706l55300q84142k80112P08012R15364L45096k536K03792J63941
$$ 19260 656966 301666 -582476 -862588 -154576 760788 1105884 1103348 1307140 1471081
36074A471081n41137j050395n72210K33894K26410m41188o37276p9025L01882
$$ 1471081 929944 -120451 -692661 -458767 -232357 -673545 -1310821 -1389846 -1087964
36065a087964j15627p50563p55503r5691O72742J145305J203945Q02592K3945
$$ -1087964 -1203591 -1954154 -2709657 -2805348 -2132606 -987301 216644 1019236 1043181
36056A043181p94681j241525j126382n85922K5463M14987O20082Q58480J027469
$$ 1043181 248500 -993025 -2119407 -2705329 -2679866 -2264879 -1644797 -786317 241152
36047B41152O80300k39619j008505r12793j70575M20121N24302M15691K77092
$$ 241152 921452 681833 -326672 -1239465 -1410040 -989919 -465617 -49926 227166
36038B27166Q276l14802m11493k64662r3879R8014L78329L91781k21935r22011
$$ 227166 235442 -79360 -490853 -755515 -849394 -751380 -373051 18730 -203205 -1125216
36028a125216o99060L72650R88741M68685k12978K5444O68972M91358m52086r58083
$$ -1125216 -1824276 -1451626 -462885 5800 -207178 -181734 487238 978596 526510 -431573
36018d31573n80156j29909j53345j25718L65770O94346K29278m51372l27085M88996
$$ -431573 -1011729 -1141638 -1294983 -1420701 -1054931 -360585 -131307 -582679 -909764 -420768
36008d20768Q84285L36072m84811p60866m36637Q4271M89753N65228K32608j50180
$$ -420768 463517 799589 314778 -446088 -882725 -798454 -308701 256527 489135 338955
35998C38955q2374K31820k0178r49756j505074r28774M1047K76114n2463K5530
$$ 338955 256581 488401 468223 -481533 -1986607 -2915381 -2874334 -2598220 -2650683 -2625153
35988b625153N24145N51201j2496k67325R0841K69338q1441j51001N19665J029015
$$ -2625153 -2101008 -1549807 -1562303 -1829628 -1738787 -1469449 -1550890 -1701891 -1182226 -153211
35978a53211N43307l07401n29563l58770n26661o80549L4360J230891J573846
$$ -153211 390096 82695 -446868 -805638 -1332299 -2012848 -1978488 -747597 826249
35969H26249P24003k97302o92956o32074l54588K14816P24752M66901m09679q09433
$$ 826249 1550252 1252950 559994 -72080 -426668 -211852 512900 979801 570122 -239311
35959b39311k65613L82094L71411P7658O0865K9225l74787n41051K75822J506274
$$ -239311 -504924 -122830 248581 326239 387104 416329 41542 -499509 -223687 1282587
35949A282587J718144M85683j019717j461585q01798j09492k21944q50896j030024
$$ 1282587 3000731 3486414 2466697 1005112 203314 93822 -128122 -979018 -2009042
35940b009042l41115N73900R04289P03447N28434L90866q6210n98584l41546N26919
$$ -2009042 -2350157 -1776257 -871968 -168521 359913 750779 664569 65985 -275561 251358
35930B51358P35012k61455j308838j149982r2159P46287J018348J003058O34901
$$ 251358 986370 724915 -583923 -1733905 -1826064 -1079777 -61429 941629 1576530
35921A576530j61750p24037m53968L7851j73130o58106k72515P46567R28634n0407
$$ 1576530 1414780 690743 236775 274626 101496 -556610 -829125 -82558 846076 795669
35911G95669p83940m17359P9546k19072m97504L49353J596840J540158p640j464034
$$ 795669 11729 -405630 -326084 -545156 -1042660 -693307 903533 2443691 2436051 972017
35901I72017j609941p82005J24712P43889J016415P76303Q7422n11871n52684
$$ 972017 -637924 -1419929 -1295217 -551328 465087 1241390 1328812 816941 264257
35892B64257j67723J62576J54855j29508m07586l23771K29775Q13698P79432P4567
$$ 264257 96534 259110 413965 284457 -123129 -446900 -217125 596573 1376005 1450572
35882A450572o05235o83269m02009l52356n78374n80183j02855N07442P80320
$$ 1450572 845337 162068 -239941 -592297 -1170671 -1750854 -1853709 -1346267 -565947
35873e65947O13181J92861k70465n69574n11003j30816K46306L79426M27015O52104
$$ -565947 47234 240095 -30370 -599944 -1110947 -1241763 -995457 -616031 -189016 463088
35863D63088R04167P24331K0700o74844q12316m67518j39375o3176n1442K6524
$$ 463088 1367255 2091586 2112286 1437442 625126 157608 18233 -44943 -96385 -69861
35853f9861N257j79004j98891K08533O86945O12134L62m08953j67293K40494J53189
$$ -69861 -64604 -243608 -442499 -233966 452979 1065113 1065475 656522 489229 729723 882912
35842H82912k44449k60228J23774J67828l92432p69741k17292Q40578J324648
$$ 882912 638463 378235 502009 669837 277405 -492336 -709628 130950 1455598
35833A455598Q11166j98636j029506j286106q05640J67062Q46596O09366j58547
$$ 1455598 2266764 2068128 1038622 -247484 -1053124 -886062 -39466 569900 411353
35824D11353n06747j90281J71661K03610K17916L72199K64367k13929m26350J6137
$$ 411353 -95394 -285675 -114014 89596 307512 679711 944078 730149 303799 319936
35814C19936M97029L21282j79049k52515L6440Q5024n6454K08696P85123P81984
$$ 319936 816965 1138247 959198 706683 743123 828147 771693 980389 1765512 2547496
35804B547496j03252r56036q50912o9968M11720K56371N359J36695M16045L28792
$$ 2547496 2444244 1488208 637296 567328 979048 1235419 1240778 1377473 1793518 2122310
35794B122310j72052o46065p91828p37150o15153k83691J87736K17373m17689
$$ 2122310 1950258 1304193 512365 -224785 -839938 -1123629 -935893 -718520 -1136209
35785a136209p85314P0002J326099J115436o35464j712057q20001L65864j23189
$$ -1136209 -1921523 -1851521 -525422 590014 -45450 -1757507 -2577508 -2211644 -2334833
35776b334833j272914o90001J365191K164309O87681r70968r87019k24435j57268
$$ -2334833 -3607747 -4297748 -2932557 -768248 -80567 -1051535 -2038554 -2262989 -2420257
35767b420257m25208l571P43036Q56908N33359M90555M85901j5958m76563j39230
$$ -2420257 -2845465 -2849036 -2106000 -1249092 -715733 -225178 260723 244765 -231798 -371028
35757c71028M00052O4523p80561q95015k44547J64033K27116P08361J344682R26984
$$ -371028 29024 93547 -687014 -1582029 -1826576 -1662543 -1435427 -727066 617616 1544600
35747A544600m54853j129621l85445M36619J71832m59110l85970J2861q7217l12552
$$ 1544600 1089747 -39874 -425319 11300 183132 -275978 -661948 -649087 -736304 -1048856
35737a048856J35212Q53913P88283p2151p81743q97872p35416m25188J85378P96289
$$ -1048856 -913644 -59731 728552 656401 -125342 -1023214 -1758630 -2183818 -1998440 -1202151
35727a202151Q11440K56298k43992l74492l21350j69131J49887L90723K24847
$$ -1202151 -390711 -134413 -378405 -752897 -1074247 -1243378 -1093491 -702768 -477921
35718d77921j07269o9749L00779M86697L53541J96657M4019k74539m66301j15174
$$ -477921 -585190 -654939 -354160 132537 486078 682735 726754 452215 -14086 -129260
35708a29260L47796O1622p77048r95291k95899K11039j21292l41212M34473J313686
$$ -129260 218536 280158 -496890 -1492181 -1788080 -1577041 -1698333 -2039545 -1605072 -291386
35698b91386Q83660n14647j184840m88405M78161O71051L53363K28349L04706
$$ -291386 592274 77627 -1107213 -1595618 -1117457 -446406 -93043 135306 440012
35689D40012J73600k10118n44084o17988l91873P6751N45309O94224M96395K24028
$$ 440012 613612 403494 -140590 -758578 -1150451 -1073700 -528391 165833 662228 886256
35679H86256m802l55926q31859j049112o77734J21004Q32971R92551M64376l71711
$$ 886256 881454 525528 -306331 -1355443 -2033177 -1912173 -1079202 -86651 377725 6014
35669F014p47295k39408N83270P20188K9682n84802m52003K2646J37437p6120
$$ 6014 -741281 -980689 -397419 322769 352451 -232351 -684354 -661708 -524271 -600391
35659f00391j35098L7134J49001J46602J88341K07096M5434j34952j12206j03577
$$ -600391 -735489 -698355 -549354 -402752 -214411 -7315 38119 -96833 -209039 -312616
35649c12616m13682p10878l40871O10910J241263R69188J68283n18592q94101
$$ -312616 -726298 -1437176 -1778047 -1167137 74126 1043314 1211597 693005 -201096
35640b01096r56892n43714K94305R74673R79353N32334K08208O5568k84963q19930
$$ -201096 -1157988 -1701702 -1407397 -432724 546629 1078963 1287171 1352739 1067776 247846
35630B47846r33181l43864L16125K62992l28624n11275J04330P50977N78901j04580
$$ 247846 -685335 -1029199 -713074 -450082 -778706 -1289981 -1185651 -434674 144227 39647
35620C9647k97907J70196L96346j40527p26051n66977r7171k74306r96820j225238
$$ 39647 -258260 -88064 308282 167755 -558296 -1125273 -1222444 -1496750 -2493570 -3718808
35610c718808n70012K39022N92596P64256J094575J250503Q38597J60363k12809
$$ -3718808 -4288820 -4049798 -3457202 -2692946 -1598371 -347868 490729 651092 438283
35601D38283k26117k23923l51786m84609n17899m23891k15768j1494J18991L56451
$$ 438283 212166 -11757 -363543 -848152 -1366051 -1789942 -2005710 -2017204 -1898213 -1541762
35591a541762P36662O70329l39111j470917j198723M76266J618671R64866k48945
$$ -1541762 -805100 -134771 -473882 -1944799 -3143522 -2667256 -1048585 -83719 -332664
35582c32664k31364O39766O46794l62312p96634m620P10697K50959o27565o32638
$$ -332664 -564028 75738 722532 360220 -436414 -441034 269663 520622 -106943 -739581
35572g39581K01691Q59559Q17032L70332m2298k12641j43439l9674o8851m2022
$$ -739581 -537890 321669 1138701 1509033 1466735 1254094 1110655 1070981 1002130 960108
35562I60108K27174L15878k88389j039868p42335N88183J374685N99989p37144
$$ 960108 1187282 1503160 1214771 174903 -567432 20751 1395436 1995425 1258281
35553A258281j097390m44418J62204K85540K87758K59053n2707m11598k33366
$$ 1258281 160891 -283527 -121323 164217 451975 711028 658321 246723 13357
35544A3357M25479Q29046N38860k02581r56315j319530q76662L13808J301924
$$ 13357 438836 1267882 1806742 1604161 647846 -671684 -1548346 -1234538 67386
35535F7386J118564N1861o93615n95773k80861l32201m69866j85720M61647R99849
$$ 67386 1185950 1237811 544196 -51577 -332438 -664639 -1134505 -1320225 -858578 141271
35525A41271J050784N37481k05533n23648j36341L17393K1948q05144j173536
$$ 141271 1192055 1729536 1524003 1000355 864014 1181407 1203355 398211 -775325
35516g75325p56944k03512P8999M59975J077819J264940N73519l74364p20159
$$ -775325 -1532269 -1735781 -1656782 -1196807 -118988 1145952 1719471 1345107 624948
35507F24948m91966k82431k77424k09697O0794M16168O51302M81692j90537p94592
$$ 624948 132982 -149449 -426873 -636570 -575776 -159608 491694 973386 782849 -11743
35497a1743n41500K96678M03222o84582j594611r72908M57571R18526J58837l85101
$$ -11743 -553243 -256565 146657 -537925 -2132536 -3105444 -2647873 -1729347 -1570510 -1955611
35487a955611J22407Q81870R52250N27824K10130k044l35961n56076l19847J89205
$$ -1955611 -1833204 -951334 916 528740 738870 736826 400865 -155211 -475058 -285853
35477b85853M89904L80567k2997m99082p34483n09064q5195N184k33107j68430
$$ -285853 204051 584618 561621 62539 -671944 -1181008 -1266203 -1261019 -1494126 -1662556
35467a662556M65484J043267R30611L84280M2505n7642l19909p20939p85285l65639
$$ -1662556 -1197072 -153805 776806 1161086 1203591 1145949 826040 105101 -680184 -1045823
35457a045823J30894L33029K56082K3544l05046n13061k62946L98240Q60802N95321
$$ -1045823 -914929 -581900 -325818 -302274 -607320 -1120381 -1383327 -985087 -124285 471036
35447D71036j41676n44887k36329K62244K35441k28958l54796J67245O57984M44513
$$ 471036 329360 -215527 -451856 -189612 45829 -183129 -537925 -370680 287304 731817
35437G31817r6845j57365J44991m8942p80582r67040r2868P65497M16415o41524
$$ 731817 634972 477607 622598 573656 -206926 -1173966 -1266834 -501337 -84922 -726446
35427g26446r08093l1857P78904M99547m60855r89300n95493K86757R01291Q39374
$$ -726446 -1634539 -1666396 -887492 -387945 -848800 -1838100 -2433593 -2146836 -1245545 -406171
35417d06171L57616R5330K89496M36659O0968m67587m46386M6248K79854M5727
$$ -406171 -48555 46775 336271 772930 833898 366311 -80075 -33827 246027 291754
35407B91754r8218J58349M25606L86766K44281J05040k83761p81076o48023L06773
$$ 291754 193536 351885 777491 1164257 1408538 1513578 1229817 448741 -199282 107491
35397A07491J093561P93268j18840n02292j57639J73287J19415N7704K44941M28286
$$ 107491 1201052 1994320 1875480 1373188 1215549 1388836 1508251 1565955 1810896 2239182
35387B239182M12355L02590P6770m12143q65805o74320R4880M87026j03773r65591
$$ 2239182 2651537 2954127 3030897 2618754 1752949 1078629 1173509 1660535 1556762 591171
35377E91171r05762J77484J132630R79412K4421o72893o45938m20761n86125r35735
$$ 591171 -314591 -137107 995523 1974935 1999356 1326463 680525 259764 -326361 -1262096
35367a262096q70569l28829K37813O67878J162252J502104J041178j61819j019388
$$ -1262096 -2132665 -2461494 -2223681 -1555803 -393551 1108553 2149731 1987912 968524
35358I68524q19270k31042j78649m21564k26893J74364M8064l24531j5705P74261
$$ 968524 149254 -81788 -260437 -682001 -908894 -734530 -686466 -1010997 -1026702 -252441
35348b52441Q34697K1275l51138K92516P29297l7786j060372r59415j02367J45588
$$ -252441 582256 603531 252393 544909 1274206 1236420 176048 -783367 -885734 -740146
35338g40146l47842m81854J61722P88131P55398L02348j71485n34492n23137J10542
$$ -740146 -1087988 -1569842 -1408120 -619989 135409 437757 266272 -268220 -791357 -680815
35328f80815Q62112Q11082k1947n10911J1195Q11224Q59186J92754m01490n39165
$$ -680815 181297 992379 970432 459521 470716 1281940 2141126 2333880 1932390 1393225
35318A393225m13529j63603K34116N33048L06923l66803p48707k80434N92262
$$ 1393225 979696 816093 1050209 1583257 1890180 1523377 774670 494236 1086498
35309A086498Q06433k2431j011283j041719j88170M15143J46530l35061j95547
$$ 1086498 1892931 1870500 859217 -182502 -370672 44471 191001 -144060 -339607
35300c39607L68952O09455L79098Q3222j39017l74897l68186J08440M82844j9180
$$ -339607 29345 638800 1017898 1101120 962103 587206 219020 327460 810304 791124
35290G91124j019206j274759m80490K73534J67765k65747k33744J25408L15521
$$ 791124 -228082 -1502841 -1983331 -1709797 -1542032 -1807779 -2041523 -1916115 -1600594
35281a600594L91519N06132K93261m02410p98347j75534Q29099R69018J67828
$$ -1600594 -1209075 -702943 -409682 -812092 -1610439 -1785973 -956874 12144 179972
35272A79972m83599m06706j67723l16281n53905l99322N0570M26185O29416P15349
$$ 179972 -303627 -710333 -878056 -1194337 -1748242 -2147564 -2096994 -1670809 -1041393 -326044
35262c26044O23264L33316J3681j89510k71802k00798O0947K90941J28814l99220
$$ -326044 297220 630536 644217 454707 182905 -17893 43054 333995 462809 63589
35252F3589p95960o75682j69256L33202N61865M37197Q4221j58038p0960O4785
$$ 63589 -732371 -1408053 -1577309 -1244107 -682242 -245045 -160824 -318862 -389822 -325037
35242c25037j77303n98156m83619L26253J028629Q76471J48526l36125k91231
$$ -325037 -502340 -1100496 -1584115 -1257862 -229233 647238 795764 459639 168408
35233A68408m1392J70692L51458L76906P0868l17387k85285J39866L01575j71370
$$ 168408 127016 297708 649166 1026072 1096940 779553 494268 634134 935709 764339
35223G64339p90678q61798l60408K01964M87783M67613P9493o59139j234632r72860
$$ 764339 -26339 -888137 -1248545 -1046581 -558798 -91185 -11692 -670831 -1905463 -2878323
35213b878323o970O45125L49960k56959j80611N03109Q38803M60659L0346O0318
$$ -2878323 -2885293 -2240168 -1890208 -2147167 -2327778 -1824669 -985866 -525207 -494861 -434543
35203d34543J43546j70580m33587J5080Q21483R47411J58632o26427o43503k26993
$$ -434543 -290997 -461577 -895164 -880084 -58601 888810 1047442 421015 -222488 -449481
35193d49481p8537j64482P3477O87583J041706P06329M6697l16491l23213m07806
$$ -449481 -528018 -692500 -619023 68560 1110266 1816595 1863292 1546801 1223588 815782
35183H15782p28812q65288m35722K59968N25461J06724n43640q22700n21368J65192
$$ 815782 86970 -778318 -1214040 -954072 -428611 -321887 -865527 -1688227 -2209595 -2044403
35173b044403Q08889Q88498K15074n98600n83127L30789R77067L91299q23705
$$ -2044403 -1235514 -347016 -131942 -730542 -1313669 -982880 -5813 385486 -438219
35164d38219j263248n91880J90313L11529J27026J88799K97578O3309k43252j52348
$$ -438219 -1701467 -2293347 -2103034 -1791505 -1664479 -1475680 -1178102 -1114793 -1358045 -1510393
35154a510393Q8469j15987n76949m25135N09772J217416Q47423n3043k86327L25567
$$ -1510393 -1421924 -1537911 -2114860 -2539995 -2030223 -812807 34616 -18427 -304754 20813
35144B0813P70263L43641m19960o20136k01406K10607K77355J45524p6262l65260
$$ 20813 791076 1134717 714757 94621 -106785 103822 381177 526701 450439 85179
35134H5179m06134J17925Q03310Q22249J24094l80061j31430K91136J22211n17913
$$ 85179 -320955 -203030 600280 1422529 1546623 1166562 1035132 1326268 1448479 930566
35124I30566j007336j066977o91213J26143R90144J094691L20788l30453j71268
$$ 930566 -76770 -1143747 -1834960 -1708817 -718673 376018 696806 366353 195085
35115A95085J08137k17527m35532L22370J132482M65210j107774j473314k37810
$$ 195085 303222 85695 -349837 -27467 1105015 1570225 462451 -1010863 -1248673
35106a248673P31022L87136q7654K44596L85253n18108j300251o55681N99876
$$ -1248673 -517651 -130515 -218169 26427 411680 -106428 -1406679 -2062360 -1462484
35097a462484R07794M05761J95279K17728k03461n19556K68642J473728J414373
$$ -1462484 -554690 -148929 46350 264078 60617 -458939 -190297 1283431 2697804
35088B697804M6489j031495j112828r76525r03779j70382J064159J343332J74545
$$ 2697804 2744293 1712798 599970 -376555 -1280334 -1450716 -386557 956775 1131320
35079A131320r60375p64354J07900L72280l1364l81510m25355k36681K87425R15659
$$ 1131320 170945 -593409 -485509 -113229 -144593 -526103 -951458 -1188139 -900714 14945
35069A4945Q86501L4367o80268n31790q6896j01119k47864P8770M91970K70569
$$ 14945 901446 935813 255545 -276245 -363141 -464260 -712124 -633354 -141384 129185
35059A29185k87860l09287K31864N76889M29219J95031J34704R3756k4174j69340
$$ 129185 -158675 -467962 -236098 340791 770010 965041 1099745 1193501 1169327 999987
35049I99987l62726m75106j42166N23167O28426l16729j369947j228160k1876
$$ 999987 637261 162155 19989 543156 1171582 854853 -515094 -1743254 -1765130
35040a765130R11031Q44733L00326l9396q2271O1246L39153M71693J37943l96832
$$ -1765130 -854099 -9366 290960 251564 169293 230539 569692 1041385 1179328 782496
35030G82496m88016p4062J87008j05508n52040n89658k28359N1281j18253n71772
$$ 782496 294480 220418 407426 301918 -250122 -839780 -1068139 -1016858 -1135111 -1706883
35020a706883o62368N0474J012217J067766J9231q40426m04885O55689Q91679
$$ -1706883 -2369251 -2318777 -1306560 -238794 -219563 -1059989 -1464874 -809185 82494
35011H2494J54788m24039k34647K11442L76394K64083r1682o30020p75306n4503
$$ 82494 237282 -186757 -421404 -209962 166432 430515 338833 -291187 -1066493 -1120996
35001a120996Q26358P19014j75262n96004l20505l57523q15150m59659Q98410
$$ -1120996 -294638 424376 249114 -346890 -667395 -1024918 -1840068 -2299727 -1401317
34992a401317J495300L04729j058424p24500N20387O07687n08591j029000l32687
$$ -1401317 93983 398712 -659712 -1384212 -863825 -256138 -764729 -1793729 -2126416
34983b126416K94904L1297k97950J03820O96786P01157L41517K13570K43637L7573
$$ -2126416 -1831512 -1800215 -2098165 -1994345 -1297559 -596402 -254885 -41315 202322 239895
34973B39895k97316l61030j62212p0997k27028l55788j32387M14928Q36180O63252
$$ 239895 -57421 -418451 -580663 -651660 -878688 -1234476 -1366863 -951935 -115755 547497
34963E47497P143m37892k33404J98678J70489l07857o15383m01618Q9979M50129
$$ 547497 554640 116748 -116656 82022 252511 -55346 -670729 -1072347 -982368 -532239
34953e32239M20394m8582o08622o04775J43595Q98412Q91456L63743O8343P5498
$$ -532239 -111845 -160427 -769049 -1373824 -1230229 -331817 559639 923382 991725 1067223
34943A067223q5553l62495k81220j8626k60130q72244q50219Q1594Q83366P10248
$$ 1067223 981670 619175 337955 319329 59199 -813045 -1663264 -1581670 -698304 11944
34933A1944O1303j80616j4328P1962N6962J90534L49439K84170J22765O4984j9552
$$ 11944 73247 -107369 -121697 -49735 7227 197761 547200 831370 954135 1019119 999567
34922I99567j91431j39538J75325J43541n34693j052962n26793N61915R08448
$$ 999567 808136 668598 843923 987464 452771 -600191 -1126984 -565069 343379
34913C43379K09182n12547m55259l9169q0987o19960r66281o04046K39500Q39619
$$ 343379 552561 40014 -415245 -454414 -535401 -1155361 -2121642 -2725688 -2486188 -1646569
34903a646569P36956K60819R2363K77804J57213m88083q68801l27708N62056Q34909
$$ -1646569 -909613 -648794 -556431 -278627 -121414 -609497 -1478298 -1806006 -1243950 -409041
34893d09041N48273L57407J09964q09848j846898j523735K68311J642892J180205
$$ -409041 139232 496639 606603 -203245 -2050143 -3573878 -3305567 -1662675 -482470
34884d82470j44546n17144J65344N66338J46375k86840j54966P3775p6403k65476
$$ -482470 -627016 -1144160 -978816 -412478 -266103 -552943 -707909 -634134 -710537 -976013
34874i76013l7802L83248N29253M19896L57615L26201R1467k52277k73326K12773
$$ -976013 -1013815 -630567 -101314 318582 676197 1002398 1093865 841588 568262 781035
34864G81035P83142P56019p1969j042772j173078k66387P09189P15230n8906n39917
$$ 781035 1564177 2320196 2248227 1205455 32377 -234010 475179 1190409 1131503 591586
34854E91586l30385j44662m83296p45919k59012N28499P22488L66502J70165J55810
$$ 591586 261201 116539 -366757 -1112676 -1371688 -843189 -120701 245801 415966 571776
34844E71776k89777j025751j031133k7864Q52060O42172j00698k76309J41767
$$ 571776 281999 -743752 -1774885 -1802749 -950689 -308517 -409215 -685524 -543757
34835e43757L61460J30180j24169k27349m09243o25693n51955k31603j4934J08020
$$ -543757 -182297 -52117 -176286 -403635 -812878 -1438571 -1990526 -2222129 -2237063 -2129043
34825b129043M01269O66945M22707j73238l77640L0073M62120N07605M33470M82922
$$ -2129043 -1727774 -1060829 -638122 -811360 -1189000 -1158927 -696807 -189202 244268 727190
34815G27190M44800K13262M8062k1702l17517p40030o97003j78080r833n14333
$$ 727190 1171990 1385252 1433314 1411612 1094095 354065 -342938 -521018 -530851 -1045184
34805a045184q22662k31392O02301O82500J78547l3673K31847M66457L86114j39
$$ -1045184 -1867846 -2099238 -1496937 -814437 -635890 -669563 -437716 28741 414855 414716
34795D14716p09717j309993q10006Q74499K052595J255228m58219q51115J73232
$$ 414716 -295001 -1604994 -2415000 -1540501 512094 1767322 1309103 457988 631220
34786F31220N55179n37783j416893o59846O96462R13949M4597o73463q16830p76060
$$ 631220 1186399 648616 -768277 -1428123 -731661 182288 226885 -446578 -1263408 -2039468
34776b039468n37294J24803O98066M73966j99286l27926K20478O54016O02628
$$ -2039468 -2576762 -2451959 -1753893 -1279927 -1479213 -1807139 -1586661 -932645 -330017
34767c30017N13060O55244O67535K86861k14581n31605o56280n48459o1142O07025
$$ -330017 183043 838287 1505822 1792683 1578102 1046497 390217 -158242 -219384 387641
34757C87641Q98570N75249K4796k90842l50024l69217l94354k96152j1286L23921
$$ 387641 1286211 1861460 1886256 1595414 1245390 876173 481819 185667 174381 498302
34747D98302M17603O9242n06621p64796m41321R8848L57964L10572K10941R2340
$$ 498302 915905 985147 478526 -286270 -727591 -628743 -270779 39793 250734 343074
34737C43074r4978j07921K42105N12292P3452q33077j152298l62582P65712J096034
$$ 343074 248096 140175 382280 894572 968024 134947 -1017351 -1379933 -614221 481813
34727D81813M58780k87962l48190J63267M72601J21696m45462m59216N5174K02968
$$ 481813 940593 652631 304441 467708 940309 1062005 616543 157327 212501 415469
34717D15469m68983j130515p55234L44629R12006N01854j08216l07746m13366
$$ 415469 -53514 -1184029 -1939263 -1594634 -682628 -180774 -288990 -596736 -1010102
34708a010102p01180o88970l8534O25342O11969K84941L87541O97045M01765l66417
$$ -1010102 -1711282 -2400252 -2438786 -1813444 -1201475 -916534 -528993 168052 569817 203400
34698B03400n22339K61209Q87827M20241m85846n25833L35821Q03623P7850j057674
$$ 203400 -318939 -57730 830097 1250338 764492 238659 574480 1378103 1455953 398279
34688C98279j295466m33845N28840P06914K47612j00448M0737L64097L71980m9620
$$ 398279 -897187 -1331032 -802192 -95278 152334 51886 92623 456720 828700 779080
34678G79080n66412p92989o88611n23642m52621k66862K43329P93726Q42960L92127
$$ 779080 212668 -580321 -1268932 -1792574 -2245195 -2512057 -2268728 -1475002 -632042 -239915
34668b39915J24194M79230R66167Q16959M8848o48216r03235r22453q15088l93003
$$ -239915 -115721 363509 1329676 2146635 2195483 1547267 644032 -278421 -1093509 -1486512
34658a486512J85682L02866j88001n33912j32840M96118M71479j07630l97668
$$ -1486512 -1300830 -997964 -1185965 -1719877 -1852717 -1356599 -885120 -992750 -1390418
34649a390418j82879o1889k09268K5638Q64190J367809P29271l50696n38649K14951
$$ -1390418 -1573297 -1635186 -1844454 -1818816 -954626 413183 1142454 791758 253109 468060
34639D68060O79282K26004l70097l11722M6596L7951j06810K13561P22825N72840
$$ 468060 1147342 1373346 1003249 691527 738123 776074 669264 882825 1605650 2178490
34629B178490k37412p34325m07921Q3421j1422m65069n64018j64027K85308M54134
$$ 2178490 1941078 1206753 798832 882253 870831 405762 -158256 -322283 -36975 417159
34619D17159L63757Q6895l18989o21506n12812L3126O46171Q16098K84760o48616
$$ 417159 780916 867811 548822 -72684 -585496 -552370 93801 909899 1194659 546043
34609E46043j225237r06472m230O48705O56165L15610l0352l16959l69668O7332
$$ 546043 -679194 -1585666 -1589896 -941191 -285026 30584 232 -316727 -686395 -619063
34599f19063O45931N32925l38071r04787m66539K44636K78053j8522K24732P15571
$$ -619063 26868 559793 221722 -683065 -1149604 -904968 -626915 -645437 -420705 294866
34589B94866M42392m69322p85953j45753L62614j0448n38349l12334L29439M88348
$$ 294866 737258 267936 -518017 -663770 -301156 -311604 -849953 -1162287 -832848 -344500
34579c44500J29927m6417K03636L89068J12939l70112n11018j20392M22051N79488
$$ -344500 -214573 -260990 -57354 331714 444653 74541 -436477 -556869 -134818 444670
34569D44670K43429k45716o68542j097893j310284o91707O96474J631362J211840
$$ 444670 688099 442383 -226159 -1324052 -2634336 -3326043 -2629569 -998207 213633
34560B13633K67922J60167O57520M46045n21136q91980k29228L25974J31359J9400
$$ 213633 481555 641722 1299242 1745287 1224151 332171 102943 428917 560276 579676
34550E79676M90209O44251j02174q15633o91601m02292n51194l27497P59417J313640
$$ 579676 1069885 1714136 1611962 796329 104728 -297564 -848758 -1176255 -416838 896802
34540H96802J59096j247654p63368R78352J497686L62441m29620O7775M82358
$$ 896802 1055898 -191756 -955124 23228 1520914 1883355 1453735 1521510 2003868
34531B003868j47085p51329l18727L47851J64453m39516m73307K497L23128L91535
$$ 2003868 1856783 1105454 786727 1134578 1299031 859515 386208 388705 711833 1103368
34521A103368M37170L31604l6443l16224k50888p8520M9246L19110N74401K69445
$$ 1103368 1540538 1872142 1835699 1519475 1268587 1190067 1239313 1558423 2132824 2402269
34511B402269m95502q54523n10496j40198m9739L02819Q53678M88756r61323j737190
$$ 2402269 1906767 1052244 541748 401550 351811 654630 1508308 1997064 1035741 -701449
34501g01449n50294J232297J421074J10701p89812m91163O0247J89973K58548
$$ -701449 -1251743 -19446 1401628 1512329 722517 231354 291601 481574 740122
34492G40122L55957n7149q55366j047301l35879L48582L53849K08226M58253O51502
$$ 740122 1096079 1038930 183564 -863737 -1199616 -851034 -497185 -288959 169294 820796
34482H20796K13946m47306n06098Q9452O26134N51843l3745n96356o32980j47146
$$ 820796 1034742 587436 81338 170790 796924 1348767 1315022 718666 85686 -61460
34472f1460K65886J07067l22233l60107N118K28879K29815M43720P74393N02316
$$ -61460 204426 311493 -10740 -370847 -365729 -136850 92965 536685 1311078 1813394
34462A813394m04422q94804l63324L21721J33462n12140m75492K82954P18869
$$ 1813394 1408972 514168 150844 472565 606027 93887 -381605 -98651 620218
34453F20218L64033j26955j97968j67349m09793n57931j13163O20087Q50051L80063
$$ 620218 984251 857296 659328 491979 82186 -475745 -588908 31179 881230 1261293
34443A261293j73552k83361j78662l69609p77634p52498P24Q82442J084136O14271
$$ 1261293 1087741 804380 625718 256109 -521525 -1274023 -1273299 -390857 693279 1307550
34433A307550K15557K80726L60124k4845n47803n39436l3226K40998p6365m61233
$$ 1307550 1523107 1803833 2163957 2139112 1591309 1051873 1018647 1259645 1183280 722047
34423G22047k88119K83535N67040K67643k45648n17574m89266l49673k18335j29404
$$ 722047 433928 717463 1284503 1552146 1306498 788924 299658 -50015 -268350 -397754
34413c97754j12747j11291L0047L23610N24228M28288J44098j27181l92217o61154
$$ -397754 -510501 -621792 -591745 -268135 256093 684381 828479 701298 309081 -352073
34403c52073o33635l0812Q11391J162197P84465J65078k36238m75856o83534o70229
$$ -352073 -985708 -1016520 -205129 957068 1741533 1906611 1670373 1194517 510983 -159246
34393a59246l32804j3081l5215k16183k20722p8541K8034J31974K28175N9079
$$ -159246 -492050 -505131 -540346 -756529 -977251 -1055792 -1027758 -895784 -667609 -608530
34383f08530l60365m47191J07576O35976L87786k49171l21374J68658L37970q4115
$$ -608530 -968895 -1416086 -1308510 -672534 -284748 -533919 -855293 -686635 -348665 -432780
34373d32780m20651k66622L1371K78393P05707J060902N88456o05628j303525
$$ -432780 -853431 -1120053 -1088682 -810289 -104582 956320 1544776 939148 -364377
34364c64377r09667l27569l56524l68921L80325J186681R72945J50206o9399K89276
$$ -364377 -1274044 -1601613 -1958137 -2327058 -1946733 -760052 212893 363099 293700 582976
34354E82976J50752o18172r40209l29559M16194N83933M35115M34447N96175Q30903
$$ 582976 733728 115556 -824653 -1154212 -738018 -154085 281030 715477 1311652 2142555
34344B142555J018726O63996m78077j439953j012536K26469M10384p51849j375653
$$ 2142555 3161281 3825277 3347200 1907247 894711 1121180 1531564 779715 -595938
34335e95938l99472O65545K27394q40048q36722n1945P3309l70064j20017P39154
$$ -595938 -995410 -329865 -102471 -942519 -1779241 -1831186 -1757877 -2127941 -2247958 -1508804
34325a508804Q65916J37408j43449L29326L71167l45462n68188J74049N33198
$$ -1508804 -642888 -505480 -648929 -319603 51564 -293898 -862086 -688037 -154839
34316a54839k55505q31331J1473J152351R62825l5464k50816K23034K2559q59677
$$ -154839 -410344 -1241675 -1230202 -77851 884974 849510 598694 821728 844287 -15390
34306a5390j007784r5392N07358j9181p60245o67776L0748O17580R04658Q58765
$$ -15390 -1023174 -1118566 -611208 -630389 -1390634 -2058410 -2027662 -1410082 -505424 353341
34296C53341K56806o14901q11943J5303R33418R32670K10846l30246l10426k8673
$$ 353341 610147 -4754 -816697 -801394 132024 1064694 1275540 945294 634868 606195
34286F06195J33907j9297m18787n79654m5354P50961P65786j40764p86273l33861
$$ 606195 740102 720805 302018 -277636 -322990 427971 1193757 1052993 266720 -67141
34276f7141M46452L83081l43862o41724k04972K82441L93584L93427M74139M35845
$$ -67141 379311 762392 418530 -223194 -428166 -145725 247859 641286 1115425 1551270
34266A551270K06599n955j33937k64228k96521j36105o9776l19628m25580J44427
$$ 1551270 1757869 1751914 1617977 1353749 1057228 921123 851347 531719 106139 250566
34256B50566R02371P86028k40576r82793o82877j3274N4624l57020l92346K26031
$$ 250566 1152937 1938965 1698389 715596 32719 19445 74069 -282951 -675297 -449266
34246d49266Q43798O96744k44409j176967j167257j80353O66988L26811p67649
$$ -449266 394532 1091276 846867 -330100 -1497357 -1677710 -1010722 -683911 -1451560
34237a451560j152448k65800Q46976J044427M96900O5637J1609O4292K16875N62194
$$ -1451560 -2604008 -2869808 -2022832 -978405 -481505 -415868 -404259 -339967 -123092 439102
34227D39102O64257M1480q12591q26972Q5107P19748J99761q12865j064754l69157
$$ 439102 1103359 1144839 332248 -494724 -409617 310131 509892 -302973 -1367727 -1736884
34217a736884L41382L69576k4592k65463k10433k6699K17065M68411M89697J61887
$$ -1736884 -1395502 -1025926 -1050518 -1315981 -1526414 -1553113 -1336048 -867637 -377940 -216053
34207b16053j49197L1596N58999P44947K71866l64911n28309k26210K6005j21673
$$ -216053 -365250 -333654 225345 970292 1242158 877247 348938 122728 148733 27060
34197B7060n70448r57463r10841l41130L28534M95628J43275p7002K24488O15159
$$ 27060 -543388 -1500851 -2411692 -2752822 -2424288 -1928660 -1785385 -1862387 -1637899 -1022740
34187a022740N88905L60202L39731L15847o2105l82980k3059O21878N38584k70639
$$ -1022740 -433835 -73633 266098 581945 519840 136860 113801 735679 1274263 1003624
34177A003624o86507k10676L35300K69378Q3654L37927N22649m1563r10857j142402
$$ 1003624 317117 106441 441741 711119 794773 1132700 1655349 1613786 702929 -439473
34167d39473p04933k63669N5141O11045J161105R54377J1188o89139n72141j73624
$$ -439473 -1144406 -1408075 -1352934 -741889 419216 1373593 1384781 695642 123501 -50123
34157e0123j26305k25974l9705J94087j0242m19574l12325L66275P63621K60194
$$ -50123 -176428 -402402 -442107 -248020 -258262 -677836 -990161 -623886 139735 399929
34147C99929o33328q92815k38973O21587R23464O09761J24174j74687j92339P718
$$ 399929 -233399 -1126214 -1365187 -743600 179864 789625 913799 739112 546773 554491
34137E54491K15450J73353r6297k51022j23019J7246m6212q1828R2506J26042
$$ 554491 769941 943294 846997 595975 472956 490202 443990 362162 454668 580710
34127E80710k69168o11707l04278K82330L00219j40688r7485N72733Q45995J36351
$$ 580710 311542 -300165 -604443 -322113 -21894 -162582 -260067 312666 1158661 1295012
34117A295012p90227r98763n37043J09291P48720J072641N22127o59991j197709
$$ 1295012 504785 -493978 -1031021 -921730 -173010 899631 1421758 761767 -435942
34108d35942m86346L94795L45760p2316J54823N73960J33472p48933q03153j77894
$$ -435942 -922288 -527493 -181733 -254049 -99226 474734 608206 -140727 -943880 -1121774
34098a121774j42122o34568k31502J115559J483453P724j438396r49871N85548
$$ -1121774 -1263896 -1898464 -2129966 -1014407 469046 476770 -961626 -1911497 -1325949
34089a325949J033967K65259m6333O71791J122321L89287o73337q72680l35200
$$ -1325949 -291982 -26723 -73056 598735 1721056 2110343 1437006 564326 229126
34080B29126K4388l4779K5893M46107P06053K79365n52362r59317n93205m5149
$$ 229126 253514 218735 244628 690735 1396788 1676153 1123791 164474 -428731 -473880
34070d73880m5695m28495l61489L92687J037273Q41915J51648k01136j03394j21226
$$ -473880 -519575 -948070 -1309559 -916872 120401 962316 1113964 912828 809434 688208
34060F88208m23347m86623k1148M31977K09271n19273r17795m90523L95302R84047
$$ 688208 264861 -221762 -242910 189067 398338 -120935 -1038730 -1529253 -1133951 -149904
34050a49904R15551M91824K62446L71166L43700l10854j248078j396677k81653
$$ -149904 765647 1257471 1519917 1891083 2234783 1923929 675851 -720826 -1002479
$$ [...]
##END NTUPLES=NMR SPECTRUM
##END=
