##TITLE=31Pdec_SA_PPh3vCl(CH2Cl2)
 CDCl3, 8 sc
 19.9.2019
##JCAMPDX= 6.0         $$ Bruker NMR JCAMP-DX V2.0
##DATA TYPE= NMR SPECTRUM
##DATA CLASS= NTUPLES
##ORIGIN= UXNMR, Bruker Analytische Messtechnik GmbH
##OWNER= root
$$ XWIN-NMR		Version 3.5
$$ Thu Sep 19 15:30:54 2019 Russian Standard Time (UT+4h)  she@DPX200
##.OBSERVE FREQUENCY= 81.013821
##.OBSERVE NUCLEUS= ^31P
##.ACQUISITION MODE= SIMULTANEOUS
##.ACQUISITION SCHEME= undefined
##.AVERAGES= 24
##.DIGITISER RES= 17
##SPECTROMETER/DATA SYSTEM= spect
##.PULSE SEQUENCE= zgpg30
##.SOLVENT NAME= CDCl3
##.SHIFT REFERENCE= (INTERNAL, CDCl3, 0, 182.463)
##AUDIT TRAIL= $$ (NUMBER, WHEN, WHO, WHERE, WHAT)
$$ ##TITLE= Audit trail, XWIN-NMR		Version 3.5
$$ ##JCAMPDX= 5.01
$$ ##ORIGIN= Bruker BioSpin GmbH
$$ ##OWNER= she
$$ F:/spectra/data/she/nmr/P31/1/pdata/1/auditp.txt
$$ ##AUDIT TRAIL=  $$ (NUMBER, WHEN, WHO, WHERE, WHAT)
(   1,<2019-09-19 15:28:25.26 +0400>,<she>,<DPX200>,
      <created by zg, POWCHK disabled, PULCHK disabled
       configuration hash MD5:
       00 E9 B6 7A A2 85 ED C7 34 08 36 98 17 FE 4E 26
       data hash MD5: 32K
       E4 66 8B 17 84 DC D6 A6 F0 E7 05 4C 80 98 D7 F9>)
(   2,<2019-09-19 15:29:40.21 +0400>,<she>,<DPX200>,
      <Start of raw data processing
       efp BC_mod = 2 LB = 1 FT_mod = 6 PKNL = 1 PHC0 = -414.1935 PHC1 = 103.8003 SI = 64K 
       data hash MD5: 64K
       68 10 12 C1 B3 3A 77 64 3E EA 12 8F A3 02 E6 E3>)
(   3,<2019-09-19 15:29:59.43 +0400>,<she>,<DPX200>,
      <pk PHC0 = -1.676677 PHC1 = 4.8 
       data hash MD5: 64K
       B9 E8 74 1B DA 69 9F 67 49 FB 7C E7 86 F6 E8 19>)
(   4,<2019-09-19 15:30:02.71 +0400>,<she>,<DPX200>,
      <abs ABSG = 5 
       data hash MD5: 64K
       20 F8 36 E3 13 A2 ED 1E 16 60 AC 0A A0 E3 EB B9>)
$$ ##END=
$$ 
$$ hash MD5
$$ 4C 44 90 EE FF 91 7B 77 64 3B A1 09 84 34 B5 A0
##$RELAX= 
##$RELAX= 
##$RELAX= 
##$RELAX= 
##$RELAX= 
##$RELAX= 
##$RELAX= 
##$RELAX= 
$$ Bruker specific parameters
$$ --------------------------
##$DU= <F:/spectra>
##$EXPNO= 1
##$NAME= <P31>
##$PROCNO= 1
##$TYPE= <nmr>
##$USER= <she>
##$AMP= (0..31)
100 100 100 100 100 100 100 100 100 100 100 100 100 100 100 100 100 100 
100 100 100 100 100 100 100 100 100 100 100 100 100 100 
##$AQSEQ= 0
##$AQ_mod= 1
##$AUNM= <au_zg>
##$AUTOPOS= <>
##$BF1= 81.014009
##$BF2= 200.13
##$BF3= 200.13
##$BF4= 200.13
##$BF5= 200.13
##$BF6= 200.13
##$BF7= 200.13
##$BF8= 200.13
##$BYTORDA= 1
##$CFDGTYP= 0
##$CFRGTYP= 5
##$CHEMSTR= <none>
##$CNST= (0..31)
1 1 145 1 1 1 1 1 1 1 1 1 1 1 1 1 1 1 1 1 1 1 1 1 1 1 1 1 1 1 1 1 
##$CPDPRG= <waltz16>
##$CPDPRG1= <>
##$CPDPRG2= <waltz16>
##$CPDPRG3= <>
##$CPDPRG4= <mlev>
##$CPDPRG5= <mlev>
##$CPDPRG6= <mlev>
##$CPDPRG7= <mlev>
##$CPDPRG8= <mlev>
##$CPDPRGB= <>
##$CPDPRGT= <>
##$D= (0..31)
0 1 0 0 0 0 0 0 0 0 0 0.03 2e-05 3e-06 0 0 0 0 0 0 0 0 0 0 0 0 0 0 0 0 
0 0 
##$DATE= 1568892504
##$DBL= (0..7)
120 120 120 11 120 120 24 19 
##$DBP= (0..7)
150 150 150 150 150 150 150 150 
##$DBP07= 0
##$DBPNAM0= <>
##$DBPNAM1= <>
$$ [...]
##$SUBNAM3= <"">
##$SUBNAM4= <"">
##$SUBNAM5= <"">
##$SUBNAM6= <"">
##$SUBNAM7= <"">
##$SUBNAM8= <"">
##$SUBNAM9= <"">
##$SW= 369.568048894756
##$SWIBOX= (0..15)
0 1 3 0 0 0 0 0 0 0 0 0 0 0 0 0 
##$SW_h= 29940.119760479
##$TD= 32768
##$TD0= 1
##$TE= 0
##$TE2= 300
##$TE3= 300
##$TEG= 300
##$TL= (0..7)
0 120 53 12 22 120 120 120 
##$TP= (0..7)
150 150 150 150 150 150 150 150 
##$TP07= 0
##$TPNAME0= <>
##$TPNAME1= <>
##$TPNAME2= <>
##$TPNAME3= <>
##$TPNAME4= <>
##$TPNAME5= <>
##$TPNAME6= <>
##$TPNAME7= <>
##$TPOAL= (0..7)
0.5 0.5 0.5 0.5 0.5 0.5 0.5 0.5 
##$TPOFFS= (0..7)
0 0 0 0 0 0 0 0 
##$TUNHIN= 0
##$TUNHOUT= 0
##$TUNXOUT= 0
##$USERA1= <user>
##$USERA2= <user>
##$USERA3= <user>
##$USERA4= <user>
##$USERA5= <user>
##$V9= 5
##$VALIST= <valist>
##$VCLIST= <CCCCCCCCCCCCCCC>
##$VD= 0
##$VDLIST= <DDDDDDDDDDDDDDD>
##$VPLIST= <PPPPPPPPPPPPPPP>
##$VTLIST= <TTTTTTTTTTTTTTT>
##$WBST= 1024
##$WBSW= 4
##$XGAIN= (0..3)
0 0 0 0 
##$XL= 0
##$YL= 0
##$YMAX_a= 39043
##$YMIN_a= -43658
##$ZGOPTNS= <>
##$ZL1= 120
##$ZL2= 120
##$ZL3= 120
##$ZL4= 120
##$ABSF1= 182.463
##$ABSF2= -187.1042
##$ABSG= 5
##$ABSL= 3
##$ALPHA= 0
##$AQORDER= 0
##$ASSFAC= 0
##$ASSFACI= 0
##$ASSFACX= 0
##$ASSWID= 0
##$AUNMP= <proc_1d>
##$AZFE= 0.1
##$AZFW= 0.5
##$BCFW= 0
##$BC_mod= 2
##$BYTORDP= 0
##$COROFFS= 0
##$CY= -3
##$DATMOD= 1
##$DC= 0
##$DFILT= <>
##$DTYPP= 0
##$F1P= 0
##$F2P= 0
##$FCOR= 1
##$FTSIZE= 65536
##$FT_mod= 6
##$GAMMA= 0
##$GB= 0
##$INTBC= 1
##$INTSCL= 5.30512e-09
##$ISEN= 30
##$LB= 1
##$LEV0= 0
##$LPBIN= 0
##$MAXI= 10000
##$MC2= 0
##$MEAN= 0
##$ME_mod= 0
##$MI= 50
##$NCOEF= 0
##$NC_proc= -3
##$NLEV= 6
##$NOISF1= 182.463
##$NOISF2= 159.3651
##$NSP= 0
##$NTH_PI= 0
##$NZP= 0
##$OFFSET= 182.463
##$PC= 4
##$PHC0= -415.8702
##$PHC1= 108.6003
##$PH_mod= 1
##$PKNL= yes
##$PPARMOD= 0
##$PSCAL= 0
##$PSIGN= 0
##$REVERSE= no
##$SF= 81.0140089999434
##$SI= 65536
##$SIGF1= 159.3651
##$SIGF2= -187.1042
##$SINO= 113.3802
##$SIOLD= 16384
##$SREGLST= <1H.CDCl3>
##$SSB= 0
##$STSI= 65536
##$STSR= 0
##$SW_p= 29940.119760479
##$SYMM= 0
##$S_DEV= 0
##$TDeff= 32768
##$TDoff= 0
##$TI= <>
##$TILT= no
##$TM1= 0
##$TM2= 0
##$TOPLEV= 0
##$USERP1= <user>
##$USERP2= <user>
##$USERP3= <user>
##$USERP4= <user>
##$USERP5= <user>
##$WDW= 1
##$XDIM= 65536
##$YMAX_p= 350091661
##$YMIN_p= -3199950
$$ End of Bruker specific parameters
$$ ---------------------------------
##NTUPLES= NMR SPECTRUM
##VAR_NAME=  FREQUENCY,     SPECTRUM/REAL,   SPECTRUM/IMAG
##SYMBOL=    X,             R,               I
##VAR_TYPE=  INDEPENDENT,   DEPENDENT,       DEPENDENT
##VAR_FORM=  AFFN,          ASDF,            ASDF
##VAR_DIM=   65536,         65536,           65536
##UNITS=     HZ,            ARBITRARY UNITS, ARBITRARY UNITS
##FACTOR=    0.456856943014862, 1,           1
##FIRST=     14782.0589164792, 0,            0
##LAST=      -15158.0608439998, 0,           0
##MIN=       -15158.0608439998, -3199950,    0
##MAX=       14782.0589164792, 350091661,    0
$$ Real data points
##PAGE= N=1
##DATA TABLE= (X++(R..R)), XYDATA
$$ [...]
43440 -84128 25683 174499 203254 120217 68920 153861 317640 395701 308314 180782 215780
43429 215780 439487 646232 633192 429161 234639 178977 206012 186810 82615 -23048
43419 -23048 -26176 83342 209101 246773 184984 96992 47006 30895 738 -84634 -232470
43408 -232470 -407369 -543301 -583930 -514149 -353711 -154677 -19694 -58707 -265293 -479281
43398 -479281 -544653 -469889 -358991 -238692 -72295 87791 113726 -12049 -160359 -240066
43388 -240066 -288637 -334465 -314379 -210528 -136584 -174849 -230982 -172654 -31296 58101 52205
43377 52205 9920 -35469 -82817 -81204 23754 176801 262447 253596 207648 147366 67572 26274
43365 26274 80514 148465 103130 7388 61955 269968 356833 138489 -200266 -346684 -249600
43354 -249600 -99863 -23177 10759 26659 3800 4883 145907 380474 486730 364106 199268
43343 199268 205237 299483 208190 -144821 -517136 -642104 -514190 -320678 -191075 -109850
43333 -109850 -26351 53405 89006 49638 -77487 -267561 -431438 -465255 -362263 -233862
43323 -233862 -176672 -150392 -41685 166553 353445 399392 311898 181616 59956 -60679
43313 -60679 -162060 -171921 -56563 107153 211650 249172 291199 337217 279634 74463 -136484
43302 -136484 -178198 -77217 -24578 -109693 -218175 -223195 -151362 -96686 -87301 -122957 -231083
43291 -231083 -368892 -373209 -163847 74776 95472 -66692 -151324 -71030 -21837 -128382 -210763
43280 -210763 -63449 204610 318487 236912 188205 321752 515914 578624 495916 403771
43270 403771 396090 433985 412559 278018 94942 2862 77694 239999 335810 300764 205604
43259 205604 153581 183697 268205 352679 396588 412022 447215 492156 445654 259019 76476
43248 76476 106663 341963 532998 493147 317096 225242 291404 418684 499909 485798 357783
43237 357783 169553 82086 207658 415273 441756 234823 36954 50687 162789 132842
43227 132842 -52436 -192487 -192324 -165061 -186400 -141195 77744 357728 496394 461232 373766
43216 373766 290962 170010 39716 24109 136472 203280 99661 -45867 -11673 205340
43206 205340 366590 278849 8605 -213071 -243664 -164412 -180488 -382419 -612402 -624278
43196 -624278 -392369 -166095 -152111 -249336 -228989 -91469 -47058 -156884 -220811 -105350
43186 -105350 15746 -88195 -338424 -430063 -245454 1888 67694 -28253 -84443 6974
43176 6974 172687 305428 392737 476492 553200 571812 513402 418454 318675 185523 -9881
43165 -9881 -207173 -287745 -211247 -76294 -12213 -34090 -40710 49298 191280 260056 188861
43154 188861 37190 -88538 -147416 -155845 -103397 24461 132945 66230 -148670 -243783 -53471
43143 -53471 190530 136359 -157308 -251423 50881 399461 385074 94769 -66930 52263
43133 52263 252238 364556 421885 435882 305634 42023 -155948 -176047 -150750 -202096 -206750
43122 -206750 630 315814 465425 364028 181252 65794 -22420 -170223 -339332 -407633
43112 -407633 -319214 -153705 -77396 -214726 -512682 -749855 -750682 -576011 -424093 -368303 -305914
43101 -305914 -163359 -9807 81932 153697 252212 311563 264712 194461 234036 354278 388939
43090 388939 266790 88782 -37725 -111123 -150351 -133786 -88959 -113317 -203799 -182723 58423
43079 58423 319791 283147 -69286 -407439 -467433 -346863 -296412 -362011 -385422 -281043 -135711
43068 -135711 -33152 66017 212155 347891 389867 360128 334202 291142 134058 -120317
43058 -120317 -290382 -249128 -112037 -83570 -158104 -133346 58810 213731 146599 -32976
43048 -32976 -106919 -96447 -198225 -414190 -500524 -336292 -110661 -31003 -40116 25388 154934
43037 154934 222553 208748 173738 94133 -74080 -223966 -197297 -38700 49409 8076 -24817
43026 -24817 14408 11553 -83470 -125919 -23658 59057 -74567 -338388 -465656 -379530 -283354
43015 -283354 -378117 -631858 -854493 -887228 -684719 -315911 50633 230723 174707 20647
43005 20647 -48760 5743 70671 48654 -16732 -13636 75442 141433 89540 -33136 -87694 -4522
42993 -4522 141312 221267 201185 177516 247790 355754 331699 132488 -40329 15199 187339
42982 187339 163807 -127900 -410904 -475085 -468347 -594520 -731429 -618302 -289213 -17538
42972 -17538 102031 203282 307168 265949 87024 -14467 28300 38181 -38723 -3409 194791
42961 194791 267158 39255 -209918 -166208 22867 20536 -144945 -200247 -150704 -238211 -433715
42950 -433715 -429086 -177799 -16906 -131557 -279177 -216846 -61451 -1988 52504 259190
42940 259190 488496 486088 269010 84745 34358 -15386 -154499 -281324 -272718 -153427 -47360
42929 -47360 -48792 -158646 -280019 -286748 -163622 -47519 -49102 -81304 13215 188548 208519
42918 208519 -20719 -271008 -252875 20753 253971 229981 37621 -87033 -40982 91150
42908 91150 184054 168033 17315 -227979 -416017 -389951 -196571 -72964 -143437 -240600 -146622
42897 -146622 82205 192973 89458 -68135 -117854 -81455 -51861 -42051 -24899 -18676 -42404
42886 -42404 -45454 39956 195340 305501 247531 -2166 -321674 -524972 -530163 -419954 -303720
42875 -303720 -193590 -87554 -74004 -213612 -386373 -423532 -351301 -329312 -383556 -405750 -403195
42864 -403195 -510232 -715174 -812527 -699129 -498334 -314113 -99004 131687 214002 122034
42854 122034 92001 251684 350248 114457 -304483 -525571 -452183 -299764 -200015 -88175
42844 -88175 42167 71524 -21591 -109702 -129786 -139340 -134044 -27169 144117 203557 93323
42833 93323 -44460 -110479 -176513 -282875 -306817 -171670 -28343 -62074 -220953 -297804 -219937
42822 -219937 -106668 -67102 -82844 -107246 -163213 -276527 -368360 -299184 -43197 228258 298282
42811 298282 134812 -93964 -236262 -289540 -280464 -146366 143120 438511 541106 444090
42801 444090 303756 202645 95106 -22467 -55107 40882 184795 290312 349395 368653
42791 368653 331225 257887 210222 199074 167402 77820 -54858 -202023 -303387 -251275 -21138
42780 -21138 215646 264706 176024 167576 292491 381344 331740 236683 171341 74427 -65628
42769 -65628 -116170 -17757 81138 38133 -87272 -169307 -190010 -160570 -40721 123765 154553
42758 154553 -5212 -149258 -95916 35343 25831 -112093 -220629 -276930 -348126 -376644 -270723
42747 -270723 -135703 -155185 -289846 -350197 -332559 -413897 -618668 -757031 -713894 -547792
42737 -547792 -287569 88159 419030 414228 62238 -267533 -283426 -110287 -17765 -35428
42727 -35428 -38716 -26343 -65789 -80819 59972 291005 394284 286241 103130 9727 50441
42716 50441 172045 276837 269265 147168 18146 -55584 -158985 -356674 -503794 -393091
42706 -393091 -58842 239360 338576 313884 279491 223922 111812 2928 -30630 -8042 27316
42695 27316 91944 186549 214395 94022 -81447 -115661 47831 239621 256855 92567 -66761
42684 -66761 -55615 94145 207838 183821 109150 131415 264164 396306 470433 535727 597570
42673 597570 546235 330688 104664 62668 180622 266264 247706 247851 350307 466993 515374
42662 515374 557792 625448 545406 153812 -375696 -644132 -497815 -198367 -60453 -98829
42652 -98829 -145713 -155815 -208569 -286105 -252604 -69280 122672 181362 119339 32887 -29380
42641 -29380 -65057 -60747 -17333 6260 -49429 -153822 -212295 -182425 -113760 -60896 -1536 126290
42629 126290 319712 472082 451563 227843 -66333 -208081 -63772 262351 478391 369736
42619 369736 36424 -191778 -121114 82898 114964 -73561 -223338 -122158 124732 253306
42609 253306 164560 -19673 -157367 -211508 -191797 -98145 42374 160910 207321 185329 122094
42598 122094 50026 10979 13902 -8426 -125816 -293638 -402174 -458423 -600222 -863453 -1046662
42587 -1046662 -933811 -600622 -359693 -391760 -551560 -587121 -450340 -295965 -227108 -169570
42577 -169570 -27185 141074 191534 106921 34075 91025 220623 286312 247716 169857 106929
42566 106929 72077 103449 249002 457192 576674 524131 388721 302605 257037 137715
42556 137715 -68456 -204341 -133904 57911 145028 37058 -116391 -147936 -110950 -176854
42546 -176854 -337333 -389082 -264510 -189217 -361207 -616133 -633774 -411607 -275292 -397637
42536 -397637 -565822 -531263 -363598 -283345 -310909 -294812 -190733 -95635 -45310 20694 95674
42525 95674 90422 5850 -41730 -12454 -16872 -136044 -283989 -317960 -201248 -8671 149010
42514 149010 175157 58699 -67349 -37700 139655 294889 333404 312056 240520 16966
42504 16966 -314321 -456508 -234038 81340 93790 -153353 -241408 14049 337378 435880
42494 435880 352213 235491 54443 -232010 -437076 -354901 -81042 129328 222666 304333
42484 304333 324628 134854 -144610 -160982 150659 381114 174524 -281017 -523415 -422063
42474 -422063 -250452 -230295 -282552 -262719 -205202 -216364 -273129 -269260 -193373 -131329 -105436
42463 -105436 -25384 160779 342777 350024 154934 -96359 -256580 -302392 -265508 -140802
42453 -140802 54808 209567 220076 125732 23426 -105084 -323500 -523869 -486177 -201677
42443 -201677 65130 133393 133979 241451 361598 300992 132284 136935 397463 660819 652719
42432 652719 380706 77082 -55503 -6234 61930 -19659 -222900 -322097 -169411 84088
42422 84088 154844 -24918 -250193 -312297 -202343 -60947 -41450 -203647 -425551 -449756
42412 -449756 -149652 278973 529771 544746 494113 452628 333316 147650 68592 154321
42402 154321 240635 219907 218376 360073 541133 597789 545844 492662 443802 356217 260822
42391 260822 170001 -17276 -341138 -621939 -671664 -570748 -517503 -479998 -264557 79493
42381 79493 216216 -12197 -310784 -302575 -36243 87245 -137114 -443292 -444742 -129828
42371 -129828 141898 107699 -104505 -218664 -193329 -198523 -295652 -353126 -281567 -152628 -40107
42360 -40107 70912 152847 102702 -66154 -178948 -156919 -141330 -232689 -296551 -198357 -49995
42349 -49995 -13331 -19376 70763 156199 32147 -235958 -363530 -259144 -124394 -127005 -213116
42338 -213116 -278385 -305957 -283497 -175412 -32382 32488 9432 -17977 -49565 -155443 -284353
42327 -284353 -290781 -177086 -98526 -93310 -32083 109972 170596 82452 7523 68167 158576
42316 158576 167853 187219 315796 426977 327856 42683 -231168 -356348 -305185 -93260
42306 -93260 172339 274789 90151 -248279 -514630 -633460 -633555 -489050 -201576 51631
42296 51631 80562 -38389 -58696 67876 131497 -491 -196517 -280012 -252146 -190411 -84354
42285 -84354 74312 143737 -33025 -356494 -510068 -340278 -74265 -37405 -220576 -293650
42275 -293650 -69151 222288 239487 -10573 -205626 -150495 20450 107290 108178 120569 136885
42264 136885 85998 -2899 -18379 70380 162702 143458 12884 -92608 -13299 254129 506301
42253 506301 542158 401300 277908 217428 73824 -201821 -431583 -466099 -392648 -358610
42243 -358610 -341198 -246777 -113593 -46974 -41540 -25023 -9247 -56784 -159584 -268251 -363535
42232 -363535 -392981 -256356 4524 132247 -42323 -327706 -408482 -266459 -142682 -149837
42222 -149837 -174945 -143953 -128128 -162084 -182883 -196134 -298816 -475948 -553687 -426999 -193632
42211 -193632 -8440 73515 80328 70884 110030 181886 157747 -8304 -118983 16501 221181
42200 221181 120869 -304305 -639581 -593312 -346531 -210111 -210667 -217167 -246191 -385735 -553692
42189 -553692 -568928 -395606 -154645 26564 47356 -155830 -468805 -588869 -342663 71055
42179 71055 327672 371950 380836 423432 386069 205337 -30322 -209826 -264221 -128772 174604
42168 174604 430158 402868 143340 -62156 -74574 -45270 -117626 -179934 -44686 252340
42158 252340 475351 456832 237436 -33064 -248710 -396250 -498098 -538109 -474049 -334758
42148 -334758 -241987 -267515 -319723 -271434 -162082 -141553 -221869 -237620 -91265 106367 211154
42137 211154 232884 251181 255180 194873 119591 124229 188038 202661 159754 175760 290144 359313
42125 359313 237558 -10244 -179204 -178782 -115427 -114121 -154599 -134990 -28004 99528 182947
42114 182947 196997 119677 -50652 -237445 -332374 -322629 -294002 -285079 -234487 -119309 -38922
42103 -38922 -72167 -137959 -111798 -17085 31224 32984 100156 244231 314173 192599 -58677
42092 -58677 -297121 -444405 -488265 -445547 -385595 -388852 -406396 -265298 80080 396031 413241
42081 413241 170987 -36044 -35295 60746 80767 7534 -102710 -246625 -389668 -380450 -125674
42070 -125674 204116 325267 202810 100585 228539 481896 602216 478703 200018 -89769
42060 -89769 -271373 -260353 -69278 164045 309136 376347 431757 434719 291563 43025 -151575
42049 -151575 -224835 -252641 -271982 -199567 6811 237527 362092 369681 314450 230250 170422
42038 170422 212439 329387 370097 273229 187375 252153 372715 369284 253332 166780 115811
42027 115811 -18657 -226125 -340468 -293861 -200951 -146764 -81410 8801 18576 -78913 -120579
42016 -120579 14138 182768 151207 -91611 -339627 -438429 -403384 -297372 -140626 32327
42006 32327 135614 103726 -44310 -227359 -354820 -368218 -279783 -168339 -100448 -65452 -17521
41995 -17521 48059 104654 147093 177440 168018 108714 67416 113802 181672 106856 -151877 -401960
41983 -401960 -399958 -125628 181328 264148 98052 -116891 -192718 -144535 -118838 -167828 -183899
41972 -183899 -85148 38569 69100 82747 268646 613150 833688 720241 419138 242315
41962 242315 270327 305214 196260 40688 9545 107572 196612 179884 78411 -29721 -82520
41951 -82520 -84739 -121784 -255034 -365706 -222036 197135 568371 585095 368663 294106 438087
41940 438087 478988 213459 -112547 -168243 -9386 64402 -19728 -65238 19131 84325 9776
41929 9776 -128947 -225865 -279440 -286325 -187152 -20210 37820 -85794 -207324 -111457 171982
41918 171982 439320 560460 523569 340108 83686 -40934 130792 479231 693571 630062
41908 630062 432803 279220 174831 71999 35030 148314 337653 418347 305196 82326
41898 82326 -125498 -266092 -337465 -331894 -246168 -114081 7962 80049 88919 36375 -55030
41887 -55030 -130065 -132671 -71317 -23817 -40446 -65591 -13399 89450 120360 42934 -21284 33335
41875 33335 135539 148830 79502 43535 59742 31480 -53000 -67300 36548 103627 -13165
41864 -13165 -216079 -270610 -95490 182589 426434 603354 709137 716307 637171 535407
41854 535407 433044 295410 149070 113459 238242 386690 381164 228114 102878 119356
41844 119356 201723 203828 89886 -41282 -77996 -6244 92256 129970 95924 54162 70950
41833 70950 151909 239038 249239 131093 -73716 -228342 -216543 -75976 41451 61993 68107
41822 68107 144239 238540 268054 282708 387562 533659 543314 371081 198179 196190 306382
41811 306382 349572 277814 199163 180456 145465 5974 -178814 -243272 -113302 85126 155922
41800 155922 58839 -53518 -43710 41038 72549 44084 53059 115117 136492 84598 48541 85479
41788 85479 131819 127022 105381 89039 8969 -165326 -317534 -319638 -194674 -36294 145129
41777 145129 362512 514814 472131 267613 61081 -68304 -159709 -229613 -248567 -252834 -314071
41766 -314071 -371022 -253806 55311 313798 263095 -89247 -490057 -682839 -593794 -348774
41756 -348774 -155751 -126181 -183954 -183037 -102540 -57661 -125988 -250240 -324443 -296858 -174218
41745 -174218 -640 148539 211273 187220 110932 20770 1599 157701 427697 535759
41735 535759 312979 -13062 -79513 114586 249068 204059 201172 349608 412110 211640
41725 211640 -43653 -102584 -81448 -220021 -416572 -362654 -56397 157561 58852 -212813
41715 -212813 -410923 -436667 -316666 -138532 -41987 -91809 -139435 11594 290673 400653
41705 400653 200974 -136289 -389287 -510257 -521865 -382526 -77816 271437 498032 523245
41695 523245 367671 118219 -91968 -177160 -198388 -266771 -347186 -295677 -101791 73123
41685 73123 140442 195629 315625 409143 365365 212936 36009 -132394 -233959 -149670 118930
41674 118930 347107 319812 96344 -89104 -123763 -78691 -29498 37858 148063 273476
41664 273476 359268 347520 194017 -78066 -361467 -550133 -617969 -590959 -499879 -392259
41654 -392259 -317674 -262108 -177066 -101775 -135463 -235082 -195790 54019 281970 236025 -7100
41643 -7100 -156001 -92867 36679 74772 6243 -117530 -234014 -253702 -152361 -72137 -161146
41632 -161146 -318217 -292110 -57073 119928 51496 -133129 -225249 -221917 -228434 -231081 -151522
41621 -151522 -35971 -7149 -65768 -93295 -35544 48303 110473 163312 198519 176368 120459
41610 120459 118938 187824 214543 91381 -146161 -356700 -429518 -355263 -209433 -109455 -148544
41599 -148544 -310976 -461135 -466432 -337212 -207435 -170794 -181643 -145522 -64905 -36244 -114701
41588 -114701 -250087 -374155 -482904 -583364 -615073 -505148 -283607 -68740 59621 103029
41578 103029 70113 -39827 -152805 -130999 50897 215063 169279 -48271 -209960 -169971
41568 -169971 -3251 120671 102949 -57629 -291702 -462768 -442370 -264128 -130247 -168831
41558 -168831 -246256 -149000 80146 156443 -52670 -310402 -310382 -85484 50808 -67024 -266862
41547 -266862 -308238 -176005 -16396 88028 147065 152299 95259 62930 156425 307670 332780
41536 332780 206857 125808 210180 301753 200159 -14460 -89817 20025 98505 4302 -146008
41525 -146008 -214703 -271367 -431915 -599909 -565155 -317541 -80026 -12186 -33306 3706 84408
41514 84408 78703 -37280 -105789 35714 331505 509472 354041 -30082 -308174 -303297 -190992
41503 -190992 -221758 -365276 -398042 -270151 -154967 -131698 -69498 89893 175169 67279
41493 67279 -65559 -27577 62195 -57097 -356324 -529011 -425474 -219414 -99060 -26555
41483 -26555 100833 243366 302742 281866 240983 192191 139142 129792 165920 141098 -19883
41472 -19883 -217746 -281072 -174579 -17676 66143 33714 -100810 -269714 -348677 -252406 -51093
41461 -51093 78802 41593 -84545 -150469 -91714 27722 94733 58213 -24369 -51227 6967
41450 6967 71706 51769 -46752 -125804 -95929 45204 221772 353006 421972 467480 499161
41439 499161 450587 260745 -17060 -247540 -349405 -338794 -248289 -91714 72890 140716
41429 140716 78664 -11300 -776 127909 284673 373481 366293 312133 287738 305727 281158
41418 281158 142049 -50224 -171252 -198614 -197841 -167803 -52155 89370 103764 -6540 -39342
41407 -39342 113963 305852 375234 370802 380791 320626 103059 -118463 -127873 9416 33881
41396 33881 -110270 -217910 -174181 -114663 -167085 -244046 -199740 -40111 130996 264492 368087
41385 368087 433690 441564 389351 280683 140743 54704 106209 250283 328598 247131 75008
41374 75008 -54577 -74093 6579 145791 292208 404118 466430 470065 400360 284193 205002
41363 205002 213888 271125 328366 394414 452471 423351 323391 333245 540484 725319 617856
41352 617856 286769 30029 -57281 -123810 -201197 -129646 111688 321497 417222 548229
41342 548229 741547 759475 510755 304200 421135 669148 665174 393222 165599 139360
41332 139360 186033 193646 203356 235724 224255 155586 90022 27780 -79471 -185308 -182544 -80503
41320 -80503 8541 52859 111433 169975 140027 32714 -33345 -22106 -26752 -104622 -212848
41309 -212848 -325497 -455979 -534677 -435249 -183404 14705 30029 -35262 -28312 46916 94470
41298 94470 85883 46363 -34783 -169234 -297729 -348396 -331319 -299736 -259131 -196472 -161382
41287 -161382 -212851 -285532 -218814 24559 245951 219094 -4199 -115487 68945 356901
41277 356901 430865 271514 143772 175530 189809 46988 -80739 23521 239314 244913
41267 244913 -29937 -324062 -406069 -305243 -167030 -70458 -29400 -15460 58327 238904
41257 238904 407212 404961 288282 264032 351292 332200 115597 -81522 -55320 78598 79120
41246 79120 -69628 -196856 -226969 -218741 -184877 -72825 88978 198419 242041 302926 389565
41235 389565 399362 298068 212350 264357 388528 395574 191125 -127095 -377057 -449049 -355604
41224 -355604 -180709 -23075 36380 -15338 -80969 -27230 144473 256387 155332 -91850
41214 -91850 -287577 -337797 -290491 -196094 -84647 -55911 -201566 -413183 -462441 -332863 -272112
41203 -272112 -417443 -578450 -549291 -443626 -494736 -660029 -690541 -533238 -394190 -391041
41193 -391041 -391338 -267284 -105054 -47546 -75374 -68340 5855 74390 79881 37005 1580 35345
41181 35345 164467 330059 417484 374045 264628 181116 136782 84531 -212 -99348 -188184
41170 -188184 -246778 -248717 -183508 -98098 -83095 -185939 -334333 -372903 -209957 72069 284969
41159 284969 318948 221401 91002 -33755 -138153 -160594 -54180 110695 206358 215357 244729
41148 244729 342480 386939 232957 -70634 -291383 -254967 -26257 181077 238721 191748
41138 191748 128739 60353 -19102 -35893 80454 254202 335982 314794 310529 333025 228364
41127 228364 -48009 -278709 -253221 -55615 88017 134723 189402 233303 150013 9984
41117 9984 54819 325987 548424 507845 345042 313345 400616 393496 229913 77086 66288
41106 66288 124602 115121 21069 -80597 -157553 -248979 -360160 -397096 -263452 -17626 140861
41095 140861 98013 -16872 7072 176196 292892 242896 132993 86190 41498 -129344
41085 -129344 -395547 -581689 -571904 -412251 -241719 -184784 -263010 -349202 -271168 -31994 149274
41074 149274 107140 -47748 -104384 -71209 -139689 -351074 -496793 -402108 -151848 47675
41064 47675 114387 109733 102936 113811 138330 145752 78347 -78920 -242585 -291990 -182063 20557
41052 20557 189236 217929 99015 -52881 -97291 -15785 75849 83176 43370 39811 64523
41041 64523 37882 -55116 -119694 -64084 73239 139680 28329 -181967 -286159 -181884 9921
41030 9921 115289 140418 215485 336256 337181 167159 14151 40040 134563 88377 -92364
41019 -92364 -222011 -221296 -178458 -152206 -109119 -73524 -152551 -351142 -510269 -497337 -339647
41008 -339647 -124177 95443 233911 177997 -35322 -177430 -93924 91445 163528 101158
40998 101158 29065 -16953 -89117 -146825 -81565 75543 157497 105866 43326 48620 23285
40987 23285 -121994 -282892 -294612 -170501 -71354 -63712 -37605 99816 234403 136090 -249207
40976 -249207 -661626 -763975 -522978 -256532 -240572 -374857 -371217 -195038 -112753 -284682
40966 -284682 -518386 -529597 -300748 -52633 40865 -19063 -145562 -254259 -284210 -223943
40956 -223943 -111649 26259 184217 291900 221657 -33802 -282647 -341002 -244427 -144483
40946 -144483 -81084 778 81780 90632 63915 115951 260090 408488 519750 577534 467551
40935 467551 110867 -278799 -344415 -65301 180329 150240 55851 158527 329794 310362
40925 310362 193627 271178 495880 504197 194225 -92175 -69545 130808 253121 282270
40915 282270 306619 251820 17849 -260104 -348262 -237396 -104817 -14898 108718 237559
40905 237559 212116 11059 -151768 -87331 142327 328421 344591 218760 65937 -3891
40895 -3891 21903 41263 -22204 -86533 -26966 105126 130905 6394 -140279 -251395 -413550
40884 -413550 -628421 -728599 -637786 -512282 -475011 -403809 -172832 77427 150918 134201
40874 134201 248321 455552 514677 395643 328250 400827 405463 188893 -86582 -177759 -77480
40863 -77480 46857 96954 88782 51670 7942 80 53007 139966 211998 211512 75809 -171650
40851 -171650 -356240 -319006 -138536 -25430 -11148 47626 150011 109528 -86682 -160436
40841 -160436 53869 333013 392087 274812 193102 172918 125571 112483 231573 331247 152803
40830 152803 -259521 -568285 -578087 -418530 -269335 -145259 -23408 23624 -68170 -243801
40820 -243801 -401322 -485046 -468664 -335485 -111963 135017 336465 427261 382619 308948
40810 308948 386356 611874 728141 561926 299312 221497 297529 299511 215798 225702 303107
40799 303107 200240 -122907 -375732 -344753 -151960 -1328 75534 104414 47095 -64297
40789 -64297 -85047 14180 69228 -13313 -116330 -146241 -181070 -253000 -220306 -27314 126505
40778 126505 70950 -70808 -93896 -10700 48497 56934 24588 -108468 -314817 -403289 -307218
40767 -307218 -245299 -360476 -423349 -194277 125172 162580 -58733 -216262 -244594 -364356
40757 -364356 -582981 -606647 -323963 81 123027 95025 25218 -103051 -244240 -210476
40747 -210476 43536 282952 296754 142096 -34632 -198884 -316564 -271701 -62213 120700
40737 120700 163221 174273 211640 115286 -170049 -357962 -205033 61222 42230 -233400
40727 -233400 -380865 -262505 -126689 -127389 -106530 23562 48727 -174763 -403612 -346472 -128180
40716 -128180 -106094 -322613 -456275 -315494 -93630 -54358 -193997 -340348 -409014 -407137
40706 -407137 -308781 -101714 105727 184394 158750 138164 102541 -76056 -384623 -611859
40696 -611859 -605656 -457083 -350162 -336447 -340262 -293944 -184604 -48558 10015 -103764 -293138
40685 -293138 -284587 38216 409154 455798 152390 -166540 -220250 -45609 151014 236752
40675 236752 203807 115915 71730 134549 248053 285193 204453 91486 32603 19143 -5471
40664 -5471 -66345 -137860 -159768 -87999 25190 50410 -49403 -136415 -86724 18469 37968
40653 37968 29551 153960 349491 352668 94485 -158796 -168716 -30289 25599 -25947 -28957
40642 -28957 87041 225414 258451 133683 -106756 -328265 -390728 -317706 -306518 -478999
40632 -478999 -695795 -724295 -533661 -312201 -226009 -263070 -305177 -272950 -192261 -154823 -207748
40621 -207748 -282695 -280849 -219348 -205927 -263339 -296228 -261700 -237671 -262620 -247455 -134834
40610 -134834 -13059 36676 80629 193418 293262 261216 133473 30075 -27866 -88281 -136600
40599 -136600 -141706 -155591 -217723 -246188 -184637 -150462 -231830 -247354 13725 370047 399498
40588 399498 49489 -232728 -102918 238138 391915 309670 247906 334538 443249 438427
40578 438427 321679 144534 -52261 -206069 -268358 -273864 -277048 -252089 -162728 -81531 -101030
40567 -101030 -162802 -134274 -37601 -21887 -99340 -115764 -42389 -75384 -306854 -487504 -326903
40556 -326903 81857 360268 315065 97205 -88447 -203629 -269797 -257514 -180094 -137017
40546 -137017 -162897 -164563 -95666 -53526 -101119 -137239 -68744 25979 47845 54616 123364 173522
40534 173522 126413 109355 254422 401041 294744 25619 -57635 126176 288745 255091
40524 255091 200655 272143 303162 124870 -105066 -138896 -10397 81500 108376 177805 271628
40513 271628 264395 142163 -1482 -131044 -250691 -292141 -211332 -136822 -229402 -433317 -540687
40502 -540687 -463368 -281083 -78928 84566 103594 -78455 -315224 -377001 -216260 29458
40492 29458 254949 442465 546416 508818 371149 214136 30244 -185185 -297881 -198557
40482 -198557 -29264 -1709 -44905 89372 394106 580570 503181 312847 146045 -25347
40472 -25347 -158251 -85249 158198 255996 47242 -223723 -294303 -270120 -383078 -575680
40462 -575680 -606427 -431026 -211717 -37125 123460 243842 239381 120965 -11120 -92368
40452 -92368 -89124 49252 287377 442105 387095 239675 185235 212994 208939 202206 281973
40441 281973 346590 214460 -30228 -88984 107128 274734 197163 21627 -9937 80660
40431 80660 117479 97185 177563 389575 567174 582376 492716 409022 343068 259256 182411
40420 182411 153924 131075 39578 -83875 -113298 -25022 41800 -14356 -90814 -22687 172546
40409 172546 323974 350273 332425 346375 371820 394587 449737 505729 450410 280305 174524
40398 174524 262757 417661 409991 210359 10335 -27134 72749 180455 218319 219408 272514
40387 272514 406499 516199 441420 146889 -210862 -417798 -381789 -196508 -74740 -176728
40377 -176728 -420309 -512035 -283526 70644 256525 295559 414163 571216 468171 100821
40367 100821 -105290 88067 352525 319828 147365 174235 293165 146335 -209638 -346398
40357 -346398 -141018 67449 50289 -16755 59674 198308 286734 377517 473293 418360 186639
40346 186639 9929 33999 94033 22767 -57721 30681 207646 286886 270178 256392 208374
40335 208374 54751 -92733 -70664 62470 112162 56967 59583 194384 352088 410161 348318
40324 348318 211751 91868 108446 272395 401186 312300 71842 -88018 -69659 17944
40314 17944 67669 98712 157483 223631 246646 194284 65577 -72272 -97109 22608 141374
40303 141374 112701 4260 -7604 75640 69942 -98387 -269513 -273530 -129903 47767 216955
40292 216955 379472 482635 458389 326961 182387 81711 -10418 -168419 -405785 -623684
40282 -623684 -687420 -584824 -460316 -428007 -409749 -269053 -61942 4667 -125105 -265588
40272 -265588 -265065 -214484 -266614 -370945 -346233 -158053 32010 85536 20662 -92142 -240612
40261 -240612 -411585 -510373 -440280 -246081 -99543 -117834 -238502 -307686 -266874 -200982 -196769
40250 -196769 -217621 -177476 -103828 -126540 -270445 -350878 -180094 148641 310239 132762
40240 132762 -168968 -255492 -99997 -1384 -142383 -321311 -250920 19197 187501 145312
40230 145312 88871 157744 215862 121578 2550 59164 235930 319085 278398 267520 316615
40219 316615 283845 145298 81083 175075 248998 142128 -21883 -30252 84840 112503 -6253
40208 -6253 -121776 -133857 -109479 -108526 -68397 51385 140793 75632 -85291 -156623 -60759 94428
40196 94428 182646 209945 240514 233986 61670 -298062 -666556 -833193 -774402 -634141 -518861
40185 -518861 -408799 -271313 -149206 -88986 -71115 -76171 -145532 -297890 -444165 -473820 -389537
40174 -389537 -278708 -191287 -131309 -126803 -195950 -258899 -198833 -21508 146634 231272 276889
40163 276889 320985 316687 228136 99032 -35116 -205771 -405955 -518474 -456040 -313692
40153 -313692 -266298 -337055 -372300 -252684 -51531 36145 -117018 -446972 -730954 -770417
40143 -770417 -585308 -396644 -372876 -443447 -430374 -304858 -198975 -184453 -171913 -62903
40133 -62903 101081 197793 167082 46027 -90064 -178199 -193248 -160273 -127379 -116143 -116833
40122 -116833 -123949 -143056 -172069 -209404 -258515 -286059 -223087 -78300 2120 -104958 -314626
40111 -314626 -438556 -453386 -506870 -646630 -719637 -597341 -336702 -46242 234263 419304
40101 419304 331843 -54626 -463523 -596416 -477329 -339670 -266192 -159461 -14498 25397
40091 25397 -92611 -237970 -288245 -252940 -175414 -77064 -42337 -188780 -472610 -661503 -589907
40080 -589907 -342023 -118339 -22153 -35322 -97429 -138611 -121476 -103827 -171713 -279199 -276689
40069 -276689 -143867 -47356 -84929 -122497 -10972 159575 177770 4475 -200214 -293536
40059 -293536 -260165 -145817 -12241 59480 33390 -21905 -23437 5477 -6475 -39171 -7881
40048 -7881 92033 169911 156039 44980 -146921 -361801 -463582 -346222 -87753 104001
40038 104001 106611 -37249 -226844 -371873 -373696 -191861 43787 128795 35329 -68561 -100602
40027 -100602 -201739 -483195 -781121 -834523 -635946 -432555 -396562 -450459 -436199 -316044
40017 -316044 -151792 829 94662 66629 -88162 -245990 -248899 -80137 113842 191843
40007 191843 160727 131178 181035 306149 473017 650712 779126 765257 563539 248179
39997 248179 -36464 -207119 -297778 -375853 -436232 -416050 -300225 -156202 -43132 61514
39987 61514 194811 306454 300932 173601 23781 -76933 -142984 -182523 -155351 -74872 -36522
39976 -36522 -59749 -22701 119266 174271 -30438 -314581 -315478 13652 333312 399265 354989
39965 354989 419962 525271 459899 216429 -24808 -153841 -177523 -95477 66041 154466
39955 154466 31484 -210619 -360327 -393549 -470371 -623858 -668262 -482334 -207315 -65780
39945 -65780 -100373 -174211 -146858 5897 177779 211299 63060 -115438 -156124 -101903 -110373
39934 -110373 -157256 -50640 219701 385892 276104 75777 42320 132889 131399 16683
39924 16683 -48440 -30011 -58616 -147693 -133112 29612 127528 -15029 -257077 -314577 -128880
39913 -128880 85170 123042 -2558 -136422 -167961 -123554 -120333 -231497 -376455 -383820 -204507
39902 -204507 -446 59114 28304 81254 207950 194520 -39055 -256691 -197975 61088
39892 61088 206799 92622 -127714 -262542 -299160 -307024 -276443 -161666 -5648 80846 44523
39881 44523 -58432 -120263 -75352 31780 73433 -15421 -131071 -117689 24795 156445 213861
39870 213861 266594 334060 321326 218075 191587 350514 555153 617038 570978 570837 603083
39859 603083 508231 257375 20427 -52312 24977 151342 235871 217368 106871 15924 44496
39848 44496 149278 207823 176264 90723 -24968 -133968 -142348 -28449 55996 -11272 -89870
39837 -89870 40219 314347 456571 410416 414072 581051 674743 438116 -48095 -476373
39827 -476373 -639201 -541837 -330754 -208373 -288060 -445607 -435346 -212593 3689 40357
39817 40357 -34494 -92803 -125853 -145899 -109080 -55393 -124363 -292428 -303011 -30990 285028
39806 285028 380145 342360 407553 537235 495942 262892 74157 72772 162077 209269 183457
39795 183457 84481 -74630 -199602 -191614 -96809 -37918 -20059 42199 138079 178023 180265
39784 180265 255696 402115 488854 463085 408557 379239 329751 233802 125772 6638 -146338
39773 -146338 -262905 -228304 -75347 21710 -20138 -103603 -120264 -65844 37386 173633 245091
39762 245091 116249 -171106 -360222 -251724 70224 341987 372644 169512 -80478 -127178
39752 -127178 123626 465300 577631 391326 140594 27057 -1999 -71647 -153910 -159550
39742 -159550 -127846 -164532 -252897 -265929 -145340 31180 150893 166981 110516 42416 -22356
39731 -22356 -148265 -387865 -661193 -812525 -797705 -707997 -585962 -361811 -48565 144451
39721 144451 38281 -251181 -419662 -318780 -79805 86477 98344 5123 -111465 -187824
39711 -187824 -188154 -120296 -36631 3713 -20296 -83150 -143138 -171280 -145714 -44309 111444
39700 111444 218552 180750 54196 3336 60587 55947 -110017 -254156 -141925 165637
39690 165637 404628 486526 544802 627672 616650 490282 396427 372797 259499 19801 -111052
39679 -111052 21613 225866 270575 246054 347215 471851 365205 75398 -77768 15039
39669 15039 115411 33237 -122034 -181673 -162228 -138141 -77480 33815 68667 -51517 -153281
39658 -153281 -1687 342809 546099 405926 92363 -77794 -4598 142582 176047 86715
39648 86715 -9974 -28496 34948 138626 214159 195939 113476 111959 270287 431101 367613
39637 367613 125443 5609 139383 288125 208966 22982 -4139 101705 97781 -33905
39627 -33905 -47569 131968 251506 124281 -88811 -164041 -147147 -177409 -167233 58024 396740
39616 396740 545386 430728 300018 331608 402282 346103 226510 183530 166014 22153
39606 22153 -214732 -328231 -202875 47003 245919 320159 267443 104930 -77343 -115164
39596 -115164 71896 359439 530986 493548 333627 188924 120204 94833 46821 -48461
39586 -48461 -135503 -125598 1018 163038 264000 276733 222886 118116 -16052 -118791 -123706
39575 -123706 -25367 108668 184153 144532 28766 -40445 13702 110004 111872 36400 31171
39564 31171 119536 140685 28143 -33880 113151 323611 348488 201250 91346 69458 4686
39553 4686 -99323 -40599 262127 604364 741558 643047 439983 271114 229188 307253 352181
39542 352181 222372 19945 -7549 176249 341120 334312 251305 192572 103429 -22261 -31549
39531 -31549 121203 221215 107477 -55343 -33799 122696 217122 229638 252687 236832 79622
39520 79622 -118425 -156417 -38637 65808 112592 183418 248247 191173 50422 -29813 -75592
39509 -75592 -236570 -453084 -466246 -226906 -13435 -29571 -135467 -123438 -42671 -67958 -201728
39498 -201728 -292314 -259203 -154141 -59290 -29353 -76100 -134553 -112415 -30293 -25232 -157134
39487 -157134 -313746 -378798 -388825 -434710 -503874 -521071 -466528 -352534 -155272 117520 342968
39476 342968 384092 255553 97748 4820 -35017 -45301 -10729 54436 64834 -54675 -266553
39465 -266553 -429393 -411849 -204868 59401 202187 144635 -16299 -98773 -38853 12868
39455 12868 -137250 -449815 -650943 -575489 -396533 -363177 -401857 -221002 191331 461865
39445 461865 336802 37035 -72406 50115 212185 347466 491737 534848 340115 66915
39435 66915 37104 259694 405508 314845 214458 306479 432846 343728 83738 -107577
39425 -107577 -139197 -106506 -73922 -10161 86751 140204 78566 -97098 -314038 -471239 -528741
39414 -528741 -562498 -656717 -745554 -676974 -449457 -249380 -209883 -265770 -301590 -304130 -292029
39403 -292029 -227822 -100391 9820 45230 64551 135532 211566 195362 65606 -111891 -231944
39392 -231944 -179582 91077 462852 729237 796260 725568 580215 365367 139265 21779
39382 21779 41564 113922 198643 317834 402263 337152 209983 263547 505008 621233 428665
39371 428665 153365 79067 165133 240002 330006 505796 605582 453915 224648 235623 457844
39360 457844 573248 479206 379813 368824 291838 111617 66242 291515 551545 552325 340032
39349 340032 185813 204612 289831 354103 438284 573804 679218 653733 515909 395075
39339 395075 385539 442474 455113 402393 361408 350899 275286 91728 -71170 -73420 32173
39328 32173 81406 29611 -31650 -49525 -59595 -74317 -54809 1768 58202 120282 221910
39317 221910 336089 402366 426610 444923 408406 230381 -49454 -263512 -289301 -134426
39307 -134426 128315 395088 521877 425390 211524 83907 105617 156909 132203 58764
39297 58764 7073 5162 64547 174937 248014 184297 33080 -23917 103577 296760 377663
39286 377663 300424 157459 64258 72114 144134 195333 181429 128867 55816 -58777 -167201
39275 -167201 -132525 53080 146417 -49174 -342761 -364529 -97719 75470 -85350 -363327
39265 -363327 -435757 -309146 -224923 -298465 -446159 -567351 -620766 -582633 -477565 -404737 -409652
39254 -409652 -380861 -197798 65765 219549 210366 158517 140059 78921 -86349 -243485 -223194
39243 -223194 -32461 140310 169572 143214 202333 312008 319170 207723 129838 151317 148241
39232 148241 54594 30296 210312 432012 436138 244865 94229 51163 -23019 -138115 -113422
39221 -113422 76446 184113 60476 -95348 -33750 184989 315672 267881 133041 -11113
39211 -11113 -129368 -143264 -9621 147929 145630 -32474 -228899 -305648 -233291 -31375 243049
39200 243049 455765 473401 310871 117738 -3265 -93049 -222549 -337248 -275155 39251
39190 39251 438732 617097 445361 136552 3524 89423 172412 125432 85104 193790
39180 193790 347177 337583 141602 -78035 -192675 -199515 -138709 -49200 2316 -43101 -154346
39169 -154346 -229346 -210097 -142083 -118072 -181242 -274854 -290781 -196112 -90218 -77612 -115210
39158 -115210 -86723 -9365 -22037 -144895 -211456 -112743 37734 87801 69351 107812 206482
39147 206482 269788 287241 345599 460610 511784 378327 88981 -184854 -281029 -206280 -132710
39136 -132710 -196955 -334569 -387681 -334354 -289940 -308967 -339372 -360739 -382715 -302241 5419
39125 5419 397177 515227 248431 -92304 -206336 -175612 -216381 -294765 -251838 -132766 -98700
39114 -98700 -130662 -111609 -113183 -294502 -556820 -605563 -374083 -117374 -43022 -85922 -100312
39103 -100312 -58675 4884 66972 78612 18201 618 151592 359538 368519 162043 25542
39092 25542 142681 348483 400937 295312 159101 12845 -177175 -331435 -338219 -242530
39082 -242530 -195487 -254550 -363351 -481905 -593713 -610465 -428721 -113620 100073 60464
39072 60464 -119899 -204358 -110265 32407 89047 88416 126241 177211 124782 -27854 -110677
39061 -110677 -6591 191332 320931 347141 315729 217340 52655 -35433 113655 419641
39051 419641 596193 483556 214917 13455 -49382 -39197 -17267 6224 42632 104515 174279
39040 174279 183383 91769 -9206 26552 190634 290268 186090 -22687 -122853 -41477 95889
39029 95889 130930 32965 -101369 -161868 -116079 -14 141777 263552 290966 181039 33182
39018 33182 30141 202177 361267 365923 326956 399227 483911 357202 41242 -197603 -229776
39007 -229776 -204444 -258140 -311293 -257540 -156260 -101345 -56188 40166 134861 169061 202745
38996 202745 283168 301001 149582 -56249 -103641 28202 180602 275261 355255 371027 164294
38985 164294 -243353 -541767 -469910 -151160 64816 28564 -97808 -123105 -47299 33775
38975 33775 92149 146744 172610 127361 19095 -118704 -261886 -342006 -243909 36896 306463
38964 306463 374346 289000 227103 211723 140948 61537 150709 377798 456648 262604 52002
38953 52002 85684 247377 262881 126751 48955 94001 145670 163206 205965 235968 155480
38942 155480 36758 61230 206747 241138 80759 -75615 -53271 64271 111381 76316
38932 76316 44504 41292 42687 44012 34006 -12253 -58854 -26424 70544 121189 108539 169599
38920 169599 372643 548117 471384 164129 -100586 -94802 130731 325641 317464 171659
38910 171659 60228 26299 -20764 -91305 -63025 90274 192984 125020 25077 58812 134109
38899 134109 77241 -29544 36198 252495 373352 309968 210012 159860 95191 29993 81154
38888 81154 208478 211584 64469 -12588 97040 240768 273613 246858 220868 144390 31117
38877 31117 4361 49432 -21648 -233541 -343643 -220967 -61588 -61035 -136519 -153994 -160425
38866 -160425 -189124 -113960 64695 68287 -237721 -522980 -425112 -98332 22202 -155071
38856 -155071 -351704 -402804 -396367 -380944 -280426 -102054 55710 198448 382994 496877
38846 496877 363367 60593 -130879 -109244 -27055 21982 118191 269473 318642 204222
38836 204222 100591 171379 337187 406701 331314 231688 239255 374089 535091 586969 490392
38825 490392 326055 153662 -74562 -369126 -563404 -477448 -186332 37638 58715 14704
38815 14704 91761 280046 411939 378779 248017 160503 133201 24639 -246491 -521224
38805 -521224 -577588 -444422 -344835 -339366 -273484 -115565 -49787 -121828 -105924 90162 200297
38794 200297 40436 -117014 51287 372940 431289 206266 50796 112029 190774 165929
38784 165929 166482 265533 339166 314212 278958 269965 198113 64074 21679 141438 293385
38773 293385 332796 255084 135566 52003 65194 144201 148261 18744 -95766 -72032 -43945
38762 -43945 -174067 -323866 -245188 -3315 122145 98274 145938 307447 377340 292326 228980
38751 228980 251429 209303 69984 13445 89741 109608 3980 -23760 141545 305404 275092
38740 275092 136275 48155 -2194 -67368 -71399 51177 212003 299016 299944 213081 15722
38729 15722 -207680 -306818 -297027 -331531 -402095 -340343 -178539 -182962 -398959 -490035 -221543
38718 -221543 184378 390952 383780 339315 295072 202802 123102 124068 125813 42356 -57545 -88634
38706 -88634 -89626 -86764 -8129 121843 122007 -44215 -138973 -11008 154326 161249 126486 212075
38694 212075 276069 109525 -165103 -268227 -195019 -140721 -110620 44451 269483 334793
38684 334793 220987 156791 238794 296692 202228 68275 48151 125810 202461 254281 314850
38673 314850 388650 446565 458729 405477 291197 153158 40935 1409 66431 192767 242616
38662 242616 138774 21030 89551 290097 352681 183911 7420 38680 230460 428327
38652 428327 555511 537697 286108 -95583 -308648 -222794 -42379 21394 7382 -5053
38642 -5053 -75322 -174496 -75549 271532 527540 418293 150843 66846 134263 142642 163044
38631 163044 376575 607879 498630 86320 -215079 -197080 -37276 93401 224270 352796
38621 352796 369362 284448 245284 274746 251523 176841 199645 344343 458190 457015 399408
38610 399408 314430 181731 68599 55709 61481 -14344 -37275 172047 448839 439555 145639
38599 145639 -55759 20550 148124 119946 25856 -38885 -180746 -415870 -476333 -162369
38589 -162369 326916 646746 718703 680034 582446 379625 124549 -40373 -69595 -40488
38579 -40488 -6256 58758 160254 217428 141044 -30854 -115404 29146 292846 397511 245474
38568 245474 53853 42350 137679 143653 58170 13764 23821 23433 64538 217886 364295
38557 364295 352578 289030 372077 500107 383149 31159 -224279 -232975 -202055 -292234 -378626
38546 -378626 -339418 -274796 -279023 -253199 -107063 69589 177512 247622 290895 222218 63851
38535 63851 16231 180664 394088 474535 452360 423208 352602 188736 25015 -13932 47209
38524 47209 95080 93298 98475 177828 355558 561772 628094 449180 151549 -24611 -2584
38513 -2584 102765 188936 228195 181902 59474 8789 116108 185204 -16 -258721 -211304
38502 -211304 126352 342242 259140 148905 219722 317897 309643 349497 533460 644843 510414
38491 510414 299914 207506 126139 -83866 -270984 -232896 -54357 76046 175307 318842
38481 318842 395115 298462 182389 229076 328502 269886 98500 -3152 -44951 -143992 -230182
38470 -230182 -138226 83079 225426 228437 200391 197912 198679 218877 260667 236540 135813 137651
38458 137651 338344 503855 356965 2987 -207487 -159774 -37232 39727 138924 279979
38448 279979 343921 273369 169085 144479 220945 360616 472593 429297 223581 56330
38438 56330 107791 275068 306009 146226 -22328 -54404 16434 86337 78785 -45274 -235546
38427 -235546 -332459 -223371 5705 176540 231546 243941 276263 327027 359051 306221 135334
38416 135334 -41537 -43169 125886 255235 238534 203517 235284 221941 134489 181946 447982
38405 447982 638101 501048 277365 358575 664123 764386 536148 285049 233220 276906
38395 276906 294306 332198 391358 334062 130808 -39113 -45076 32599 82713 118801 169551
38384 169551 180206 113577 25887 -20498 -22699 1755 15777 -60333 -243770 -384323 -317844
38373 -317844 -112475 -434 -65966 -169363 -196405 -209042 -291523 -387033 -371573 -221198 -51179
38362 -51179 -7381 -113686 -222365 -179855 -53873 -69579 -266609 -388049 -233168 41143
38352 41143 144687 48004 -46844 -32142 19056 38514 45549 70509 139726 295771 510855
38341 510855 641440 581732 391845 193894 62333 91354 374082 777804 950450 736020
38331 736020 390013 198514 113655 -9833 -79547 26878 150299 93775 -19953 3365
38321 3365 26159 -157801 -337917 -157166 235278 327732 30930 -192933 -44222 253563
38311 253563 413974 455348 455517 350631 167841 106535 200594 215988 57980 -35534 101209
38300 101209 267881 234120 106092 113012 240035 320809 336990 392763 496698 561889 547997
38289 547997 461245 296798 106726 40405 188035 435508 574182 518415 348088 179775
38279 179775 66066 12037 37716 174612 375633 494790 470645 483494 733401 1065327
38269 1065327 1090086 750315 440292 406561 395470 161435 -54032 46790 230750 89196
38259 89196 -235011 -238808 124861 385907 302842 133042 100363 99164 53427 124351 391823
38248 391823 680854 841643 902079 865753 672271 419191 308480 329147 306915 271879
38238 271879 417770 694404 837098 814673 823520 818807 537018 60842 -150246 51471
38228 51471 262793 170848 -19287 -17997 115170 219835 332062 475058 489132 310763
38218 310763 121711 29772 -83161 -229819 -192906 77179 300626 310993 303306 426365
38208 426365 492893 340768 139632 81947 85923 48794 78779 229012 310831 220572 154328
38197 154328 257726 359204 288773 166584 141838 140527 98329 138913 293006 351270 224000
38186 224000 125575 173059 148627 -80984 -261794 -163766 33455 72599 30321 88413 183211
38175 183211 191262 190961 239430 159610 -144794 -414389 -371972 -107828 129212 276619 348552
38164 348552 257482 15947 -136557 -61898 65832 88825 118365 248298 337372 310857 347314
38153 347314 519024 588919 422900 250893 247425 220752 16673 -136430 -14505 204721
38143 204721 250771 157668 74573 7825 -423 189935 457100 419660 58166 -135596 83134
38132 83134 323741 262765 167509 298250 358462 53150 -320446 -382194 -291285 -316987 -271977
38121 -271977 45333 315524 223456 71411 231735 432915 272125 12920 138098 481558
38111 481558 558039 423205 442321 514020 317582 64470 188973 503411 472943 158820
38101 158820 79586 272070 303062 120414 83810 196867 104771 -143099 -98304 273143
38091 273143 501049 400144 278521 296613 269088 181130 274174 515682 562723 362368
38081 362368 265084 445415 682638 784837 798259 758850 628997 482466 417472 366168
38071 366168 291814 374072 660476 828222 695881 611273 850124 1042055 780151 383684
38061 383684 374794 587424 543913 359350 468023 761169 824646 757458 917879 1124589
38051 1124589 967676 652160 654628 809139 646151 360494 472303 800553 811259 728542
38041 728542 1173977 1891418 2010625 1476324 1040344 910719 621952 214070 272372 728411
38031 728411 866512 629403 680437 1052582 1027282 543147 406452 822790 1024671 708210
38021 708210 551482 884001 1099854 883374 809419 1180674 1408311 1118375 806207 834933
38011 834933 811362 501333 365691 647129 876465 776039 709478 805923 635221 179218
38001 179218 94039 569194 959689 950249 988305 1176973 949825 312917 151320 743967
37991 743967 1222453 1090871 994973 1339738 1486997 1090121 896645 1358649 1728166 1469695
37981 1469695 1326491 1960969 2699313 2700286 2309528 2191615 2126315 1728175 1404425 1541893
37971 1541893 1634179 1219105 803538 895506 1017045 639289 201268 245276 431117 344702
37961 344702 380993 886898 1325917 1215134 1002905 1152692 1294416 1121066 1117569 1548222
37951 1548222 1771087 1410321 1115713 1324154 1446768 1139426 1124931 1880098 2834226 3708183
37941 3708183 5095722 6738540 6965254 5131913 2967892 2110779 1946533 1356343 859261
37932 859261 1277383 1878676 1723692 1446662 1879877 2299036 1845328 1280054 1491964 1706590
37922 1706590 1056756 434518 825825 1343359 953760 560599 1205975 1847745 1252796
37913 1252796 457054 869762 1572438 1133625 477187 1121455 2132440 1831079 1071509
37904 1071509 1677267 2947737 2954540 2099158 2105015 2627186 2203777 1469435 2008095 3056270
37894 3056270 2784853 1804771 1924610 2572022 2071851 1262488 1999269 3272341 2848141
37885 2848141 1575663 1849902 3021564 2781008 1852076 2567014 3999529 3550199 2184984
37876 2184984 2773009 4404439 4049343 2686137 3645817 5965146 5979801 4517563 5429994
37867 5429994 7916089 7978161 6683775 8672571 13195054 15679300 17362702 23078373
37859 23078373 30129716 31200699 28206044 29834183 35106606 35383672 33926974 43858387
37851 43858387 63387926 78337694 98629504 160383920 266321859 350091661 338653105
37844 338653105 240965044 138257324 88345776 76001575 62182063 41928629 32662672
37837 32662672 35020614 34755201 29463374 28196434 31008743 29057576 21682316 16833294
37829 16833294 16284331 14280207 9770752 7757000 8864393 8337424 5466022 4512969
37821 4512969 6045852 5981407 3647584 2846487 4326516 4595346 2981731 2913503 5130706
37812 5130706 6142798 4757052 4074180 5420713 6005177 4558833 4027886 6233334 8574207
37803 8574207 9076040 10921173 18256796 29393968 37233854 36114347 26946718 16036100
37795 16036100 9391049 7808017 7571894 5893158 4005580 4004732 5045524 5054300 4325368
37786 4325368 4445536 4969053 4284030 2843673 2404517 2739769 2206255 1040281 974350
37777 974350 1930936 2177389 1564550 1585204 2304837 2234848 1307449 1046828 1620422 1571611
37767 1571611 732235 603037 1468385 1827335 1165869 745993 1123256 1293647 841040
37758 841040 659732 1033583 1129358 821722 1001323 1810954 2567050 3443787 5029843 6280093
37748 6280093 5421471 3033966 1651961 2030360 2419794 1894531 1624410 2206909 2474490
37739 2474490 1868376 1496235 1868058 1931872 1300020 1126772 1808309 2081984 1416474 1060413
37729 1060413 1661838 2043219 1451803 888871 1064959 1130636 599058 452106 1132669 1484996
37719 1484996 926684 642802 1347921 1896793 1464105 1081113 1574971 1971062 1459623
37710 1459623 1011617 1450331 1800316 1212179 709520 1302827 2104568 2054082 1818809 2233154
37700 2233154 2548988 2044693 1690176 2368214 3136464 3126512 3357613 4644042 5615348 5083485
37690 5083485 4435016 5162753 6049163 5689482 5707671 8008741 10999198 13034043 17840136
37681 17840136 30357981 46789251 55047264 47987894 31873958 18545243 12698730
37674 12698730 10553754 8152090 5905950 5349962 5797356 5729927 5111022 4780395 4776163
37665 4776163 4449722 3644617 2886447 2598522 2657398 2699351 2565795 2363373 2206637 2052870
37655 2052870 1835261 1617822 1484591 1393223 1293397 1255921 1314757 1349225 1307977 1336432 1474935
37644 1474935 1500213 1319226 1207690 1347564 1465559 1301943 1095849 1176979 1397470 1428230
37634 1428230 1320733 1311047 1360086 1347703 1407938 1599771 1590527 1175794 755218 742765 870904
37623 870904 678190 326109 275844 477029 561359 553158 689584 802380 600790 338097
37613 338097 465498 818539 871535 619181 473316 449004 210963 -181386 -316692 -151024
37603 -151024 -202 99723 353120 633083 636477 513707 660038 978068 1036076 853271
37593 853271 820576 948573 927858 838618 1036908 1408596 1514549 1424390 1616409 2093017
37583 2093017 2408705 2536626 2845804 3245018 3303682 3269828 3904822 5061906 5476552 4428490
37573 4428490 2740901 1622424 1274159 1175870 1063472 989324 890536 681779 491642 425798
37563 425798 383218 352211 510619 805649 870716 615346 448972 632572 849861 746348
37553 746348 489202 439119 601689 744911 793005 808095 799239 774345 783633 775956 644788
37542 644788 489441 528868 697877 695716 512929 489814 720922 839479 593235 234642
37532 234642 107499 194357 300683 372846 415235 371915 282717 303280 425715 443081 305057
37521 305057 219891 293567 370174 342220 313954 345767 340362 287553 319697 430951 448515
37510 448515 366490 397520 620021 882856 1097787 1285401 1316205 1010749 544339 326683
37500 326683 412649 475387 431442 577717 957150 1121404 794764 331014 206662 412831
37490 412831 627387 681706 600123 444357 343536 449862 701336 849744 812229 728706
37480 728706 628231 390245 115668 153261 621284 1230666 1673887 1857085 1721848 1264827
37470 1264827 795686 710145 910577 922708 665070 551340 702681 687387 294675 -46979
37460 -46979 28053 257382 280617 225284 330781 450849 404776 426398 766836 1167605 1207737
37449 1207737 922292 650527 517130 470257 576889 839492 924557 516432 -183757 -676002
37439 -676002 -751840 -559556 -254346 75960 277708 257825 154888 135218 151998 131395
37429 131395 201829 462168 708604 699869 545426 524249 640742 668553 554825 487625 583902
37418 583902 740419 798078 709667 567475 545236 732738 971244 989950 774501 632300
37408 632300 797971 1139410 1363513 1371791 1307080 1344420 1506686 1669602 1817172 2289324
37398 2289324 3455188 4926698 5524602 4549078 2791698 1640148 1391978 1230102 735582
37389 735582 436392 693533 1023943 952705 729782 708950 717658 562320 512507 724425
37379 724425 772572 346472 -114188 -83686 230305 337684 281904 366813 472590 312922
37369 312922 58572 67555 256250 319182 306556 420948 518599 385648 243164 403400
37359 403400 678424 695875 541235 512535 508367 269467 -18554 9140 242863 320827 287983
37348 287983 416751 595828 542842 408613 497926 604716 347940 -23665 53078 469319
37338 469319 595098 353378 292939 566165 700407 523836 479382 768451 947301 704569
37328 704569 375719 319361 355709 208318 19040 32410 147815 144213 61328 61715 139964
37317 139964 190562 181784 132410 91450 178320 434358 662334 666260 571241 598414 648864
37306 648864 506030 320089 404052 635574 604279 316050 169158 219058 92350 -273853
37296 -273853 -439410 -190625 123874 213998 255337 413516 482135 311092 147234 220822
37286 220822 370790 378486 322112 318324 252216 56583 -42107 151981 473553 629794 552210
37275 552210 339408 81462 -104604 -98304 39359 130914 185902 350019 528245 444018
37265 444018 146140 27254 208474 349461 248869 177089 360472 562052 491070 275684
37255 275684 200883 264312 299029 289888 286356 220204 62324 -36464 27474 138034 181466
37244 181466 220588 299637 325285 288025 328241 431596 361854 75685 -109052 24713 256504
37233 256504 286963 165090 116897 186898 283714 371812 410197 300426 74288 -68021 -50952
37222 -50952 -30219 -87983 -92086 10830 64242 17072 49551 203318 217466 -45297 -323440
37211 -323440 -348057 -214539 -117308 -3715 238152 507083 675912 821790 1020344 1132851
37201 1132851 1035805 849215 724591 628207 520788 491635 523591 422069 192465 156406
37191 156406 423973 592003 313695 -127095 -204231 112205 407774 458405 421254 468446
37181 468446 569632 624726 576398 417579 245278 229503 405815 618106 756864 868416
37171 868416 935923 806118 480626 221955 199228 281838 348042 508898 826370 1102687
37161 1102687 1181102 1184499 1231548 1197044 983232 736874 562033 331778 38480 -14014
37151 -14014 323870 719737 832826 797964 883606 993464 917328 784012 818554 895177 787768
37140 787768 651537 783184 1067270 1130017 926806 738480 683479 652427 636379 709018
37130 709018 757101 622639 443092 466539 600153 533775 260114 85637 153309 314143
37120 314143 437833 499160 403281 97403 -173769 -103651 193456 311160 165798 90163
37110 90163 271939 498241 562402 553041 584492 565239 423435 293986 280398 254361 100974
37099 100974 -28717 56953 262993 372341 448012 765872 1339930 1826893 2002845 2026561
37089 2026561 2056955 1973457 1807764 2053841 2982424 4053898 4963070 6992715 11738162
37080 11738162 17945968 21287591 18777955 12476302 7171326 5034616 4396276 3377700
37072 3377700 2328845 2147766 2389923 2303757 2223696 2606760 2819852 2180122 1294069 1101260
37062 1101260 1337589 1176987 739551 705465 961516 888935 597598 660092 933105 824188
37052 824188 482735 563350 980593 1036513 681449 546453 764341 813234 541538 358558
37042 358558 379876 313379 197702 340234 543190 328052 -90495 -27997 464376 622654
37032 622654 263589 34396 229197 368798 189876 89653 285410 411097 275477 222134
37022 222134 417719 521136 362074 264627 425900 608078 661531 734600 807977 652902
37012 652902 371163 335870 522724 564125 481108 621320 868284 736610 299531 166042
37002 166042 455971 661065 605247 649112 858318 911374 929784 1390889 2067754 2112932
36992 2112932 1419503 837654 775444 677457 224954 -63560 129624 338293 251191 247151
36982 247151 519595 635055 434568 410241 714318 769071 343190 26965 142116 189812
36972 189812 -97026 -190054 177246 420360 178601 -29508 161243 286817 39555 -85084
36962 -85084 225198 471438 334635 266630 472669 402251 -87394 -213439 365961 838284
36952 838284 647977 414361 634262 726934 274799 -39079 296976 642784 469885 342722
36942 342722 650004 701394 154347 -69186 545106 976219 481419 31848 536540 1158822
36932 1158822 939743 575129 917816 1240080 772645 438579 1132744 1807134 1330308
36923 1330308 724406 1341606 2329436 2265175 1805164 2211536 2766981 2322670 1889026 2874281
36913 2874281 4341539 4973797 5928907 8403877 10403563 9830081 8666925 9634789 11049685
36904 11049685 10401410 10495633 15201253 21643632 25922855 35188677 61107344 97611708
36896 97611708 118086191 103980840 67800208 37701822 25677490 22032973 16515593
36889 16515593 10863138 9538595 10399114 9702782 8533892 9053098 9592430 7923743 5509842
36880 5509842 4678165 4626961 3536818 2066965 1758409 2098343 1846692 1466127 1852970
36871 1852970 2266975 1699301 871630 902927 1296058 1056357 568974 645319 857158 465822
36861 465822 -38247 131801 564314 525282 374770 721574 1095646 836734 423754 567546
36851 567546 829099 493666 4112 133247 473168 181184 -397459 -296066 371547 672693
36841 672693 451544 336368 435225 296059 -17985 1077 281790 304021 146113 365245
36831 365245 902162 1095707 779680 462453 410117 388124 323198 427913 634954 634839 503158
36820 503158 614632 925643 998231 752212 565136 596900 605077 468682 356295 346578 369034
36809 369034 503236 854905 1181493 1140480 869196 815373 1021183 1086259 856280 667283
36799 667283 842042 1323207 1825230 2031065 1710584 991634 412283 346754 515434 434562
36789 434562 149486 56387 185261 215234 101134 118632 313094 434985 424892 459247
36779 459247 509701 364210 112141 99799 342253 468815 334480 209660 262168 318127
36769 318127 267314 259304 340410 311247 116850 -3303 75851 169262 162532 225561 447809
36758 447809 596490 468055 206146 56595 46635 98072 225359 421689 544320 497656
36748 497656 372728 271481 166660 57401 73037 277412 525642 639588 591860 441371
36738 441371 255920 169134 311014 578573 670827 470515 210936 146770 243818 329931
36728 329931 373902 446091 538104 592315 625537 690687 781667 862502 909704 872276 713620
36717 713620 551152 591293 838491 1066271 1226366 1663036 2625648 3675442 3952192 3137503
36707 3137503 1887811 1122184 1052008 1151866 981812 689051 605064 683035 638065 467999
36697 467999 448650 627600 711775 565978 458651 599392 747244 577787 203529 -13851
36687 -13851 -7765 -2265 -63147 -30369 121612 213880 197485 243734 420186 546734 478545
36676 478545 315422 227796 243597 284769 277369 185290 55546 16748 96850 108349 -96823
36665 -96823 -346019 -371979 -240115 -232264 -347286 -293776 -11776 191700 137683 39413 115418
36654 115418 267715 319544 269907 138916 -130274 -428013 -463473 -219709 -94998 -321144
36644 -321144 -570983 -474878 -208859 -156120 -251542 -156746 80638 76908 -222480 -437156 -363090
36633 -363090 -229139 -228544 -215735 -56696 71271 -31107 -248075 -330158 -232731 -84862 20382
36622 20382 31538 -113797 -362882 -487998 -333799 -41051 131291 124359 66905 31774 -8729
36611 -8729 -30072 42937 167886 190375 69708 -37784 9744 157182 267900 327696 412224
36600 412224 500485 468541 295829 156253 225072 463857 678866 745689 690480 590774 508536
36589 508536 509947 632643 820611 1004156 1248850 1667466 2136040 2284761 1908288 1250626
36579 1250626 721979 436583 209655 -73277 -308306 -378606 -298840 -124924 101949 278954
36569 278954 278986 132172 25225 44675 52622 -93504 -312307 -393096 -241774 54631 344124
36558 344124 512870 525887 436145 329786 242173 171854 159381 249256 373836 405931 344966
36547 344966 301980 275752 139784 -77520 -125540 108560 374437 388842 221578 126951
36537 126951 140018 109264 22938 -263 3309 -123266 -332711 -384081 -225293 -80913 -83878
36526 -83878 -99464 -25485 8052 -98416 -191893 -106992 56811 100868 25938 -28945 -30826
36515 -30826 -56061 -141981 -286518 -496214 -695157 -701346 -442490 -84283 188113 370340
36505 370340 475927 372404 11435 -345348 -408795 -251510 -138943 -96507 28815 172420
36495 172420 104891 -133290 -236316 -117142 -13894 -32502 31342 266721 418435 308116
36485 308116 164129 257828 465095 483081 286776 73769 -89486 -257934 -351304 -226687
36475 -226687 18847 98841 -80234 -301448 -336870 -190621 -7783 112255 164674 201489
36465 201489 278672 387200 448102 419081 354875 310845 268197 222744 241294 328864 347704
36454 347704 195731 -28949 -173648 -244371 -328555 -404411 -398947 -355507 -361066 -367209 -262542
36443 -262542 -70532 96651 216029 300282 247561 -21023 -321794 -362201 -128381 124539
36433 124539 265891 401545 564131 591313 417783 221938 140476 72063 -75341 -167335
36423 -167335 -78744 38013 -39337 -246288 -322245 -189808 -15778 76935 136068 199212 190717
36412 190717 79800 -5448 66578 239072 334553 285658 204781 206495 236778 150870 -63741
36401 -63741 -242880 -265504 -223664 -272098 -369942 -318333 -53081 252127 422625 480210 507527
36390 507527 434834 125653 -348789 -676642 -617680 -279712 -3487 15180 -88482 -72577
36380 -72577 78859 159259 58265 -77344 -74852 7717 -4074 -116037 -168627 -100736 -39768
36369 -39768 -102003 -240562 -337730 -344910 -287689 -210462 -146387 -88263 1583 94381 66347 -121987
36357 -121987 -284471 -218042 -18375 19491 -174872 -347787 -307579 -188581 -213583 -381211
36347 -381211 -537119 -609653 -619067 -562161 -436099 -296157 -167338 16382 266869 428719
36337 428719 348584 89875 -149512 -274785 -329510 -353713 -336624 -275176 -170529 -2499
36327 -2499 198631 307382 235521 65750 -43501 -38366 34997 143358 258884 305234 246860
36316 246860 183885 219532 276574 201558 27712 -36740 103366 312695 433693 464514 465222
36305 465222 420721 303751 193732 213510 360417 486415 472128 376118 364872 494584
36295 494584 617169 554878 328787 119405 14409 -67137 -164509 -156661 28870 226208
36285 226208 223710 64752 -31930 -9066 -23020 -151298 -254414 -203263 -78550 -32932 -67836
36274 -67836 -68616 1915 58916 28321 -54668 -85291 11482 217756 433504 554278 549302 459722
36262 459722 333464 191220 51778 -47338 -70964 -20796 44152 23793 -138022 -352826
36252 -352826 -427959 -276197 -49034 22079 -99255 -227070 -200851 -63451 42166 70722
36242 70722 104123 222150 402696 547444 579372 515174 448139 452402 508249 540008 521073
36231 521073 505969 540193 562659 442440 141700 -175764 -263002 -58700 212313 285398
36221 285398 173728 129193 279379 439056 355264 31247 -301582 -464348 -465253 -393605 -307753
36210 -307753 -240949 -220246 -233664 -219089 -118044 57424 203286 184355 -28629 -278954
36200 -278954 -358936 -249845 -137186 -148799 -193588 -139029 -28852 5134 -37548 -42825 29607
36189 29607 113445 160671 174882 155480 135636 230135 489509 733579 704943 395180 54164
36178 54164 -136048 -216764 -254541 -198673 -33936 106621 121403 96074 131839 138949 -13611
36167 -13611 -218616 -219393 11985 182289 45683 -273263 -440892 -317204 -67208 98399
36157 98399 148547 159380 147227 87454 33720 75021 169866 153948 -39175 -270217 -369489
36146 -369489 -324982 -219320 -79002 94236 211293 164729 1467 -99306 -39174 103698
36136 103698 206249 235253 221738 182385 115926 34391 -38827 -81350 -70457 5685 122893
36125 122893 217145 212117 68689 -159645 -335195 -362564 -305523 -296621 -328247 -254339 -38164
36114 -38164 144093 138540 25920 -24987 -12695 -64016 -205559 -321236 -313203 -200872 -88920
36103 -88920 -102302 -280440 -472081 -451744 -225904 -70378 -142757 -246118 -160654 -7578
36093 -7578 -17618 -111549 -47955 125683 148326 24126 27382 207950 293307 174753 104623
36082 104623 250414 398100 306638 70371 -91094 -157289 -201095 -185350 -101330 -114345 -319680
36071 -319680 -506489 -415360 -120231 78615 57114 -53293 -125299 -168803 -226517 -296422 -354616
36060 -354616 -361423 -279567 -144703 -40449 42427 197895 399502 466968 330408 159542
36050 159542 118907 167905 222920 318990 453828 472404 300607 111619 55203 7799 -174586
36039 -174586 -343535 -287407 -126012 -152529 -363306 -463304 -310184 -61991 116375 227161
36029 227161 294509 273772 151822 -17445 -178455 -258820 -171787 18510 68530 -108275
36019 -108275 -242176 -111513 38325 -146693 -495669 -511769 -165152 36734 -143236 -316675
36009 -316675 -131544 186308 271047 206828 283959 437613 361900 51400 -165687 -105590
35999 -105590 73271 157485 109233 -15934 -170774 -286173 -287053 -179730 -35227 101839
35989 101839 201969 203212 100838 41235 176923 435736 574481 475166 259747 84941
35979 84941 -45901 -198621 -337537 -347100 -198023 -4469 102943 107668 78864 56532 30372
35968 30372 17004 62383 134651 116960 -11612 -79148 70087 332056 461180 401192 322965
35957 322965 325164 292526 125276 -64196 -111522 -40575 -4151 -51863 -89813 -43762 55085
35946 55085 154761 260305 385326 474408 437455 281752 167132 251417 466058 538819 307016
35935 307016 -71811 -314063 -337937 -276894 -239714 -224020 -234556 -301982 -370045 -328620 -184625
35924 -184625 -50638 46766 172900 279622 204902 -48430 -236883 -198221 -75915 -79933
35914 -79933 -171208 -155219 8479 167191 209261 197372 263316 444528 623930 614196 349640
35903 349640 2445 -172166 -116462 2819 46304 33623 -4410 -127364 -351690 -563509
35893 -563509 -663178 -671326 -609958 -426482 -141374 75371 105887 42948 28322 57277 69415
35882 69415 104304 215107 329726 347180 293363 256330 246520 222508 156108 -14228 -353868
35871 -353868 -751472 -935942 -807840 -577327 -426623 -254475 40516 267211 233822 130173
35861 130173 247578 452131 353095 -56361 -358756 -343331 -254934 -303948 -331207 -165598
35851 -165598 17527 -33740 -242535 -335368 -238846 -104262 -23661 58688 177384 262688 252405
35840 252405 194736 207529 344168 490493 441112 159763 -89198 -19020 286761 442413
35830 442413 243721 -110960 -337493 -392271 -373496 -298912 -158446 -54634 -100006 -233418
35820 -233418 -285503 -195153 -61182 -16868 -119796 -302119 -374386 -176501 199998 447601
35810 447601 390596 183512 62027 37976 -2402 -34340 40427 135349 51893 -169928 -228597
35799 -228597 8135 258818 187168 -127009 -287767 -117941 116858 82098 -191260 -380803
35789 -380803 -293755 -50681 135512 195062 165648 74568 -36238 -78647 -38069 -40008 -164833
35778 -164833 -279791 -218098 -53100 8968 -30097 34794 251729 407801 362301 245470
35768 245470 195966 116443 -123191 -398134 -458513 -265375 -13140 135947 183061 186896 162109
35757 162109 86466 -61322 -246739 -339486 -229152 -26023 7779 -172747 -272170 -67390
35747 -67390 225556 240248 -207 -124074 42027 263737 280834 133062 4522 -38747
35737 -38747 -21397 67368 224434 355776 369434 284405 173386 67943 -21496 -74337 -106820
35726 -106820 -164725 -216104 -154957 16727 122809 37324 -112221 -95291 116315 317933
35716 317933 326486 153751 -70577 -241688 -321671 -325605 -313417 -349246 -426911 -456456 -354168
35705 -354168 -139881 73167 187330 207538 208693 228579 231272 186487 125505 68211 -43859
35694 -43859 -244264 -410584 -378169 -199637 -134971 -306022 -499061 -437786 -149449 104188
35684 104188 204187 291473 489609 687776 691559 484103 238706 127047 191714 362990
35674 362990 517970 540081 397311 177899 10128 -58977 -77822 -92789 -84837 -22077 60702
35663 60702 78781 -2940 -119523 -180536 -177901 -177992 -206693 -204895 -136996 -81190 -126324 -208700
35651 -208700 -164157 36533 208307 164336 -67812 -303397 -406201 -368511 -251409 -137292
35641 -137292 -105561 -171689 -269935 -344827 -396589 -374715 -148392 264990 546936 395801 -19459
35630 -19459 -190903 74460 388158 306958 -101377 -422464 -446944 -303208 -145177 9929
35620 9929 139777 159888 70425 -3684 28796 142679 278594 378473 348157 146603 -74553
35609 -74553 -93061 83252 205474 125889 -21033 -55143 8975 72827 143729 255847 315799
35598 315799 201698 -39735 -245758 -354585 -433219 -502933 -474543 -296540 -79043 -4752
35588 -4752 -128025 -295882 -302595 -137735 -26748 -157879 -420968 -535487 -410341 -223874
35578 -223874 -143579 -146345 -163061 -213640 -306353 -368799 -380858 -416969 -460220 -367988 -151136
35567 -151136 -63513 -219040 -342832 -171956 90304 63709 -193855 -257717 6969 265425
35557 265425 258771 156677 216555 397864 503215 465475 312287 52718 -216805 -285874
35547 -285874 -113170 24322 -122413 -413057 -526648 -423580 -348866 -423979 -489883 -387008
35537 -387008 -189781 -89676 -172491 -369694 -539085 -553935 -392447 -181885 -101968 -212839
35527 -212839 -403993 -513286 -468294 -327381 -221102 -238458 -333323 -357248 -215085 28997
35517 28997 218069 242383 99079 -132103 -333004 -405699 -324368 -117127 180351 489346
35507 489346 644294 522477 234149 32915 -8590 -63312 -212514 -251345 -3655 336407
35497 336407 414412 183546 -65080 -97828 47783 217497 293492 199209 -32278 -179278
35487 -179278 -37424 263322 370791 189867 4318 26699 91770 -24817 -217429 -235106
35477 -235106 -99273 -47983 -131566 -151185 -10766 130339 129605 69328 75514 100332 41986
35466 41986 -28753 54466 273335 382330 194930 -182145 -461326 -469484 -278985 -85343
35456 -85343 -25227 -105243 -229088 -256527 -90416 231090 539577 675681 622117 483724
35446 483724 371166 338599 384812 443098 401541 218953 4237 -107061 -134706 -199817 -299568
35435 -299568 -287673 -122822 14509 -51468 -259106 -403616 -375424 -211345 -2244 142299
35425 142299 127761 -1383 -49124 91929 271130 299168 244384 308264 469498 506773 382746
35414 382746 333428 480677 594536 407132 17 -303575 -335920 -207957 -94308 -54012
35404 -54012 -62406 -106721 -212061 -393088 -572140 -576349 -312688 54794 241795 195468 149066
35393 149066 254465 353463 262225 105178 141955 367970 528783 490134 366245 280873
35383 280873 210831 106595 2025 -45555 -10733 111527 260299 281055 89841 -163433
35373 -163433 -261836 -223400 -246778 -381033 -478927 -482384 -495544 -526667 -429623 -200301 -68388
35362 -68388 -155188 -279904 -261859 -178555 -141139 -54945 157061 299313 153467 -159823 -340639
35351 -340639 -318826 -247293 -202659 -170203 -227635 -441375 -643648 -615986 -444772 -377141 -367920
35340 -367920 -144979 254636 423099 182096 -125039 -137783 39725 102823 30409 13324
35330 13324 70522 37828 -129318 -288672 -329471 -275318 -175812 -39603 115270 236303 266711
35319 266711 169958 -25605 -182889 -149928 52414 224884 213630 46176 -170499 -345192
35309 -345192 -367034 -159195 154301 312508 243272 152224 194667 263135 226498 159749 164686
35298 164686 172266 121825 129751 251752 285782 85047 -126275 -68212 131479 149179 7424
35287 7424 -3346 130519 126540 -58215 -120156 65046 219458 120267 -78750 -162269 -164596
35276 -164596 -167186 -89102 86710 140640 -76047 -372949 -502057 -512204 -575262 -644988 -571665
35265 -571665 -419036 -370217 -390454 -260152 70694 384785 466277 311502 76732 -69566
35255 -69566 -70528 -31411 -73717 -102676 103172 487013 653004 401707 70991 59293 234153
35244 234153 184839 -96124 -221146 -46861 131354 68583 -133895 -304279 -414578 -414535 -195056
35233 -195056 144444 308542 233458 194378 333494 420237 292290 186710 329889 499919
35223 499919 373225 85764 33666 244832 371126 262194 140830 173958 239309 214660
35213 214660 180135 197560 157570 6893 -96289 -35237 36840 -76043 -278900 -291965 -41301
35202 -41301 244254 329671 215314 45738 -92251 -185558 -179243 11387 327966 516704
35192 516704 378052 42058 -149869 -63191 81642 45115 -114887 -193100 -153119 -108194
35182 -108194 -94888 -76984 -99994 -214163 -292782 -174190 36420 73442 -71280 -125508 16572
35171 16572 133641 74873 3853 63218 95758 -39560 -129805 78512 401183 427936 142311
35160 142311 -44092 97671 311067 273207 39553 -105089 -57102 40953 68466 92285
35150 92285 243869 503667 658439 511481 140833 -134483 -113661 44847 51978 -121556
35140 -121556 -243136 -163488 22027 166034 243779 284741 279021 223581 154832 78214 -47408
35129 -47408 -221436 -386054 -515126 -617198 -643548 -520914 -298057 -123224 -39181 58189
35119 58189 209010 290814 211487 61810 -26485 -60037 -115106 -188173 -226842 -234628 -239764 -214884
35107 -214884 -117434 30466 162460 220376 154420 -44630 -268921 -346669 -232524 -56436
35097 -56436 62924 138883 194762 164099 17357 -128107 -139711 -22772 144457 317008
35087 317008 432931 392992 215455 84299 108612 164083 118320 58922 103241 132488 -26454
35076 -26454 -254638 -266521 -45442 131984 115563 45811 44948 13227 -149464 -332348 -367794
35065 -367794 -254222 -108741 -11907 8523 -52524 -139883 -164934 -133273 -146774 -228848 -266915
35054 -266915 -190216 -74732 13412 146216 378040 560646 477390 145172 -149139 -152461
35044 -152461 79573 254655 171135 -69564 -202613 -113085 73807 209242 287520 332576
35034 332576 277905 106477 -20486 30638 131364 88941 -4260 98775 349739 406993
35024 406993 141793 -165460 -245968 -172992 -116626 -36253 165017 382187 443725 377872 340294
35013 340294 376071 425302 463892 473867 369430 112234 -180704 -374707 -465849 -482165 -383469
35002 -383469 -205302 -140970 -289018 -460716 -445176 -327402 -310436 -356427 -284982 -133030
34992 -133030 -106412 -211418 -243251 -148324 -99197 -163433 -185448 -89143 -40305 -175793 -373253
34981 -373253 -430124 -321593 -159867 -21709 74555 117585 117306 101580 58795 -36147 -133935
34970 -133935 -162292 -161212 -222565 -296745 -242639 -97415 -87848 -293554 -496636 -486573 -345673
34959 -345673 -284672 -325276 -308738 -148254 63705 171082 102929 -54334 -104137 62673
34949 62673 298984 342192 144849 -78919 -167163 -183205 -203855 -148881 33640 196075 190885
34938 190885 103518 99005 157626 161763 135697 170923 188984 30149 -239606 -350367 -189120
34927 -189120 61066 188791 186146 159222 168685 232686 356036 478052 492723 384409 254760
34916 254760 169050 76885 -59200 -161775 -147653 -62660 -22637 -69462 -155653 -228358 -259229
34905 -259229 -222702 -116559 1383 51109 15429 -40444 -45252 -7346 -10372 -109384 -239538
34894 -239538 -271806 -176433 -71791 -62871 -95432 -54412 49524 116881 156269 285553 503198
34883 503198 615045 479295 204284 -9764 -125794 -224382 -276811 -156800 105575 260467
34873 260467 124655 -175856 -358623 -316697 -184121 -103643 -65295 -7030 44989 30798 -8746
34862 -8746 38158 187027 300248 225418 -49797 -385584 -588502 -535282 -279767 -51544
34852 -51544 -57619 -244874 -350050 -240664 -93330 -125989 -263177 -252046 -66384 30253 -122334
34841 -122334 -324420 -278963 24900 336888 460741 384922 157167 -183387 -528554 -711753
34831 -711753 -670649 -517548 -399354 -352681 -326844 -272743 -169052 -33106 53469 8367 -114402
34820 -114402 -141924 -9076 125444 95808 -20438 -13363 147538 287754 315551 348412 484465
34809 484465 609690 553963 334833 118809 6717 -21117 4016 68676 109007 37644 -132193
34798 -132193 -272075 -277056 -165256 -28996 58168 75419 49228 34207 68341 137048 193462
34787 193462 196813 120660 -25931 -154807 -150029 -26211 45504 -31094 -99665 48437 344945
34776 344945 493928 353160 93432 -53299 -33971 88040 250168 343582 217787 -113649
34766 -113649 -384863 -357232 -120935 25952 -53165 -225496 -309546 -253173 -98396 89028
34756 89028 224835 246250 184730 134282 140319 187497 284826 458419 638092 657345 434007
34745 434007 91124 -169024 -278096 -326528 -393559 -432752 -367018 -244822 -210771 -301649 -358746
34734 -358746 -220745 48888 230479 219672 110226 5153 -111712 -267507 -399566 -450343
34724 -450343 -460369 -477714 -467308 -401029 -344796 -354892 -377764 -360226 -360917 -423538 -440593 -306449
34712 -306449 -121817 -55638 -64488 32017 219293 270853 99765 -99733 -148748 -126833 -196469
34701 -196469 -336651 -394617 -307510 -143358 19539 148489 228763 257274 238873 154216 -16016
34690 -16016 -208873 -301842 -262434 -193206 -174741 -150553 -40223 108729 168380 84085 -85451
34679 -85451 -237157 -278628 -170066 24578 171083 200409 164836 125512 65794 -20319 -42480
34668 -42480 77386 261559 349266 291257 180304 102688 50489 -10642 -59426 -31854 109218
34657 109218 315118 455215 428447 305452 294281 491475 717662 699634 398547 57077
34647 57077 -89079 -52206 -8055 -49440 -98977 -43800 114969 277418 374772 427650 461579
34636 461579 422304 237075 -63383 -354048 -539056 -595237 -509133 -284903 -38880 43258
34626 43258 -74600 -196671 -125765 95435 268509 297203 248131 201270 165955 134063 106739
34615 106739 63434 -8774 -59067 -30798 33763 37796 -27997 -85387 -105597 -132889 -161921 -120987
34603 -120987 -19260 18440 -58349 -113351 -12726 148497 137695 -121891 -454652 -621746
34593 -621746 -518860 -203061 159390 349521 222835 -134549 -440438 -486871 -336815 -189266
34583 -189266 -116320 -51674 1456 -71024 -276972 -423099 -361798 -219841 -218846 -331302 -305126
34572 -305126 -33844 280010 388312 273350 78722 -104397 -267076 -384755 -408546 -321134
34562 -321134 -137908 90709 232947 142971 -126506 -285139 -121604 211729 382533 288939
34552 288939 112778 3843 -70466 -133509 -83825 111758 272136 204269 -32328 -199691
34542 -199691 -176123 -63236 -21106 -94784 -206350 -250150 -187420 -84189 -49349 -113335 -196908
34531 -196908 -223461 -211086 -209301 -203678 -158352 -109908 -122955 -167733 -143987 -40585 26023 -25175
34519 -25175 -118939 -129588 -52320 3975 -33137 -124554 -182993 -152930 -35097 108161 169894
34508 169894 81518 -105556 -266739 -334351 -322889 -231883 -27442 239373 404197 368950
34498 368950 234098 151270 108849 -13029 -217676 -362893 -347751 -201323 2735 175167
34488 175167 161897 -143320 -581137 -802959 -665009 -393020 -245149 -175228 5905 272146
34478 272146 402614 301945 101141 -42389 -71665 30722 250242 466191 532952 475223
34468 475223 457296 515387 476982 230862 -60620 -152014 -44923 9764 -165813 -458080
34458 -458080 -607500 -515597 -337453 -261559 -269179 -194064 4243 153190 100518 -79349 -202477
34447 -202477 -209264 -174064 -157411 -171663 -233133 -317436 -314099 -163163 9702 40388 -39211
34436 -39211 -76679 -58501 -92967 -160299 -115267 35320 94550 -15302 -123447 -84064 25987
34425 25987 96177 171722 311647 431595 450916 454442 544989 656714 671516 602919 506407
34414 506407 334356 69101 -112258 -32544 185615 239031 48922 -153538 -152537 26511
34404 26511 241185 407953 496111 483206 391125 285647 197826 113709 58764 108237 276099
34393 276099 451458 484796 325343 79139 -61735 7549 180029 250827 179592 131614
34383 131614 203061 254958 149614 12590 60535 251704 333338 212510 60212 30918
34373 30918 87900 158358 268407 431648 550180 526112 374608 164507 -51073 -196184
34363 -196184 -189226 -76681 -41296 -183853 -377560 -426872 -304059 -142639 -51155 -26040 -25124
34352 -25124 -44159 -102927 -189722 -242227 -200586 -88117 -3964 11 -5576 69427 197216 267489
34340 267489 224709 99297 -51775 -156139 -140460 -33352 20083 -33967 -36555 123796 239712
34329 239712 38732 -342399 -461657 -197455 52237 -73822 -436210 -676630 -711330 -695169
34319 -695169 -674776 -556362 -337073 -132086 -422 86472 139283 152783 164615 194693 192004
34308 192004 142450 126607 158712 108072 -68057 -171162 -50575 96159 -21819 -325814
34298 -325814 -454955 -283794 -54811 26055 35722 100462 177766 196227 208848 267258 294110
34287 294110 213271 99216 84333 190789 329205 400215 355239 224416 101790 33839
34277 33839 -51522 -201145 -279283 -128671 143668 263460 183374 134880 230342 279220 127458
34266 127458 -65561 -74953 56045 134559 127286 149465 249168 383137 516851 588814 480993
34255 480993 198370 -26102 3481 167392 217257 154491 188458 368658 513732 516627 486293
34244 486293 531097 592409 565473 442504 276993 119093 18716 -10390 -32460 -85837 -68827
34233 -68827 116140 332409 324981 82651 -124580 -117396 -3642 74156 163372 333128 470425
34222 470425 430296 271399 167738 163212 165292 122159 67729 32288 23013 56461 122075 164198
34210 164198 171642 202941 246706 180594 -8224 -97473 88642 374804 440542 276717 181952
34199 181952 302080 443792 424198 350824 398382 505791 501106 405865 396565 512336 602250
34188 602250 566023 470245 384869 259529 47758 -155323 -208965 -110996 4690 31545 -24318
34177 -24318 -108389 -189020 -249953 -269439 -233298 -142917 -11218 114667 145775 35785 -128817
34166 -128817 -210240 -206760 -250914 -374769 -405125 -199197 117786 290270 238517 83299 -66947
34155 -66947 -176347 -180448 -43482 89509 33122 -114907 -48532 264249 447462 229989
34145 229989 -150086 -275970 -92180 138947 263579 328473 342791 250956 118690 80068
34135 80068 103982 56190 -19758 51081 238297 300334 170824 70925 140864 228880 183890
34124 183890 109160 145325 209127 152753 25755 -23882 13104 60947 142583 309500 460018
34113 460018 425172 213744 19248 -7037 115001 254985 268427 89325 -180898 -344720
34103 -344720 -351576 -365650 -485783 -538290 -330156 -4136 87753 -162068 -494826 -623459
34093 -623459 -511694 -294166 -94357 12552 -14211 -144105 -276215 -317212 -240191 -91538
34083 -91538 20404 -3748 -133184 -217617 -181644 -117645 -105097 -66525 62557 154562 71659
34072 71659 -81560 -111671 -58778 -109404 -240159 -236975 -69332 51771 38284 56747 204699
34061 204699 332331 316732 260949 263630 223034 53104 -110499 -120431 -57283 -55464 -55939 40713
34049 40713 120546 12857 -198249 -279223 -201820 -134502 -115700 -11630 176255 226678 13460
34038 13460 -299129 -486252 -528824 -535545 -531513 -464295 -345693 -251887 -198592 -116663 28711
34027 28711 152291 121984 -82903 -310092 -367718 -229919 -67853 -49349 -157077 -250398
34017 -250398 -250799 -188427 -103176 863 101058 140491 92042 -7197 -91478 -100844 140
34006 140 178837 317773 303331 138547 -70844 -227313 -291369 -253316 -138448 -35756 -35023
33995 -35023 -114983 -162682 -122528 -53828 -12826 40386 154363 265584 254613 112004 -28835
33984 -28835 -44107 47710 131188 124642 25358 -130449 -278196 -311064 -154900 103478 240968
33973 240968 117134 -177583 -442065 -568329 -559914 -432467 -218708 -25652 47259 30420
33963 30420 8576 -38148 -166255 -272121 -162365 149754 407164 427315 291350 165943
33953 165943 123670 203537 431942 672277 671636 411640 213096 312724 525622 533563 326293
33942 326293 116661 -14792 -108520 -95400 102964 320996 317579 160979 129471 243227
33932 243227 232147 7483 -171293 -101703 83890 172592 145900 65088 -80005 -252282
33922 -252282 -301081 -173589 -27181 -160 -36099 -49979 -77125 -122763 -66864 109483 190696
33911 190696 21195 -219833 -245374 -37254 200510 340090 371784 265424 29576 -167905
33901 -167905 -177540 -117951 -216401 -435763 -508604 -348184 -177800 -193289 -313433 -357900 -295332
33890 -295332 -198756 -85237 70979 229224 284631 166443 -90852 -340871 -401047 -211905
33880 -211905 74220 242243 253748 246688 295914 300344 158991 -50285 -151173 -61799 162230
33869 162230 414047 581738 558929 322216 8494 -171343 -136192 -1651 91974 160514
33859 160514 310709 528260 648870 576444 421041 334073 295165 189576 36243 -28080
33849 -28080 18912 47543 4652 1122 98172 181067 162693 157198 294435 481018 523980 414223
33837 414223 309593 287098 286939 271311 261231 222763 93771 -55143 -56274 104970 220783
33826 220783 119503 -115929 -271084 -262049 -187549 -161732 -177508 -148256 -48107 33418 10869
33815 10869 -55204 -34446 43449 -16404 -258446 -410803 -214293 186095 403935 323003 204823
33804 204823 272316 433430 497158 441705 338608 187293 -19304 -187095 -226386 -179076
33794 -179076 -123303 -45667 70911 135174 74809 -5988 31441 111938 30141 -222275 -402533
33783 -402533 -339494 -151780 -62463 -123315 -227241 -296263 -324302 -283464 -134770 54418 128467
33772 128467 36163 -83538 -84099 -9132 -646 -49093 19003 268323 502906 487587 242623
33761 242623 408 -91485 -97627 -129039 -185812 -221659 -263309 -367184 -496374 -534763 -433190
33750 -433190 -276387 -174422 -132538 -78315 5007 45054 -1974 -73464 -94452 -85590 -96087
33739 -96087 -88875 -12720 52230 -19238 -167608 -187155 -34330 93596 63621 -12660 -21982
33728 -21982 -57143 -198654 -285205 -144409 97900 205179 202670 267785 352305 263020 73917
33717 73917 73565 268006 321241 94497 -125498 -100793 1946 -48721 -163898 -163724 -134531
33706 -134531 -242916 -381483 -322376 -97261 80485 171504 280639 346667 194470 -107168
33696 -107168 -252612 -118428 86381 157050 139731 148912 154836 84679 -18679 -64377 -30954
33685 -30954 77685 285407 555548 742211 735428 597479 469970 396140 318717 215638
33675 215638 141645 126099 102080 -12553 -182581 -263681 -178843 -42636 -32345 -155197 -257096
33664 -257096 -276672 -338888 -511816 -617767 -443643 -51531 291314 446329 499752 549121
33654 549121 572724 535572 470322 399726 293595 153633 50203 30541 60231 84205 86911
33643 86911 81127 92455 148982 231650 262428 207345 147477 167184 228520 252903 251546 245675
33631 245675 145067 -110887 -356182 -364441 -186116 -81350 -115933 -91613 72140 174526
33621 174526 75880 -53554 -3359 164250 258911 244646 183018 50547 -172058 -351113
33611 -351113 -359506 -292034 -312293 -373828 -317978 -173508 -105212 -99598 26585 278690 404665
33600 404665 251532 -6142 -108079 -24089 81023 73932 -59838 -252686 -378586 -321897
33590 -321897 -116365 49136 46499 -28349 10441 190397 354516 361016 232150 100103 57016
33579 57016 81643 102726 108486 146615 198853 137072 -102435 -358448 -404840 -263959 -192630
33568 -192630 -314330 -445527 -391204 -243423 -212951 -281049 -235717 -17065 182453 183496 10807
33557 10807 -219219 -433534 -556094 -486546 -245627 -37163 -38961 -190825 -290605 -243115 -112673
33546 -112673 14794 100067 110488 35659 -55129 -75615 -52318 -97933 -240628 -367222 -359595
33535 -359595 -217521 -33611 86527 82004 -3483 -25520 100605 252003 231784 47257
33525 47257 -100807 -126145 -159218 -270028 -308437 -175430 -56313 -155530 -339532 -317980 -110812
33514 -110812 -39662 -245471 -497721 -557108 -474032 -404297 -349816 -253653 -186864 -243293 -344857
33503 -344857 -331659 -187907 -22059 125732 289997 419489 388014 194730 3654 -75560
33493 -75560 -120421 -223922 -297586 -185270 62642 184967 33328 -216166 -284550 -155599
33483 -155599 -65869 -130611 -163083 33378 339160 450915 263938 -53111 -321686 -495010
33473 -495010 -541512 -411359 -194166 -116776 -260066 -419075 -373234 -179825 -63987 -112762
33463 -112762 -221983 -278551 -257047 -185344 -138569 -212510 -374287 -405333 -159642 163172 205993
33452 205993 -67008 -287202 -163768 131408 215602 16857 -155318 -45862 226611 362519
33442 362519 260549 67900 -88058 -244431 -441453 -573870 -526242 -365155 -250095 -201721
33432 -201721 -119990 -13098 -15819 -136480 -173316 11646 278630 395240 328038 220375
33422 220375 164371 133325 91885 46849 6977 -16499 13986 125132 298755 499132 664827
33411 664827 665549 410342 54052 -84154 69279 189502 -15955 -385910 -544478 -437049
33401 -437049 -350761 -451807 -583489 -548035 -356063 -144935 -26903 -49146 -150174 -156940
33391 -156940 14353 183476 121684 -96090 -183402 -60463 81702 126055 135720 90029 -137746
33380 -137746 -439908 -467003 -136304 178532 183445 72831 128097 214888 56866 -214976
33370 -214976 -230592 5629 117100 -25400 -110882 74968 283944 180227 -168997 -409737
33360 -409737 -365591 -171296 -7871 97006 180226 201442 98243 -52728 -58072 129529
33350 129529 258752 52422 -384320 -633400 -496488 -236688 -166013 -224648 -181692 -50905
33340 -50905 -15249 -67190 -43710 45635 44345 -29291 -15539 34599 -100185 -369919 -439716
33329 -439716 -248247 -190796 -514464 -875060 -812504 -407268 -108100 -89513 -160241 -206006
33319 -206006 -326917 -532431 -651875 -620413 -570818 -557304 -445703 -187388 31300 56716
33309 56716 -7574 -7156 -11628 -190166 -502381 -706241 -660737 -479931 -369596 -400526 -465319
33298 -465319 -415037 -229575 -55372 -39307 -130426 -129508 41924 227297 245746 107409 -66990
33287 -66990 -225325 -350619 -347833 -149502 102587 170329 25020 -127722 -149126 -111997 -92946
33276 -92946 -17580 167160 329783 327109 230804 212154 280622 317524 316564 384772 499797 471472
33264 471472 219989 -60818 -122891 42733 221536 231362 97713 4946 101764 323221
33254 323221 418125 225038 -99187 -243409 -135635 -19031 -89899 -233360 -230909 -80275
33244 -80275 53459 101370 122193 129593 78386 11107 36993 135758 139757 -30278 -237005
33233 -237005 -304724 -234307 -172709 -235479 -416056 -615338 -709946 -633598 -432892 -216750 -40839
33222 -40839 115799 266811 388610 484232 583251 643923 556908 314457 84786 17305 36500
33211 36500 -50013 -267085 -429895 -404234 -277818 -198321 -143475 18175 273349 421971
33201 421971 339679 166780 132177 254860 347771 296626 190505 143271 124294 52026 -47657
33190 -47657 -84690 -40118 43618 153375 286211 392921 446969 513182 625726 662823 507617
33179 507617 286511 234559 317975 230866 -151450 -544950 -632191 -477952 -373343 -402440
33169 -402440 -399304 -268166 -98292 45961 216301 389571 386058 118948 -196220 -241447
33159 -241447 32796 359880 470403 349131 170380 80998 101114 170700 216836 198124
33149 198124 145767 146140 218344 228247 29153 -287887 -408062 -152651 260181 444422 295088
33138 295088 67603 16216 110332 163011 105198 26631 16035 63990 104736 89646 27125
33127 27125 -19214 8554 88722 141585 135814 125627 167086 247641 312338 307989 199247 11065
33115 11065 -140580 -146256 -45656 16118 -17059 -69527 -90086 -103445 -76683 80203 297035
33104 297035 322869 69985 -194368 -192846 -32184 -19610 -185947 -263184 -110183 106947
33094 106947 194234 151447 44793 -127369 -332493 -439032 -381841 -270850 -219531 -170036
33084 -170036 -12480 199059 284748 173405 -2521 -60666 33761 142207 114016 -39248
33074 -39248 -162916 -161097 -106859 -98141 -100805 -49699 -13841 -84538 -160090 -72660 73511 -44975
33062 -44975 -499106 -932519 -992284 -722740 -373760 -36488 300085 511968 468867 324445
33052 324445 366859 570023 584673 260114 -81408 -52244 294404 561403 522095 335819
33042 335819 246074 241373 124777 -157768 -408876 -443774 -350947 -358621 -479610 -469167 -199880
33031 -199880 91080 85417 -185810 -385614 -311495 -96858 48939 104698 146717 151663 49541
33020 49541 -91807 -93894 101269 328877 379671 232683 60412 14741 55722 20968 -159212
33009 -159212 -369302 -444509 -352086 -205108 -136600 -203590 -376742 -558707 -627342 -527359 -329648
32998 -329648 -161324 -79675 -48706 -21377 6600 18033 1566 -40812 -79386 -65241 10253
32987 10253 89233 120945 123403 117250 47566 -143219 -396241 -583824 -658549 -665219 -628696 -537804
32975 -537804 -426791 -352840 -292960 -187524 -88372 -116867 -249221 -303882 -202287 -86707
32965 -86707 -92521 -149872 -122845 -15993 82977 148293 167033 61254 -171941 -333313 -228007
32954 -228007 47005 207429 149854 37218 31178 129270 279979 461763 594568 553294
32944 553294 353860 181224 150069 170780 134888 92733 133952 207693 189767 52604 -130912
32933 -130912 -270403 -258517 -7210 386705 621045 497266 171665 -68743 -195109 -383491
32923 -383491 -627511 -685625 -466814 -209010 -143348 -184236 -116594 69291 221385 290665
32913 290665 342123 360546 261537 97120 50632 172528 282576 218822 60299 -830 74232
32902 74232 143448 86062 -63034 -175807 -157030 470 229439 424754 489430 387148
32892 387148 182008 24663 49978 240001 407685 370591 135625 -135982 -324752 -432305
32882 -432305 -473188 -408535 -243392 -91662 -52873 -81013 -62054 20188 81056 64400 -12938
32871 -12938 -120728 -226514 -263820 -192098 -89764 -81106 -150731 -141352 15818 173453 154733
32860 154733 -6627 -119225 -97687 -65728 -172013 -378493 -492304 -393469 -180881 -63002
32850 -63002 -122431 -238256 -253869 -159032 -53868 6710 34377 6104 -125705 -302265 -370074
32839 -370074 -285188 -189603 -198153 -220235 -118910 39114 57414 -99619 -264456 -332296 -395175
32828 -395175 -528631 -588634 -372915 64724 407454 412520 165791 -50260 -83354 -28037
32818 -28037 -29972 -76702 -57111 28166 42266 -81080 -224832 -254227 -197541 -159457 -140471
32807 -140471 -89436 -81783 -251792 -528248 -631220 -421680 -101727 53082 39870 64432
32797 64432 221588 406008 499472 480197 351205 124480 -89333 -128126 8038 107203
32787 107203 6302 -181688 -211960 -35614 128318 53543 -236537 -491309 -472184 -169070
32777 -169070 180794 288107 67047 -285876 -479330 -388327 -120104 142852 310681 402910
32767 402910 458683 468594 389434 216924 34742 -42609 2908 64067 49702 4951 14279
32756 14279 35270 -37807 -149387 -87933 214322 532401 612998 469460 276068 83886
32746 83886 -160676 -383149 -410466 -248955 -106181 -74918 -13820 153792 240328 70858
32736 70858 -201523 -271604 -84513 136584 208460 143946 25986 -86556 -132582 -90744 -44053
32725 -44053 -62170 -59302 57805 157483 43056 -168671 -126763 225108 500446 400484 116623
32714 116623 -11790 2272 -76852 -249133 -284844 -123877 45383 112366 174206 292197
32704 292197 357519 281026 131242 7540 -69269 -85568 -13099 88541 110694 89199 175386
32693 175386 343436 342989 82059 -143617 -13175 356580 537103 317056 -96262 -373725
32683 -373725 -371707 -147729 140972 307836 252299 70024 -42797 -23397 14336 -17038 -58052
32672 -58052 -30712 34644 77915 116554 182349 225172 179639 77910 -1392 -58277 -139460
32661 -139460 -204027 -146180 25144 143898 85539 -76190 -187590 -221464 -260192 -308557 -259334
32650 -259334 -82168 64437 -625 -253254 -488506 -553367 -477452 -375205 -301344 -236092
32640 -236092 -154444 -58059 40375 127422 189252 220134 224221 202566 152792 87719 36885 21112
32628 21112 36764 63456 73080 46899 18755 87425 324247 649485 854601 788266 496440
32617 496440 159460 -70260 -144179 -93287 -730 23431 -79429 -243120 -335578 -319680 -309814
32606 -309814 -422496 -602555 -669264 -539697 -327574 -177246 -79975 48432 166447 141674
32596 141674 -3256 -60931 53872 132071 -34249 -303965 -345237 -90258 187125 251045
32586 251045 152305 60937 52846 136772 308696 475696 477922 291649 80115 -38475 -115426
32575 -115426 -175269 -97098 150826 346423 297306 145442 152981 291651 299737 84296 -184602
32564 -184602 -346040 -373913 -263034 -52383 45109 -172539 -528925 -571825 -155778 324313
32554 324313 424729 168956 -84371 -104370 64695 277356 408878 376817 207545 52346
32544 52346 35056 126185 229323 302473 317855 212313 -11365 -219765 -292988 -262716 -220548
32533 -220548 -175702 -95593 1609 89021 178465 248450 237871 189850 246657 387075 354862
32522 354862 30495 -302903 -309591 -77645 41158 -34887 -83935 -47092 -145947 -449716 -676147
32511 -676147 -601801 -393825 -317492 -336794 -257695 -103748 -61895 -134421 -132454 -16614 20862
32500 20862 -114136 -231975 -142465 36184 35765 -170262 -328892 -269606 -126937 -118380 -233115
32489 -233115 -280323 -179928 -45058 23154 72907 188781 361718 530166 646339 645173
32479 645173 466809 190577 21332 29777 26124 -163911 -409100 -444297 -253813 -71514
32469 -71514 -34916 -62745 -81386 -142750 -256270 -305046 -222170 -92948 1855 94477 197876
32458 197876 220894 124831 26890 25697 44856 -19820 -105645 -79731 52440 178677 256250
32447 256250 315189 334979 263927 142613 82016 123238 216562 318130 404250 412525 284629
32436 284629 67478 -126592 -255011 -343285 -365936 -260405 -80632 -5127 -126186 -324151
32426 -324151 -422961 -398248 -351185 -328037 -260385 -77816 190644 438889 564815 530869 394919
32415 394919 287877 299554 355712 269882 -21231 -324899 -389733 -212628 -29802 4396
32405 4396 -19752 17458 58859 21380 9455 157967 333475 253416 -71724 -264202 -56275
32394 -56275 347628 535201 388713 165226 133348 269271 324142 131543 -170383 -246857
32384 -246857 59674 512920 742640 666635 490083 332027 108231 -176120 -306400 -177240
32374 -177240 5395 20342 -74131 -129448 -179222 -285285 -301529 -81485 211015 298725 205702
32363 205702 175758 250991 253475 152731 117773 187455 210603 162392 206236 356256 375903
32352 375903 135057 -185188 -360493 -359936 -217170 70574 384028 485569 346303 232106
32342 232106 300104 360241 229084 56621 51122 116889 58957 -52958 -47778 -11553 -125328
32331 -125328 -267264 -166846 100154 173650 -21317 -164080 -75234 18396 -96660 -282076
32321 -282076 -334768 -315952 -345084 -313010 -93405 137917 109631 -121344 -254705 -197860 -129090
32310 -129090 -124397 -44986 134193 192068 12912 -181446 -161167 -59677 -163951 -454244
$$ [...]
##END NTUPLES=NMR SPECTRUM
##END=
