##TITLE=31Pdec_SA_43.142(RM)
 CDCl3, 24 sc
 14.10.2019
##JCAMPDX= 6.0         $$ Bruker NMR JCAMP-DX V2.0
##DATA TYPE= NMR SPECTRUM
##DATA CLASS= NTUPLES
##ORIGIN= UXNMR, Bruker Analytische Messtechnik GmbH
##OWNER= root
$$ XWIN-NMR		Version 3.5
$$ Mon Oct 14 16:05:22 2019 Russian Standard Time (UT+4h)  she@DPX200
##.OBSERVE FREQUENCY= 81.013821
##.OBSERVE NUCLEUS= ^31P
##.ACQUISITION MODE= SIMULTANEOUS
##.ACQUISITION SCHEME= undefined
##.AVERAGES= 24
##.DIGITISER RES= 17
##SPECTROMETER/DATA SYSTEM= spect
##.PULSE SEQUENCE= zgpg30
##.SOLVENT NAME= D2O
##.SHIFT REFERENCE= (INTERNAL, D2O, 0, 182.463)
##AUDIT TRAIL= $$ (NUMBER, WHEN, WHO, WHERE, WHAT)
$$ ##TITLE= Audit trail, XWIN-NMR		Version 3.5
$$ ##JCAMPDX= 5.01
$$ ##ORIGIN= Bruker BioSpin GmbH
$$ ##OWNER= she
$$ F:/spectra/data/she/nmr/P31/1/pdata/1/auditp.txt
$$ ##AUDIT TRAIL=  $$ (NUMBER, WHEN, WHO, WHERE, WHAT)
(   1,<2019-10-14 16:03:07.20 +0400>,<she>,<DPX200>,
      <created by zg, POWCHK disabled, PULCHK disabled
       configuration hash MD5:
       00 E9 B6 7A A2 85 ED C7 34 08 36 98 17 FE 4E 26
       data hash MD5: 32K
       78 CA B2 0E AC 81 67 C3 7E CC 76 9F DD 1F DD AE>)
(   2,<2019-10-14 16:03:10.64 +0400>,<she>,<DPX200>,
      <Start of raw data processing
       efp BC_mod = 2 LB = 1 FT_mod = 6 PKNL = 1 PHC0 = -268.8127 PHC1 = -227.5996 SI = 64K 
       data hash MD5: 64K
       1F 32 06 41 0F 83 73 BE C1 FE A9 61 36 FA 75 44>)
(   3,<2019-10-14 16:03:24.85 +0400>,<she>,<DPX200>,
      <pk PHC0 = 18.04258 PHC1 = 0 
       data hash MD5: 64K
       34 BF A0 45 9D E1 C9 E6 FF 84 FD E4 FD C2 9D B7>)
(   4,<2019-10-14 16:03:35.35 +0400>,<she>,<DPX200>,
      <abs ABSG = 5 
       data hash MD5: 64K
       BA 20 7D 08 45 AF 07 E9 5E 90 C6 09 ED 09 CD E7>)
$$ ##END=
$$ 
$$ hash MD5
$$ DD B1 C7 EB A1 35 E3 0B C5 34 8F C7 E2 D9 63 6F
##$RELAX= 
##$RELAX= 
##$RELAX= 
##$RELAX= 
##$RELAX= 
##$RELAX= 
##$RELAX= 
##$RELAX= 
$$ Bruker specific parameters
$$ --------------------------
##$DU= <F:/spectra>
##$EXPNO= 1
##$NAME= <P31>
##$PROCNO= 1
##$TYPE= <nmr>
##$USER= <she>
##$AMP= (0..31)
100 100 100 100 100 100 100 100 100 100 100 100 100 100 100 100 100 100 
100 100 100 100 100 100 100 100 100 100 100 100 100 100 
##$AQSEQ= 0
##$AQ_mod= 1
##$AUNM= <au_zg>
##$AUTOPOS= <>
##$BF1= 81.014009
##$BF2= 200.13
##$BF3= 200.13
##$BF4= 200.13
##$BF5= 200.13
##$BF6= 200.13
##$BF7= 200.13
##$BF8= 200.13
##$BYTORDA= 1
##$CFDGTYP= 0
##$CFRGTYP= 5
##$CHEMSTR= <none>
##$CNST= (0..31)
1 1 145 1 1 1 1 1 1 1 1 1 1 1 1 1 1 1 1 1 1 1 1 1 1 1 1 1 1 1 1 1 
##$CPDPRG= <waltz16>
##$CPDPRG1= <>
##$CPDPRG2= <waltz16>
##$CPDPRG3= <>
##$CPDPRG4= <mlev>
##$CPDPRG5= <mlev>
##$CPDPRG6= <mlev>
##$CPDPRG7= <mlev>
##$CPDPRG8= <mlev>
##$CPDPRGB= <>
##$CPDPRGT= <>
##$D= (0..31)
0 1 0 0 0 0 0 0 0 0 0 0.03 2e-05 3e-06 0 0 0 0 0 0 0 0 0 0 0 0 0 0 0 0 
0 0 
##$DATE= 1571054586
##$DBL= (0..7)
120 120 120 11 120 120 24 19 
##$DBP= (0..7)
150 150 150 150 150 150 150 150 
##$DBP07= 0
##$DBPNAM0= <>
##$DBPNAM1= <>
##$DBPNAM2= <>
$$ [...]
##$SUBNAM3= <"">
##$SUBNAM4= <"">
##$SUBNAM5= <"">
##$SUBNAM6= <"">
##$SUBNAM7= <"">
##$SUBNAM8= <"">
##$SUBNAM9= <"">
##$SW= 369.568048894756
##$SWIBOX= (0..15)
0 1 3 0 0 0 0 0 0 0 0 0 0 0 0 0 
##$SW_h= 29940.119760479
##$TD= 32768
##$TD0= 1
##$TE= 0
##$TE2= 300
##$TE3= 300
##$TEG= 300
##$TL= (0..7)
0 120 53 12 22 120 120 120 
##$TP= (0..7)
150 150 150 150 150 150 150 150 
##$TP07= 0
##$TPNAME0= <>
##$TPNAME1= <>
##$TPNAME2= <>
##$TPNAME3= <>
##$TPNAME4= <>
##$TPNAME5= <>
##$TPNAME6= <>
##$TPNAME7= <>
##$TPOAL= (0..7)
0.5 0.5 0.5 0.5 0.5 0.5 0.5 0.5 
##$TPOFFS= (0..7)
0 0 0 0 0 0 0 0 
##$TUNHIN= 0
##$TUNHOUT= 0
##$TUNXOUT= 0
##$USERA1= <user>
##$USERA2= <user>
##$USERA3= <user>
##$USERA4= <user>
##$USERA5= <user>
##$V9= 5
##$VALIST= <valist>
##$VCLIST= <CCCCCCCCCCCCCCC>
##$VD= 0
##$VDLIST= <DDDDDDDDDDDDDDD>
##$VPLIST= <PPPPPPPPPPPPPPP>
##$VTLIST= <TTTTTTTTTTTTTTT>
##$WBST= 1024
##$WBSW= 4
##$XGAIN= (0..3)
0 0 0 0 
##$XL= 0
##$YL= 0
##$YMAX_a= 12418
##$YMIN_a= -12357
##$ZGOPTNS= <>
##$ZL1= 120
##$ZL2= 120
##$ZL3= 120
##$ZL4= 120
##$ABSF1= 182.463
##$ABSF2= -187.1042
##$ABSG= 5
##$ABSL= 3
##$ALPHA= 0
##$AQORDER= 0
##$ASSFAC= 0
##$ASSFACI= 0
##$ASSFACX= 0
##$ASSWID= 0
##$AUNMP= <proc_1d>
##$AZFE= 0.1
##$AZFW= 0.5
##$BCFW= 0
##$BC_mod= 2
##$BYTORDP= 0
##$COROFFS= 0
##$CY= -3
##$DATMOD= 1
##$DC= 0
##$DFILT= <>
##$DTYPP= 0
##$F1P= 0
##$F2P= 0
##$FCOR= 1
##$FTSIZE= 65536
##$FT_mod= 6
##$GAMMA= 0
##$GB= 0
##$INTBC= 1
##$INTSCL= 5.30512e-09
##$ISEN= 30
##$LB= 1
##$LEV0= 0
##$LPBIN= 0
##$MAXI= 10000
##$MC2= 0
##$MEAN= 0
##$ME_mod= 0
##$MI= 50
##$NCOEF= 0
##$NC_proc= -6
##$NLEV= 6
##$NOISF1= 182.463
##$NOISF2= 159.3651
##$NSP= 0
##$NTH_PI= 0
##$NZP= 0
##$OFFSET= 182.463
##$PC= 4
##$PHC0= -250.7701
##$PHC1= -227.5996
##$PH_mod= 1
##$PKNL= yes
##$PPARMOD= 0
##$PSCAL= 0
##$PSIGN= 0
##$REVERSE= no
##$SF= 81.0140089999434
##$SI= 65536
##$SIGF1= 159.3651
##$SIGF2= -187.1042
##$SINO= 113.3802
##$SIOLD= 16384
##$SREGLST= <1H.CDCl3>
##$SSB= 0
##$STSI= 65536
##$STSR= 0
##$SW_p= 29940.119760479
##$SYMM= 0
##$S_DEV= 0
##$TDeff= 32768
##$TDoff= 0
##$TI= <>
##$TILT= no
##$TM1= 0
##$TM2= 0
##$TOPLEV= 0
##$USERP1= <user>
##$USERP2= <user>
##$USERP3= <user>
##$USERP4= <user>
##$USERP5= <user>
##$WDW= 1
##$XDIM= 65536
##$YMAX_p= 276577961
##$YMIN_p= -18142959
$$ End of Bruker specific parameters
$$ ---------------------------------
##NTUPLES= NMR SPECTRUM
##VAR_NAME=  FREQUENCY,     SPECTRUM/REAL,   SPECTRUM/IMAG
##SYMBOL=    X,             R,               I
##VAR_TYPE=  INDEPENDENT,   DEPENDENT,       DEPENDENT
##VAR_FORM=  AFFN,          ASDF,            ASDF
##VAR_DIM=   65536,         65536,           65536
##UNITS=     HZ,            ARBITRARY UNITS, ARBITRARY UNITS
##FACTOR=    0.456856943014862, 1,           1
##FIRST=     14782.0589164792, 0,            0
##LAST=      -15158.0608439998, 0,           0
##MIN=       -15158.0608439998, -18142959,   0
##MAX=       14782.0589164792, 276577961,    0
$$ Real data points
##PAGE= N=1
##DATA TABLE= (X++(R..R)), XYDATA
$$ [...]
41310a215645q1507J38067Q27117L95673o02733m84347M59450M95632k57663J71736
41300a54220J964086K502516J81355k824329l222776p74016J801821K317563J017557
41291B809557o09647j463024j225055k81007M47803L18352k00704j18493O01807
41282B79589R02952J76650q01764r06372q0871P32625P22042p7582q75185p47403
41272f75319L79504J262484N67017j220824k084366j184611j03011m05240j174102
41263d638468n83819R31781J219640p5595q13323K97745J720283J516100R6067
41254c29589p97695o08270o908O63489J432758J698774O98833j062059k050913
41245c61580j535296l38376L55500K67334p3333j67604J5411K85416O42327J128140
$$ y = [-1215645, -1297152, -1159085, -331968, 63705, -539028, -1023375, -563925, -68293, -325956, -154220, 1809866, 4312382, 4493737, 1669408, -1553368, -2327384, -525563, 1792000, 2809557, 2199910, 736886, -488169, -769176, -321373, -3021, -203725, -322218, 279589, 1182541, 1359191, 557427, -348945, -429816, 302809, 1024851, 947269, 72084, -675319, -295815, 966669, 1533686, 312862, -1771504, -2956115, -3059126, -3464366, -4638468, -5222287, -4290506, -3070866, -3146461, -3959784, -3662039, -1941756, -425656, -329589, -1127284, -1735554, -1742462, -1078973, 353785, 2052559, 2751392, 1689333, -361580, -1896876, -2235252, -1879752, -1612418, -1685751, -1853355, -1837944, -1552528, -910201, 217939]
41235B17939J229001J29228j797876k536917p80373J762134K163172K63868j202433
41226e52257p08566K47641K05245J3509N61538P58503j11624l08411J440760K900139
41216D446477J379557j628793k377541n09280R39818P31491O17922J120044K96696
41207E016391k090601l052589r58745J572849J635976J77356k59305L98489O02103
41198C041924K65543K75462K77650m44966r72608j64153Q21102r348k090696k911593
41188a911683j708136j35681O28530J076395J516223J303131L98647k20338k15974
41179G31114k74138m83263q9595P10423O06393n20297r60504J84874J391593R51035
41169B247635n58093j384379j107426o35840m90650m40969l44056j75678L74450
$$ y = [217939, 1446940, 1576168, -221708, -2758625, -3538998, -1776864, 386308, 650176, -552257, -1260823, -1013182, -807937, -794428, -232890, 525613, 413989, 105578, 1546338, 4446477, 5826034, 4197241, 1819700, 1310420, 2250238, 2981729, 3599651, 4719695, 5016391, 2925790, -126799, -1085544, 487305, 2123281, 2300637, 2041332, 2439821, 3041924, 3307467, 3582929, 3860579, 3415613, 2443005, 2278852, 3099954, 3090606, 999910, -1911683, -3619819, -3755500, -3126970, -2050575, -534352, 768779, 1167426, 947088, 731114, 456976, -26287, -115882, 594541, 1200934, 680637, -279867, -94993, 1296600, 2247635, 1689542, 305163, -802263, -1438103, -1928753, -2369722, -2713778, -2889456, -2515006]
41160b515006J306043J727147R14543m03885q90670m44477j11379l42000n28761
41151a288445l22864k18264m88591n70872m0464O00327P17525N13820N40980O96601
41141A39753M45354j78196n36380l97925l07907o52002q65695j45574J201488
41132a297084J759117O31750j325892k367891j769073l66929P39571J334440J660652
41123a001339J545138O46419o91807j521905j269362k29246Q54852J341616R81416
41114F55782J35845m04259l15349l01218j146998k355037k505727j012887J215979
41105f033869K857794L085624J573924j077122k780174j542279J597719K902682
41097E84299N61371k515959k377042O73817K785094J926300j05693j126914j298663
$$ y = [-2515006, -1208963, 518184, 1432727, 1028842, 138172, -306305, -417684, -759684, -1288445, -1611309, -1829573, -2318164, -2889036, -2929500, -2329173, -1611648, -1097828, -556848, 139753, 585107, 406911, -129469, -527394, -835301, -1487303, -2352998, -2498572, -1297084, 462033, 1093783, -232109, -2600000, -4369073, -4736002, -3996431, -2661991, -1001339, 543799, 1190218, 498411, -1023494, -2292856, -2522102, -1667250, -325634, 655782, 791627, 387368, 72019, -229199, -1376197, -3731234, -6236961, -7249848, -6033869, -3176075, -90451, 1483473, 406351, -2373823, -3916102, -2318383, 584299, 1145670, -1370289, -3747331, -3073514, -288420, 1637880, 1532187, 405273, -893390]
41088h93390j499856j275674M4153J673599K312285J819316Q71696q1963n89233
41079B380933m4196J135634J286625l02016j970991j813825k93424P14751O42569
41070A736060L44718J49759l69462r29924o01308N54094J318200R58047p4492
41061C085692j042466j460331r39711L32804J205191Q65352J95713M51758J039016
41052C733018L73679j293168j990849j116129k46894l53664l82308M22475Q64075
41043A0235o0816j061403m47410R81966R20640r93383k493057j660241O58110
41034d145359J970138J111189n00506p24062N22422J165994J3879j295449o73263
41025b555017J071517J387588J04073k53710J244261K092184K39526k497881k962438
$$ y = [-893390, -2393246, -3668920, -3624767, -1951168, 361117, 2180433, 3052129, 2970166, 2380933, 2336737, 3472371, 4758996, 4456980, 2485989, 672164, 378740, 1093491, 1736060, 2080778, 2230537, 1861075, 931151, 329843, 883937, 2202137, 3160184, 3085692, 2043226, 582895, -356816, -24012, 1181179, 2046531, 2242244, 2694002, 3733018, 4106697, 2813529, 822680, -293449, -540343, -894007, -1276315, -853840, 10235, -50581, -1111984, -1559394, -577428, 343212, -650171, -3143228, -4803469, -4145359, -2175221, -1064032, -1564538, -2288600, -1766178, -600184, -586305, -1881754, -2555017, -1483500, -95912, 8161, -245549, 998712, 3090896, 3330422, 832541, -2129897]
41016b129897r73410J010739J409172O15438n84112j612794j621410l20620J001203
41007c205691R91268L90797Q80540K086497J837998m12005k475525k413045r26749
40998c245915J67314M71775P79334J205436R81266r863o53295n5195J022140R70448
40988A633445m13579j382872n80724Q69780Q84867m19449q86930K06253R32270
40979H43061j10057j389197q25973R62759J787101J209908O39915O60919L44730
40970D123166q15123j974939k119763j053779O37956J718143J015642q97704j667383
40961a033784j80021J498900J032564n67647o93741M79128M72484r94835j437476
40952a424428J0141J030115J09129r86129m03746P74673P34257l8712j27251J57052
$$ y = [-2129897, -3103307, -2092568, -683396, -67958, -652070, -2264864, -3886274, -4206894, -3205691, -2214423, -1823626, -943086, 1143411, 2981409, 2569404, 93879, -2319166, -3245915, -3078601, -2606826, -1827492, -622056, 359210, 349347, -303948, -359143, 662997, 1633445, 1219866, -163006, -743730, 126050, 1010917, 591468, -295462, -89209, 843061, 733004, -656193, -1482166, -519407, 1267694, 2477602, 3117517, 3778436, 4123166, 3308043, 1333104, -786659, -1840438, -1202482, 515661, 1531303, 633599, -1033784, -1213805, 285095, 1317659, 750012, 56271, 535399, 1007883, 13048, -1424428, -1414287, -384172, -275043, -1261172, -1664918, -890245, -155988, -194700, -321951, -164899]
40942a64899k30012p49660k64717N96638L08102q62189j117716O8411J222720
40933a193322J064063L7630n82542j95639O65971Q76500r0327j237909r99033
40924a654608N20706J333897L13206j105506j068661M8407O05539L15705J68106
40915e23209L75390J95592m66069q94865q69919o91900j31399J113068K074778
40906A81467J357111n58152j518520n75324R11323J493392J343953J027895K08380
40897C871525j190245j847371p13732R27522Q42646q59749j582793J06440K219819
40888A774062J937351n06468k175084j492967j62905l41943j495968j561386k58273
40879d283581O92691M22549L0212N23021J410766J988683K386055K489711J429293
$$ y = [-164899, -394911, -1144571, -1409288, -812650, -504548, -1366737, -2484453, -2416042, -1193322, -129259, -91629, -674171, -869810, -203839, 672661, 582334, -655575, -1654608, -1133902, 199995, 513201, -592305, -1660966, -1612559, -1007020, -691315, -523209, -147819, 47773, -418296, -1313161, -2183080, -2874980, -3006379, -1893311, 181467, 1538578, 980426, -538094, -1113418, -202095, 1291297, 2635250, 3663145, 3871525, 2681280, 833909, 120177, 1047699, 1890345, 1030596, -552197, -445757, 1774062, 3711413, 3204945, 1029861, -463106, -626011, -967954, -2463922, -4025308, -4283581, -3590890, -3168341, -3138129, -2615108, -1204342, 784341, 3170396, 5660107, 7089400]
40870G089400p07421k105833j574839m21860m73722j384425j606500r85485m43286
40861b613971O1539J075689J729650O44647j393750k015977p01988N82695N13698
40852b117768n4595k06751l42776n86050m0152J190109J341518j68643j210707
40843b195815o3757J672550J464014k39708r62724j98288K52754l05413m26498
40834a002885O17214J333991M51144r62675j151781j90369N38608N56551N77639
40825G67437R29535R59774J70011q88038j172847k72285J134891J757398P85152
40816D171028j179763k435127j823477j4692J228033J009556P9187l65425n3982
40807F15338M66504P69612Q01679N01566j37437o77631n97777j58268k04229q22759
$$ y = [7089400, 6381979, 4276146, 2701307, 2279447, 1805725, 421300, -1185200, -2170685, -2613971, -2552432, -1476743, 252907, 897554, -496196, -2512173, -3214161, -2631466, -2117768, -2172363, -2379114, -2721890, -3307940, -3348092, -2157983, -816465, -985108, -2195815, -2259572, -587022, 876992, 637284, -325440, -523728, -270974, -576387, -1002885, -385671, 948320, 1399464, 436789, -714992, -905361, -366753, 189798, 767437, 1696972, 2656746, 2826757, 1938719, 765872, 493587, 1628478, 3385876, 4171028, 2991265, 556138, -1267339, -1282031, -53998, 955558, 1034745, 669320, 615338, 1081842, 1851454, 2653133, 3154699, 3017262, 2339631, 1741854, 1583586, 1379357, 556598]
40797E56598r48960R7324J312277J136067m09582j660208j397032j23978R52959
40788d84535J415116J628081J794370J596556O60508q96631k300573k538962j320579
40779d46649L39547R73799K62395o83167p93947k13349L15683N85298Q48551J057758
40769B245919R03506M57750J46028P0515j56194q22331j664177k039476j427394
40760b285854N6073J465514J707643P79759m6244K14241R02009O55142n77553
40751B870730j440235j086373j40300N23819Q76106J019325M48364r47633j900111
40742B23692j104948P46287J624785Q73161j02484j48943Q6465k67730n41302
40733A388983K32159J149993L49500j993032l341927k067393L78954J521568J042160
$$ y = [556598, -392362, -295038, 1017239, 2153306, 1743724, 83516, -1313516, -1437494, -484535, 930581, 2558662, 4353032, 5949588, 6610096, 5713465, 3412892, 873930, -446649, -107102, 866697, 1129092, 445925, -348022, -561371, -245688, 339610, 1188161, 2245919, 3149425, 3607175, 3753203, 3823718, 3667524, 2845193, 1181016, -858460, -2285854, -2229781, -764267, 943376, 1723135, 1676891, 1891132, 2793141, 3448283, 2870730, 1430495, 344122, 203822, 727641, 1603747, 2623072, 3071436, 2123803, 223692, -881256, -134969, 1489816, 2362977, 2260493, 2111550, 2198015, 1930285, 1388983, 1621142, 2771135, 3120635, 1127603, -2214324, -4281717, -3902763, -2381195, -1339035]
40724a339035O02207J036871J258695K13732j282277j515672k05727J023720O67375
40715D59889p29001j205901J07348J765044J749485N5921j271434p23126R09644
40706A117869J760119J151159k9309p03662n62755M9506L97326l12858j974625
40697H92770l025657j897739P25756K162438Q78502j479884k127464o19183R03809
40688c586652Q00252o5728P9342J337685K156644J516715N7450j065881j539819
40679c09992j636543j262886r0201J477808K232604J428066j96149j058023m12856
40670A71828Q45479J219505L52073n67906l19439P51027J158525K15208j145474
40661B680826j658707j129202j54116Q05382J407735J155304O9680p96194n36303
$$ y = [-1339035, -736828, 300043, 1558738, 1772470, 490193, -1025479, -1231206, -207486, 459889, -269112, -1475013, -1367665, 397379, 2146864, 2202785, 931351, 208225, 1117869, 2877988, 4029147, 3999838, 3296176, 2733421, 2782927, 3180253, 2867395, 892770, -2132887, -4030626, -3304870, -1142432, -263930, -1743814, -3871278, -4490461, -3586652, -2786400, -2852128, -2772786, -1435101, 721543, 2238258, 2295708, 1229827, -309992, -1946535, -3209421, -3299622, -1821814, 410790, 1838856, 1642707, 584684, 171828, 1017307, 2236812, 2588885, 2020979, 1701540, 2452567, 3611092, 3826300, 2680826, 1022119, -107083, -261199, 544183, 1951918, 3107222, 3176902, 2380708, 1844405]
40652A844405K06452Q1214r36015j541538j097567l58203m6256L1066J35389J02497
40642a578556J03173O66441J453005J296983J21991n06775L71604J536293J308081
40633D772240j80765j501233j776281j012802L99892J440440Q01595j229517k313617
40624f00048r66644J100059J277976k09203r44268j34633N14928j78058j121423
40615a261314q57965L34755J051947N57440n50033r88911j08553J096946Q76826
40606A51138q18058j852875r08458M19599J75598p17665j31671J451421J689579
40597e41392L97737l16627J20068L5488r56134j014743L93807J216639M28129
40588b37028r8991R26230J703292M69398j331757j437939l03582K27363Q6195
$$ y = [1844405, 2050857, 2132071, 1196056, -345482, -1443049, -1801252, -1847508, -1816442, -1681053, -1578556, -1475383, -808942, 644063, 1941046, 2063037, 1556262, 1927866, 3464159, 4772240, 4591475, 3090242, 1313961, 301159, 701051, 2141491, 2943086, 1713569, -600048, -1566692, -466633, 811343, 602140, -342128, -476761, 38167, -139891, -1261314, -2119279, -1784524, -732577, -175137, -725170, -1714081, -1822634, -725688, 151138, -666920, -2519795, -3428253, -3008654, -2833056, -3550721, -3682392, -2230971, -541392, -143655, -460282, -340214, -304726, -1260860, -2275603, -1881796, -665157, -237028, -336019, 590211, 2293503, 2762901, 1431144, -6795, -310377, -83014, 3181]
40579C181L29742P29809M42709o9060l0149j05032r55615j336476p9181J258971
40569A88899N20288j241051j147839Q00460J638623J62895j332823p66320Q96504
40560b80364J557069P19539o98094j704923j576686k05115J278480J432428M11431
40551I33765k79496m8589K30978L6140j44297k35744q27548j491747p70392J293421
40541a303509K416994J081237j204938j992847j066569r6432j086j75625M6510
40532b296265N00163P69254P56268N46451K16983j45823m47457n31371j59485
40523g91282N95948J014344M12304p40615j124321k81613O71673N40244l05304
40514h622m70638M68467J238759M87183j230005j838672m66294J035669L98524
$$ y = [3181, 332923, 1062732, 1505441, 1436381, 1406232, 1301200, 345585, -990891, -1070072, 188899, 709187, -531864, -1679703, -879243, 759380, 922275, -410548, -1176868, -280364, 1276705, 1996244, 1298150, -406773, -1983459, -2188574, -910094, 522334, 933765, 654269, 605680, 836658, 872798, 728501, 492757, -334791, -1826538, -2596930, -1303509, 1113485, 2194722, 989784, -1003063, -2069632, -2166064, -2167150, -2342775, -2296265, -1796102, -1026848, -270580, 275871, 492854, 347031, -100426, -631797, -791282, -195334, 819010, 1231314, 490699, -633622, -915235, -243562, 296682, -8622, -479260, -10793, 1227966, 1715149, 485144, -1353528, -1819822, -784153, -385629]
40505c85629j692015k275175l57238J620516J510164M60341M16416O60769m80902
40496e22753j925433j141137J361948K309250P03604p42695j03601J019514P77620
40487A736317K10984R27157J906978J216255n60440j200338l58537K15016l12027
40478C781365q11237l62273L40194L31797j41460k44898N5653j9773q34615j627728
40468D67025j370561k10786N40167J84955l23707P6865P10456J99381j072099
40459g98304j244699J94429J596286J565534O07116j78023n11679m17434K17155
40450A030381Q28679L73911r26254j511607q72831l64710p58037q15435M41374
40441b574529J798217J726147O87288j8550k89625m68323K88J294481J919557
$$ y = [-385629, -2077644, -4352819, -4710057, -3089541, -1579377, -1119036, -702620, -41851, -522753, -2448186, -3589323, -2227375, 81875, 785479, 42784, -60817, 958697, 1736317, 1947301, 2874458, 4781436, 5997691, 5437251, 4236913, 3878376, 4093392, 3781365, 2970128, 2607855, 2948049, 3279846, 3138386, 2893488, 2949141, 2929368, 2094753, 467025, -903536, -1114322, -574155, -389200, -712907, -636042, 74414, 273795, -798304, -2043003, -1848574, -252288, 1313246, 1920362, 1742339, 1230660, 813226, 1030381, 1859060, 2232971, 1306717, -204890, -1077721, -1442431, -2200468, -3015903, -2574529, -776312, 949835, 1637123, 1618573, 1328948, 860625, 860913, 2155394, 4074951]
40432D074951P16472r64549j182025m27926m92271j265039j172831j66047L24080
40423e55185Q5499K06003N59955j57725j656572j880060k05656J491544J715671
40414c96526J162114Q24091L66911n11243r39390l78033K23854P114l62000k7963
40404c1071M71272K00693n79500j011360r89072q14939l31664M74332P81977Q3939
40394a745393o06587k7949J259924J467242J49662j121961r12785L36385J185013
40385a6449J004842L18567j72210k42719J6462M66929R12116J113126R48303M21471
40375D770438m54478j465491j883405r64691Q32479J772167Q12832q00264j056980
40366A562607m9044K02723j021236j852927o56750J455428K303788J612429O85166
$$ y = [4074951, 4791423, 3826874, 2644849, 2216923, 1724652, 459613, -713218, -879265, -555185, -469686, -263683, 296272, 138547, -1518025, -3398085, -3603741, -2112197, -396526, 765588, 1589679, 1956590, 1445347, 505957, 127924, 351778, 358892, -3108, -31071, 440201, 640894, 61394, -949966, -1939038, -2753977, -3085641, -2611309, -1829332, -1745393, -2351980, -2379929, -1120005, 347237, 496899, -625062, -1537847, -1201462, -16449, 988393, 1306960, 1134750, 892031, 908493, 1375422, 2287538, 3400664, 4348967, 4770438, 4315960, 2850469, 967064, 2373, 834852, 2607019, 3419851, 2619587, 1562607, 1513563, 1716286, 695050, -1157877, -1814627, -359199, 1944589, 3557018, 4242184]
40357D242184K7565q60586j788855j836139r88440k53506o2532O8592K70861J40745
40347a040111q4845L53402J189162J143804q0086j143062r50561j7520O01812
40338b8005O36427K56747n05545j270145j191824j43799P50503N79358j2700J97248
40328g31735J157797J584453P14330p38437j494348j089549j35317N31945O37606
40319D36745L95086K0237l17174l15672Q1138K72157k41063p70623k18045J000671
40309C43457J245232K33550l87988J72701M46735o01907j474571o59416N58543
40300a23664K45537p39332l08742R73357P62097r39958j802543j094946l25051
40291c353245M2470J082479K312037J692511m79617j254373K12870J110490k61000
$$ y = [4242184, 4269749, 3409163, 1620308, -215831, -1204271, -1457777, -1520309, -1451717, -1180856, -1040111, -1124956, -771554, 417608, 1561412, 1481326, 338264, -612297, -629817, -28005, 608422, 865169, 359624, -910521, -2102345, -2246144, -1495641, -916283, -928983, -731735, 426062, 2010515, 2724845, 1986408, 492060, -597489, -732806, -200861, 436745, 831831, 852068, 534894, 219222, 300360, 572517, 331454, -439169, -657214, 343457, 1588689, 1822239, 1434251, 1606952, 2053687, 1451780, -22791, -682207, -123664, 121873, -617459, -926201, 47156, 809253, -130705, -1933248, -3028194, -3353245, -3310775, -2228296, 83741, 1776252, 1296635, 42262, 255132, 1365622, 1104622]
40282A104622j688460j090042j2564m64014j195207j84267J538176J730847P64129
40273E03220M77008P06229M8567j059445j031943r7366J94270k25945j91227K85000
40263c91632K97367J24996N89714R74573Q8135j164086r03133M18016N48813q24335
40253b41572j565227n32152R38402J416483J051305L82869n33668j290577j129852
40244a503989k43684L49323L81406L96490L68271j55854p20346m79553J59504
40235a448432J76466j25368J92840N03529n02685j940363j483013P51659J888644
40226a986723N88447j033497q58127L47528Q68238O73444N11325J89981n46548
40217a245932q38809j5955R94830R44572M5991o63189q46986p16556k16227O09422
$$ y = [1104622, -583838, -1673880, -1686444, -2150458, -3345665, -3529932, -1991756, -260909, 503220, 980228, 1686457, 1735024, 675579, -356364, -453730, -259460, -485405, -676632, -391632, -94265, 30731, 620445, 1595018, 1683153, 519067, -384066, 33950, 582763, -241572, -1806799, -2338951, -1400549, 15934, 1067239, 1450108, 916440, -374137, -1503989, -1747673, -1398350, -1016944, -620454, -252183, -408037, -1128383, -1607936, -1448432, -1271966, -1397334, -1204494, -700965, -1203650, -3144013, -4627026, -3875367, -1986723, -1398276, -2431773, -3289900, -2942372, -2074134, -1400690, -889365, -699384, -1245932, -2084741, -2100696, -1105866, -161294, -115303, -778492, -1625478, -2342034, -2558261, -1948839]
40207a948839J135302R00731K46175l54975q79798j237214j040817l74620N2852
40198c501203q2080l44268l58680j13469N35985J545063J985072J077624j83209
40189E60835j10134J012832J263256J57775p84321q27917r25019j240672m32547
40180a325912J518762K361883R44559q26225j009848l28596q9965K06423J040397
40171B491478R33280j059435k832482k052583M7034O52675j38551l0906J109610
40162h79880J047804p39639j960540j040609Q06850J753348J519491P10189k33934
40153I83080p84765m71774K52646M72405K36232K91443N40624K71487j92485J96041
40143A794934J144565J064547m27078j708497j457151l35467L07094K20134J78
$$ y = [-1948839, -813537, 87194, 333369, -21606, -901404, -2138618, -3179435, -3554055, -3501203, -3583283, -3927551, -4286231, -4399700, -3863715, -2318652, -333580, 744044, 560835, 450701, 1463533, 2726789, 2884564, 2100243, 1272326, 347307, -893365, -1325912, 192850, 2554733, 3499292, 2673067, 1663219, 1334623, 1244658, 1451081, 2491478, 3424758, 2365323, -467159, -2519742, -2472708, -1820033, -1958584, -1989490, -879880, 167924, -571715, -2532255, -3572864, -2766014, -1012666, 506825, 1217014, 983080, 198315, -273459, -20813, 451592, 687824, 979267, 1519891, 1791378, 1598893, 1794934, 2939499, 4004046, 3576968, 1868471, 411320, 75853, 382947, 603081, 603259]
40134F03259l9086j8455l0549R815K70866P54606R53591K46494r38480j170628
40124F41433j8262R31177J99369j347358j830393j101907m59443k86676R9104
40115c172956O26847M72404k24503m54700r9024Q8177Q2291M25628O99459O0602
40105a495775q96990q27953L968J96845j57464K74918J256860J102944j71950
40096g14597o29147K17937P00681L02555N58088J664660J479462o05101k022813
40087I51725j197456j88190q13397j232663N79674K663361J987457m49447j234309
40078A066755O1483Q63212J78529m76085m16854n61519p91206J71139J859958
40069A955412K068411L57205j170952j246416r36798j040154o61208N24655J096275
$$ y = [603259, 564173, 545718, 515169, 524984, 795850, 1550456, 2504047, 2750541, 1812061, 641433, 623171, 1554348, 1753717, 406359, -1424034, -2525941, -2985384, -3272060, -3172956, -2546109, -2073705, -2298208, -2752908, -2851932, -2763755, -2681464, -2255836, -1556377, -1495775, -2392765, -3220718, -3216750, -3019905, -3177369, -2902451, -1645591, -542647, -714597, -1343744, -1125807, -425126, -122571, 435517, 2100177, 3579639, 2974538, 951725, -245731, -433921, -1247318, -2479981, -1900307, 763054, 2750511, 2301064, 1066755, 1128238, 1991450, 2169979, 1693894, 1277040, 715521, -75685, 95454, 1955412, 4023823, 4381028, 3210076, 1963660, 1026862, -13292, -674500, -149845, 946430]
40060I46430L58451k24402M07106R25071m8521j361192j094726L72320J146709
40051A427246Q15097N72369P70382M09695p45806j352537n12423O41679M01141
40042B426843j121227k108837j445897j4465P64241P86220P84086O58352k48954
40033D80362j329392r73750P53137J557810K29894j262112p43300P03690O18313
40024C4652p10657r06651L06406P97922J9262k377J512181K409872J199053m35610
40014D224053n67426q3432o46032j610580j397711m23040j88066n50544k86024
40005a528802M78448P21184P23590J419051K000991O95815k057379l554338k373897
39996c475337k9701J396889J520168R92092J87092o76918j229317j361744j190888
$$ y = [946430, 1304881, 1080479, 1487585, 2412656, 2364135, 1002943, -91783, 280537, 1427246, 2242343, 2814712, 3585094, 3994789, 3248983, 1896446, 1384023, 2025702, 2426843, 1305616, -803221, -2249118, -2263583, -1499342, -713122, 70964, 729316, 480362, -849030, -1822780, -1069643, 488167, 718061, -544051, -1287351, -583661, 34652, -676005, -1582656, -1276250, -478328, -459066, -461443, 1050738, 3460610, 4659663, 4224053, 3656627, 3573195, 2927163, 1316583, -81128, -504168, -692234, -1242778, -1528802, -1050354, -329170, 394420, 1813471, 3814462, 4510277, 2452898, -1101440, -3475337, -3505038, -2108149, -587981, 404111, 591203, -85715, -1315032, -2676776, -3867664]
39987c867664n36537O24246J402274J003016K62378N55580J328823P64938q99368
39978F37686j134804R14306K587732J427181j197203k223365j266731n15812r84824
39969a755834j291147k62801J279890J990484J796318J412013J002198K19233
39961D390354q45480j501100j294330o36866l64134o76404p85397O8960J414861
39952b29536J921022J041288l01546q91714n34839P3935K79168n7448n99646q24444
39942a23760n94063l91796m93733k40945Q75189J726378P26976j416605k089231
39933b021590n60987O81348l36104k035170j870070k15942P55428Q03899J369211
39924c429977K249883J626619m60997j580243n84386O95322M49709o34963j074581
$$ y = [-3867664, -4404201, -3779955, -2377681, -1374665, -1112287, -556707, 772116, 1537054, 637686, -497118, 417188, 3004920, 4432101, 3234898, 1011533, -255198, -771010, -1755834, -3046981, -3309782, -2029892, -39408, 1756910, 3168923, 4171121, 4390354, 3544874, 2043774, 749444, 112578, -251556, -927960, -1713357, -1644397, -229536, 1691486, 2732774, 2431228, 1539514, 1004675, 1078610, 1357778, 1300330, 700684, -123760, -717823, -1109619, -1603352, -1844297, -969108, 757270, 1484246, 67641, -2021590, -2582577, -1901229, -2237333, -4272503, -6142573, -6358515, -5603087, -4799188, -3429977, -1180094, 446525, -14472, -1594715, -2179101, -1483779, -1034070, -1669033, -2743614]
39915b743614p33934M2570J520398L198386L096445M04211k450997k518764k86622
39906d71921J178693N55310m63299k62194M39556J86989q44905j190061j54735
39897a026567J332611J843584R94865k50157p75015n65334l98150m88090k92254
39888C75493K15306J92357n66431q79718Q3945J243697J052130j26609n12923
39879A077247M76198J505800J293023J38788p57848o71532J51618P55542K63163
39870D231999j037405j682888q21911M33176M38112o20217j095114m15120K60938
39861c08430R0376k61023p091M90497O05633N43851O77914N93784k39776j319443
39851H66292j517660n23738P13805R91673L0162j288376j746066r36390M54270
$$ y = [-2743614, -3477548, -3434978, -1914580, 1283806, 4380251, 4784462, 2333465, -185299, -471921, 706772, 1262082, 798783, 536589, 976145, 1163134, 318229, -871832, -1026567, 306044, 2149628, 3144493, 2894336, 2119321, 1553987, 1155837, 667747, 375493, 590799, 783156, 216725, -662993, -579048, 664649, 1716779, 1590170, 1077247, 1553445, 3059245, 4352268, 4491056, 3733208, 3061676, 3213294, 3968836, 4231999, 3194594, 1511706, 689795, 1122971, 1561083, 940866, -154248, -569368, -308430, -218054, -479077, -486168, 4329, 609962, 1153813, 1831727, 2425511, 2185735, 866292, -651368, -1175106, -461301, 530372, 560534, -727842, -2473908, -3410298, -2956028]
39842b956028J537605J991949J726083N48477j079301j711652n53351J048644
39834E52426J128234k15077j212792j237679j247125j340921k28197K064088L217489
39825A480446J795908m36403j043464k30898K12031m8680m7629K12444q5568o33657
39815A174530m04072K10180j73225j282344j163403O99447K232459J643723j35107
39806B802188r38836j51266J003029J137320r8575j809086k327353p26594J667817
39797E58644K278708M22051j618472j541890k5272M56129r18750k477866k446691
39788e313409q89232Q51539J637853J215395J86439l88170J08215J104359J364547
39779a22464L55041j215174k153545j715770J3365K048058K888973J748149m21067
$$ y = [-2956028, -1418423, 573526, 2299609, 2848086, 1768785, 57133, -496218, 552426, 1680660, 1465583, 252791, -984888, -2232013, -3572934, -3801131, -1737043, 1480446, 3276354, 2839951, 1796487, 1565589, 1777620, 1728940, 1681311, 1893755, 1808187, 1174530, 770458, 980638, 807413, -474931, -1638334, -938887, 1293572, 2937295, 2802188, 1863352, 1712086, 2715115, 3852435, 3753860, 1944774, -382579, -1109173, 558644, 2837352, 3259403, 1640931, 99041, 73769, 529898, -388852, -2866718, -5313409, -6202641, -5351102, -3713249, -2497854, -2311415, -2699585, -2591370, -1487011, -122464, 232577, -982597, -3136142, -4851912, -4838547, -2790489, 98484, 1846633, 1425566]
39770A425566j735774j418949m16725J60469L55246O61106Q69409M80385k50748
39761A29985n91641l88732m8539K64129N76781N60722K4624l04461L04489J052307
39751A579664M71177j101493j663326o27584J78712m33323r90718J088J261234
39742a324569Q29964m80832m40447P36120R04133k8497R0689J617423K205293
39733D109277Q23678n33715n33906p41773k209964k838963q29711J723603J843014
39724H11540L43336Q1954R77152N33063j388261k176331r03907M25920N75483
39715g20051O90304J371138J281544o2115r35688l31585K90221k35328o74537
39706F73903J32782R61052M70806k18463L90644J228465M60851j039111r02481
$$ y = [1425566, -310208, -1729157, -2145882, -1985413, -1630167, -969061, -99652, 380733, 129985, -461656, -850388, -898927, -634798, -58017, 502705, 527329, 222868, 527357, 1579664, 2050841, 949348, -713978, -1341562, -1162850, -1596173, -2586891, -2585803, -1324569, -494605, -975437, -1415884, -679764, 224369, 195872, 286561, 1903984, 4109277, 4932955, 4399240, 3865334, 3123561, 913597, -1925366, -2755077, -1031474, 811540, 1154876, 1236830, 2213982, 2747045, 1358784, -817547, -1721454, -1295534, -720051, -29747, 1341391, 2622935, 2560820, 1625132, 1293547, 1583768, 1348440, 673903, 806685, 1767737, 2238543, 2020080, 2410724, 3639189, 4100040, 3060929, 2158448]
39697B158448P49852J413803J65060j179045j178986o00711m08839q4833R34254
39688A969003J773649J360982Q7743q81207j175555j112619o82705K79749J211173
39679B830213J118519j10387j350962j468753n64759K74372L08834r5562j05276
39670H36239M94427J139826J234200O93176j22544o25048l40406M55849P14938
39661D480657n5677p87887k48354Q74741Q23694l37405o94958J82640K60243j356879
39651C140815k269199m57541J896941J270615j734049l146184j474048O42347
39643b130303R97306O78763J214976J851890J446283P18481O52694N42685l60905
39634E611870r03602R8000J387752J013208m65994r53520l24699l58972j355787
$$ y = [2158448, 2908300, 4322103, 4487163, 3308118, 2129132, 1528421, 1119582, 1034749, 1969003, 3742652, 5103634, 5191377, 4310170, 3134615, 2021996, 1339291, 1619040, 2830213, 3948732, 3838345, 2487383, 1018630, 453871, 728243, 1037077, 941515, 836239, 1330666, 2470492, 3704692, 4397868, 4275324, 3650276, 3309870, 3765719, 4480657, 4424980, 3637093, 3388739, 4263480, 5087174, 4749769, 4054811, 4237451, 4497694, 3140815, 871616, 414075, 2311016, 3581631, 1847582, -1298602, -2772650, -2130303, -1132997, -454234, 760742, 2612632, 4058915, 4777396, 5430090, 5972775, 5611870, 4708268, 4806268, 6194020, 7207228, 6741234, 5787714, 5463015, 5104043, 3748256]
39625C748256j466537J50526J855745K052509J223354M34036m37534j679797k377541
39616C503017j611550j61766M18249r1302o07306m68762Q456M12565O00779L66153
39606B368533k79591o62267k68146J83597l44064j277115q43303J189037K622968
39597B689649J650453n31315j278064j08788P94215j88837j810812j699468M01788
39588h1179K245898J889068k7004j284579q68380Q3256J48700m46946m69378K95686
39578A485142P47344K29470n11382n71508j60115M5477J8662L1933j13572n27286
39568F74165n25157L32644J020186K95810j134206j364907j95964N65717Q3871
39559b47841k19998P09572J561890Q18960n88452o90737M32987R90278L62242
$$ y = [3748256, 2281719, 2432245, 4287990, 6340499, 7563853, 7997889, 7560355, 5880558, 3503017, 1891467, 1729701, 2147950, 2056648, 1449342, 980580, 989036, 1401601, 2002380, 2368533, 2088942, 1426675, 1158529, 1342126, 998062, -279053, -1122356, 66681, 2689649, 4340102, 3808787, 2530723, 2421935, 3216150, 3027313, 1216501, -482967, -81179, 2164719, 4053787, 4026783, 2742204, 1873824, 1957080, 2105780, 1658834, 1189456, 1485142, 2232486, 2461956, 1950574, 1379066, 1218951, 1264428, 1283090, 1315023, 1201451, 674165, 149008, 481652, 1501838, 1797648, 663442, -701465, -897429, -331712, -247841, -467839, 241733, 1803623, 2622583, 2034131, 1343394, 1776381, 2766659, 3128901]
39550C128901l50516m97531o31617r01672n27901N79739J238596P47293m7486
39541B737806j74854Q3333K0978k58064k71210m7873J86992N44463R80317R45849
39531D747737K57791l32122k12425N7315l57480j187027j525952j268611j058099
39522h78873j041061p10708M8943P40374J172678J667866K090199J587844j21683
39513D555579j858087k134315r64411J76314K19231k99583k29393M96892Q54505
39504H16732L68232q1252L95697J186600R33305m45753j559516j490189q38210
39495g14354l83555J82114J288018K116084J478636k58209j364339r13619K60389
39486A691165R35088Q40757L05060m78205j198750j196753k96403N89714N45945
$$ y = [3128901, 2778385, 2280854, 1649237, 747565, 219664, 799403, 2037999, 2785292, 2737806, 2562952, 2646285, 2667263, 2409199, 2137989, 2090116, 2277108, 2821571, 3801888, 4747737, 5005528, 4673406, 4460981, 4518296, 4160816, 2973789, 1447837, 179226, -878873, -1919934, -2630642, -2581699, -1841325, -668647, 999219, 3089418, 4677262, 4555579, 2697492, 563177, -401234, -224920, -5689, -305272, -534665, -37773, 816732, 1184964, 1103712, 1499409, 2686009, 3619314, 3173561, 1614045, 123856, -714354, -1097909, -915795, 372223, 2488307, 3966943, 3708734, 2344395, 1430776, 1691165, 2626253, 3467010, 3772070, 3293865, 2095115, 898362, 601959, 1191673, 1737618]
39477A737618N4771L27518J271318J310266k40678j703004j072535J044721J999682
39468D729677O51061j176390j428509n83308l98396r77193r14903M8128N53256
39459E03423N4221k39663L57658N93344n32488j635647q05239J318164K285421
39450A899194J281569j16839o42409q28931j272750j224773l3089J314257J452166
39441A828395O84462M25767R72619J143733J98182j014550j257518n26247J11296
39432B566139m3807n79427o66330j42553K93073q3020j127029j865651j440148
39423c088753R566J404121J679877P48634m69055j001909p50065l10233l2227
39414a810044L04151Q06773J067879Q41535N95692P52656P91185j6915j151831
$$ y = [1737618, 1792389, 2119907, 3391225, 4701491, 4460813, 2757809, 1685274, 2729995, 4729677, 5380738, 4204348, 2775839, 2192531, 1794135, 816942, -97961, -49833, 503423, 557644, 317981, 675639, 1268983, 736495, -899152, -1704391, -386227, 1899194, 3180763, 3063924, 2421515, 1592584, 319834, -904939, -938028, 376229, 1828395, 2512857, 2938624, 3911243, 5054976, 5253158, 4238608, 2981090, 2454843, 2566139, 2522332, 1942905, 1276575, 1134022, 1427095, 1344075, 217046, -1648605, -3088753, -3079187, -1675066, 4811, 753445, 284390, -717519, -1467584, -1777817, -1810044, -1505893, -699120, 368759, 1210294, 1805986, 2558642, 3349827, 3332912, 2181081]
39405B181081j193418J40651J294309P98557q20332j793340j311215j82837N04912
39396c81632N94180O06264Q59054J133875J001337L01478o32500j203505j060438
39387A218113l65261M11608Q06613N45200k14343p49977l89462M83414N90640
39378B336545n73989j771576j501009j04924O49721O8469n97495k19418M31978
39369a281698n862j144984j184979M75365K238007K358862J047894j82488n98879
39360A721238p31926j004149q86115J91600J665385K193953J168841m89344j232504
39351B596979n01660P32459J104890L41477o48402j044026r78434r43660q52168
39342a92545k43140P91880J499146J339725N39900l23459r11527j169612j089551
$$ y = [2181081, 987663, 1128314, 2422623, 3221180, 2400848, 607508, -703707, -886544, -381632, 212548, 818812, 1677866, 2811741, 3813078, 4114556, 3482056, 2278551, 1218113, 852852, 1264460, 2071073, 2616273, 2401930, 1651953, 1262491, 1745905, 2336545, 1762556, -9020, -1510029, -1614953, -965232, -896763, -1494258, -1713676, -1281698, -1287560, -2432544, -3617523, -3142158, -904151, 1454711, 2502605, 2320117, 1721238, 989312, -14837, -900952, -709352, 956033, 3149986, 4318827, 3829483, 2596979, 2095319, 2827778, 3932668, 4274145, 3625743, 2581717, 1603283, 659623, -192545, -435685, 356195, 1855341, 3195066, 3734966, 3411507, 2499980, 1330368, 240817]
39333B40817o15479K66155J271466J645112P31222q90524j459706j05603J591978
39324B675438J377895n02001j501584m62174P20498J09188j305829j325496J4744
39315a99321Q15287M73747K27192O21473O64214q0227o06786m43998o12875j540248
39305f81542j783327l14496J386904J328412N8478k16161J040370K201914K073400
39296E093952J092922n5772j165089j598441n63166J121783J351208k65486j446819
39287C565092n17049R84442O90826r04368j353309j60594O52609m7477q78070
39278B032102m61886L81024J90454p87194j192572o05790K61284Q08726Q59741
39269A485889K47978q16534j378721p62629L86153R87886R46340O86463P227j189791
$$ y = [240817, -374662, -108507, 1162959, 2808071, 3539293, 2648769, 1189063, 1083460, 2675438, 4053333, 3551332, 2049748, 1587574, 2308072, 2417260, 1111431, -214065, -199321, 615966, 1089713, 1316905, 1938378, 2602592, 2522365, 1915579, 1471581, 858706, -681542, -2464869, -2779365, -1392461, -64049, -5571, -221732, 818638, 3020552, 5093952, 6186874, 6131102, 4966013, 3367572, 2804406, 3926189, 5277397, 5011911, 3565092, 3048043, 4032485, 4723311, 3818943, 2465634, 2305040, 2957649, 2910172, 2032102, 1570216, 1951240, 2141694, 1354500, 161928, -443862, -182578, 626148, 1485889, 1733867, 917333, -461388, -1224017, -837864, 150022, 1096362, 1782825, 1790052, 600261]
39259F00261j683766l24063J649940J812571J96131n81956N88340J565936N45465
39250D368859r94019q74832K06767J70513p52289o04589O85566J120385P1462
39241C397823p02113K1953J217996J567747J225046P84819J42682p17868j203114
39232E734971j181683j289956j521400r42023M89082J368388R64683K88798J05642
39223D016502l18661j220064j059520Q84460K415801J329754q92579j042615R87463
39214E100541K311477J700738R68771J271540J139154n33042k164385j973669
39206G821125q14123n40296r95609p05247L93379R87509O54730J80310j73668
39197F808110q86111j589415j057924O80176J721840O72535j373389k191341j104541
$$ y = [600261, -1083505, -1407568, 242372, 2054943, 2251074, 1669118, 2257458, 3823394, 4368859, 3374840, 2500008, 2706775, 2877288, 2124999, 1520410, 2205976, 3326361, 3397823, 2695710, 2717663, 3935659, 5503406, 6728452, 7513271, 7655953, 6938085, 5734971, 4553288, 3263332, 1741932, 799909, 1288991, 2657379, 3622062, 3910860, 4016502, 3697841, 2477777, 1418257, 2302717, 4718518, 6048272, 5155693, 4113078, 5100541, 7412018, 9112756, 10081527, 11353067, 12492221, 11959179, 9794794, 7821125, 7007002, 6466706, 5471097, 4765850, 5159229, 6146738, 6801468, 6981778, 6808110, 5921999, 4332584, 3274660, 3954836, 5676676, 6349211, 4975822, 2784481, 1679940]
39188A679940O24218J654702J817583J524135Q60087k44314j372668j736873r86793
39179C820017L89729J561411K005462J580755L83557j022572j573035p14214N38274
39170F969384N23089p18834j121803M85766K192477J332705j524716k972799j394174
39161C771095R55189J477436P71053P92608J144297r0975k481633l227443j384057
39152A727570O60526R68688P51642J604458K318487R20022j595357k355933q17348
39143D182755P21856O42981l38551j089935j318273o98442R21370K080915R54638
39134F059314j378919j658176N64371J692346l67415k537489j288689J601804
39126B687147J810226o63139j728262J15908J713458O36575j266577j374343j75225
$$ y = [1679940, 2304158, 3958860, 5776443, 7300578, 8160665, 7916351, 6543683, 4806810, 3820017, 4209746, 5771157, 7776619, 9357374, 9740931, 8718359, 7145324, 6431110, 6969384, 7492473, 6773639, 5651836, 6137602, 8330079, 9662784, 8138068, 5165269, 3771095, 4726284, 6203720, 6974773, 7767381, 8911678, 8820703, 6339070, 3111627, 1727570, 2388096, 3356784, 4108426, 5712884, 8031371, 8951393, 7356036, 5000103, 4182755, 4904611, 5547592, 5209041, 4119106, 2800833, 2102391, 3023761, 5104676, 6059314, 4680395, 3022219, 3586590, 5278936, 4911521, 2374032, 1085343, 2687147, 4497373, 3834234, 2105972, 2221880, 3935338, 4571913, 3305336, 1930993, 1755768]
39117A755768N05754P17423J389512J857877Q90636q10806j402086o51740L3031
39108D285369j8064j41772K7041M4913p3365L96805J462620J960577J091596m70442
39098H565278j525789j706361j374068p62925R4017Q43176R10108K82514k24955
39089E100995J44502J064818J414902O93361l19202o38005l48958k41352n57441
39080F313620q89452j082499j315322j352439p21755K65884O97597M65496M41527
39071B822657R42309J145435N38149j37919m9201N66051J029569J092115O02619
39062H551784n99492j788411j594321m3157R44815K27348p38729k03834J065348
39053E821351J164119J83665k33266J89663K35219k93732l29772J13411k45682
$$ y = [1755768, 2261522, 2978945, 4368457, 6226334, 7116970, 6306164, 4904078, 4252338, 4285369, 4267305, 4125533, 4152574, 4197487, 4124122, 4520927, 5983547, 7944124, 9035720, 8565278, 7039489, 5333128, 3959060, 3196135, 3290152, 4133328, 5043436, 5325950, 5100995, 5245497, 6310315, 7725217, 8418578, 8099376, 7461371, 7112413, 6871061, 6313620, 5424168, 4341669, 3026347, 1673908, 952153, 1218037, 1915634, 2381130, 2822657, 3764966, 4910401, 5448550, 5310631, 5261430, 5827481, 6857050, 7949165, 8551784, 7952292, 6163881, 4569560, 4526403, 5471218, 5698566, 4959837, 4756003, 5821351, 6985470, 7169135, 6935869, 7125532, 7360751, 7067019, 6737247, 6850658, 6604976]
39044F604976j360518j431648R8617J328217Q34817j51246K0799P34680M34613
39035G113307o31855r40000k32390K84284j8698n18599o59947o61132p89190q68835
39025B076945o26552M9750J011549J542149P29010j108973k082182r50231Q96892
39016A538357J098081l71143j222502k58888J057310J092538M34248N69177J378956
39007E316134J531583P59314R8262o6882o11215j881603k650597j747571J67282
38998I14707J487431J726288J589306J379247O81809l27572o71490j49871J23422
38989F753277m73365r02694k23231N08571l25886k095394k333794j00557K605199
38980C412126L274914J579697q57199k353208k266345j046522K00318O93705P46335
$$ y = [6604976, 5244458, 3812810, 3911427, 5239644, 6074461, 5923215, 5944014, 6678694, 7113307, 6481452, 5541452, 5309062, 5593346, 5574648, 5056049, 4396102, 3734970, 2945780, 2076945, 1450393, 1500143, 2511692, 4053841, 4782851, 3673878, 1591696, 641465, 1538357, 2636438, 2265295, 1042793, 783905, 1841215, 2933753, 3368001, 3937178, 5316134, 6847717, 7607031, 7705293, 7638411, 7027196, 5145593, 2494996, 747425, 914707, 2402138, 4128426, 5717732, 7096979, 7778788, 7451216, 6779726, 6629855, 6753277, 6279912, 5377218, 5153987, 5662558, 5336672, 3241278, 907484, 806927, 3412126, 6687040, 8266737, 7409538, 5056330, 2789985, 1743463, 1943781, 2637486, 3383821]
38971C383821R92900J050649J02440j216875j133457N76883J870491J294511l0309
38962F891054m88151m59187j065870j756914j256828j17251m1114r52245r97117
38953b43623L75077J485699J156913M44877O84572J348786J081884j36738j054305
38944E143142q59866K4798N86898J88191q00182j197957m01493M92761p0847j674992
38934A430453k103693m55717J392630J455913M20830K30035Q68694N63645j043506
38925B759284j981772q17669J144953J620578L46868q83645p96226m5860R0510
38916A437021m92364q00815j80728R05463J489860J100619J24724n63384l59482
38907B660914M01019O21700k82560j386342j201928K85753J403626J015045L8898
$$ y = [3383821, 4376721, 5427370, 5529810, 4312935, 3179478, 3756361, 5626852, 6921363, 6891054, 6402903, 5943716, 4877846, 3120932, 1864104, 1746853, 1705739, 753494, -243623, 131454, 1617153, 2774066, 3218943, 3903515, 5252301, 6334185, 6197447, 5143142, 4283276, 4308074, 4894972, 5083163, 4282981, 3085024, 2683531, 3176292, 3105445, 1430453, -673240, -1128957, 263673, 1719586, 2140416, 2370451, 3239145, 3802790, 2759284, 777512, -40157, 1104796, 2725374, 3072242, 2188597, 1392371, 1346511, 1437021, 944657, 143842, -36886, 868577, 2358437, 3459056, 3583780, 3020396, 2660914, 3061933, 3683633, 3401073, 2014731, 812803, 1098556, 2502182, 3517227, 3556125]
38898C556125p136Q45395J374363J048028L20411n09060j350329j500552l29973
38889C447272J173584J161160m55834j709405j381566m72860j34533J31243R76786
38880B735847J449105M13752j258961j693158o65159L17648K92945k20384m03311
38871I68324j8674P70462J426855J144214p2459q89509l55334M81846J32257p90878
38861B797104n25018O95856Q09733n45919j195017K1977J260719O95310n86356
38852C428389o38682J19889P1373m59689J21581J484306J613373K61607n46318
38843E455829r428J09624j185717j953784m16188J722795J572896n14114j566010
38834C215903n62484M79753K47781J01083J206504K212344J555652J65281k48268
$$ y = [3556125, 3548989, 4394384, 5768747, 6816775, 7137186, 6628126, 5277797, 3777245, 3447272, 4620856, 5782016, 5326182, 3616777, 2235211, 1762351, 1627818, 1759061, 2735847, 4184952, 4598704, 3339743, 1646585, 981426, 1299074, 1592019, 1371635, 968324, 949650, 1720112, 3146967, 4291181, 4218722, 3329213, 2973879, 3455725, 3587982, 2797104, 2272086, 2967942, 3777675, 3231756, 2036739, 2058716, 3319435, 4014745, 3428389, 2789707, 2909596, 2980969, 2521280, 2642861, 4127167, 5740540, 6002147, 5455829, 5446401, 5556025, 4370308, 2416524, 2000336, 3723131, 5296027, 4781913, 3215903, 2653419, 3133172, 3380953, 3482036, 4688540, 6900884, 8456536, 8621817, 8373549]
38825H373549j27041q64995j684362n03658K324048L937628L083021J796952K110825
38816A8445967L302194L600094K661072R80919j367835l804890m607230l028619
38808A6181672q93055l69966j240939k007854k411942k837497k475942o08189
38800C336288J135803N77452j342640j549805N13659K126849J583891L31482o5585
38791F647394k88492j192435j801270j095977J07187P17074J098705J659701J441248
38782G293135o8130j282223o96799N64856M61500p80297j340837q29985l93421
38773B927799l01453L35155J536518K126083J592632O91638Q7349k29837k14125
38764H551759J98630M18569j18370p63068m75079M23269P64641N39223P53161
$$ y = [8373549, 8246508, 7381513, 5697151, 5193493, 7517541, 11455169, 14538190, 16335142, 18445967, 21748161, 25348255, 28009327, 28990246, 27622411, 23817521, 19210291, 16181672, 15288617, 14918651, 13677712, 11669858, 9257916, 6420419, 3944477, 3336288, 4472091, 5049543, 3706903, 2157098, 2670757, 4797606, 6381497, 6712979, 6647394, 6358902, 5166467, 3365197, 2269220, 2376407, 3093481, 4192186, 5851887, 7293135, 7225005, 5942782, 5245983, 5810839, 6272339, 5492042, 4151205, 3321220, 2927799, 2626346, 2961501, 4498019, 6624102, 8216734, 8908372, 8995721, 8765884, 8551759, 8750389, 9168958, 9050588, 8287520, 7812441, 8235710, 9000351, 9539574, 10292735]
38755A0292735J436953J535415Q14993J49117j98178p76998j279481o46225P58988
38746A2087319J206956N80714J063057L517994N236675L313251j063388l922672
38738B2019906l524193j945264j666348k513402k723496j712387n86628l24203
38730G023985n37989l55882J61309K31367k22493k98839M62970J309823J453459
38721I227710J087118N04317o69669k209355k437421m04318J941007J882073k43233
38712H678229j631724j158787l37058k3473Q92926K673094L434577K120661L30797
38703A4979242m30959j022352k309747k834184j232376Q72752J078433j08542
38695H992267n12016m3107k77100j082656q26583L06772L42245q87004j203289
$$ y = [10292735, 11729688, 13265103, 14080096, 14229213, 14031035, 13254037, 11974556, 11328331, 12087319, 13294275, 13874989, 14938046, 18456040, 23692715, 27005966, 25942578, 22019906, 18495713, 16550449, 14884101, 12370699, 9647203, 7934816, 7348188, 7023985, 6485996, 6130114, 6291423, 6522790, 6300297, 6001458, 6464428, 7774251, 9227710, 10314828, 10819145, 10149476, 7940121, 5502700, 5098382, 7039389, 8921462, 8678229, 7046505, 5887718, 5550660, 5527187, 6420113, 9093207, 12527784, 14648445, 14979242, 14548283, 13525931, 11216184, 8382000, 7149624, 8022376, 9100809, 8992267, 8480251, 8437144, 8160044, 7077388, 6250805, 6557577, 6899822, 6012818, 4809529]
38686D809529J01119P68682p71502k646412k201348K46614K102173J879800L47861
38677D636516j004767j306452n25475N83181R70031L99063k31075j05229M76932
38668C892725P49419N72883L09496J15872l7412m5268O2334j22547p76868j241669
38658C478965o50254Q29587J862133J297415m81487j818842j540687k64498M46322
38649C158654J47537k0102Q00335J779796J662069O81395J05739L01042M94788
38640I111253L21280L41395Q98534J591009K123434K628683K826145J916307j47613
38631B1610427k136201k895854k580455k002790j388574m58785O42214J242938
38623A2032920R78066K63105k43331m51469q05620j325283j112741N07659K512769
$$ y = [4809529, 4910648, 5679330, 4907828, 2261416, 60068, 306682, 2408855, 4288655, 4636516, 3631749, 2325297, 1799822, 2383003, 3353034, 3752097, 3521022, 3415793, 3892725, 4642144, 5215027, 5524523, 5640395, 5602983, 5557715, 5620049, 5497502, 4720634, 3478965, 2828711, 3658298, 5520431, 6817846, 6336359, 4517517, 2976830, 2712332, 3158654, 3306191, 3286089, 4086424, 5866220, 7528289, 8209684, 8315423, 8616465, 9111253, 9432533, 9773928, 10672462, 12263471, 14386905, 17015588, 19841733, 21758040, 21610427, 19474226, 16578372, 13997917, 11995127, 10606553, 10147768, 10789982, 12032920, 13010986, 13274091, 13030760, 12579291, 11773671, 10448388, 9335647, 9843306, 12356075]
38614A2356075K901140J241558n44761n81623Q08227K161607K959862L456750
38606B4758835L428610K641960J939577K330228L405668M020115M087155M427892
38598E1040040N468420P408683J0868624J6022204K2231745K9708582L8863201
38591A81611499M5160485L8083216J1722761k3741604m7793302m9404857l6594939
38584A19043259k4208655j7728355j3170006p750331l633588k562407k969119
38577D7020798l218390l624533m368882m495987l778368l215129l162679k916745
38569A8240085k295065j786669j238300k68203L16755m35028j497035j025431
38561A0011109N77993J118315O5165q52156o16448m1030L86480J305209K539911
$$ y = [12356075, 15257215, 16498773, 15954012, 15372389, 16180616, 18342223, 21302085, 24758835, 28187445, 30829405, 32768982, 35099210, 38504878, 42524993, 46612148, 51040040, 56508460, 63917143, 74785767, 90807971, 113039716, 142748298, 181611499, 226771984, 264855200, 276577961, 252836357, 205043055, 155638198, 119043259, 94834604, 77106249, 63936243, 56185912, 52552324, 49989917, 47020798, 43802408, 40177875, 35808993, 31313006, 27534638, 24319509, 21156830, 18240085, 15945020, 14158351, 12920051, 12651848, 12968603, 12533575, 11036540, 10011109, 10589102, 11707417, 11772582, 10920426, 10303978, 10262948, 10649428, 11954637, 14494548]
38552A4494548K703879J547287N94533O17327N13099l93732r57377k67400O79588
38543A9531752O29172p0228m35029l97564k88305J25420J093860K293461L481129
38534B5963668M799262N962621O229017N528155M425655K853084M64496j610425
38526E4615533j374146J288106M644610Q269689J3180644J7616553J6132136N880288
38518A20253413q252817j7906076j9583945j6275783j2128224q714118o100170
38511C1292280m288490k833537j171137O7124l14029j934782l036793k977099
38503A4803537k721559k600172j588513M49500J691804P72173j064732j573268
38495H168770m51257N84476K42396r20377j477358p96541M19327R48056L41087
$$ y = [14494548, 17198427, 18745714, 19340247, 19957574, 20470673, 20076941, 19119564, 18852164, 19531752, 20160924, 20090696, 19655667, 19258103, 18969798, 19095218, 20189078, 22482539, 25963668, 30762930, 36725551, 42954568, 48482723, 52908378, 55761462, 56225958, 54615533, 53241387, 54529493, 59174103, 67443792, 80624436, 98240989, 114373125, 120253413, 112000596, 94094520, 74510575, 58234792, 46106568, 37392450, 31292280, 27003790, 24170253, 22999116, 23066240, 22752211, 20817429, 17780636, 14803537, 12081978, 9481806, 7893293, 8342793, 10034597, 10806770, 9742038, 8168770, 7717513, 8301989, 8544385, 7624008, 6146650, 5350109, 5769436, 6717492, 7058579]
38486G058579n93373p76634k37062m1403p62299j564062j202990L77487J918882
38477D177125K274084J560418O78986l1194j073687k536368l249261k086021J17095
38468a68823J103259K693j445063j179675N24225J674258J274756K62932j33639
38459A914923J30043L62926K59137O9426J2662k6850k09613l80914k07093K93047
38449B217694O24459M82158K59900M51948Q39416R09531P90641Q87790Q29701
38440H293238l7165j150528j158822j10579L22048o16636j580796j368476p93651
38431A798633j059541j639218j332245l94102J8685k08332k75640P3109N92844
38422b425807J357692K192881K104818P67007l27356R4196Q41705J05171j339972
$$ y = [7058579, 6465206, 5688572, 5451510, 5410107, 4647808, 3083746, 1880756, 2258243, 4177125, 6451209, 8011627, 8690613, 8659419, 7585732, 5049364, 1800103, -285918, -168823, 934436, 937129, -507934, -1687609, -1163384, 510874, 1785630, 2048562, 1914923, 2044966, 2407892, 2667029, 2736455, 2749117, 2722267, 2512654, 2131740, 1924647, 2217694, 2842153, 3324311, 3584211, 4036159, 4875575, 5785106, 6575747, 7463537, 8293238, 8256073, 7105545, 5946723, 5836144, 6158192, 5541556, 3960760, 2592284, 1798633, 739092, -900126, -2232371, -2626473, -2607788, -2816120, -3091760, -3018651, -2425807, -1068115, 1124766, 3229584, 3996591, 3669235, 3763431, 4605136, 4710307, 3370335]
38413C370335j247404L23890J127019N35343L04611J100851J207254k87606j676985
38404D757308j418959m55124k11771l31621o3961l6285p86157j178712k80547
38395e829O28285M7514r79509m56740J096343J311673k51990j499937j117672
38386a227862k19713j13449l56994K6786Q15586J093145O49582R3384M1664N68233
38376A370362J038788N17462j020364k100174j370495L51824R73991R3473n62177
38367g07310q3121J49266q89934j546298J36140K793435L045022L33027k040035
38358A190192j465325N71625J078104j89393j078042o19659P5114K67955O11791
38349D42362J258821J072985k37444r91798P607J296870P87119j004693j745733
$$ y = [3370335, 2122931, 2446821, 3573840, 4109183, 4413794, 5514645, 6721899, 6434293, 4757308, 3338349, 2883225, 2671454, 2339833, 2275872, 2239587, 1453430, 274718, -5829, 622456, 669970, -309539, -766279, 330064, 1641737, 1389747, -110190, -1227862, -1447575, -1561024, -1918018, -1891232, -1075646, 17499, 667081, 760465, 802129, 1370362, 2409150, 2926612, 1906248, -193926, -1564421, -1212597, -238606, -145133, -707310, -790431, -641165, -1531099, -3077397, -2941257, -147822, 2897200, 3230227, 1190192, -275133, 296492, 1374596, 1185203, 107161, -512498, -437384, -169429, 442362, 1701183, 2774168, 2536724, 1544926, 1552533, 2849403, 3636522, 2631829, 886096]
38340H86096q04315J10064j50867o44468k54561N63431Q27497N36283J95959j80940
38330A084179o96086r53430o77818l33334l66772l92893J29380R00929J192082
38321a13763Q49186K21519n31607j342969j726281j134028J70727J160719J106203
38312a340294L35606j49006K39129R93019J100432M16304k1620M80074J015705
38303C069349L19724j130132j566723m69337P51197Q50247J45653n68909j050906
38294C50163r96793N1290J406707J438117O4924o34701L79992J124846l03583
38285B880962k294239j953598L21518J454603M91841k95886M89677J145416l9017
38276B201277j864440k126066p89298M94421R30290R54199P84825K19520m05061
$$ y = [886096, 81781, 191845, 40978, -603490, -858051, -294620, 532877, 1069160, 1265119, 1084179, 388093, -565337, -1243155, -1576489, -1943261, -2336154, -2206774, -1305845, -113763, 735423, 956942, 425335, -917634, -2643915, -3777943, -3607216, -2446497, -1340294, -1004688, -1153694, -914565, 78454, 1178886, 1595190, 1573570, 2053644, 3069349, 3389073, 2258941, 692218, 222881, 974078, 1824325, 1969978, 1401069, 350163, -646630, -595340, 811367, 2249484, 2314408, 1679707, 2059699, 3184545, 2880962, 586723, -1366875, -1045357, 409246, 901087, 605201, 1094878, 2240294, 2201277, 336837, -1789229, -2578527, -2084106, -1153816, -199617, 585208, 804728, 399667]
38267C99667m15388L2792N1518n98018j068787o11734M13908J034873Q27146K57616
38257C23593n3374r9569k61187m35432K3666J185013J978893J487525L73804N1325
38247D574257O38334Q73867J02392q96968j348751j459714j406053o76251O14933
38238A016046R53245o31842k607464k507416k08283J865861J904916O85452l3409
38229D37106J44797L23081m6093n25381n01853k276L67455J11160m91310n15036
38219f98350M44906J363321P68963j184962k482652j621537M95757J793226J529103
38210D07775O21876k4902k75776l3184Q24661J552188R63035p21179j731912j181733
38200D00849l31659m38707o82569K65187J712582J924177R77845N16204Q69885
$$ y = [399667, -15721, 17071, 68589, -529429, -1598216, -2209950, -1796042, -761169, 65977, 323593, 270219, 170650, -90537, -525969, -502303, 682710, 2661603, 4149128, 4522932, 4574257, 5212591, 6086458, 6188850, 5291882, 3943131, 2483417, 1077364, 401113, 1016046, 1969291, 1337449, -1270015, -3777431, -3985714, -2119853, -214937, 470515, 437106, 581903, 904984, 858891, 333510, -168343, -170619, 196836, 307996, -183314, -698350, -253444, 1109877, 1878840, 693878, -1788774, -3410311, -2914554, -1121328, 407775, 1029651, 1004749, 728973, 695789, 1520450, 3072638, 4035673, 3314494, 1582582, 400849, 69190, -369517, -1052086, -786899, 925683, 2849860, 3827705, 4343909, 5213794]
38191E213794O83298l73193q35026j10611K82070o90623j729035j452092p41046
38182B47536r83468j442957n87215R63728J240506K30362o3107J012775J621708
38173B239868L40885j668749k382329j425038J63366J604230K656370K855054
38165D383657J691994m08611k043441k103741r34853J2142j98314r31057r52822
38156a485046k29617J46096j31342o9832O42185O78421o66043j687354n99708
38147c402240J411303J739036L60354k64917P73332J605441R20075r1495k10363
38138B840526k12745q90899j148598q548J133560M55952j242908j719361p76262
38129a569283k36177o85544o28544P13255J859013J293673k66997r93817l68208
$$ y = [5213794, 5897092, 5523899, 4688873, 4578262, 4860332, 4169709, 2440674, 988582, 247536, -735932, -2178889, -2766104, -1802376, -561870, -331508, -394615, 618160, 2239868, 2580753, 912004, -1470325, -2895363, -2731997, -1127767, 1528603, 4383657, 6075651, 5667040, 3623599, 1519858, 585005, 597147, 398833, -532224, -1485046, -1714663, -1568567, -1699909, -1769741, -1127556, -449135, -1115178, -2802532, -3402240, -1990937, -251901, 108453, -156464, 616868, 2222309, 3142384, 3050889, 2840526, 2627781, 1736882, 588284, 579736, 1713296, 2169248, 926340, -793021, -1569283, -1805460, -2491004, -3119548, -2406293, -547280, 746393, 479396, -514421, -882629]
38120h82629O21264J076106Q69884N6158j244527k239657j773073K01387K111582
38111a203505K426861J391119L20572l95837j369941k370592k052848k20446J188037
38102b286580O71353n08360k48568J089175J367560J71159p10609l62070N0954
38093g65986k77546l99363K98178O19168l88299j513635j133858L06818J148405
38084b106118R21123L88928m3365m67406n97412j79024J85372o4269j91506P92846
38074a360831K182197K178702M26482j425298j896664j263990o36112l89441n8191
38065b243146P05887J509684J526852M51599q78751j210890l67168N22553N05694
38056E22314j46754p11277j022123j160066r04873k04349M23757O02764O28439
$$ y = [-882629, -261365, 814741, 1684625, 1740783, 496256, -1743401, -3516474, -3315087, -1203505, 1223356, 2614475, 2935047, 2539210, 1169269, -1201323, -3254171, -3474617, -2286580, -1615227, -2123587, -2372155, -1282980, 84580, 255739, -454870, -816940, -765986, -1043532, -1442895, -1144717, -525549, -913848, -2427483, -3561341, -3254523, -2106118, -1184995, -796067, -839432, -1306838, -1904250, -2083274, -1897902, -1962171, -2153677, -1360831, 821366, 3000068, 3426550, 2001252, 104588, -1159402, -1795514, -2184955, -2243146, -1537259, -27575, 1499277, 1950876, 1072125, -138765, -505933, 16620, 522314, 375560, -335717, -1357840, -2517906, -3422779, -3627128, -3203371, -2600607, -1972168]
38047a972168P60586O98122L15272J05165K59935J67663m93990j044433q54323
38038b058171j85781N89866J432828J710446M21062j735625k325678n75850J061140
38029a665763M79699q62304n78044O14295M14843q48845q89999L56279O83084
38020b296755l66727q02113J63493R74578Q65778J003251J592747R45882j240344
38011H39790k562102j529802Q0349L18372L4370O24625J106718R4342j082266
38002b075604k26010J786676J954540k11793j817526q26494J150585J385911k27187
37993H93098j380834o59659P05911P01082o76890j454757n09573Q53679R79444
37984e48499M09828P83138J874012J821389K54084j024667r34622n52120q39895
$$ y = [-1972168, -1211582, -513460, -198188, -93023, 166912, 334575, -159415, -1203848, -2058171, -2243952, -1654086, -221258, 1489188, 1910250, 174625, -2151053, -2726903, -1665763, -1186064, -2048368, -2626412, -2012117, -1597274, -2446119, -3336118, -2979839, -2296755, -2663482, -3465595, -3302102, -2327524, -1461746, -458495, 1134252, 2080134, 839790, -1722312, -3252114, -3171765, -2853393, -2819023, -2194398, -1087680, -993338, -2075604, -2301614, -514938, 1439602, 1227809, -589717, -1416211, -265626, 1120285, 893098, -487736, -1147395, -441484, 259598, -417292, -1872049, -2381622, -1527943, -548499, -138671, 644467, 2518479, 4339868, 4593952, 3569285, 2634663, 2082543, 1242648]
37975A242648j032138m50103j1897m87573r00759k16338Q29785J136171J071547
37966A181343J284996J079907j81349j302449r09943J41158J16632p15952p84071
37957h9728j10284r8017p20914m14082J029264J754931O68310r36287j380772
37948b97579p54842k23929l16977o95125q54115m71730M10021J248358J481139
37939d74779J152341O13137q7296q48082j031225l06943M18021Q3685p84236p07778
37929a973155M69234J291540Q26071j55931m49468J52193J013827J404117Q75380
37920C453808l30521j163470q27571N6645K24094l63839m81636M09504J272058
37911B249072R47312l50316j444975j532417p80356q065O2680m96938r31608p71095
$$ y = [1242648, 210510, -239593, -251490, -739063, -1639822, -1856160, -1026375, 109796, 1181343, 2466339, 3546246, 3364897, 2062448, 1152505, 1293663, 1410295, 694343, -89728, -200012, -298029, -1018943, -1433025, -403761, 1351170, 2019480, 1083193, -297579, -1052421, -1276350, -1593327, -2288452, -3142567, -3614297, -3204276, -1955918, -474779, 677562, 1290699, 1203403, 355321, -675904, -982847, -564826, -481141, -1265377, -1973155, -1503921, -212381, 613690, 457759, 8291, 160484, 1174311, 2578428, 3453808, 3123287, 1959817, 1132246, 1188891, 1412985, 1049146, 567510, 977014, 2249072, 3196384, 2846068, 1401093, -131324, -911680, -919745, -857065, -1354003, -2285611, -3056706]
37901c056706k89004K30520R02516J426521R24720m91625j138634q0929J072448
37892e00173M60913r19957o80732R89091J524270K44254m31791J066560K821827
37883D574262K305570N9895j312810p59986L00710K24132r55288j845540j356195
37874A234750k2134M64112n69020j632633j121421J93607M00695l18428j0772
37865a381244J446095J778836J60055j109245k86738Q95566J38153j562864j537308
37856a458694L06427J500961P72512n97078j091852o48227J53174R47949J336618
37847A221790J003251L22475m7860j43573m22734p65117p05205m11080m09474
37838c57527n43669k40057L53052N44591L31659M12564R34583J184103O88965
$$ y = [-3056706, -3345710, -3115190, -2212674, -786153, 138567, -353058, -1491692, -1572621, -500173, -39260, -959217, -1639949, -650858, 873412, 1117666, 685875, 1752435, 4574262, 6879832, 6939727, 5626917, 4866931, 5167641, 5391773, 4436485, 2590945, 1234750, 1212616, 1676728, 1107708, -524925, -1646346, -1452739, -1052044, -1370472, -1381244, 64851, 1843687, 2003742, 894497, 607759, 1503325, 1641478, 78614, -1458694, -1152267, 348694, 1121206, 524128, -567724, -1215951, -1062777, -114828, 1221790, 2225041, 2547516, 2499656, 2356083, 1933349, 1168232, 463027, 51947, -357527, -901196, -1141253, -788201, -243610, 88049, 500613, 1435196, 2619299, 3308264]
37829C308264j33848o24415o29045m66540m66493n52604k49203N42908Q69035
37820A598059k67600k042740k267431l70235J474600J296748K9847k67689L65943
37811d50498L92284k63549k45202M80016L71460p86183j042911O41834K326758
37802A424009J566231j122143k789696j745742M76077J132320l42949j644030
37794c045923n76090J865817K604727P25536j106772m39247J477044J788251K99564
37785C592907p47324m28171l0838l11903m64963j97296m34025j316152j674732
37776b012497j169960q11873p04462L42466K076659K328184O32360l89804Q01351
37767A092424J784042Q9737k346575k011532N33038J622198L61646m44650N65153
$$ y = [3308264, 3174416, 2550001, 1920956, 1454416, 987923, 435319, 186116, 729024, 1598059, 1330459, -712281, -2979712, -3349947, -1875347, -578599, -548752, -816441, -450498, -58214, -321763, -566965, -86949, 284511, -501672, -1544583, -902749, 1424009, 2990240, 1868097, -921599, -2667341, -2191264, -1058944, -1401893, -3045923, -3622013, -1756196, 848531, 1574067, 467295, 28048, 1505092, 3293343, 3592907, 2845583, 2417412, 2386574, 2074671, 1609708, 1412412, 978387, -337765, -2012497, -3182457, -3994330, -4698792, -4356326, -2279667, 48517, 680877, 291073, 1092424, 2876466, 2966203, 619628, -1391904, -858866, 763332, 1124978, 680328, 1245481]
37758A245481J131602m15893k071411j320718R39272J919823R00762m66082q95810
37749I67026n32895K48082J268638J794023R29120q54391j762668q58191N84186
37740A782930O36411p61988j701340q52733O77086P97365o35045j530371n29258
37731b116943J008535J018314k18753o36818L60424J046588J39288j232392j235931
37722a867688J76135J558381J936011J386294K30036j194530k140333j859574
37714a775268n57008O79351J025283O41456K75277M37309R16288R67888J68220
37705B778796r24084j416391j369951j595503j956917j103739J283099L159760
37697a144930K467031R3117j170079l30592Q91999R11985J90542k42187m51853
$$ y = [1245481, 2377083, 1961190, -110221, -1430939, -491667, 1428156, 2328918, 1862836, 967026, 434131, 682213, 1950851, 3744874, 4673994, 3819603, 2056935, 1198744, 1782930, 2419341, 1657353, -43987, -896720, -219634, 577731, -57314, -1587685, -2116943, -1108408, -90094, -308847, -945665, -585241, 461347, 600635, -631757, -1867688, -1691553, -133172, 1802839, 3189133, 3419169, 2224639, 84306, -1775268, -2332276, -1652925, -627642, 13814, 289091, 726400, 1642688, 2610576, 2778796, 1854712, 438321, -931630, -2527133, -4484050, -5587789, -4304690, -1144930, 1322101, 1415218, 245139, -85453, 806546, 1718531, 1909073, 1666886, 1215033]
37688A215033p78208p41526l8091M07067k40344j092705o78523P31793J405512
37679A90008O23176m89868p03138m2771P79996J188545P56080m76381j380875
37670D44772o31236J291631K213396J109653m43914p24337m38351j159881k203206
37661e41473j434025R34791J950754K00507j801831j173162J113468J795458J08903
37652A153390j539379j466252o49984k25412M28818J750319K265434P79594j200041
37643A296487j477654n79322o58443j602369j147701R44374J913893L65323j170079
37634b115491l2476K360802K666999O00122j055575q38322j89464m30003p13991
37625B52601Q3499J357983J833245J340187N06527l24635r52405r82164n38488
$$ y = [1215033, 436825, -304701, -342792, 64275, -176069, -1268774, -1947297, -1215504, 190008, 813184, 323316, -379822, -422593, 357403, 1545948, 2302028, 1825647, 444772, -186464, 1105167, 3318563, 4428216, 3984302, 3259965, 2821614, 1661733, -541473, -1975498, -1040707, 910047, 1110554, -691277, -1864439, -750971, 1044487, 1153390, -385989, -1852241, -2502225, -2727637, -2298819, -548500, 1716934, 2496528, 1296487, -181167, -760489, -1418932, -3021301, -4169002, -3224628, -1310735, -945412, -2115491, -2147967, 212835, 2879834, 3479956, 2424381, 1586059, 1396595, 966592, 252601, 336100, 1694083, 3527328, 4867515, 5374042, 5049407, 4097002, 3114838, 2576350]
37616B576350n52095j411803j981256r97982R26807J774182O22756j117220j315147
37607a475408L80339K045360J644277m83162j871915r62566Q59510J129691l69283
37598H96843j506683q97936M54257R83655N80411P2671j19136K2455M81890P86534
37588A754961J50472j186688j768657r34639N1471n3064m90506J34259J409325
37579i33066J719575Q21433J10703L86971Q63534O04509k69271j092045j448969
37570G63374j250185o93040j71056K92044J143880K183951K089647K57296j559445
37561C056466j148603Q84908J661041N5932j774595j655263l73086p4685r64819
37552c32704j272857k6048J633928K027714Q55758p65461j620911j410334o71877
$$ y = [2576350, 2024255, 612452, -1368804, -2366786, -1439979, 334203, 956959, -160261, -1475408, -1095069, 950291, 2594568, 2111406, 239491, -723075, 136435, 1266126, 896843, -609840, -1507776, -1053519, -69864, 510547, 583218, 464082, 486537, 968427, 1754961, 1905433, 718745, -1049912, -1984551, -1933080, -1986144, -2476650, -2342391, -933066, 786509, 1607942, 1718645, 2105616, 2969150, 3573659, 3304388, 2212343, 763374, -486811, -1179851, -1350907, -1058863, 85017, 2268968, 4358615, 4615911, 3056466, 1907863, 2792771, 4453812, 4509744, 2735149, 1079886, 706800, 632115, -332704, -1605561, -1631609, 2319, 2030033, 2885791, 2120330, 499419, -910915, -1582792]
37543a582792j4937M10164P15438Q41763N95027j45o41290j001919r34976n79718
37533b193385k97112j85462K69737J411590K279444J359500j076534k602705j559822
37524b594749O75599J520480M18078j086327j734422j471025n00436R15641J905456
37515a951705J694424P78115K15066J03470m3476m8154L43836L94942l58296o44048
37505D84174N83476J614993J64439k520225k965781p99851P71060K42167k18783
37496b644331Q06068J439676K92200p50801P481R32305J72792q54257j84909R33845
37486A50069L81163q17389m24620P26185K25905j309586j098436R31955J964325
37477G29571Q56657o72827j458376j998740j963021j70345K319261K561686J86654
$$ y = [-1582792, -1597729, -1187565, -472127, 369636, 964663, 964518, 323228, -678691, -1613667, -2193385, -2490497, -2675959, -2406222, -994632, 1284812, 2644312, 1567778, -1034927, -2594749, -1919150, -398670, 19408, -1066919, -2801341, -4272366, -4772802, -3857161, -1951705, -257281, 520834, 735900, 839370, 795894, 747740, 1091576, 1486518, 1128222, 484174, 1067650, 2682643, 2847082, 326857, -2638924, -3438775, -2667715, -2425548, -2644331, -1838263, -398587, -106387, -857188, -849707, 82598, 255390, -598867, -783776, 150069, 531232, -286157, -710777, 15408, 241313, -1068273, -2166709, -1234754, 729571, 1586228, 913401, -544975, -2543715, -4506736, -4677081, -2357820, 203866, 390520]
37468C90520j665772r91108N62363J077823J098180J258368L06773k114921l335193
37459c412967j179916K206419L021127J081584m65642p3036M71140n71939k214882
37450a138112k373505o91571J253209J903678J207016L29804K26032O68597Q44206
37441B229354N93005M02611L22618j38924r01857j156675o79490k80991m64432
37432g4781o25384j69481M90546O92553M74584J78050j45220m22402m17603l15896
37422c35034o15089j096093q95390L2191O61185N41776M37699P78980Q56649K68764
37412F35638k52451k89016n30449j176453j166353j72148L77512k46489m23753
37403c243962J035836K220951Q27128j782634k272381m04749Q26302J15124m07302
$$ y = [390520, -1275252, -2266360, -1703997, -626174, 472006, 1730374, 2037147, -77774, -3412967, -4592883, -2386464, 634663, 1716247, 1250605, 1177569, 1648709, 1076770, -1138112, -3511617, -4203188, -2949979, -1046301, 160715, 490519, 716551, 1385148, 2229354, 2822359, 3224970, 3547588, 3408664, 2506807, 1350132, 670642, 389651, -74781, -700165, -869646, -379100, 313453, 788037, 966087, 820867, 398465, -19138, -335034, -950123, -2046216, -2941606, -2909415, -2248230, -1706454, -1268755, -489775, 366874, 635638, 383187, 94171, -436278, -1612731, -2779084, -2951232, -2573720, -2820209, -3243962, -2208126, 12825, 839953, -942681, -3215062, -3619811, -2793509, -2678385, -3085687]
37394c085687Q66782K309194J806353n0772j225681j033609j15922J001582J795400
37385B267640J360532l16309j623238j301375k88528j36101n09329n6611R17208
37376C13889P99896m38413r43643l8783N39830m72688j610287r56659O66149R11111
37366a229598l19978o61411R27939K382012J586431m96482j336305l99108N71494
37357A024994L66321l66285o50416m31443J01240J026896J856705J403730n44536
37348C787206k288830k042584k14429J144086R19700j9289l90281j85400l02542
37339D07637r47215j127298k7640J516303J724506K83561q82860j53066J247106
37330B041034P84545j501623k588688n94494K401037K967799O37145j891402k273401
$$ y = [-3085687, -2218905, 90289, 1896642, 1845870, 620189, -413420, -529342, 472240, 2267640, 3628172, 3311863, 1688625, 387250, 98722, -37379, -546708, -603319, 313889, 1113785, 675372, -268271, -307054, 232776, -239912, -1850199, -2806858, -2140709, -1229598, -1549576, -2210987, -1283048, 1098964, 2685395, 2188913, 852608, 453500, 1024994, 1391315, 1025030, 374614, -56829, 44411, 1071307, 2928012, 4331742, 3787206, 1498376, -544208, -758637, 385449, 1305149, 1285860, 895579, 710179, 407637, -539578, -1666876, -1694516, -178213, 1546293, 1829854, 946994, 793928, 2041034, 2825579, 1323956, -1264732, -1859226, 541811, 3509610, 4146755, 2255353, -18048]
37321a8048q34189M94328M14624o98085j358280n53937R57079J344537J7596j491649
37311a726024j523404l17312P79595J234361J306680Q92175j37418q98083l92447
37302g81877O89388O54433n85270j182229r4768J322341J311411J32007o12947
37293H52489l40576L5492k12216n66998k18055O20703R52937L84852l43396m23048
37283G42184m9832Q8167q775J95195O13562N52274j9842k98097l2980K6046m90772
37272A317130r37525r40106r92818j066346j93240J463922J834491j07756k126404
37263a748652j560225P96465K016638J361467O36502P02970M77673m76039j069246
37254A137553r00960r15008j244701p57870N48779J086859M69456L21862J216824
$$ y = [-18048, -852237, -357909, 56715, -641370, -1999650, -2553587, -1596508, -251971, -234375, -1726024, -3249428, -3566740, -2787145, -1552784, -246104, 646071, 508653, -389430, -781877, -92489, 561944, -23326, -1205555, -1300323, 22018, 1333429, 1465436, 852489, 511913, 547405, 335189, -231809, -449864, 170839, 1123776, 1508628, 1165232, 742184, 692352, 780519, 771744, 966939, 1580501, 2132775, 2112933, 1814836, 1781856, 1807902, 1317130, 379605, -560501, -1553319, -2619665, -2812905, -1348983, 485508, 377752, -1748652, -3308877, -2512412, -495774, 865693, 1502195, 2205165, 2682838, 2206799, 1137553, 236593, -678415, -1923116, -2680986, -2132207, -1045348, -575892, -254030, 962794]
37245I62794J374663o1567j035973N1002J333668M91378j133682o05137J569830
37236B946976J934326n29617k749298k041733L73293J598935Q97889j94807m41365
37227A794599r7398P7829p4009j21208K68668Q04727Q07593O0023q07616j038523
37217A674685n75220J53103Q70308J385055J264863K60285j076929j748091j243906
37208I64153J27602J532740J957909Q45205j055128j999530j135450L50798P19905
37199B308204j07590p36028m02605J92143K52537R3830M97411J409069J845832
37190E352803J072849m13802j344090j200247q93666j413705k185970j771332
37182b797160j07576J251596J423267J250319J381164Q89516q81133k438176j903953
$$ y = [962794, 2337457, 2275890, 1239917, 1290919, 2624587, 3115965, 1982283, 1377146, 2946976, 4881302, 4351685, 1602387, -439346, -66053, 1532882, 2430771, 2235964, 1794599, 1697201, 1775030, 1701021, 1579813, 1848481, 2653208, 3460801, 3520824, 2713208, 1674685, 1099465, 1252568, 2122876, 3507931, 4772794, 5033079, 3956150, 2208059, 964153, 1091755, 2624495, 4582404, 5427609, 4372481, 2372951, 1237501, 1588299, 2308204, 2200614, 1464586, 1061981, 1254124, 1506661, 1600491, 2097902, 3506971, 5352803, 6425652, 6011850, 4667760, 3467513, 2573847, 1160142, -1025828, -2797160, -2904736, -1653140, -229873, 1020446, 2401610, 3291126, 2409993, -28183, -1932136]
37173a932136J15284J260905O36359m49653p61908m20389J54181Q93362J339921
37164H35926P20997p42469j759654j593517p43025J56783R14924J098263K00015
37155i11757j073386j136994J73415J024993K06318r86775o89206P40953J304809
37146a347630J91978j318028j628664m70005J183764K056894J483641k941j056538
37137i07529q95364l9934O36661R91923J177451Q82135J8453m35796L59630J320143
37127C107773M55573k048965l389033j684192J284086K192638L23165j836317
37119a595272j899440j02761J655978K059969J129631l06555j199022r60402j62229
37110a380103k0090p27344j042861j56990R41576R57014K77510R5400K32191l61304
$$ y = [-1932136, -1816852, -555947, 80412, -369241, -1131149, -1551538, -1397357, -503995, 835926, 1556923, 814454, -945200, -2538717, -3281742, -3124959, -2210035, -1111772, -911757, -1985143, -3122137, -2948722, -1923729, -1717411, -2704186, -3393392, -2652439, -1347630, -1155652, -2473680, -4102344, -4572349, -3388585, -1331691, 151950, 149009, -907529, -1802893, -1842827, -1206166, -214243, 963208, 1845343, 1863796, 1428000, 1787630, 3107773, 3563346, 1514381, -1874652, -3558844, -2274758, -82120, 241045, -1595272, -3494712, -3597473, -1941495, 118474, 1248105, 941550, -257472, -1217874, -1380103, -1400193, -2127537, -3170398, -3327388, -2385812, -1428798, -1151288, -1055888, -823697, -1185001]
37100a185001j246149p49422J148771K290785J464714J02311k02560K3852k35354
37091A411947l73899M13008J051890J95641j112001q10824P17454J089751k92936
37082B290031j376742p03448P29258J467721J436949R92929k0008j312988j824157
37073A679545j292929p65648p10652j61437J263873K059329R07362j177739k193440
37064c91736j664943n24663N57853J332476J297001L66702l63425Q9347J024037
37055A722649J066202K43708k96676k12506j87598n01279p43671q02366q80654
37046e92191p17942j6746O23614N14791K70337Q46986J546337R15852m37388k73315
37036B680335J523477K082341k62439l087635l097064o20923J301907J260451
$$ y = [-1185001, -2431150, -3180572, -2031801, 258984, 1723698, 1826009, 1623449, 1647301, 1411947, 1038048, 1451056, 2502946, 2698587, 1586586, 775762, 1493216, 2582967, 2290031, 913289, 209841, 939099, 2406820, 3843769, 4836698, 4816690, 3503702, 1679545, 386616, -379032, -1089684, -1251121, 12752, 2072081, 2979443, 1801704, -391736, -2056679, -2581342, -2023489, -691013, 605988, 972690, 609265, 698612, 1722649, 2788851, 3032559, 2735883, 2523377, 2335779, 1834500, 1090829, 288463, -592191, -1310133, -1326879, -703265, -188474, 81863, 928849, 2475186, 3391038, 2953650, 2680335, 4203812, 6286153, 6023714, 2936079, -160985, -781908, 519999, 1780450]
37028A780450M88219O6835l54436q38333m74337P80746J416973N87514m49794
37019C003837l01965L55477l6144j349953j937925j053969K65757P71602L66542
37010H3259k14220k40141N43686J513756J338239n09626k473460k327636q4984
37001b371127J746326J332951k49436p92944P0905Q71779O46528m5528l50630
36992H58824k41740j55861k24272j90562K10276R10438J427438J261285M93156
36983D348982k87860p35003r53527q90289k79270N29534O17836j19053o46388
36974A584962n13232o85548j615822j825998q9363K035620J997396K5327j202847
36965b89505n49473L56177K27312l1167M59401P45429n8850q54235k98521Q18035
$$ y = [1780450, 2268669, 2335504, 1981068, 1142735, 668398, 1449144, 2866117, 3453631, 3003837, 2701872, 3057349, 3021205, 1671252, -266673, -1320642, -1054885, -283283, 83259, -130961, -371102, 172584, 1686340, 3024579, 2514953, 41493, -2286143, -2371127, -624801, 708150, 458714, -334230, -263325, 608454, 1254982, 1209454, 858824, 617084, 461223, 236951, 46389, 256665, 1167103, 2594541, 3855826, 4348982, 4061122, 3326119, 2372592, 1482303, 1203033, 1732567, 2350403, 2231350, 1584962, 1071730, 386182, -1229640, -3055638, -3145001, -1109381, 888015, 913342, -289505, -838978, -482801, -255489, -286656, 172745, 918174, 859324, 5089, -293432, 524603]
36955E24603P62034m18708j121525o61284J18673N19415P68235J001020P22546
36946B215009k93708j374857j666619j083263k69815J79104K87527M76866Q39976
36937f89780R29722N00983K2701q5019j89731n58080l76125R32857J934317P57443
36927C179288j600530k015377Q0843J441380j03292k106582j258969J396097K141812
36918A154670L18804j082550m12057M30390l82430j629842j293840K05315R09792
36909a781748L43405j65993K11184O73981J71266j009833j552419p59642N36720
36900c333079R65950L40234j70329K69082J010183J008257M10156J99781O28750
36891A328985R41912N91688q2483m76110m42784k88607l70246o80673p29131j38800
$$ y = [524603, 1286637, 867929, -253596, -914880, -796207, -276792, 491443, 1492463, 2215009, 1921301, 546444, -1120175, -2203438, -2473253, -2294149, -2006622, -1529756, -689780, 239942, 740925, 763626, 678607, 488876, -69204, -445329, 487528, 2421845, 3179288, 1578758, -436619, -355776, 1085604, 982312, -1124270, -2383239, -987142, 1154670, 1473474, 390924, -21133, 409257, 26827, -1603015, -2896855, -2691540, -1781748, -1438343, -1604336, -1393152, -719171, -547905, -1557738, -3110157, -3869799, -3333079, -2367129, -2026895, -2197224, -1928142, -917959, 90298, 500454, 700235, 1328985, 2270897, 2862585, 2780102, 2303992, 1861208, 1572601, 1202355, 521682, -207449, -346249]
36881c46249N84956N14102k98368p28248k46103L35802L28179K32253N22909N30170
36871A429403l46630j306245j251971l94069L84561Q35884Q73559o3947j759081
36862a598536k489720j226066N39157R52542O21366J162100K070386J602123O516
36853A639868q34163n27835k32667L042J043946K004614R38491j576981k646699
36844a88384j339375K40752O92000R51692J448658R83801l70608n67484P49625
36835B600677J144629l54413j267743n1111R21166n22795k374620j824075M3431
36826a684854M65894k71109o4857P82372M52341m84111P0664J658922J744154
36817B669416j5769j371961j265941q53234p76052m31072J2305k35800m42471
$$ y = [-346249, 238707, 752809, 454441, -273807, -519910, -184108, 144071, 376324, 899233, 1429403, 1082773, -223472, -1475443, -1869512, -1484951, -649067, 224492, 160545, -1598536, -4088256, -5314322, -4775165, -3822623, -3201257, -2039157, 31229, 1633352, 1639868, 805705, 277870, 45203, 48245, 1092191, 3096805, 4035296, 2458315, -188384, -1527759, -1287007, -595007, 356685, 1805343, 2789144, 2418536, 1851052, 2600677, 3745306, 3390893, 2123150, 2072039, 2993205, 2470410, 95790, -1728285, -1684854, -1218960, -1490069, -1554926, -772554, -320213, -804324, -733660, 925262, 2669416, 2653647, 1281686, 15745, -837489, -1613541, -2044613, -2032308, -2268108, -2710579]
36808b710579O90889J997195J001935j685611k553078m19300J836340J802606
36800c9603O28773K36371L61637M1979m11063n63311q61258j136241k94925J256434
36790g81207J321127n29010j706175o39248O71583K98426j89615J190491K762834
36781B399206J717563r87746j995466q18159r859n45570p82700j33269q0107q25489
36771b061596m21800J486452K264964M50948j471827p56128J376013J832472L94224
36762C093722n24706j7506L33055m10960j032653m20091O72753J006406N26056
36753C226076j64497p75810j030529n30638L13783L47693n31810q61253J00345
36744I3360R06008J77765r55556o51058M09332Q0772j378663j402076N83063J932488
$$ y = [-2710579, -2019690, -22495, 979440, -706171, -3259249, -3678549, -1842209, -39603, 589170, 825541, 1187178, 1229157, 818094, 254783, -606475, -1742716, -2037641, -781207, 539920, 10910, -1695265, -2334513, -1662930, -1364504, -1554119, -363628, 2399206, 4116769, 3129023, 1133557, 315398, 305539, -240031, -1022731, -1156000, -1236107, -2061596, -2483396, -996944, 1268020, 1718968, 247141, -508987, 867026, 2699498, 3093722, 2569016, 2551510, 2884565, 2473605, 1440952, 1020861, 1693614, 2700020, 3226076, 3061579, 2285769, 1255240, 724602, 1038385, 1386078, 854268, -6985, 93360, 999368, 1177133, 221577, -429481, -20149, 60623, -1318040, -2720116, -2137053, -204565]
36734b04565J003360k42159K75467J192544K47456j541743j442736K99973P40094
36725C27691r40143k107183q28606J404864K205052J328444k4405j104224j506530
36716a245040p10677R05303J753759R52268m27932j007567r04675q77560q30698
36707b392819m16616j01406k60986q5571J130137K289423J714533k75406j609697
36698h408j283838m64661m82042r73669o74932P04796K092721K316314J360170
36689B586451L19402J65980P03989R80252N52168k09736r80333j753758k119672
36680B44743j391592J3354M77226o35753j723406j053493P11340J521081R00279
36671i36221K85829N83260J038785Q21664K83049M4292o5387m60648r65443j159491
$$ y = [-204565, 798795, 556636, 832103, 2024647, 2272103, 730360, -712376, -412403, 327691, -612452, -2719635, -3548241, -2143377, 61675, 1390119, 1365714, 261490, -1245040, -1955717, -1050414, 703345, 1655613, 1227681, 220114, -684561, -1562121, -2392819, -2809435, -2910841, -3171827, -3257398, -2127261, 162162, 1876695, 1601289, -8408, -1292246, -1756907, -2238949, -3212618, -3887550, -3182754, -1090033, 1226281, 2586451, 2905853, 3071833, 3775822, 4756074, 5308242, 5098506, 4118173, 2364415, 244743, -1146849, -1133495, -656269, -1292022, -3015428, -4068921, -3357581, -1836500, -936221, -650392, -67132, 971653, 1793317, 2076366, 2120658, 2055271, 1594623, 629180, -530311]
36661e30311r93122n73432J06436P60939P20259j52106r06790n73324M87094J030185
36651f24172O60294L15988P62835J338934R12602k77669p29303J88614J159949
36642C708072O81096p90494j479505p50053K82528O13328N44963O35190O54407
36633D099532K94695r4712l06120q65168j838627j972531l58479J672964J888107
36624B519661J86700j213767p57124O88248J412189R42406n1408q79730j125798
36615A721377o14882J71569K72144m92197j027107m45708N64251P51655J80960
36606A082062n1349K33191l992j065437j601427n29446J092622J345743J16922
36597F18889q62314n55895K17537M91664N90899J038583J251725N67488k72383
$$ y = [-530311, -1523433, -2096865, -1990429, -1229490, -509231, -661337, -1568127, -2141451, -1654357, -624172, 36122, 352110, 1114945, 2453879, 3366481, 3088812, 2359509, 2548123, 3708072, 4389168, 3598674, 2119169, 1369116, 1651644, 2264972, 2809935, 3445125, 4099532, 4394227, 4299515, 3993395, 3128227, 1289600, -682931, -1041410, 631554, 2519661, 2706361, 1492594, 735470, 1423718, 2835907, 3778313, 3726905, 2847175, 1721377, 1106495, 1278064, 1550208, 1058011, 30904, -414804, 149447, 901102, 1082062, 1030713, 1263904, 1259912, 194475, -1406952, -1936398, -843776, 501967, 618889, -243425, -799320, -581783, -90119, 500780, 1539363, 2791088, 3358576, 3086193]
36588C086193j02890O82621O28644n07188j480341j570507j334098j129447m76603
36579b203616N87670J020402M17047j67898R3300N29555L38153M122K07173M34937
36569A260845K7176l64899J23392P74864K67853r90758j230445L3188J267766
36560A168982J088500r5120r50153p99079o136N55447K69587n23569p50265j9596
36550f1402O15568M3263j258415j892348j411327m66692M58439J228000J328060
36541a416854L80633p68976r16082l90884n55486j349348j101308P29187K358124
36532c030994K147674Q35644J35844K51555J50820m28095p23323m53759k36882
36523a351516l44254j38050P70621J599187J374725M31107K3004M32074M58113
$$ y = [3086193, 2983303, 3665924, 4294568, 3787380, 2307039, 736532, -597566, -1727013, -2203616, -1615946, -595544, -178497, -346395, -253095, 276460, 614613, 618735, 825908, 1260845, 1288021, 923122, 1046514, 1821378, 2089231, 1098473, -131972, -98784, 1168982, 2257482, 2162362, 1212209, 413130, 406994, 962441, 1232028, 708459, -41806, -61402, 554166, 597429, -660986, -2553334, -3964661, -4431353, -3972914, -2744914, -1416854, -1036221, -1805197, -2721279, -3112163, -3667649, -5016997, -6118305, -5389118, -3030994, -883320, -47676, 88168, 339723, 490543, 62448, -660875, -1114634, -1351516, -1695770, -1833820, -1063199, 535988, 1910713, 2341820, 2364824, 2796898, 3255011]
36514C255011o89608j959044j961649j162998j035833j429109p55006J068793
36506d669443K074639J334683L35409J44396l68925j738094j829649P78718L408582
36497e29684K594651n61091j943263n48318P53853L78301n6248M66033N05604
36488A059838o01960j102824q1804O41472k79397j305596p97503K17682J89724
36479b060368j92643L82058J286622J224963N42900K15002o4612q24170j231584
36470g21832n21619K89597J4238o34538m06641L31743O07845O43019Q23143L68012
36460G92967r97975j630582m19198R31646M87102o53833m02664N63084K55073
36451a074380o76912l596J817338K124424O03670k62176M64691Q60340j93553
$$ y = [3255011, 2565403, 606359, -1355290, -2518288, -3554121, -4983230, -5738236, -4669443, -2594804, -1260121, -924712, -780316, -1149241, -2887335, -4716984, -3938266, -529684, 2064967, 1503876, -439387, -987705, -233852, 144449, 88201, 554234, 1059838, 457878, -644946, -726750, -85278, -364675, -1670271, -2467774, -2250092, -2060368, -2253011, -1870953, -584331, 640632, 1183532, 1398534, 1333922, 509752, -721832, -1243451, -953854, -939616, -1574154, -1980795, -1649052, -1041207, -398188, 424955, 792967, -205008, -1835590, -2254788, -1323142, -836040, -1489873, -1892537, -1329453, -1074380, -1751292, -1754888, 62450, 2186874, 2790544, 2528368, 2993059, 3853399, 3659846]
36442C659846j232714j043185m45108k41189N9330M90422L2284j229092j620562
36433a569968n39763N63654P26484P50004J046801N83031q70043j672661q11479
36424a793940N50835J208593J552816J897444J352843k08484j171431p26336l72603
36415B289737j227153j877719q32919P90711J165219O71440O75958Q43741P0542
36406B569557j031232j023119k61163l11887j224013j513891o32476M13847P92038
36397b222339O68902M68953N17424J052708J591951J032157n69205j427726n56567
36388E56258M91541J01369o69922r3086Q63937Q2486j620129j302870J203848
36379c86568K575526R60943j355456j644306n10227j05815n30913k67952Q54260
$$ y = [3659846, 2427132, 1383947, 938839, 697650, 756980, 1247402, 1279686, 50594, -1569968, -2109731, -1546077, -819593, -69589, 977212, 1560243, 690200, -982461, -1793940, -1243105, -34512, 1518304, 3415748, 4768591, 4560107, 3388676, 2662340, 2289737, 1062584, -815135, -1648054, -857343, 307876, 979316, 1655274, 2499015, 2569557, 1538325, 515206, 254043, -57844, -1281857, -2795748, -3428224, -3014377, -2222339, -1553437, -1084484, -567060, 485648, 2077599, 3109756, 2540551, 1112825, 556258, 1047799, 1149168, 479246, 386160, 1250097, 1332583, -287546, -1590416, -386568, 2188958, 3149901, 1794445, 150139, -360088, -465903, -996816, -1264768, -410508]
36370d10508J335721M67073n75786m69757M56832P67744j24152j156113j001982
36361g10928J25845P51036J80437o81537q79798o23935k84422N44153J858807
36352B79658K357030J208959l47976q21122p51750j259695j524205k69915J218324
36343H9308P00050r13489o28323J398778J689009o10888j830468K08822K292522
36334B395321R58793j823311j948765L30217J479113O77619K46704P40024J51764
36325C207479j651298j976847N2873J639860P64664p37819n92812K92904J02477
36316A101481l95025M46592J642307R47919j165445k020942r67510j71670q97576
36307a479869j705404j156925K3435O14858P54482Q28261K43372j151793j863352
$$ y = [-410508, 925213, 1392286, 816500, 346743, 803575, 1571319, 1447167, 291054, -710928, -585083, 165953, 346390, -335147, -1214945, -1838880, -2123302, -1579149, 279658, 2636688, 3845647, 3497671, 2676549, 1924799, 665104, -859101, -1129016, 89308, 789358, -124131, -752454, 646324, 2335333, 1724445, -106023, 102799, 2395321, 3354114, 1530803, -417962, -87745, 1391368, 2068987, 2315691, 3055715, 3207479, 1556181, -420666, -367793, 1272067, 2036731, 1298912, 706100, 999004, 1101481, 706456, 1153048, 2795355, 3743274, 2577829, 556887, -410623, -582293, -1479869, -3185273, -4342198, -4318763, -3703905, -2949423, -2121162, -1877790, -3029583, -4892935]
36298d892935p18651J040612J439310O89588M91821J042847R26163j82942r36755
36289a100942p23227n50614r35057q97832O4452Q68623P59138N47904P32645K72336
36279i62574j139292j491544N88178K852146K192298n79444j772778k96126J112597
36270E03461M72037p83145p84838n6898K21846M36840J139260J302225J8471j451638
36260A017621j338731m7923O50622K37000m65679r49221j070962l59115R22566
36251a403822J012457r10711k473273r26465K348454L206036O66390j755866j415794
36242a652594K1393Q8415n24436L9134J123815Q31399m11656n70469L95370N80161
36232g9468l53203n81045N15164J108226J05943q10008N7812J466599J048093
$$ y = [-4892935, -5611586, -4570974, -3131664, -2442076, -1950255, -907408, 18755, -164187, -1100942, -1824169, -2374783, -3309840, -4207672, -4143220, -3274597, -2515459, -1967555, -1234910, -962574, -2101866, -3593410, -3005232, -153086, 2039212, 1459768, -313010, -609136, 503461, 975498, 192353, -592485, -649383, -427537, 9303, 1148563, 2450788, 2469259, 1017621, -321110, -369033, 281589, 518589, 52910, -896311, -1967273, -2326388, -1403822, -391365, -1302076, -3775349, -4701814, -2353360, 852676, 1519066, -236800, -1652594, -1631201, -1542786, -2067222, -2028088, -904273, -72874, -484530, -1054999, -659629, -79468, -432671, -1013716, -498552, 609674, 715617, -94391, -36579, 1430020, 2478113]
36223B478113j052289k445125j918447o16783K12316Q13756J681366K163732J376940
36214B693579j94059j035241m39613O62407Q51845j29614j123575r50687J58490
36205D93532Q75654N15982j13712K6925P05783R06797M03655j38261m52989r11650
36195B311716j355419r51649K83341R99988L76357n40549l94844M23317N68777
36186A721035k5037k36509J44882N6808q48715j412133q35940l4804j23874n65870
36176b160157r6097J064666J323603O2621j330994j245839J46216J317661J381924
36167D63604R08026P67068Q87112N98347j81231p94279q87942r12688j239620
36158c91603j386049p48909K75285O85208K72026j44901O7113O32807J044662
$$ y = [2478113, 1425824, -1019301, -2937748, -3554531, -3342215, -2528459, -847093, 1316639, 2693579, 2499520, 1464279, 1024666, 1687073, 2538918, 2409304, 1285729, 335042, 493532, 1369186, 1885168, 1771456, 1798381, 2504164, 3410961, 3814616, 3676355, 3223366, 2311716, 956297, 4648, 287989, 1287977, 1664334, 1123785, 728941, 1152258, 1721035, 1695998, 1459489, 1604371, 1661179, 812464, -599669, -1435609, -1470413, -1594287, -2160157, -2256254, -1191588, 132015, 194636, -1136358, -2382197, -2235981, -918320, 463604, 1371630, 2138698, 3025810, 3624157, 3442926, 2648647, 1760705, 848017, -391603, -1777652, -2526561, -2251276, -1566068, -1294042, -1438943, -1371830, -739023, 305639]
36149C05639J262445J387524J196594M57781n87368j377505j485909q64863J0900
36140C05238K58504n72685j659772j605204k71178Q28971M95798m91368m74395
36131c186091P43922J606236Q51290r06735j936602j310994K51693J332372J309211
36122a245698P31618L21842J25812j972L35959J422482K319545J673120j88583
36113E494125j284158o96123M6561o84807k056690k041155n07461O81630M59329
36104e88749k60427m20380k81526m16883n05513k8541O66694Q77321N56306N6672
36094c45026o03031j379888j568929n92501P08009P55387m83418j052817L41044
36085d221170K175917K002445R3021o26695J226046L226306K511182l2520j193510
$$ y = [305639, 1568084, 2955608, 4152202, 4609983, 4022615, 2645110, 1159201, 294338, 305238, 563742, -8943, -1668715, -3273919, -3545097, -2716126, -2220328, -2711696, -3186091, -2442169, -835933, 15357, -891378, -2827980, -4138974, -3887281, -2554909, -1245698, -514080, -192238, -66426, -68398, 267561, 1690043, 4009588, 5682708, 5494125, 4209967, 3513844, 3560405, 2875598, 818908, -1222247, -1729708, -1048078, -588749, -849176, -1269556, -1551082, -1967965, -2473478, -2502019, -1835325, -958004, -401698, -345026, -948057, -2327945, -3896874, -4489375, -3781366, -3025979, -3509397, -4562214, -4221170, -2045253, -42808, 50213, -576482, 649564, 3875870, 6387052, 6354532, 5161022]
36076E161022l58368k04949k074761l533381k165505M72532J099380m66630j408009
36067c478669l04043J210849J394272O74365K40469K05986J70610K44257N10344
36058H68440M98954Q0938k433O39292J074245K23379j501789k567022k063973
36049b749969n35839P25002Q60264J61710k56826K07537P97033M70021m53748
36040g74815p41777k04945J26322j07825r0833L60726K16703o87807p77342P04472
36030a977121J895357R17039j004754j213704M08904J526277J032259J78394j07481
36021A655170n20825j289044j116551M83443J693389Q86571p52817r25796L54033
36012D67573R43589j50337j479996j354793Q1524J425281J643401O60302q75360
$$ y = [5161022, 4802654, 4597705, 2522944, -1010437, -3175942, -2703410, -1604030, -2070660, -3478669, -3782712, -2571863, -1177591, -503226, -262757, -56771, 113839, 358096, 868440, 1367394, 1448332, 1445899, 2085191, 3159436, 3382815, 1881026, -685996, -2749969, -3285808, -2560806, -1700542, -1538832, -1795658, -1588121, -791088, -321067, -774815, -1516592, -1721537, -1595215, -1703040, -1793873, -1433147, -1216444, -1904251, -2681593, -1977121, -81764, 835275, -169479, -1383183, -974279, 551998, 1584257, 1762651, 1655170, 1134345, -154699, -1271250, -787807, 905582, 1792153, 1039336, 113540, 467573, 1411162, 1260825, -219171, -1573964, -1492440, -67159, 1576242, 2236544, 1361184]
36003A361184j891507j550283j36382J031278R20395k16565j282094j377018l17641
35994c458633J285125K192012J462722k69339j090659j00264J190104P75835r63115
35985A023788j720825n95381O98753N85649j5346N69371J843146J796946M3104
35976D229205j577387j645787p58586l2220M50494R31217J009959M03123k60857
35967B749161l74686l11987n66281p60074n20434m71751j072976j248455J73025
35958b404458K102954K185550K23774j284300o03185R68267J268726K78478m16376
35949B319430k14794k0612n21142j279662j579188j200661k85824P76004J251485
35940g54964O18098n91597j127213m53438O03177Q21413j56890j581289k197269
$$ y = [1361184, -530323, -2080606, -2216988, -1185710, -265315, -481880, -1763974, -3140992, -3458633, -2173508, 18504, 1481226, 1211887, 121228, 20964, 1211068, 1986903, 1023788, -697037, -1292418, -593665, -8016, -23362, 546009, 2389155, 4186101, 4229205, 2651818, 1006031, 247445, 215225, 665719, 1596936, 2606895, 3010018, 2749161, 2374475, 2062488, 1496207, 736133, 215699, -256052, -1329028, -2577483, -2404458, -301504, 1884046, 2107820, 823520, 220335, 1188602, 2457328, 2735806, 2319430, 2104636, 2084024, 1562882, 283220, -1295968, -2496629, -2782453, -2006449, -754964, -136866, -728463, -1855676, -2309114, -1705937, -884524, -1041414, -2622703, -4819972]
35931d819972j150404J111283K805826K437181O53398l38123M19713J394661Q77959
35922C391522m91636q36583K8876N54966J94466J42200P91855N42310j476112
35913B841864l201758k210579N61713J974106J079216j02636k43581m25063j342635
35904a069353j444747L47699K118003J497908n80914j219824P4605J010465M07568
35895A141410k16485M00695J143778O27454m40740o12280j26150k90071j203934
35886D23677j712279j259707l88572M29581J153229J377414M67896j176342j998298
35877b683401r61538J188459K681385K374607N74718j306168j854550r32506J09332
$$ y = [-4819972, -5970376, -4859093, -2053267, 383914, 1037312, 699189, 1118902, 2513563, 3391522, 2899886, 2063303, 2092179, 2647145, 2841611, 2983811, 3775666, 4317976, 2841864, -359894, -2570473, -2008760, -34654, 1044562, 941926, 698345, 273282, -1069353, -2514100, -2166401, -48398, 1449510, 868596, -351228, -276623, 733842, 1141410, 924925, 1325620, 2469398, 3096852, 2656112, 2043832, 1917682, 1627611, 423677, -1288602, -2548309, -2936881, -2507300, -1354071, 23343, 491239, -685103, -2683401, -3644939, -2456480, 224905, 2599512, 3174230, 1868062, 13512, -918994, -809662]
$$ [...]
##END NTUPLES=NMR SPECTRUM
##END=
