##TITLE=31Pdec_PPh3vCl(CCl4)
 CDCl3, 24 sc
 17.9.2019
##JCAMPDX= 6.0         $$ Bruker NMR JCAMP-DX V2.0
##DATA TYPE= NMR SPECTRUM
##DATA CLASS= NTUPLES
##ORIGIN= UXNMR, Bruker Analytische Messtechnik GmbH
##OWNER= root
$$ XWIN-NMR		Version 3.5
$$ Tue Sep 17 15:41:50 2019 Russian Standard Time (UT+4h)  she@DPX200
##.OBSERVE FREQUENCY= 81.013821
##.OBSERVE NUCLEUS= ^31P
##.ACQUISITION MODE= SIMULTANEOUS
##.ACQUISITION SCHEME= undefined
##.AVERAGES= 24
##.DIGITISER RES= 17
##SPECTROMETER/DATA SYSTEM= spect
##.PULSE SEQUENCE= zgpg30
##.SOLVENT NAME= CDCl3
##.SHIFT REFERENCE= (INTERNAL, CDCl3, 0, 182.463)
##AUDIT TRAIL= $$ (NUMBER, WHEN, WHO, WHERE, WHAT)
$$ ##TITLE= Audit trail, XWIN-NMR		Version 3.5
$$ ##JCAMPDX= 5.01
$$ ##ORIGIN= Bruker BioSpin GmbH
$$ ##OWNER= she
$$ F:/spectra/data/she/nmr/P31/1/pdata/1/auditp.txt
$$ ##AUDIT TRAIL=  $$ (NUMBER, WHEN, WHO, WHERE, WHAT)
(   1,<2019-09-17 15:40:23.25 +0400>,<she>,<DPX200>,
      <created by zg, POWCHK disabled, PULCHK disabled
       configuration hash MD5:
       00 E9 B6 7A A2 85 ED C7 34 08 36 98 17 FE 4E 26
       data hash MD5: 32K
       84 66 1C B8 D5 2F A6 63 74 ED 80 B5 B7 8B D5 C7>)
(   2,<2019-09-17 15:40:25.75 +0400>,<she>,<DPX200>,
      <Start of raw data processing
       efp BC_mod = 2 LB = 1 FT_mod = 6 PKNL = 1 PHC0 = -396.4231 PHC1 = 107.2003 SI = 64K 
       data hash MD5: 64K
       04 86 2E E5 0F CA A4 30 1F 80 E4 AF 28 28 59 D7>)
(   3,<2019-09-17 15:40:40.73 +0400>,<she>,<DPX200>,
      <pk PHC0 = 2.72431 PHC1 = 0 
       data hash MD5: 64K
       1F 30 B7 56 FD A0 0E 76 C7 CB E3 99 30 20 01 1B>)
(   4,<2019-09-17 15:40:45.23 +0400>,<she>,<DPX200>,
      <abs ABSG = 5 
       data hash MD5: 64K
       B9 B0 8D C4 F1 E4 65 1C 92 CA 60 C1 AD 75 01 E1>)
$$ ##END=
$$ 
$$ hash MD5
$$ 3D 88 46 12 9A 29 4E 28 60 BF 3A 3A 73 62 1F 94
##$RELAX= 
##$RELAX= 
##$RELAX= 
##$RELAX= 
##$RELAX= 
##$RELAX= 
##$RELAX= 
##$RELAX= 
$$ Bruker specific parameters
$$ --------------------------
##$DU= <F:/spectra>
##$EXPNO= 1
##$NAME= <P31>
##$PROCNO= 1
##$TYPE= <nmr>
##$USER= <she>
##$AMP= (0..31)
100 100 100 100 100 100 100 100 100 100 100 100 100 100 100 100 100 100 
100 100 100 100 100 100 100 100 100 100 100 100 100 100 
##$AQSEQ= 0
##$AQ_mod= 1
##$AUNM= <au_zg>
##$AUTOPOS= <>
##$BF1= 81.014009
##$BF2= 200.13
##$BF3= 200.13
##$BF4= 200.13
##$BF5= 200.13
##$BF6= 200.13
##$BF7= 200.13
##$BF8= 200.13
##$BYTORDA= 1
##$CFDGTYP= 0
##$CFRGTYP= 5
##$CHEMSTR= <none>
##$CNST= (0..31)
1 1 145 1 1 1 1 1 1 1 1 1 1 1 1 1 1 1 1 1 1 1 1 1 1 1 1 1 1 1 1 1 
##$CPDPRG= <waltz16>
##$CPDPRG1= <>
##$CPDPRG2= <waltz16>
##$CPDPRG3= <>
##$CPDPRG4= <mlev>
##$CPDPRG5= <mlev>
##$CPDPRG6= <mlev>
##$CPDPRG7= <mlev>
##$CPDPRG8= <mlev>
##$CPDPRGB= <>
##$CPDPRGT= <>
##$D= (0..31)
0 1 0 0 0 0 0 0 0 0 0 0.03 2e-05 3e-06 0 0 0 0 0 0 0 0 0 0 0 0 0 0 0 0 
0 0 
##$DATE= 1568720422
##$DBL= (0..7)
120 120 120 11 120 120 24 19 
##$DBP= (0..7)
150 150 150 150 150 150 150 150 
##$DBP07= 0
##$DBPNAM0= <>
##$DBPNAM1= <>
##$DBPNAM2= <>
$$ [...]
##$SUBNAM3= <"">
##$SUBNAM4= <"">
##$SUBNAM5= <"">
##$SUBNAM6= <"">
##$SUBNAM7= <"">
##$SUBNAM8= <"">
##$SUBNAM9= <"">
##$SW= 369.568048894756
##$SWIBOX= (0..15)
0 1 3 0 0 0 0 0 0 0 0 0 0 0 0 0 
##$SW_h= 29940.119760479
##$TD= 32768
##$TD0= 1
##$TE= 0
##$TE2= 300
##$TE3= 300
##$TEG= 300
##$TL= (0..7)
0 120 53 12 22 120 120 120 
##$TP= (0..7)
150 150 150 150 150 150 150 150 
##$TP07= 0
##$TPNAME0= <>
##$TPNAME1= <>
##$TPNAME2= <>
##$TPNAME3= <>
##$TPNAME4= <>
##$TPNAME5= <>
##$TPNAME6= <>
##$TPNAME7= <>
##$TPOAL= (0..7)
0.5 0.5 0.5 0.5 0.5 0.5 0.5 0.5 
##$TPOFFS= (0..7)
0 0 0 0 0 0 0 0 
##$TUNHIN= 0
##$TUNHOUT= 0
##$TUNXOUT= 0
##$USERA1= <user>
##$USERA2= <user>
##$USERA3= <user>
##$USERA4= <user>
##$USERA5= <user>
##$V9= 5
##$VALIST= <valist>
##$VCLIST= <CCCCCCCCCCCCCCC>
##$VD= 0
##$VDLIST= <DDDDDDDDDDDDDDD>
##$VPLIST= <PPPPPPPPPPPPPPP>
##$VTLIST= <TTTTTTTTTTTTTTT>
##$WBST= 1024
##$WBSW= 4
##$XGAIN= (0..3)
0 0 0 0 
##$XL= 0
##$YL= 0
##$YMAX_a= 6040
##$YMIN_a= -4811
##$ZGOPTNS= <>
##$ZL1= 120
##$ZL2= 120
##$ZL3= 120
##$ZL4= 120
##$ABSF1= 182.463
##$ABSF2= -187.1042
##$ABSG= 5
##$ABSL= 3
##$ALPHA= 0
##$AQORDER= 0
##$ASSFAC= 0
##$ASSFACI= 0
##$ASSFACX= 0
##$ASSWID= 0
##$AUNMP= <proc_1d>
##$AZFE= 0.1
##$AZFW= 0.5
##$BCFW= 0
##$BC_mod= 2
##$BYTORDP= 0
##$COROFFS= 0
##$CY= -3
##$DATMOD= 1
##$DC= 0
##$DFILT= <>
##$DTYPP= 0
##$F1P= 0
##$F2P= 0
##$FCOR= 1
##$FTSIZE= 65536
##$FT_mod= 6
##$GAMMA= 0
##$GB= 0
##$INTBC= 1
##$INTSCL= 5.30512e-09
##$ISEN= 30
##$LB= 1
##$LEV0= 0
##$LPBIN= 0
##$MAXI= 10000
##$MC2= 0
##$MEAN= 0
##$ME_mod= 0
##$MI= 50
##$NCOEF= 0
##$NC_proc= -8
##$NLEV= 6
##$NOISF1= 182.463
##$NOISF2= 159.3651
##$NSP= 0
##$NTH_PI= 0
##$NZP= 0
##$OFFSET= 182.463
##$PC= 4
##$PHC0= -393.6988
##$PHC1= 107.2003
##$PH_mod= 1
##$PKNL= yes
##$PPARMOD= 0
##$PSCAL= 0
##$PSIGN= 0
##$REVERSE= no
##$SF= 81.0140089999434
##$SI= 65536
##$SIGF1= 159.3651
##$SIGF2= -187.1042
##$SINO= 113.3802
##$SIOLD= 16384
##$SREGLST= <1H.CDCl3>
##$SSB= 0
##$STSI= 65536
##$STSR= 0
##$SW_p= 29940.119760479
##$SYMM= 0
##$S_DEV= 0
##$TDeff= 32768
##$TDoff= 0
##$TI= <>
##$TILT= no
##$TM1= 0
##$TM2= 0
##$TOPLEV= 0
##$USERP1= <user>
##$USERP2= <user>
##$USERP3= <user>
##$USERP4= <user>
##$USERP5= <user>
##$WDW= 1
##$XDIM= 65536
##$YMAX_p= 505917910
##$YMIN_p= -247864513
$$ End of Bruker specific parameters
$$ ---------------------------------
##NTUPLES= NMR SPECTRUM
##VAR_NAME=  FREQUENCY,     SPECTRUM/REAL,   SPECTRUM/IMAG
##SYMBOL=    X,             R,               I
##VAR_TYPE=  INDEPENDENT,   DEPENDENT,       DEPENDENT
##VAR_FORM=  AFFN,          ASDF,            ASDF
##VAR_DIM=   65536,         65536,           65536
##UNITS=     HZ,            ARBITRARY UNITS, ARBITRARY UNITS
##FACTOR=    0.456856943014862, 1,           1
##FIRST=     14782.0589164792, 0,            0
##LAST=      -15158.0608439998, 0,           0
##MIN=       -15158.0608439998, -247864513,  0
##MAX=       14782.0589164792, 505917910,    0
$$ Real data points
##PAGE= N=1
##DATA TABLE= (X++(R..R)), XYDATA
$$ [...]
41246d066352m516594J197755N071045Q077338R426904N544653l491745j1073709
41238F169295j0821749m292659P45910n42185m704810n017933n64730K917094
41230a6111767K013102R08762L869349O840433L562908k587856k172099M973982
41222A296814Q344085L264021j966104n91663J616874k015795o148160l078390
41214G21682K215195j60626o860007n409502M694510R640239K513049o425717
41206I28823n912284R99098M738508L432390J343467k10432k040268j905813J625150
41197B998639L410173j934438r813462j0124276j746297N588574N334485K102614
41189d183988K166489L380251P27225l304898j984243M043362O656700K512640
$$ plain form
41246 -4066352 -8582946 -7385191 -2314146 5763192 15190096 20734749 17243004 6169295
41238 6169295 -4652454 -8945113 -8199203 -8741388 -13446198 -18464131 -19028861 -16111767
41230 -16111767 -14098665 -13189903 -9320554 -2480121 1082787 -1505069 -3677168 1296814
41222 1296814 9640899 12904920 10938816 10347153 11964027 9948232 3800072 721682
41214 721682 2936877 2776251 -4083756 -9493258 -4798748 4841491 7354540 928823
41206 928823 -4983461 -3984363 754145 4186535 5530002 5319570 3279302 1373489 2998639
41197 2998639 6408812 4474374 -5339088 -15463364 -17209661 -11621087 -6286602 -4183988
41189 -4183988 -2017499 1362752 2089977 -1214921 -3199164 844198 7500898 10013538
41181A0013538k118452j377188K063761L082403K355853K709616J966291l203275
41173A5492547r000929p964421j30278O385030O294061K143075k062863n442763
41165E713459p056690m756490L33666L631173L547679L149068L892411L241361
41157A1695637J96192k471697l254286l555067l066661J76401L969194L302116
41149F991829j064365l121089j950149k600414n177383l738450J295770J708916
41141g655335l282860l501653M226500Q360409J623340n881314l526571K654549
41133f982935K502158l59511K207204N923291K346597m150227l632402J882394
41125b63431L473531J532970J993739K866244m86436l434595l99524K678436n02334
$$ plain form
41181 10013538 7895086 6517898 8581659 11664062 14019915 16729531 18695822 15492547
41173 15492547 6491618 -1472803 -1603081 4781949 11076010 13219085 11156222 5713459
41165 5713459 -1343231 -6099721 -5766055 -2134882 1412797 4561865 8454276 11695637
41157 11695637 11891829 9420132 6165846 2610779 -455882 -279481 3689713 6991829
41149 6991829 5927464 2806375 856226 -1744188 -6921571 -10660021 -9364251 -7655335
41141 -7655335 -10938195 -14439848 -10213348 -1852939 -229599 -6110913 -9637484 -6982935
41133 -6982935 -4480777 -4840288 -2633084 3290207 5636804 1486577 -2145825 -263431
41125 -263431 3210100 4743070 6736809 9603053 9116617 5682022 5282498 7960934 7458600
41116G458600k525198L717297Q189680P44292p243723j578476P047075J465889
41108A7275436q186920j449483J2517645R471845l436322J488543J8970881J5934435
41100F2586060p692117j4943504K813983J1075698k132788l942034J7279696K6812024
41092I1857018J8824682M7290559J25366182J58972108O3607361r4239428j65608940
41085B46069542j11382367l3719810j6534092l0015463j7935979P652165Q374703
41078E2508699o400986m362318R161197O479156j0674709j7857106j0400671l511857
41070A4941405j968304N63936K192183k035540n152323J85784N423704M57894
41062A4608739p239413o271427j682539k871572l889680M084396J2294736P527989
$$ plain form
41116 7458600 4933402 8650699 16840379 17584671 10340948 8762472 15809547 17275436
41108 17275436 9088516 7639033 20156678 29628523 26192201 27680744 46651625 62586060
41100 62586060 54893943 39950439 42764422 53840120 51707332 47765298 65044994 91857018
41092 91857018 110681700 157972259 283338441 442310549 505917910 411678482 246069542
41085 246069542 134687175 100967365 84433273 54417810 36481831 44133996 52508699
41078 52508699 46107713 41745395 50906592 57385748 46711039 28853933 18453262 14941405
41070 14941405 12973101 13537037 15729220 13693680 8541357 8727141 14150845 14608739
41062 14608739 7369326 1097899 -584640 -3456212 -7345892 -3261496 9033240 16561229
41054A6561229l985007o557139p25592J277340j542924p20005K753272R02172
41046G963346m121913l645426O87784Q68592r31682K847807P841228L376521p162511
41037G723746r701246k324375K458774j320062n904115m940900j284009K034409
41029a3257778N650117P238838K890150l857868n163835j205599R21684l57960
41021g142251l96023J390408J423274M97846J603348J743055k611743n272004
41013h764090J336148J0638594R374543j217053p024147l248409Q04046k70672
41005A628960j180974O36690J47634l443693m101668j248299r00709k213404K220608
40996h454855R854171Q290070l471103j0443243m744275K942870K809597O00054
$$ plain form
41054 16561229 12576222 6019083 5293491 6570831 5027907 4307902 7061174 7963346
41046 7963346 3841433 196007 883791 1752383 820701 3668508 11509736 14886257 7723746
41037 7723746 -1977500 -4301875 -1843101 -3163163 -9067278 -14008178 -15292187 -13257778
41029 -13257778 -7607661 -368823 2521327 -1336541 -6500376 -7705975 -6784291 -7142251
41021 -7142251 -7538274 -6147866 -4724592 -4226746 -2623398 -880343 -3492086 -8764090
41013 -8764090 -7427942 3210652 12585195 11368142 4343995 1095586 1899632 1628960
41005 1628960 447986 1084676 1232310 -2211383 -6313051 -7561350 -8462059 -10675463 -8454855
40996 -8454855 1399316 9689386 6218283 -4224960 -8969235 -6026365 -3216768 -2616714
40988b616714K905938L318492m134002j0838537o796355K324495M965455J916998
40980h954230J416506L386599K131405q74010r9514K211923k56022n349407n313258
40971a1700008k18447K443310N21707n78383J696212L483868K060024m52440j718363
40962d462520j731617n39340J827011L641174L467574K299526P69100k328595
40954B942313n444037l554296L072120N687893l64250o251296k151675O312513
40946B49285N978887k641430n732261J556572O997883N89023r493476q930533
40938a1426050J846183Q773174L929729m819081n976828J22034L235404j488975
40930e804410o560239l288367N069737P846963K871636n10473L775177Q935684
$$ plain form
40988 -2616714 289224 3607716 -526286 -11364823 -18161178 -15836683 -10871228 -8954230
40980 -8954230 -7537724 -4151125 -2019720 -2893730 -2993244 -781321 -1037343 -6386750 -11700008
40971 -11700008 -11918455 -9475145 -8953438 -9531821 -7835609 -4351741 -2291717 -2744157 -4462520
40962 -4462520 -6194137 -6733477 -4906466 -1265292 2202282 4501808 5270908 2942313
40954 2942313 -2501724 -6056020 -2983900 2703993 2339743 -3911553 -6063228 249285
40946 249285 6228172 3586742 -2145519 -588947 6408936 6997959 -2495517 -11426050
40938 -11426050 -9579867 -806693 3123036 -1696045 -7672873 -7550839 -4315435 -5804410
40930 -5804410 -12364649 -15653016 -10583279 -2736316 135320 -375153 3400024 12335708
40922A2335708N692730l990684j0296616q692103l044066J715439L676001K445808
40914a57783n81488j537598J419837M313994K695693j175663j708443J279444
40906D547993K897703R95258k127222m861600p192016p056586k280922L437021
40898a1640371L055750l476605p385900k701238N111383O542774J189998j758381
40890a1062590L561403J0830626R227263j697641j0294544q026778p58428Q00747
40882g419942k864985k880184J580334J870870l615764m763598L002390R406261
40874e684618N709396j104572j170162J839480O8753k236821K616466Q288194
40866H326116L448859o359266n418216N041906O971504m827703j3610696p678086
$$ plain form
40922 12335708 18028438 14037754 3741138 -4950965 -7995031 -6279592 -2603591 -157783
40914 -157783 -739271 -2276869 -857032 3456962 6152655 4976992 3268549 4547993
40906 4547993 7445696 8440954 6313732 1452132 -5739884 -12796470 -15077392 -11640371
40898 -11640371 -8584621 -12061226 -19447126 -22148364 -17036981 -10494207 -9304209 -11062590
40890 -11062590 -7501187 3329439 12556702 10859061 564517 -7462261 -8220689 -7419942
40882 -7419942 -10284927 -13165111 -11584777 -9713907 -13329671 -18093269 -15090879 -5684618
40874 -5684618 24778 -1079794 -2249956 -410476 -341723 -2578544 37922 8326116
40866 8326116 11774975 5415709 -2507 5039399 12010903 7183200 -6427496 -14105582
40858a4105582K443372L389053j095123j405148Q71010M82047J358947P540469
40850e20955J0649698J739243j1063650j2283187k275725M584158K747472J058656
40842e364290M772006P036438K748947j700645M39508M540846K030493o078562
40834H424741j0892660q204726k695755j26554p27241j603441j825916k245845
40826a9897397j923326J540186P153262R295164M427369k861712m664104P188
40818f923370M294497L097861j195777l753593l218458n98834L177247O016276
40810H95849M983697M96104l240334l733326k266258L68503M493214O608864J462926
40801A0069239p735018r612694o41392P440314L814094n322554o464606J368622
$$ plain form
40858 -14105582 -11662210 -8273157 -9368280 -10773428 -9902418 -9420371 -8061424 -520955
40850 -520955 10128743 11867986 804336 -11478851 -13754576 -9170418 -6422946 -5364290
40842 -5364290 -592284 6444154 9193101 7492456 7931964 12472810 14503303 8424741
40834 8424741 -2467919 -10672645 -13368400 -13494954 -14222195 -15825636 -17651552 -19897397
40826 -19897397 -21820723 -20280537 -13127275 -3832111 595258 -2266454 -6930558 -6923370
40818 -6923370 -2628873 468988 -726789 -4480382 -7698840 -8297674 -5120427 895849
40810 895849 5879546 6375650 3135316 -598010 -2864268 -2495765 1997449 8606313 10069239
40801 10069239 2334221 -7278473 -7919865 -479551 3334543 -1988011 -8452617 -7083995
40793g083995P606592P046001M059746J699824j614397m319903j859802L550184
40785I084250L545578l136084p395340l409046L079946M520826J776055o10830
40777G455355k458418n151785o175117k913564J580502K440973L01078k01171
40769e122147K396552M957405M563092J492887j950885l384970j974160M56754
40761A434528J146644j18129j277667k018444m164920p027387o413536p34497
40753a9173408N326362O347631K875285l79745r57165j96374J84289J22801L61022
40744e489302J494065L410129M667876L520701M19601j950896j980524q24617
40736C267033o458O00417J147264J82702l456624q104476j0087828o999102p8629
$$ plain form
40793 -7083995 522597 7568598 11628344 13328168 11713771 7393868 5534066 9084250
40785 9084250 12629828 9493744 2098404 -1310642 1769304 6290130 8066185 7455355
40777 7455355 4996937 -154848 -6329965 -9243529 -7663027 -5222054 -4920976 -5122147
40769 -5122147 -2725595 2231810 6794902 8287789 6336904 2951934 977774 1434528
40761 1434528 2581172 2463043 1185376 -833068 -4997988 -12025375 -18438911 -19173408
40753 -19173408 -13847046 -7499415 -4624130 -5003875 -5961040 -6157414 -5973125 -5850324 -5489302
40744 -5489302 -3995237 -585108 4082768 7603469 8023070 6072174 4091650 3267033
40736 3267033 3260575 3860992 5008256 5190958 1734334 -6370142 -16457970 -23457072 -23535701
40727b3535701O183652P579129M420748J151712M91328K48352j668118k271158
40719g400056J841379P276963P455512K467097j237652j002204q19616k961137
40711E620286l949490j376433J673565J980998L73199j870566m841583n996010
40703h386034j285357O709559R287077M103281q48441l77340j32277m803671p787116
40694c520319k378709M763458L377896k929947k328720N262161P801934O62254
40686A0710008o669405n902855o00243K247388J759960R0498k104023k933509
40678c402181R05604P505111R273061L138352m277884n455822j108657K772695
40670I350279K662621m43471k905627q84758N005004P488250Q47973q965692j0254610
$$ plain form
40727 -23535701 -17352049 -9772920 -5352172 -4200460 -3709132 -3460780 -5128898 -7400056
40719 -7400056 -5558677 1718286 9173798 11640895 10403243 9401039 8581423 5620286
40711 5620286 1670796 294363 1967928 3948926 4322125 2451559 -2390024 -8386034
40703 -8386034 -9671391 -2961832 6325245 10428526 9580085 9202745 9070468 4266797 -3520319
40694 -3520319 -5899028 -1135570 2242326 -687621 -3016341 2245820 10047754 10710008
40686 10710008 4040603 -1862252 -2462495 -215107 1544853 1635351 -468672 -3402181
40678 -3402181 -2496577 5008534 14281595 17419947 13142063 7686241 6577584 9350279
40670 9350279 12012900 11569429 8663802 7779044 12784048 20272298 21120271 12154579 1899969
40661A899969k177654L941169J974660j013959J391629M098742Q14172m369383
40653F559345m761702k638186l323073m396751j155115K832294J671018j003819
40645f215989K071608P553688N931681j620498m264418M20843L008652p92623
40637F092944l300427K04894K591740j651164n316778n37648O869482O207144
40629A1160187j039575m594450k248103j332396m234189m394033Q61437M201621
40621a619501L33084m214536q48048O876616P530654j445853r748306q397357
40613a1533247p80143M253569M694482M792485N451862K852086l026872n733218
40605I71004j518475M096532L578425k208185n802646l285291K244593O057881
$$ plain form
40661 1899969 -277685 3663484 5638144 4624185 6015814 10114556 10928728 6559345
40653 6559345 1797643 -840543 -4163616 -8560367 -9715482 -6883188 -5212170 -6215989
40645 -6215989 -4144381 3409307 9340988 7720490 3456072 3876915 6885567 6092944
40637 6092944 2792517 2997411 5589151 3937987 -1378791 -1916439 4953043 11160187
40629 11160187 10120612 5526162 3278059 1945663 -2288526 -6682559 -5821122 -1619501
40621 -1619501 -1286417 -5500953 -6349001 527615 8058269 6612416 -3135890 -11533247
40613 -11533247 -12313390 -8059821 -3365339 1427146 6879008 9731094 6704222 971004
40605 971004 -547471 3549061 7127486 4919301 -883345 -4168636 -1924043 4133838
40597D133838N863456J219609o076329j0797504q303962p82396M563101M414653
40589e765534K361312K185049K864462K177664P78592j53461j642943m225488
40581a420347n594441m011860j426680k42692M48209K304106L915505L126787
40573b901413J247446J257298L092367M080365K996643O23671k415872n076419
40565B904086m605441K9904M254600K209113m537825p331467j504852O720095
40557a861787P658170L39811o426350n058781J835828N279302J206198n005782
40549b033391o141161k371380M33612L8117K95055L391798N331414K676121r63680
40540F56505m93087K027650Q13202l478423m409532n95194J811400m96304k410239
$$ plain form
40597 4133838 9997294 11216903 5140574 -5656930 -13960892 -14743288 -10180187 -5765534
40589 -5765534 -3404222 -1219173 1645289 3822953 4601545 4448084 2805141 -1420347
40581 -1420347 -7014788 -11026648 -12453328 -12696020 -12247811 -9943705 -6028200 -2901413
40573 -2901413 -1653967 -396669 2695698 6776063 9772706 10396377 7980505 2904086
40565 2904086 -1701355 -1671451 2583149 4792262 254437 -7077030 -8581882 -1861787
40557 -1861787 5796383 6136194 -290156 -5348937 -3513109 1766193 2972391 -2033391
40549 -2033391 -8174552 -10545932 -10112320 -10074203 -9779148 -6387350 -1055936 1620185 656505
40540 656505 163418 2191068 3004270 -474153 -4883685 -5478879 -3667479 -4163783 -6574022
40531f574022P67462N145960M483862L9814k268632j612673k120900m147662l033225
40522i320016K195017N472319K354187k844757l108382R75263K186386k487576
40514d577559o849560l487948O035129J2328915R230560Q10015m133228k547539
40506F808785P06018N16397k353120m166463l805602k397443J74675M147032O484463
40497F114742L648461j914379l329581Q38930L599049o1968m821965k877188L376603
40488D572704M260567k302329p102066l283736L544611L796244k499274o729812
40480e743091l843486K499423O302883N650466K224360j514703l556338l527428
40472a507914l261454l986171l463013Q46607O208542O679759J715358j887611
$$ plain form
40531 -6574022 -5806560 -660600 3823262 3863076 1594444 -18229 -2139129 -6286791 -9320016
40522 -9320016 -7124999 -1652680 701507 -2143250 -5251632 -4276369 -2089983 -4577559
40514 -4577559 -11427119 -14915067 -8879938 3448977 12679537 13489552 9356324 6808785
40506 6808785 7514803 8031200 5678080 1511617 -2293985 -4691428 -4516753 -369721 6114742
40497 6114742 9763203 7848824 4519243 5358173 8957222 8895254 4073289 1196101 4572704
40488 4572704 8833271 6530942 -571124 -3854860 -310249 3485995 986721 -5743091
40480 -5743091 -9586577 -7087154 -784271 4866195 7090555 5575852 2019514 -1507914
40472 -1507914 -4769368 -8755539 -12218552 -11371945 -5163403 1516356 3231714 1344103
40464A344103Q54131N861983N574391o39453n759619m210298J698463N068315
40456I792016K191704l938602p368736n774388k415362r68741k77351L009156
40448e750304P733447Q561254L627355k599056n697928o055083m958636j074644
40440f213595N090520P815944K977878m722561p188588l472711Q73288K872420
40432a967405L816561L283894p68219n712919n833870j526007P43246m68778Q79399
40423g554098O124248O621519k574568j1843832r243078J824549P759034M509961
40415d376265P18376J476620J000049m897952r517214n344622L641481P562000
40407i737527M462679R95258J244767K091565J4557l373867m447734k403077R54283
$$ plain form
40464 1344103 2198234 8060217 13634608 12995155 7235536 3025238 4723701 9792016
40456 9792016 11983720 8045118 676382 -5098006 -7513368 -8482109 -8759460 -5750304
40448 -5750304 1983143 10544397 14171752 11572696 5874768 -180315 -5138951 -6213595
40440 -6213595 -1123075 6692869 9670747 4948186 -2240402 -5713113 -4839825 -1967405
40432 -1967405 1849156 5133050 4364831 -1348088 -7181958 -8707965 -7964719 -8433497 -7554098
40423 -7554098 -1429850 5191669 2617101 -9226731 -18469809 -16645260 -8886226 -4376265
40415 -4376265 -3657889 -2181269 -1181220 -6079172 -15596386 -20941008 -17299527 -9737527
40407 -9737527 -5274848 -4279590 -3034823 -943258 -928701 -4302568 -8750302 -11153379 -10199096
40398a0199096L849637N403828N318056L774588J148045j918230l531384j289336
40390B556108L960750O822430L137658l899091p270394n229732k295060j227438
40382c444769R9386K263489J338881l684634o504337k361084L472539L168569
40374e651960j290669j614105K968644M862748J189910k110111j460566j246069
40366d352178m034576m445302R20131N577354L204758j167512N76777N389171
40358A668623L851082l750250p572546l958406J51102J46071M75346M697421Q017443
40349C725886N142835j311948n569020o374504n387260l106072p90863j261339
40341a4932285l388111j349398N651397R012842K670549o132465o212844J508289
$$ plain form
40398 -10199096 -6349459 -945631 4372425 8147013 9295058 7376828 3845444 2556108
40390 2556108 6516858 13339288 16476946 12577855 5307461 77729 -2217331 -3444769
40382 -3444769 -3345383 -1081894 256987 -3427647 -9931984 -12293068 -8820529 -5651960
40374 -5651960 -6942629 -8556734 -5588090 -725342 464568 -1645543 -3106109 -4352178
40366 -4352178 -8386754 -12832056 -11911925 -6334571 -3129813 -4297325 -3720548 1668623
40358 1668623 5519705 1769455 -5803091 -9761497 -9610395 -9464324 -8988978 -4291557 3725886
40349 3725886 8868721 7556773 1987753 -4386751 -9774011 -12880083 -13670946 -14932285
40341 -14932285 -18320396 -19669794 -14018397 -5005555 -2335006 -8467471 -14680315 -13172026
40333a3172026O461020M406829J168865J013857J294807K52914Q61079L551411
40325E838756L289156j541789m428196n21427M793473L808393j492548k959217
40317F786601O82620K424634j466883o074638o101523l249471j789998j523780
40309a0312438K98397L047402L553645J463621o19840j593126k157861j239086
40301g559286K690934O227966L235430m923855p759878M92493J0742409J0241134
40293A3387347L97901n764736k815194Q36635k009392o393708m934435j36033
40285g431615Q64730j866489k888314j305414m01746K44135L536690O769673L851824
40276A373474l528233n871998K30353O359031M933304L84510J059225N184907
$$ plain form
40333 -13172026 -6711006 -2304177 -1135312 -121455 1173352 1426266 2287345 5838756
40325 5838756 9127912 7586123 3157927 2636500 7429973 11238366 9745818 6786601
40317 6786601 7469221 9893855 8426972 2352334 -3749189 -6998660 -8788658 -10312438
40309 -10312438 -10014041 -6966639 -3412994 -1949373 -2569213 -4162339 -6320200 -7559286
40301 -7559286 -4868352 1359614 4595044 -328811 -8088689 -7596196 3146213 13387347
40293 13387347 13785248 8020512 5205318 6041953 4032561 -2361147 -7295582 -7431615
40285 -7431615 -6566885 -8433374 -11321688 -12627102 -13028848 -12784713 -9248023 -2478350 1373474
40276 1373474 -2154759 -8026757 -7796404 -1437373 3495931 3880441 4939666 10124573
40268A0124573L411130o143387j3624291j0401891n24349M834332J453156l914933
40260a4785660l270858K925004P731446O827122K345826j573482l373956l393536
40252f568094j919369J48207J198841J484392L322562O518046O572043R98706
40244A1755334n054443m296515K478642O553201K413555n291443p756323k533014
40236a731006M092586M744306l26050l523995K15824O069771N786904J32112j996547
40227A3463905K041127L843742j932097p696195n056414J142658J525731j527413
40219E805044O84956N858397L908258l937328n506866J186726L656416l579071
40211H076532r309759m867786K058147K616534J743666N715169P316029j668966
$$ plain form
40268 10124573 13535703 7392316 -6231975 -16633866 -17158215 -12323883 -10870727 -14785660
40260 -14785660 -18056518 -15131514 -7400068 -572946 1772880 199398 -3174558 -6568094
40252 -6568094 -8487463 -8339256 -7140415 -5656023 -2333461 4184585 10756628 11755334
40244 11755334 6700891 2404376 4883018 11436219 13849774 8558331 802008 -1731006
40236 -1731006 2361580 7105886 6779836 3255841 3471665 9541436 15328340 15460452 13463905
40227 13463905 15505032 19348774 17416677 9720482 4664068 5806726 7332457 5805044
40219 5805044 6490000 12348397 16256655 12319327 6812461 7999187 11655603 8076532
40211 8076532 -1233227 -6101013 -4042866 -1426332 317334 6032503 13348532 11679566
40203A1679566j2768217j1742601o43338O826509O929949O662738O570875L31671
40195A3847152r103078j0285158k436684K129429j530524l522321K324058P256215
40187a320911L199240l238820k452936K553290L025459o65794j837295P6335J60510
40178e00922k149149k861327j030566R13917K585505M789873N313125K034794
40170I095250j661685j124299J478467L4755n363536p937353m192758J810528
40162g860631N213037N822716N174426L144039J04334j327957K60284K237287
40154A2767535J320509j581658k571355m42636J338138n57857m182054m466412
40146A624210m99367K553672P49014k557935j848176J715795K265596q20992j885217
$$ plain form
40203 11679566 -1088651 -12831252 -13474590 -6648081 281868 6944606 13515481 13847152
40195 13847152 4744074 -5541084 -7977768 -5848339 -7378863 -10901184 -8577126 -1320911
40187 -1320911 1878329 -1360491 -3813427 -1260137 1765322 1099528 -737767 -661432 -500922
40178 -500922 -2650071 -5511398 -6541964 -5628047 -3042542 1747331 7060456 9095250
40170 9095250 7433565 6309266 7787733 7822488 2458952 -5478401 -9671159 -7860631
40162 -7860631 -2647594 3175122 8349548 11493587 11597921 10269964 10530248 12767535
40154 12767535 14088044 12506386 9935031 9492395 10830533 10272676 6090622 1624210
40146 1624210 1124843 3678515 4427529 1869594 21418 1737213 4002809 3181817 1296600
40137A296600Q80040J626034l251996q043884n991683M55294L889588K746620
40129f393387J322307J606925J906852K281050M665331P593329O693793J221235
40121B0897435m623154p336649o747304l145182L027261P956554O426672q49345
40113A5606288o321087m694081N58134K575672J01126k336903j656587N8193l70038
40104C520717k046213j327407J984979K909232j698559o779469m811489K608139
40096e640070N712333J018830k890192J105109O981874N356621j273346l411236
40088F959923n52285k98861l260136k019047L759562M725704j697578n266964
40080B350318J91723N950083L222443k098666p83959K785034j238176r035181
$$ plain form
40137 1296600 2176640 3802674 550678 -7493206 -13484889 -13029595 -9140007 -6393387
40129 -6393387 -5071080 -3464155 -1557303 723747 5389078 12982407 19676200 20897435
40121 20897435 16274281 8937632 2190328 -954854 2072407 10028961 16455633 15606288
40113 15606288 9285201 4591120 5149254 7724926 7826052 5489149 3832562 3890755 3520717
40104 3520717 1474504 147097 2132076 5041308 3342749 -3436720 -8248209 -5640070
40096 -5640070 72263 1091093 -1799099 -693990 6287884 11644505 10371159 6959923
40088 6959923 6407638 6108777 2848641 829594 4589156 9314860 7617282 2350318
40080 2350318 2542041 8492124 11714567 9615901 8831942 11616976 10378800 1343619
40072A343619p415709M479888J2349781P330447l038238p866833o222480k841353
40064a880878L20595K756148K663498O26194K57331J289089j433060p855035r229084
40055a2485202j032341P732089O562379p83880k637164J976792K756684l903337
40047a813980q246714k493859O911814R072892L756970j092921k441220l827244
40039a74262n599759k969320M062048P022213M74453q351174q323896Q2160N787053
40030g990484L264424o89890P32910L290512l11027o817436o196620K516408Q795630
40021c405573N819479o66157k734623j656058k510663l770692q19034L820555
40013e922766L261455j675452k520163L341847P935053M852517j422957l265107
$$ plain form
40072 1343619 -6072090 -1592202 10757579 18088026 15049788 7182955 960475 -1880878
40064 -1880878 -1560283 1195865 3859363 4485557 4742888 6031977 4598917 -3256118 -12485202
40055 -12485202 -13517543 -5785454 776925 -6955 -2644119 -667327 2089357 -1813980
40047 -1813980 -10060694 -12554553 -5642739 3430153 7187123 6094202 3652982 -174262
40039 -174262 -5774021 -8743341 -4681293 2340920 2815373 -5535801 -13859697 -13777537 -7990484
40030 -7990484 -4726060 -5415950 -4683040 -1392528 -1703555 -8520991 -14717611 -12201203 -3405573
40021 -3405573 2413906 1747749 -986874 -2642932 -5153595 -8924287 -9743321 -5922766
40013 -5922766 -2661311 -4336763 -6856926 -3515079 4419974 9272491 7849534 4584427
40005D584427p68285J125871J579010L038208M444004K379485k167639m711330
39997I503751m669623n630696p736379o210994M30612O375457O117724J876497
39989E6349l86328O57234J338303o63111l355925l551447m94574L626081N521869
39980B748451L636983q9073k203773j826299j114847j443528j765488j579390
39972c636964k178629l236642j837614K281392M202883O09745m011523l110258
39964a0917610K049550M112275M63590l725073l803794j160952J154688K895331
39956h931995M087370K755234j346549m216056k443768J824419L938718K837880
39948a494747J199807J006419J536849Q86445j997875n584598n708160m9691O829480
$$ plain form
40005 4584427 3816142 4942013 6521023 9559231 14003235 16382720 14215081 9503751
39997 9503751 4834128 -796568 -8532947 -14743941 -14313329 -7937872 -1820148 56349
39989 56349 -329979 327255 1665558 1002447 -2353478 -5904925 -6399499 -2773418 2748451
39980 2748451 6385434 6296361 4092588 2266289 1151442 -292086 -2057574 -3636964
39972 -3636964 -5815593 -9052235 -10889849 -8608457 -4405574 -3795829 -7807352 -10917610
39964 -10917610 -8868060 -4755785 -4292195 -8017268 -11821062 -12982014 -11827326 -8931995
39956 -8931995 -4844625 -2089391 -3435940 -7651996 -10095764 -8271345 -4332627 -1494747
39948 -1494747 -294940 711479 2248328 3134773 1136898 -4447700 -10155860 -10205551 -3376071
39939c376071P350045J551245j612520K752396P134546K613877o574793q266906
39931A571819j45559P202305N773491k46998l250158k647516j896379j372945
39923D988060P5354P93022q05540k058906o1889K601671J528531j899081k328008
39914B833214Q60937K524526Q4802k625775j945469k55407j889434n964010p091467
39905a3468083k548005M144037P250582M830167k638k973218k714688o96059J726480
39896d451425M271686N647908L256241k852027p627355o001928K55916M173706
39888c327278K551819l44253K84727K777982K366728q98599k308683l09088P56534
39879A549889k286988n643857l748159J827094L621076j184051o139869l959573
$$ plain form
39939 -3376071 3973974 5525219 3912699 6665095 13799641 16413518 9838725 1571819
39931 1571819 1426260 8628565 14402056 14155058 10904900 8257384 6361005 4988060
39923 4988060 5063414 5856436 5050896 2991990 2930101 5531772 7060303 5161222 2833214
39914 2833214 3694151 6218677 6303479 3677704 1732235 1476828 -412606 -6376616 -13468083
39905 -13468083 -16016088 -11872051 -4621469 208698 206060 -2767158 -5481846 -6177905 -4451425
39896 -4451425 -179739 5468169 8724410 5872383 -1754972 -7756900 -7500984 -3327278
39888 -3327278 -775459 -1119712 -834985 1942997 4309725 3411126 1102443 793355 1549889
39879 1549889 -737099 -6380956 -10129115 -8302021 -4680945 -5864996 -12004865 -15964438
39871a5964438L729176Q734868O646515P89833l597714m813029l429545K25328
39863g679006M729467O481650L215660k488226n694079m485393j007883J903684
39855e024126K976841K054476j68652j856141j430510L49279J137866Q8352j130046
39846c002661q15737L19474o6753k873606n631644m408340J393577O758009N774463
39837b553218r47337o111531m298597J774321N515937M584352J952495O31818
39829E48240O09896L99891r22370k843137l126228O3498M354620M447522k98058
39820C233874l336992j10855M232092K311005l634624n154546q73192K631161
39812g02077K786434L828927O120445L413139m977014r438620l997472L838472
$$ plain form
39871 -15964438 -12235262 -3500394 3146121 3935954 338240 -4474789 -7904334 -7679006
39863 -7679006 -2949539 3532111 6747771 4259545 -1434534 -5919927 -6927810 -5024126
39855 -5024126 -2047285 7191 -161461 -2017602 -3448112 -3098833 -1960967 -1872615 -3002661
39846 -3002661 -3818398 -3498924 -3565677 -6439283 -12070927 -16479267 -15085690 -8327681 -2553218
39837 -2553218 -3500555 -9612086 -13910683 -12136362 -6620425 -2036073 -83578 548240
39829 548240 1158136 1558027 635657 -2207480 -5333708 -5270210 -915590 3531932 3233874
39820 3233874 -103118 -213973 4018119 6329124 2694500 -2460046 -3333238 -702077
39812 -702077 2084357 5913284 12033729 15446868 10469854 1031234 -2966238 872234
39804H72234M871475J787317J684555K289979k700637r331754p635965J254720
39796f908076N240694j33461n307038k558668K824678L181680J016180K832635
39788A88624O762988N402409j771279p006188n259771k63742J803188J48004j551166
39779a546933j201958l74970p41538j210525k48461P30996n63413k400082n60071
39770h116955M239417N721298J700987j365179J506474M764607P75570p113752
39762B112467r208324m348949J82489K156628O005335J0388027P175814l404124
39754A1059363r180743l897018K704389O41808m854857l492455L336786P213788
39746C531061P143876P372861O127905p07190q093541p070111j24046J309782
$$ plain form
39804 872234 5743709 7531026 9215581 11505560 8804923 -526831 -8162796 -6908076
39796 -6908076 -1667382 -1800843 -7107881 -9666549 -6841871 -3660191 -2644011 188624
39788 188624 6951612 12354021 10582742 3576554 -1683217 -1946959 -143771 4233 -1546933
39779 -1546933 -2748891 -3123861 -3865399 -5075924 -5324385 -4593389 -5156802 -7556884 -8116955
39770 -8116955 -3877538 1843760 3544747 2179568 3686042 8450649 9226219 2112467
39762 2112467 -7095857 -11444806 -11262317 -9105689 -3100354 7287673 14463487 11059363
39754 11059363 1878620 -2018398 685991 1327799 -3527058 -7019513 -3682727 3531061
39746 3531061 10674937 18047798 24175703 23468513 15374972 8304861 8180815 9490597
39738I490597n074858r037858m131480L913566P952345Q101650O110206R19626
39730A8243794n655703p622430m066294j826292m234781n235694j85103N433408
39722e149095M870992P86909m68639O13206N4837m67095L184471Q138089P247350
39713A8811025M83897m363614k794681J350509K890822J402896j224340m191433
39705A2365081o470781n936752k395935Q06052L67815k792161m199223m69465
39697h725369O784431J1692018R689659K513644l897166o498722p390860q353303
39689d185668p099076j543856N418921Q796702P132218K622629k070230m564318
39681D507322l177185K38342O86409l365786o814482n111961j104774J43617j92146
$$ plain form
39738 9490597 4415739 -4622119 -8753599 -4840033 3112312 11213962 17324168 18243794
39730 18243794 12588091 4965661 899367 -926925 -5161706 -10397400 -10582503 -5149095
39722 -5149095 -278103 508806 40167 653373 708210 241115 3425586 11563675 18811025
39713 18811025 19294922 14931308 12136627 13487136 16377958 17780854 16556514 12365081
39705 12365081 5894300 -42452 -2438387 -1632335 -1264520 -4056681 -8255904 -8725369
39697 -8725369 -1940938 9751080 19440739 21954383 18057217 11558495 4167635 -4185668
39689 -4185668 -11284744 -12828600 -7409679 1387023 8519241 11141870 9071640 4507322
39681 4507322 1330137 1568479 2254888 -1110898 -7925380 -13037341 -14142115 -13998498 -14190644
39672a4190644K260381O159046N921083J193050k342511j818723j84102K39107
39664b763313O56620J211826k1132j872725k45246M554371O912618M674532K302034
39655A5409585K272104K80947o318959j1662908r213312j872905K287171J231420
39647g586857n24180m11944l15513j213206j065787J270127M069785N403252N099014
39638D724691L955714K875882K172924N64536l278715p126856o602531k157739
39630d872094J2270k524627l420829K342313Q490186N608950m205463j0067982
39622h637276p877702l255190O31186O899729J4269616J3947103K998792q292610
39614A0683648r568235l760273q5691k14861J73300J312060L23913r76175J262720
$$ plain form
39672 -14190644 -11930263 -5771217 149866 1342916 -999595 -2818318 -3002420 -2763313
39664 -2763313 -2106693 -894867 -915999 -2788724 -3033970 1520401 8433019 13107551 15409585
39655 15409585 17681689 17962636 11643677 -19231 -9232543 -11105448 -8818277 -7586857
39647 -7586857 -8111037 -8522981 -8838494 -10051700 -11117487 -9847360 -5777575 -374323 4724691
39638 4724691 8680405 11556287 13729211 14293747 11015032 3888176 -2714355 -4872094
39630 -4872094 -4859824 -7384451 -10805280 -8462967 27219 5636169 1430706 -8637276
39622 -8637276 -16514978 -19770168 -19138982 -12239253 2030363 15977466 18976258 10683648
39614 10683648 1115413 -2644860 -2730551 -2945412 -2772112 -1460052 -1136139 -2112314 -849594
39605h49594M230329J649349n050785p878911m752943j579298q82270J651743
39597a3462380O449921O210717j627533p672012l559108M911235O471777J012163
39589a265220k173427M85175L693619M267016N047430O613998M583015j590931
39581A9660675n366395l225352j017615m496452r221802o895072J719600P419313
39573a423100M905932j660796n443856m137543K36213M484993N983216M141986
39565G087045J023745j188743k647711l743481k613444J481433M240343J196080
39557D835267m368231m766438M83492L616492J069465j010295K020061M476995
39549F356808p5352o718708o041201O99168L797060J160389Q32894N753674P279729
$$ plain form
39605 -849594 3380735 5030084 -20701 -7899612 -12652555 -14231853 -15114123 -13462380
39597 -13462380 -7012459 -801742 -2429275 -10101287 -13660395 -8749160 -2277383 -1265220
39589 -1265220 -3438647 -2953472 740147 5007163 10054593 16668591 21251606 19660675
39581 19660675 14294280 11068928 10051313 5554861 -3666941 -10562013 -8842413 -1423100
39573 -1423100 3482832 1822036 -3621820 -7759363 -7523150 -3038157 2945059 7087045
39565 7087045 8110790 6922047 4274336 530855 -2082589 -601156 3639187 4835267
39557 4835267 467036 -4299402 -3815910 -199418 870047 -140248 1879813 6356808
39549 6356808 6281456 -437252 -6478453 -5779285 -1982225 -821836 11058 5764732 13044461
39540A3044461o72843j0197570r910589q55235O207315N464693P5610n716546
39532b560704j0046673r962545l079656N938844P986808J381373m871196k967262
39524a8181011L739836O743583M094035J077489J615973M018302M767044K664163
39516A0539414j048692l976984l705532J51189M527409N142483R33100m360872
39508H201515n526918j095580M484302M762013j250463o600920m154617L768446
39500B587778P722781L797179j354725r66911J877310L10295m411070m874357
39492D688280q9873K368412j490267n491605l037041K626566L809188K74648j059558
39483B598750K794790O550329M660046j217918n276602m848881j826648J130939
$$ plain form
39540 13044461 12371618 2174048 -7736541 -8591776 -2384461 3080232 3155842 -2560704
39532 -2560704 -12607377 -22569922 -25649578 -19710734 -11723926 -10342553 -15213749 -18181011
39524 -18181011 -14441175 -7697592 -3603557 -2526068 -910095 3108207 7875251 10539414
39516 10539414 9490722 5513738 1808206 1959395 6486804 11629287 12562387 8201515
39508 8201515 2674597 1579017 6063319 10825332 9574869 2973949 -1180668 2587778
39500 2587778 10310559 14107738 12753013 11786102 13663412 13973707 9562637 4688280
39492 4688280 4598407 6966819 5476552 -15053 -3052094 -425528 3383660 3658308 2598750
39483 2598750 5393540 11943869 16603915 15385997 10109395 5260514 3433866 4564805
39475D564805K739948K290158l10682l264899l866776j725992M97290N76390m41162
39466A059080k02948J365389K314266J782266P03243l90268k001167l828511m491746
39457c690396l642429k259842m12594K694756N773659N824177K941427J132530
39449H361288J918427J093859m140148q430262m568072N195797J0643003O702174
39441A6776066q19602m106945k687846j328379k632458m904371n135852j958609
39433f797996K833864N010486K358257j601887j627809J673546K890140Q13471
39425E552072L57984L411765M479786j59003n005075l341737J884458K606389
39417I786639j853465m851268l749608k737237l594771k032660L581707P014044
$$ plain form
39475 4564805 7304753 9594911 9284229 6019330 2152554 426562 923852 1500242 1059080
39466 1059080 856132 2221521 4535787 6318053 7021296 6631028 4629861 801350 -3690396
39457 -3690396 -7332825 -9592667 -10005261 -7310505 -1536846 4287331 7228758 8361288
39449 8361288 10279715 11373574 7233426 -1196836 -5764908 -569111 10073892 16776066
39441 16776066 15956464 11849519 9161673 7833294 5200836 296465 -4839387 -6797996
39433 -6797996 -3964132 1046354 3404611 1802724 174915 1848461 4738601 5552072
39425 5552072 5910056 9321821 13801607 13642604 8637529 5295792 7180250 9786639
39417 9786639 7933174 3081906 -667702 -3404939 -6999710 -9032370 -5450663 1563381
39409A563381K901769m174299n439540l08495K987639r47860p417534p898994
39401a8733933o56179P421424Q850463L600353j530965r77980L410612N213705
39393F597500J729938k760233k905672O34597K492501J71731k837110k386552
39385G36700P83591L039390L188319K623611J505692j124569l643760k808057
39377D300917P05691K469881J592988K281803N251701M148617l982696j0964870
39369E804032q325297q77974O91934k641502o19890P111460Q423967j168464r455499
39360a057233n749262L353697N619262J215171j403226m65650m78649j582081
39352e47971k62523K032903P46788l119753m563734k862622p98172J574807M768327
$$ plain form
39409 1563381 4465150 290851 -5148689 -5457184 -2469545 -3417405 -10834939 -18733933
39401 -18733933 -19390112 -11968688 -3118225 482128 -1048837 -2026817 1383795 6597500
39393 6597500 8327438 5567205 2661533 3296130 5788631 5960362 3123252 736700
39385 736700 1520291 4559681 7748000 10371611 11877303 10752734 7108974 4300917
39377 4300917 5006608 7476489 9069477 11351280 16602981 20751598 16768902 5804032
39369 5804032 -2521265 -3399239 -2707305 -5348807 -5968697 1142763 9566730 8398266 -1057233
39360 -1057233 -6806495 -3452798 2166464 3381635 1978409 1512759 1034110 -547971
39352 -547971 -810494 1222409 1969197 -1150556 -5714290 -8576912 -9375084 -7800277 -3031950
39343c031950N120740O37247k530684J063894N320054J803434m545497k472910
39335A364328N759873P142158j39181m238769j050984o07545p079920r716652
39327h566692k155574N022706K034571l529577o61686O055280N690080L34655
39319D223763J03190M687315M899632m74243l245964k42484K929918K498061M16954
39310A5796142k371223o766091r267787m366701N561817J1051620P795815J056139
39302A8489731l136323m265066l697283j405286J876058M236874N195294M590594
39294B1884593J06425q534326j4588476j0865126q31502M614565J981560j162538
39286g394825J168449N305401N661359L157058J353159p2937k877067n281495
$$ plain form
39343 -3031950 2088790 2726037 195353 1259247 6579301 8382735 3837238 1364328
39335 1364328 7124201 14266359 14127178 9888409 8837425 8229880 1149960 -8566692
39327 -8566692 -10722266 -5699560 -3664989 -7194566 -7856252 -1800972 3889108 4223763
39319 4223763 4326953 9014268 13913900 13439657 10193693 9951209 12881127 15379188 15796142
39310 15796142 13424919 6658828 -2608959 -6975660 -1413843 9637777 17433592 18489731
39302 18489731 15353408 11088342 7391059 5985773 7861831 12098705 17293999 21884593
39294 21884593 21991018 13456692 -1131784 -11996910 -12828412 -8213847 -6232287 -7394825
39286 -7394825 -6226376 -920975 4740384 7897442 9250601 9177664 6300597 1019102
39278A019102m371686j093606J066376Q78188p9756m70978m85555p31490j249209
39269e518614j304864j6665K026448K415286k19778l654318m312635j604251J682320
39260a0507071K633859M73467l067290m210080r6964O827472R934504O055249
39252H043146r17786o041449q570087q381228l155257N565320R425232L914069
39244a18040k839850q04691O316405O557379j554014p345377n082311q05442K59360
39235e416581J672779O296644Q617272L377221m866754p555397l283999K141626
39227I82811L710429J238267k249473l507814k254300j900862m495111o161861
39219a4637914k261710M379020O804888M457473K707882K489305l51803m720191
$$ plain form
39278 1019102 -3352584 -4446190 -3379814 -2501626 -2581382 -3052360 -3537915 -4269405 -5518614
39269 -5518614 -6823478 -6840143 -4813695 -2398409 -2618187 -6272505 -10585140 -12189391 -10507071
39260 -10507071 -7873212 -7399745 -10467035 -14677115 -14774079 -7946607 1987897 8043146
39252 8043146 7125360 1083911 -7486176 -15867404 -19022661 -13457341 -4032109 -118040
39244 -118040 -2957890 -3762581 2553824 9111203 7557189 211812 -4870499 -5675941 -5416581
39235 -5416581 -3743802 2552842 11170114 14547335 9680581 2125184 -1158815 982811
39227 982811 4693240 5931507 3682034 174220 -2080080 -3980942 -8476053 -14637914
39219 -14637914 -16899624 -12520604 -5715716 -1258243 1449639 3938944 3587141 -1133050
39211a133050l820953K245608M120843j931799o918615l147065L727128M147949
39203b709954j396809n639547n476940k183615L626759R780265J0384218L428551
39195I812928l679966l146066K652319O118975N558565M350111L094317J49574
39187B4910757k908787l442944l160695n205910q045471p843729m699307j582821
39179a1978907M00374J404748P83444l93254J141683M993160N929368K500130
39171D780746K35521J505025L14852o176960r878302m512961K414869J496223
39163i820987k518437L66448O849961N800984j749858m102818J039990L971917
39155a62800J186109M31166M569300N422882q19570n328320r95906N670439M964501
$$ plain form
39211 -1133050 -4954003 -2708395 1412448 -519351 -7437966 -10585031 -6857903 -2709954
39203 -2709954 -4106763 -9746310 -15223250 -17406865 -13780106 -3999841 6384377 9812928
39195 9812928 6132962 2986896 5639215 11758190 17316755 21666866 24761183 24910757
39187 24910757 22001970 18559026 15398331 10192421 2146950 -5696779 -10396086 -11978907
39179 -11978907 -11578533 -10173785 -9390341 -9783595 -8641912 -3648752 2280616 4780746
39171 4780746 5016267 6521292 6836144 659184 -9219118 -13732079 -11317210 -9820987
39163 -9820987 -12339424 -11972976 -5123015 677969 -1071889 -5174707 -4134717 -162800
39155 -162800 1023309 1454475 6023775 11446657 10627087 5298767 4302861 9973300 14937801
39146A4937801j767691n886240l872751K73797J401735j940715o115335m858705
39138g828104K900578Q880998N369131k671296m190723R11229K606517j629356
39130D348974l281522P95966K448392k296113n377465j414279K472862K04661
39122b098524j858246K619053O943762K857419m076171l593572J899803K639472
39114E332996j183453j315835K788207L878283R40591K1605J301196j610730q096337
39105B056523q811475q67245O412229N475020O81270p37621O19912O89565n3261
39096E464917M48406K89498k431275m364497k156069M89049k018883p094669o636052
39087a8009575M50532N755176L313075k355319l673111k14413L365565N481968
$$ plain form
39146 14937801 13170110 7283870 3411119 3684916 5086651 3145936 -2969399 -7828104
39138 -7828104 -4927526 3953472 9322603 6651307 2460584 3371813 5978330 4348974
39130 4348974 1067452 1863418 4311810 2015697 -3361768 -4776047 -2303185 -2098524
39122 -2098524 -3956770 -1337717 5606045 8463464 4387293 793721 2693524 5332996
39114 5332996 4149543 2833708 5621915 9500198 10440789 10462394 11763590 10152860 2056523
39105 2056523 -6754952 -7622197 -1209968 4265052 4946322 4208701 4828613 5518178 5464917
39096 5464917 5913323 6202821 3771546 -592951 -2749020 -2259971 -4278854 -11373523 -18009575
39087 -18009575 -17559043 -11803867 -8490792 -10846111 -14519222 -14733635 -11368070 -5886102
39079e886102P378778P261909K368947l363636k168274M749968N973740l434095
39071A2881235j2167075p901089L941987P490849n87028p298357k950062O729102
39063A39562J1303922Q873334L793071j170866m875328n482126l041246m92925
39055I047398R43981L018102N109812L441835j882295n371333m634980l716433
39047E956087m712700l574511J375917M488734J982551j179300O0979K251624
39039F649381L99160l051779l612826k775722k879027n41427O000454R546242
39031I734456M141311l202983k428480K904105J738562n193479o583283k19551
39023H90658L277952j323042n548932j954025M345263N250074J807383j02688
$$ plain form
39079 -5886102 1492676 8754585 11123532 7759896 5591622 10341590 16315330 12881235
39071 12881235 714160 -7186929 -3244942 4245907 3658879 -3639478 -6589540 139562
39063 139562 11443484 20316818 24109889 22939023 18063695 12581569 9540323 9047398
39055 9047398 9991379 13009481 18119293 21561128 19678833 14307500 9672520 5956087
39047 5956087 1243387 -2331124 -955207 3533527 5516078 4336778 4397757 6649381
39039 6649381 7048541 3996762 383936 -2391786 -5270813 -5812240 188214 9734456
39031 9734456 13875767 10672784 8244304 11148409 12886971 7693492 1110209 890658
39023 890658 4168610 2845568 -2703364 -4657389 -312126 4937948 6745331 6642643
39015F642643L53050l2033j893758l081787k506772q06823P92469P48442j230060
39006a014629k559297p37285K597980M093950L707053K950051N83398l970814
38998E650407n665622j75114O908510O637361J249231J100978O679865O352993
38990B8738609m388882j4020333j2031849m096989j404920l385099j415023N590268
38982f414218R752224O540604J29152l607444l665512k914696l877149n731326
38974i788365m721017P17973N688313M073294j871560l488350J331519M700366
38966c357827J383797l130616k437824L86604p72174m187522l759921P65174M643692
38957a0466617O128153O535826M963756J2380m995533n147459j220781J825305
$$ plain form
39015 6642643 6995693 6963660 5069902 1988115 -518657 -1325480 -533011 215431 -1014629
39006 -1014629 -3573926 -4311211 -1713231 2380719 6087772 9037823 9621221 5650407
38998 5650407 -15215 -190329 6718181 13355542 14604773 15705751 22385616 28738609
38990 28738609 24349727 10329394 -1702455 -5799444 -7204364 -10589463 -12004486 -6414218
38982 -6414218 3338006 9878610 10007762 6400318 2734806 -179890 -4057039 -9788365
38974 -9788365 -14509382 -13791409 -8103096 -4029802 -5901362 -9389712 -8058193 -3357827
38966 -3357827 -1974030 -5104646 -7542470 -7155866 -7928040 -12115562 -15875483 -15110309 -10466617
38957 -10466617 -4338464 2197362 7161118 7173498 2177965 -2969494 -4190275 -2364970
38949b364970K334949K490650K696235J007111k371376m683723m298512j480546
38941f670182K787484N617037K976134m232387q406658m540462K397589M955498
38933e115947L764909L485720K539230l472381j0434915q769197J549235R162324
38925g291022O929979M04914k460274j616560n43962Q57658L318086L926263P82762
38916D307844k244021r42727K355773K574612q5671j204492M88471J879760R84042
38907H113591o51761j117498l39116R95433J939619Q40362k862224o382252n949177
38898e413023j845353J599038J807317J006896K059865L992875M257305L308532
38890A0773452L249128K975700o17018n956993o555239l15049N621704M086205
$$ plain form
38949 -2364970 -30021 2460629 5156864 6163975 3792599 -891124 -5189636 -6670182
38941 -6670182 -3882698 1734339 4710473 478086 -7928572 -12469034 -10071445 -5115947
38933 -5115947 -1351038 2134682 4673912 1201531 -9233384 -18002581 -16453346 -7291022
38925 -7291022 -361043 43871 -2416403 -4032963 -4576925 -3719267 -401181 3525082 4307844
38916 4307844 2063823 1121096 3476869 6051481 5965810 4761318 5249789 7129549 8113591
38907 8113591 7461830 6344332 6005216 7000649 8940268 9780630 6918406 536154 -5413023
38898 -5413023 -7258376 -5659338 -3852021 -2845125 -785260 3207615 7464920 10773452
38890 10773452 14022580 16998280 16381262 10424269 3869030 3553981 9175685 13261890
38882A3261890j743068l442955l01959P60070k287837l275843O14087L004497
38874F588882q25428m967696j977677M830174O486527J948179k171955l284954
38866F626052n068305q176769p772998k594737J178905j015044m891603l606211
38858b5320710K512229O934882N618174R87502k061496j420553J205773L041951
38850h502248L194518K759927K531572K020760J158998J112654K278300L287693
38842I842174L199850K516602Q74249l112834p810726q234890k920715K581719
38834c064571K980498L96469k65363O41892l07315k576867l018024j646410P1137
38825f788554L602036Q990769R768023J424685p774511n695704M677000P694354
$$ plain form
38882 13261890 11518822 8075867 7773908 8533978 6246141 2970298 3584385 6588882
38874 6588882 5763454 795758 -1181919 3648255 10134782 12082961 9911006 6626052
38866 6626052 1557747 -6619022 -14392020 -16986757 -15807852 -16822896 -21714499 -25320710
38858 -25320710 -22808481 -15873599 -10255425 -9267923 -11329419 -12749972 -11544199 -8502248
38850 -8502248 -5307730 -2547803 -16231 2004529 3163527 4276181 6554481 9842174
38842 9842174 13042024 15558626 16432875 13320041 5509315 -2725575 -5646290 -3064571
38834 -3064571 -84073 312396 47033 688925 381610 -2195257 -5213281 -6859691 -6788554
38825 -6788554 -3186518 5804251 15572274 16996959 9222448 3526744 8203744 15898098
38817A5898098j651738r966899o079410K877944M230797j395762m288828j819363
38809b195161N47803P45945K320234N974054P170452L007832l926118q941473
38801D703568q878128l389307L953394P401836N124847J548820P39192P12687
38793A1916909j806763m679331l755559k30846J323146O21030J455740M461750
38785I306076N585356K254669l042777n852689l721938K262138P459407O927494
38777B1177736J501873j761063J500054O723207P434395N089148O264794J2930177
38769F0860321K1872496L0924918L8050817L6951956K4022795R555760J0151007
38762B32390070K6246604L8203199L1330553J5103168Q015926J0847887P555400
$$ plain form
38817 15898098 14246360 4279461 -1799949 1077995 5308792 3913030 -375798 -2195161
38809 -2195161 -1647358 -901413 1418821 7392875 14563327 17571159 13645041 4703568
38801 4703568 -4174560 -7563867 -3610473 3791363 8916210 10465030 11204222 11916909
38793 11916909 10110146 5430815 1675256 1444410 2767556 3388586 4844326 9306076
38785 9306076 14891432 17146101 14103324 8250635 4528697 6790835 14250242 21177736
38777 21177736 22679609 20918546 22418600 29141807 36576202 41665350 47930144 60860321
38769 60860321 82732817 113657735 151708552 188660508 212683303 222239063 232390070
38762 232390070 258636674 296839873 328170426 343273594 351289520 362137407 369692807
38755C69692807j0128795l2065852m5269364m8485196m6338125l8881067k5537501
38748A22986907j3187385r905184j2625078j1017106m156712k946742j1984352
38741E7164348j9105388j1593627M050871R881774J360445p612386n630917J967774
38733C0482894M477048J232065j976060m214754p723047r622177n260070K007657
38725I403556L633510j449583n245822l041257M00317k08070k268113m75990L970545
38716D719093M682145p14881o771173o515914N4573N300741K624660n025319q163565
38707i809640k908801L873665M095266j118850m781525l940590n45803M145884
38699a0990394Q831253Q384794l45665r726292q057700L515147J0633302N483540
$$ plain form
38755 369692807 359564012 327498160 282228796 233743600 187405475 148524408 122986907
38748 122986907 109799522 99894338 87269260 76252154 72095442 69148700 57164348
38741 57164348 38058960 26465333 30516204 40397978 41758423 34146037 28515120 30482894
38733 30482894 34959942 36192007 34215947 30001193 22278146 12655969 7395899 9403556
38725 9403556 13037066 11587483 6341661 3300404 3700721 3492651 1224538 748548 4719093
38716 4719093 9401238 8686357 1915184 -4600730 -4546157 754584 3379244 -1646075 -9809640
38707 -9809640 -12718441 -8844776 -4749510 -5868360 -10649885 -14590475 -15136278 -10990394
38699 -10990394 -2159141 6225653 5879988 -3846304 -11904004 -8388857 2244445 7727985
38691G727985k906809l574865N62163J84947m234996m161377K449079Q387763
38683D433890Q548166N595962L268322J021562k458348n559220o037309l880499
38675D932526n46951K211679K603382O54292n00949J519379L666601Q34473n856631
38666I517801q915426m329801K629366M232200j65352m673416n056738k817044
38658i578410j351266j026000M55370L827097O258746M732166O88304j129485
38650B876522O51601J469953k294043o554799m529261K541965N890059J747322
38642A799319l004026j395566L198577L275818l88271p67508K565398K108445
38634G392186m144991p264606q57861P567344O903291r17745m565166j377787
$$ plain form
38691 7727985 4821176 1246311 1808474 1993421 -2241575 -6402952 -3953873 4433890
38683 4433890 12982056 18578018 21846340 22867902 20409554 14850334 8813025 4932526
38675 4932526 4385575 6597254 9200636 9854928 9353979 10873358 14539959 15374432 9517801
38666 9517801 602375 -3727426 -1098060 3134140 2968788 -1704628 -6761366 -9578410
38658 -9578410 -10929676 -11955676 -11500306 -7673209 -1414463 3317703 4006007 2876522
38650 2876522 3528123 4998076 2704033 -3850766 -8380027 -5838062 51997 1799319
38642 1799319 -1204707 -2600273 598304 3874122 3485851 2718343 5283741 7392186
38634 7392186 3247195 -4017411 -4875272 2692072 9595363 8677618 4112452 2734665
38626B734665m51488o204057j0241034n067511L595484O158133L439996K070235
38618c965577J383263l444351q333249l743234Q180508J3162874N415511l626871
38610E028874l596772n38207m295963j0393296p479944L027595Q808816N977289
38602c461608K963821M631719N642838K593301M55960J723097K16855p091638
38594G674345j1635767n509980N262396R348792O192006L226334J642045l260181
38586A2939990r492611q591299J85743O801575M844156k88114j536087N3245O84448
38577E601046J192460K913525K555088k101472o434503n559869k217563j353596
38569e404884j231915K299762O419239N159462L50164p82719J887669J243612
$$ plain form
38626 2734665 2283177 -3920880 -14161914 -19229425 -15633941 -9475808 -6035812 -3965577
38618 -3965577 -2582314 -6026665 -14359914 -18103148 -9922640 3240234 8655745 5028874
38610 5028874 1432102 893895 -3402068 -13795364 -21275308 -18247713 -9438897 -3461608
38602 -3461608 -497787 4133932 9776770 12370071 12826031 14549128 14765983 7674345
38594 7674345 -3961422 -9471402 -4209006 5139786 11331792 14558126 16200171 12939990
38586 12939990 3447379 -5143920 -4958177 1843398 6687554 6399440 4863353 4916598 5601046
38577 5601046 6793506 9707031 12262119 10160647 3726144 -1833725 -4051288 -5404884
38569 -5404884 -6636799 -4337037 2082202 7241664 7591828 6809109 8696778 9940390
38561I940390l959011o091818j702025K187972j85297l822216j830103L040437
38553b421671L570949J28024p37104K490987M137315L50530n617211q144870n551356
38544a1794407r71343J041888q77597k817524j83576M967289N503448J48263k964046
38535g947605J814644P873351N444760l568726q161182l732497L188536N439066
38527C50347K852757j282275m538848m814091j364095K362650K028864r90717
38519e395408j599396O46784J509629M39355J552589N168755O179306L026251
38511A1527865N48511R62391p9494m509341o878571l619672J46762n33298j507142
38502c941989K866127Q517713O826139k078799r354790r305809m232758J459029
$$ plain form
38561 9940390 5981379 -110439 -1812464 375508 190211 -3632005 -5462108 -2421671
38553 -2421671 1149278 1277302 540198 3031185 7168500 7519030 1901819 -6243051 -11794407
38544 -11794407 -12765750 -11723862 -12601459 -15418983 -15602559 -10635270 -5131822 -4983559 -7947605
38535 -7947605 -6132961 1740390 7185150 3616424 -4544758 -8277255 -5088719 350347
38527 350347 3203104 1920829 -2618019 -7432110 -8796205 -6433555 -4404691 -5395408
38519 -5395408 -6994804 -6348020 -4838391 -4399036 -2846447 2322308 8501614 11527865
38511 11527865 12076376 13038767 12959273 8449932 1571361 -2048311 -1901549 -2434847 -3941989
38502 -3941989 -1075862 7441851 14267990 12189191 2834401 -6471408 -10704166 -9245137
38494i245137N506640O570150M434226J548065K85723m42138k210793k935239
38486C511497l16872K854613K257756q47494j637577N55902K183440J911353J376077
38477A1848695O23691j250647k005829P05792L095558n47877p389536p996725
38469b916878m75194N469371K203490n171780o904386k062910J915011K69911
38461g673365l806601m362009J43518N235479N297438L41950l458006k089671
38453a0371267P2558k752414o831727k951636Q266563J4387599Q245711j596935
38445F468452l738089K8568J40114m311216m970371J228477O847685N330907j62062
38436F862465k913590k001909j172481k000570k640824j758666q4773J425103
$$ plain form
38494 -9245137 -3738497 2831653 7265879 8813944 9099667 8657529 6446736 3511497
38486 3511497 3194625 6049238 8306994 7459500 5821923 6377825 8561265 10472618 11848695
38477 11848695 12472386 11221739 9215910 9921702 13017260 12469383 5079847 -2916878
38469 -2916878 -3392072 2077299 4280789 -890991 -7795377 -9858287 -7943276 -7673365
38461 -7673365 -11479966 -15841975 -15698457 -10462978 -5165540 -4823590 -8281596 -10371267
38453 -10371267 -10298709 -13051123 -19882850 -22834486 -14567923 -180324 8065387 6468452
38445 6468452 2730363 2758931 2899045 -1412171 -6382542 -5154065 1693620 7024527 6862465
38436 6862465 3948875 1946966 774485 -1226085 -3866909 -5625575 -5710348 -4285245
38428d285245K345995J941559k07358k627444k920472p41088J791676L166303
38420a536074M150711N319581M937163J653694j989477k006234J172555K713455
38412A4415374J33235l353056l936601k420296j775961k238278j919276l54543
38404a449402J423744K618978K123010j317105n779075o217500j325960L177340
38396f745970K515003J98977J622195M233580J950437l260558l447780K306308
38388f27808O249492M143813O3181k518899n203303p660784n526846O93137L355710
38379g032307p61271m579557j696130M185529O277282M096002N20184l212177
38371b202445m330052J224722R289376P854008m993829j3684392o447783N789398
$$ plain form
38428 -4285245 -1939250 2309 -205049 -2832493 -5752965 -6494053 -4702377 -1536074
38420 -1536074 2614637 7934218 12871381 14525075 12535598 10529364 11701919 14415374
38412 14415374 14548609 11195553 7258952 4838656 3062695 824417 -1094859 -1449402
38404 -1449402 -25658 2593320 4716330 3399225 -2379850 -8597350 -9923310 -6745970
38396 -6745970 -4230967 -4031990 -2409795 1823785 3774222 513664 -2934116 -627808
38388 -627808 5621684 9765497 9828678 7309779 2106476 -5554308 -11081154 -10388017 -7032307
38379 -7032307 -7793578 -12373135 -14069265 -9883736 -3606454 489548 1009732 -2202445
38371 -2202445 -6532497 -5307775 3981601 11835609 6841780 -6842612 -13290395 -7500997
38363g500997N482781m712623p745584K63641O458795M087159P25626J305779
38355a635423K4459n380306o434085J269879Q421923N747803k266442n649934
38347e902126l017991L05999J556227R31503j581375l994317k440068J925264
38339a2216884K603052j458816k709152K173725N216322O6424o635480n692280
38331a8653089K84921K821622J603599J944604L271740J324657j617192J84477
38323h834661M814845N292204J692457K26116J346962k95664m105156l024224
38315b887121L482658O515300J137489o233804p567814k894301L012027O739500
38307A303934O094683M53647n904270o908506l236509j399134l019101k883374
$$ plain form
38363 -7500997 -2018216 -6730839 -14476423 -14212782 -7753987 -3666828 -2941202 -1635423
38355 -1635423 -1610964 -6991270 -13425355 -12155476 -3733553 2014250 -252192 -5902126
38347 -5902126 -8920117 -8614118 -7057891 -6126388 -7707763 -11702080 -14142148 -12216884
38339 -12216884 -9613832 -11072648 -13781800 -11608075 -6391753 -6325329 -12960809 -18653089
38331 -18653089 -18368168 -15546546 -13942947 -11998343 -8726603 -7401946 -9019138 -8834661
38323 -8834661 -4019816 1272388 2964845 3190961 4537923 4242259 137103 -2887121
38315 -2887121 595537 7110837 8248326 2014522 -5553292 -8447593 -5435566 1303934
38307 1303934 7398617 7852264 1947994 -4960512 -8197021 -9596155 -12615256 -15498630
38299a5498630L98652R68049l309504n515356o14011O384871Q920712P871152
38291c94065O146561K288177l664393n849080j973215Q33355j691317j399542
38283e703519Q160164J6297444Q868521p750836j3507369m208192L449800j120576
38275D485437p804213m943794K297274L053484j367824k404980R07023L274784
38267b502809L782314M730461M067397r42867n551802k880951M386098P035617
38259A2123458L086584n68999k01520R4574k857343n981011n750077k920663M58446
38250b516551L062663K387216k723813o807984k707961O419643Q576874q9242
38242E600845q579669o795441M68521K909980O84225J077912M332411M084379
$$ plain form
38299 -15498630 -15099978 -14131929 -17441433 -22956789 -23570800 -17185929 -8265217 -394065
38291 -394065 5752496 8040673 4376280 -1472800 -3446015 -2612660 -4303977 -5703519
38283 -5703519 2456645 18754089 27622610 19871774 6364405 2156213 5606013 4485437
38275 4485437 -3318776 -8262570 -5965296 -2911812 -4279636 -6684616 -5777593 -2502809
38267 -2502809 1279505 6009966 10077363 9134496 3582694 701743 5087841 12123458
38259 12123458 15210042 14641043 14439523 14534097 11676754 5695743 -54334 -2974997 -2516551
38250 -2516551 546112 2933328 209515 -6598469 -9306430 -2886787 5690087 5600845
38242 5600845 -2978824 -9774265 -9305744 -6395764 -5711539 -4633627 -301216 3783163
38234C783163q4213j633199J057725K017372j166511k964044n9059K613576O43735
38225D208545k368955j674960M38354l48329k045132P5481M728569O101912K309368
38216A1424853l274967p440844q599982m846230L338855R709158P988368O61307
38208H960518l964570l136325j600722k221006k225986k90027M08033q42224L47964
38199d564345N075261P233433L201999j275237l39815K073017n18221n286674
38191E599418m942572p22383M223k769011j883583L089345L856963k034013n889941
38182e691554j929387L675525M263225L546148O514075P950976J011314q526522
38174A0813800q888339o18713L889500q07771o462832n511388j526009o21048
$$ plain form
38234 3783163 3698950 2065751 3123476 5140848 3974337 1010293 951234 3564810 4208545
38225 4208545 1839590 164630 602984 254655 -1790477 -1714996 3013573 9115485 11424853
38216 11424853 8149886 709042 -7890940 -12737170 -9398315 310843 8299211 8960518
38208 8960518 4995948 1859623 258901 -1962105 -4188091 -4478118 -4070085 -4912309 -4564345
38199 -4564345 510916 7744349 10946348 9671111 9331296 11404313 10886092 5599418
38191 5599418 656846 -65537 -61314 -2830325 -4713908 -1624563 2232400 198387 -5691554
38182 -5691554 -7620941 -3945416 317809 3863957 10378032 18329008 19340322 10813800
38174 10813800 1925461 1306748 5196248 4388477 -2074355 -7585743 -9111752 -9732800
38166i732800j230093J095678M820549N155180K040811m74290o33538Q5490Q65753
38157A992740K221810L618099L544353J404182k401688o731735q719233n397106
38149a0468578J457453N299145K818684j070638k52650L404635L210233j534228
38141B864056m067636k42250N385624N967282J130828l576060l888478q43478
38133B729888J506069N70394k349190l382187l60644M021291M536430l83125n976862
38124I12064o021107J5876N965022N487782j143986p553665q247211l956565M21607
38115a4120183J902409J863747K895821N066977N913331L197135k632271q148495
38107d061529r424693n616283M11260N543014Q884093R720805O143495r21323
$$ plain form
38166 -9732800 -10962893 -9867215 -5046666 108514 2149325 1675035 1041497 1126987 1992740
38157 1992740 4214550 7832649 11377002 12781184 10379496 3647761 -5071472 -10468578
38149 -10468578 -9011125 -3711980 -893296 -1963934 -2216584 1188051 4398284 2864056
38141 2864056 -1203580 -1445830 3939794 9907076 11037904 7461844 3573366 2729888
38133 2729888 4235957 4806351 2457161 -925026 -1285670 2735621 7272051 6888926 912064
38124 912064 -5109043 -5093167 871855 6359637 5215651 -2338014 -10585225 -14541790 -14120183
38115 -14120183 -12217774 -10354027 -7458206 -2391229 3522102 6719237 4086966 -4061529
38107 -4061529 -13486222 -19102505 -18691245 -13148231 -4264138 5456667 11600162 10678839
38099A0678839n149178j712588M674278M969860j151641m728327j292893K697335
38091H985685P04707m079688n099775k431895k69761N38568J058042j67259l441169
38082d202545l914133J548921P144295N522274o69797k855837M01404L161187
38074F135769K956855K397856J012148m265591j0075104q525381j04151N058201
38066e409398J711316l825477m703924k225881L92523L895968P711353P312180
38058D858660K514103M55047M175988O005064o02710r848790j2223022q098164
38050a2763824m116559j411178L116544P600833O994901K224376q43316l41571
38042D60206R39294K060883L659679K960311k804746q908252p407837Q44899O435025
$$ plain form
38099 10678839 5529661 3817073 8491351 13461211 12309570 7581243 6288350 8985685
38091 8985685 9690392 5610704 510929 -1920966 -2190727 -1652159 -594117 -761376 -4202545
38082 -4202545 -8116678 -6567757 576538 6098812 5429015 2573178 2974582 6135769
38074 6135769 9092624 11490480 12502628 8237037 -1838067 -10363448 -10467599 -5409398
38066 -5409398 -3698082 -7523559 -12227483 -14453364 -14060841 -10164873 -2453520 4858660
38058 4858660 7372763 7827810 12003798 18008862 17406152 7557362 -4665660 -12763824
38050 -12763824 -16880383 -18291561 -15175017 -7574184 -579283 1645093 801777 460206
38042 460206 1399500 3460383 7120062 10080373 7275627 -1632625 -9040462 -8195563 -1760538
38033a760538M697611J171064J654247L916004K923347r76933l327889k099132
38025F197781L60240O85041j871574m691591m687776k298664q79320j246441j91839
38016h624143L288349M573065M59878m326253l336967J893161M639333L262945
38008A829368J968194K611278K624496R61569K9262J292730L610638N445211M816485
37999B5189231n95675q561303j1205564n165120J467892N26445k734220J363988
37991B85674Q396782M938427q330173j4779573o740541L317949L377932q13671
37983a0347194R88766N295364K800263l954002m597236J857814O429067M920511
37975C393353K241615K170866K356593Q17995k22826Q56842J936143Q56570j428700
$$ plain form
38033 -1760538 2937073 4108137 5762384 9678388 12601735 11624802 8296913 6197781
38025 6197781 6558021 7243062 5371488 679897 -4007879 -6306543 -7185863 -8432304 -8624143
38016 -8624143 -5335794 -762729 -302851 -4629104 -7966071 -6072910 -1433577 1829368
38008 1829368 3797562 6408840 9033336 9994905 10024167 11316897 14927535 20372746 25189231
37999 25189231 24593556 16032253 4826689 -338431 1129461 1655906 -1078314 285674
37991 285674 8682456 13620883 5290710 -9488863 -16229404 -12911455 -9533523 -10347194
37983 -10347194 -9358428 -4063064 -1262801 -5216803 -9814039 -7956225 -1527158 3393353
37975 3393353 5634968 7805834 10162427 10980422 10757596 11614438 13550581 14407151 12978451
37966A2978451k799900k475350p90623J638502L868121M488996K035500l296208
37958A5647489p501683n127548L067527Q107820L814930l507755l705736K779916
37950A3574960R583637J9543657L8797155N5204826M3182119n02435m3069582
37943A36314337n1923698l1871718j1818914o066760o372330m122178n59067K661578
37935B6241250O104490N941631j475604r477797q580629k207623j209373m922055
37927A0414290l169594L810893M395245l809925r024653m805057R54342J435638
37919B01179P40973K541179K598112r09619k280132J34880k93467m874967m923546
37910g065408K234316O336214J900519j182305M421253Q678970R97380r884713
$$ plain form
37966 12978451 10178551 7703201 6912578 8551080 12419201 16908197 18943697 15647489
37958 15647489 8145806 3018258 6085785 14193605 18008535 14500780 10795044 13574960
37950 13574960 23158597 42702254 81499409 136704235 179886354 179383919 136314337
37943 136314337 84390639 52518921 40700007 34633247 28260917 24138739 23579672 26241250
37935 26241250 32345740 38287371 36811767 27333970 18753341 16545718 15336345 10414290
37927 10414290 7244696 11055589 15450834 11640909 2616256 -2188801 -1234459 201179
37919 201179 942152 3483331 6081443 5171824 2891692 3026572 2733105 -2141862 -7065408
37910 -7065408 -4831092 1505122 3405641 2223336 6644589 15323559 16320939 6436226
37902F436226q697510K170918P723697M037351P38765K586383L664206j13144
37894A8546892n114250p416411o606434k558505L305365N381238P32216m346563
37886A923548l187511L5213j837708m594770P91074J0141601R596887k292113
37878A0576221j0586792n538469M586266P264225J637868m930857p502963n219046
37870i713547O82955N696579M655377r62822l792245r50731K395819J790059q27705
37861a026261k331935k596007j336378K407769N701751L841483j108933j801509
37853A749980K450483M236660J273476P91857N990853Q584299K046815o837407
37845B0287016q324632m255831k997275n508463n893201k089257K523209N490039
$$ plain form
37902 6436226 -2261284 -90366 7633331 11670682 12409447 14995830 18660036 18546892
37894 18546892 13432642 6016231 -590203 -3148708 156657 5537895 6270111 1923548
37886 1923548 -1263963 -1228750 -3066458 -7661228 -6870154 3271447 12868334 10576221
37878 10576221 -10571 -5549040 -962774 6301451 7939319 3008462 -4494501 -9713547
37870 -9713547 -9030592 -3334013 1321364 358542 -3433703 -4384434 -1988615 -198556 -1026261
37861 -1026261 -3358196 -5954203 -7290581 -4882812 818939 4660422 3551489 1749980
37853 1749980 4200463 8437123 9710599 10502456 16493309 25077608 27124423 20287016
37845 20287016 11962384 7706553 4709278 -799185 -6692386 -8781643 -6258434 -768395
37837g68395O097209K776142l579332o941951l520495J617105K138436P29897
37829a451384L770194R204077R062685K405263l431311m107473k309571m56453
37821A2686027K168368L998809J038717n612440q948837n420721M55525L050449
37813C415897K082442J06097j586991k242395q67577J663769K841123K144697
37805G557062J629229K395773L313437L138155J266621k244494m322342L64402
37797A3097843J1076956J6870108Q524272p449715j5680874j1884214n886600
37790H667776m516291l375530J060225L251751p80225m728876k285073J853112
37782h53131K80591m232012l721909J766602N433201M969971L663676K641114
$$ plain form
37837 -768395 5328814 8104956 4525624 -2416327 -5936822 -4319717 -2181281 -1451384
37829 -1451384 2318810 11522887 20585572 22990835 19559524 15452051 13142480 12686027
37821 12686027 14854395 18853204 19891921 14279481 5330644 -90077 365448 3415897
37813 3415897 5498339 5604436 4017445 1775050 907473 2571242 5412365 7557062
37805 7557062 9186291 11582064 14895501 18033656 19300277 17055783 12733441 13097843
37797 13097843 24174799 41044907 49569179 42119464 26438590 14554376 8667776
37790 8667776 4151485 775955 1836180 5087931 4307706 -421170 -2706243 -853131
37782 -853131 -572540 -4804552 -8526461 -6759859 -1326658 3643313 7306989 9948103
37774I948103N04551j045505O83746L034333J477690k049976k261771m72295k539062
37765G279814p494610p862210k185922K356475K006919J651662M439830N207099
37757E399057l29269p170624q046654l404166J313333L738318M481869L152099
37749h66037P4412j345356P69298K690799M98574l325372l647171k81127L193352
37740b238628N488299P000158N666820k21459o470364o737320j604054K083897
37732B967349J158851n30143L41083J630911O26880j082669q32915M58252J10128
37723D847727j851181k737322q85854K168583K872615q94911o575039q230113
37715a1285495l272216L326868M743313J185617j178281K45696J473366k42067
$$ plain form
37774 9948103 10452654 9407149 10090895 13125228 14602918 12552942 10291171 9818876 7279814
37765 7279814 -214796 -8077006 -10262928 -7906453 -5899534 -4247872 191958 5399057
37757 5399057 5069788 -2100836 -10147490 -13551656 -12238323 -8500005 -4018136 -866037
37749 -866037 -791625 -2136981 -1367683 1323116 1821690 -1503682 -5150853 -5431980 -2238628
37740 -2238628 3249671 10249829 15916649 15695190 9224826 2487506 883452 2967349
37732 2967349 4126200 3596057 3937140 5568051 6194931 5112262 4279347 4737599 4847727
37723 4847727 2996546 259224 -626630 1541953 4414568 3519657 -3055382 -11285495
37715 -11285495 -14557711 -11230843 -6487530 -5301913 -6480194 -6234498 -4761132 -5003199
37707e003199j295235K052593O604561O084328J1792n477242n078561L50854N564330
37698C814221O016413J741725k459744j816555K295481L128944k517202q602730
37690A600553o750523K277021Q412842M541954m719994q971943m580935K080262
37682f110763L694709O65737j450834n54002K61245q07556j222266L94698P48624
37673d380408k000400l063962J920375Q055315P266801J371132k76630L729822
37665A2622045M393670j844011o091014k023193K609548j121877p536121n371233
37657d362186L193878N954000N01830l074585L53534M003681K523545K01453J111770
37648A0406920J744476o10052j656577R56880J315769m198186q071913k901924
$$ plain form
37707 -5003199 -6298434 -4245841 2358720 8443048 8454840 2977598 -2100963 -1750109 3814221
37698 3814221 9830634 11572359 9112615 7296060 9591541 12720485 10203283 1600553
37690 1600553 -5149970 -2872949 5539893 10081847 5361853 -3610090 -8191025 -6110763
37682 -6110763 -2416054 -1750317 -3201151 -3755153 -3493908 -4301464 -5523730 -5129032 -4380408
37673 -4380408 -6380808 -9444770 -7524395 530920 7797721 9168853 8892223 12622045
37665 12622045 17015715 15171704 9080690 7057497 9667045 8545168 1009047 -4362186
37657 -4362186 -1168308 4785692 5287522 2212937 2566471 6570152 9093697 9295150 10406920
37648 10406920 12151396 11541344 9884767 10841647 12157416 7959230 -112683 -3014607
37640c014607N140854M993686j776205l964736J088250M571793J685204j883200
37632F841039j627139j419493m272492n425095j160943L113413J173955l370080
37624f146835k862670J917931L542635J05352k760130j668780N72555J722419
37616e577523L332294N017448K619459m014301p497580k512973N497076P377873
37608D241773L090473P20100L695506O069771K155439m858283p329123k957766
37600D827890L140580M722632N20490n242414p236279m414639j032298j211087
37592e925125l419728k927034R50056L930312L491294K120529K304247K673334
37584C197885J701558J108643K185187K397255l37365l069717j823511K340042
$$ plain form
37640 -3014607 2126247 7119933 5343728 1378992 2467242 7039035 8724239 6841039
37632 6841039 5213900 3794407 -478085 -5903180 -7064123 -3950710 -2776755 -6146835
37624 -6146835 -9009505 -7091574 -3548939 -3443587 -6203717 -7872497 -7299942 -5577523
37616 -5577523 -2245229 2772219 5391678 1377377 -6120203 -8633176 -3136100 4241773
37608 4241773 7332246 8052346 11747852 17817623 19973062 15114779 7785656 4827890
37600 4827890 7968470 12691102 13211592 7969178 732899 -3681740 -4714038 -5925125
37592 -5925125 -9344853 -12271887 -11321831 -7391519 -3900225 -1779696 524551 3197885
37584 3197885 4899443 6008086 8193273 10590528 10253163 7183446 5359935 7699977
37576G699977N383446N774523L726407j595979q622181j0646603l865255M240206
37568B094541L053893n606533r407734l577119L097876L197256J184193L143201
37560b820426N228424J126927n167572m101937M477313J0290630O635889j776416
37552A3892832o211534l707439K080491N820278M617780k44876m416103m559907
37544G271522j493340J414932J895931k9047k740698l832142k357524j062273
37536i32639l206908o287702l736543M797980J0492878O854363j249658n572167
37528A159604o063304p048782o729341n55322P224481O664562k264740p753787
37520a5366629l086141M022859M068434n98155j785326J063080J789440j202315
$$ plain form
37576 7699977 13083423 18857946 22584353 20988374 12366193 1719590 -2145665 2094541
37568 2094541 5148434 -458099 -9865833 -13442952 -10345076 -7147820 -5963627 -2820426
37560 -2820426 2407998 3534925 -1632647 -5734584 -1257271 9033359 15669248 13892832
37552 13892832 7681298 3973859 6054350 11874628 16492408 16247532 11831429 7271522
37544 7271522 5778182 7193114 9089045 9059998 6319300 2487158 129634 -932639
37536 -932639 -4139547 -10427249 -14163792 -9365812 1127066 7981429 6731771 1159604
37528 1159604 -4903700 -11952482 -18681823 -19237145 -12012664 -5348102 -7612842 -15366629
37520 -15366629 -18452770 -14429911 -10361477 -10959632 -12744958 -11681878 -9892438 -11094753
37512a1094753k825326k27898K931598K783566R55740J236173L347826L309770
37504D16696m40412l963096k421413L332605P268436N756882J909986M78320J050477
37495A3388481k71593m028953o372488m672408n80923K714724L293784P58893
37487D229517l038365l765002J234701Q378222J0969902P066442Q41341l542516
37479B2374242n346759m917833k861713j841107m067305o450377l814598K230594
37471d694856M093597k55740l515913k54603M825562M777623Q78656q42623N30734
37462E542437P31842k132670n295217n452268j621250M473138Q397833O282175
37454A0926020N10054j770255J462018L768418M81812l793055l402489j249889
$$ plain form
37512 -11094753 -13920079 -14147977 -11216379 -8432813 -7477073 -6240900 -2893074 416696
37504 416696 -23716 -3986812 -6408225 -3075620 4192816 9949698 11859684 12338004 13388481
37495 13388481 13116888 9087935 2715447 -1956961 -2537884 176840 3470624 4229517
37487 4229517 1191152 -2573850 -1339149 7039073 18008975 25075417 25916758 22374242
37479 22374242 17027483 12109650 9247937 7406830 3339525 -3110852 -6925450 -4694856
37471 -4694856 -601259 -856999 -4372912 -4627515 198047 4975670 5854326 5011703 5542437
37462 5542437 6274279 4141609 -1153608 -6605876 -8227126 -3753988 4643845 10926020
37454 10926020 11436074 9665819 11127837 14896255 15378067 11585012 8182523 6932634
37446F932634k699069n072391k304835L474113M755168J042125j337411p59815
37438D030519j555391l735213k068453K910622L485234k286620o035306k219657
37430g474265L196768L104978K56054Q46734L691016L606984Q00218q45405j346914
37421E836168l173726m872864l145327O47586K636006L378622N936916Q322048
37413A5565429N168452k900275q412737o807412j324333L070905N107693N055383
37405A4523105K724401j01778k94172J038021j346939p994171j1304986n674305
37397h430824L235289N404367M7006m209388j831359L479275O075732N828456
37389I598554N554168N349774L128862j457755o525038r983367j0250474o814651
$$ plain form
37446 6932634 4233565 -838826 -3143661 330452 5085620 6127745 4790334 4030519
37438 4030519 2475128 -1260085 -3328538 -417916 3067318 780698 -5254608 -7474265
37430 -7474265 -4277497 -1172519 -916465 -69731 3621285 7228269 8028487 7183082 5836168
37421 5836168 2662442 -2210422 -5355749 -4708163 -2072157 1306465 7243381 15565429
37413 15565429 20733881 17833606 9420869 2613457 1289124 4360029 9467722 14523105
37405 14523105 17247506 17145728 16851556 17889577 16542638 8548467 -2756519 -8430824
37397 -8430824 -5195535 208832 255838 -3953550 -5784909 -2305634 3770098 9598554
37389 9598554 15152722 20502496 23631358 22173603 15648565 5665198 -4585276 -11399927
37381a1399927j962837K44265r09260r54215L415102Q305973P238361P65774l461948
37372A281288q39685M611670O551381M155860R32238j086699k393862l040208
37364A0171983k226775n46081M4390j204326k856192l020415j182425J381193
37356E61352K494639J259936k16122J146420M741947N719461J001401n760958
37348A0948076p782976l013533L833710O792759M196515j111748n079916n489648
37340C293239l155739r19854j000428k961168m269507k789531R70209L734771
37332g098008K438573j712393l560049m29045L366436J977049l114551m633210
37324a2765198j31706M647646M781068K649245K184212K265108N99358m75158
$$ plain form
37381 -11399927 -13362764 -13118499 -14027759 -14981974 -11566872 -3260899 3977462 4743236 1281288
37372 1281288 441603 5053273 11604654 15760514 16692752 15606053 13212191 10171983
37364 10171983 7945208 7399127 7443517 6239191 3382999 362584 -819841 561352
37356 561352 3055991 4315927 4099805 5246225 9988172 15707633 16709034 10948076
37348 10948076 3165100 151567 3985277 10778036 14974551 13862803 8782887 3293239
37340 3293239 137500 -782354 -1782782 -4743950 -9013457 -11802988 -10832779 -7098008
37332 -7098008 -4659435 -6371828 -9931877 -10360922 -6994486 -5017437 -8131988 -12765198
37324 -12765198 -12896904 -8249258 -3468190 -818945 1365267 3630375 4229733 3754575
37316C754575K182771O077942O119150J949043k605035n150507n299886k480244
37308D547809J855752K865536j391056n477837m286602j446888k856319n729054
37300a1918659l277067K487264L293942j084781k364081J821511M592732L084078
37292c365061L203016P092849P434511M08977o091026m714940K9645R51027J87091
37283E136089K476556L784766k015042r881798q859191J245303R069246P491581
37275H447510J019215l357575m366650l638258j649004P20537J319808l13983
37267a818400k253050l208114l291230j958464J241914L989450L019325j021881
37259e300450l842427l053137n64268J021191J818781L491358O084371P037641
$$ plain form
37316 3754575 5937346 12015288 18134438 20083481 17478446 12327939 7028053 4547809
37308 4547809 6403561 9269097 7878041 2400204 -1886398 -3333286 -6189605 -11918659
37300 -11918659 -15195726 -12708462 -9414520 -10499301 -12863382 -11041871 -6449139 -3365061
37292 -3365061 -162045 6930804 14365315 14774292 8683266 3968326 3997971 4948998 5136089
37283 5136089 7612645 11397411 9382369 -499429 -9358620 -8113317 955929 8447510
37275 8447510 9466725 6109150 1742500 -1895758 -3544762 -2824225 -1504417 -1818400
37267 -1818400 -4071450 -7279564 -10570794 -12529258 -11287344 -7297894 -4278569 -5300450
37259 -5300450 -9142877 -12196014 -12760282 -11739091 -9920310 -6428952 -344581 6693060
37251F693060L851087j781590m141025m70719L884122K116181l400283m053310
37243B697523J174041L645037o40398m541529k639208m88398l277380m974354
37235i044666O48192O542712L010445m318787j990800Q907896J3342973N204200
37227B2302165n231398q747916p992521o933761k984530L993840O256194l58265
37219C03808q086230p920958j860194K318743K592628K356569L219171M138571
37211b937892M448014L513243O71355j904452p62418K453442K113209j725037
37203E869464k100366K963290N447972m17732q307418q782547k031196N075656
37195b282877R117793J0239275P046529q23852q160421r070138m308917J235018
$$ plain form
37251 6693060 10544147 8762557 4621532 4150813 8034935 10151116 6750833 2697523
37243 2697523 3871564 7516601 6876203 2334674 -304534 -792932 -4070312 -9044666
37235 -9044666 -8396474 -1853762 1156683 -3162104 -5152904 3754992 17097965 22302165
37227 22302165 17070767 8322851 330330 -6603431 -9587961 -5594121 662073 303808
37219 303808 -7782422 -15703380 -17563574 -15244831 -12652203 -10295634 -7076463 -2937892
37211 -2937892 1510122 5023365 5694720 3790268 3027850 5481292 7594501 5869464
37203 5869464 3769098 6732388 12180360 11762628 3455210 -5327337 -7358533 -2282877
37195 -2282877 6834916 17074191 24120720 23296868 15136447 6066309 1757392 2992410
37187B992410N119584O676328M082255k206314p035385p162851o163128p297213
37179a0994314o728249o67188N905003N860081J135286j125652N1664P56584J285361
37170d521424M154371N833321J192659n279380l900449M512900Q430899K531928
37162A2954825n599176q000321n656888k363005J148914L207273M06036m838513
37154h740855m502394K520895O576531J555081n135800l797058L517822P943570
37146f2208O926993M259184J679410j136849j653304K047846N107931J292290
37138A8461293o723097r975708n394843J590359N741210O035930J836672o466212
37130E105604j2434149q393015K277884O829654J294589k484828N002939J4593739
$$ plain form
37187 2992410 8111994 14788322 18870577 16664263 9628878 2466027 -3697101 -10994314
37179 -10994314 -17722563 -18389751 -12484748 -6624667 -5489381 -6615033 -6563369 -5806785 -4521424
37170 -4521424 -367053 5466268 6658927 1379547 -2520902 1991998 10422897 12954825
37162 12954825 7355649 -644672 -6301560 -8664565 -7515651 -4308378 -3902342 -8740855
37154 -8740855 -13243249 -10722354 -4145823 -2590742 -7726542 -11523600 -8005778 -62208
37146 -62208 6864785 11123969 12803379 11666530 10013226 12061072 17169003 18461293
37138 18461293 11738196 1762488 -3632355 -2041996 3699214 9735144 11571816 5105604
37130 5105604 -7328545 -15721560 -13443676 -6614022 -5319433 -7804261 -2801322 11792417
37122A1792417J1212452k589522r457818k808616M399759M20941q355688r271832
37114d657907k424061K850944L924503N117738N601698L60112p096009o635285
37106b958267J068657K601862o706886j2653357l508064J0049956J0325899j59125
37098a939325l712716L777294P616848r7642p499044l111922N792388O282557
37090G108438M38643l81157M639909N750937J03396l986078j437315K219948J263662
37081A5720383j694897k303028k041855l509878m041589n44568L463841K561379
37073G609788j442119k155632Q74922J735166j462138l485636j644715j000024
37065i70388n173859q368559l537567N619395Q809393L515427k623803l576744
$$ plain form
37122 11792417 23004869 20415347 10957529 8148913 12548672 12969613 4613925 -4657907
37114 -4657907 -7081968 -4231024 -306521 4811217 10412915 10773027 3677018 -2958267
37106 -2958267 -1889610 712252 -5994634 -18647991 -22156055 -12106099 -1780200 -1939325
37098 -1939325 -5652041 -1874747 5742101 5644459 -1854585 -4966507 825881 7108438
37090 7108438 7547081 7165924 11805833 17556770 17660166 13674088 12236773 14456721 15720383
37081 15720383 14025486 11722458 9680603 6170725 2129136 1584568 5048409 7609788
37073 7609788 6167669 4012037 4886959 6622125 5159987 1674351 29636 -970388
37065 -970388 -6144247 -14512806 -18050373 -12430978 -3621585 -106158 -2729961 -6306705
37057f306705j399706J36096R79166J470485K98371j238024O88067M776317L926047
37048C330114l213842p170110q08705Q553994Q687864n5258o116150l697173R24061
37039D34795M39878m174581p339125n916887o15472N383318Q059107O131475K926703
37030E329211J738978J139494j153958k612720O8261L724543K609475j952942
37022H890342l429485q88081R4118k491444m306995l106740k035178k685960k252117
37013a2211540L65975K474156L277705M790513N906307L193714j218826j135880
37005E442124K655071K319009l424926n896825p82993M461782L160402n10685
36997G422959p85179l39466l005230m583923J00845P176801R156135N481639P04581
$$ plain form
37057 -6306705 -7706411 -7570315 -6591149 -5120664 -4822293 -6060317 -5372250 -595933 3330114
37048 3330114 116272 -7053838 -7862543 691451 9379315 9324057 3207907 -489266 434795
37039 434795 874673 -3299908 -10639033 -16555920 -17171392 -11788074 -3728967 2402508 5329211
37030 5329211 7068189 8207683 7053725 4441005 4509266 8233809 10843284 8890342
37022 8890342 5460857 4572776 4666894 2175450 -2131545 -5238285 -7273463 -9959423 -12211540
37013 -12211540 -11845565 -9371409 -6093704 -1303191 4603116 7796830 6578004 5442124
37005 5442124 8097195 10416204 6991278 1094453 311460 4773242 7933644 7422959
36997 7422959 6637780 6298314 3293084 -1290839 -1189994 5986807 15142942 20624581 21329162
36988B1329162k775285m075482j635748K715096L676213J093337Q97737L522755
36980B4747785K222499k175815Q66842J1486182J4932669R473631J7699383M8416523
36972A27669699O6625998L3746383l1786092o9815790n4507476k0659871p604902
36965D3667949j1509082r467555p06905J142571k777574j137189M400078L040871
36957B6653164m130894o081912j099640K175772N57625j044378r83595k209999
36949A3836143l580166j218788K465077J330238l929467o893194n629608l264060
36941f883825n04072L609045N818318K659442j832009j614954P01511j251206
36933G02250m668466j383005O533393Q060577J328467k888169N76320K635506
$$ plain form
36988 21329162 18553877 14478395 12842647 15557743 19233956 20327293 21225030 24747785
36980 24747785 26970284 24794469 25661311 37147493 52080162 61553793 79253176 127669699
36972 127669699 194295697 228042080 196255988 126440198 71932722 51272851 43667949
36965 43667949 32158867 22691312 21984407 23126978 20349404 19212215 23612293 26653164
36957 26653164 22522270 16440358 15340718 17516490 18074115 17029737 16046142 13836143
36949 13836143 10255977 9037189 11502266 12832504 8903037 2009843 -3619765 -6883825
36941 -6883825 -7387897 -3778852 2039466 4698908 2866899 1251945 1953456 702250
36933 702250 -3966216 -5349221 1184172 9244749 10573216 7685047 8261367 10896873
36925A0896873l641532r523891l695383Q734653J1850763R32685j1276434j1372689
36917g094955j075294P011260N332356j264509l802639r24964J097262j200038
36909a921521l688760k509637r09473k961836n148990j705390M486729N127047
36901i231831r9913k439921K410897Q374907R132917O116703K939492m02058l276785
36892A3524408j625847M888794Q967603M983818k770834o941836p150144o800569
36884G075393n027144J09491M185697J285522n428219o868008j360492L627389
36876b400371L589008K337026L518401M920106M269316L330845K510333j504571
36868B0570093q024849r294464j597021O514226N104302k308160l988740K167732
$$ plain form
36925 10896873 7255341 -2268550 -5963933 2770720 14621483 15554168 4277734 -7094955
36917 -7094955 -8170249 -1158989 4173367 2908858 -893781 -1818745 -721483 -1921521
36909 -1921521 -5610281 -8119918 -9029391 -11991227 -17140217 -18845607 -14358878 -9231831
36901 -9231831 -9331744 -11771665 -9360768 -985861 8147056 14263759 17203251 16801193 13524408
36892 13524408 11898561 16787355 25754958 30738776 27967942 21026106 13875962 7075393
36884 7075393 2048249 2157740 6343437 7628959 2200740 -4667268 -6027760 -2400371
36876 -2400371 1188637 3525663 7044064 11964170 16233486 19564331 22074664 20570093
36868 20570093 12545244 3250780 1653759 8167985 13272287 10964127 6975387 9143119
36860I143119O103456J562570n131142n803063j980142l32154k173341l581414
36852b192111k765791j734977k003671k724180k271686O72991N729569Q742424
36844A452568M802476l741822p049856n31209O851606M228536m801818o844228
36836e633747J339904Q141945M660739l022987m425706M01601L652407K305595
36828G419751L43060R05212K707741L502080K465897j87774k641153j963692J697325
36819A4248447L502673K6900n282934o824416m862062m047362n430995n290826
36811a3960575j713295K581661M675504M684600L692818J857193m43556k242394
36803h68044l395976m088799k944537J569135P481110R886999O355896L6587l635297
$$ plain form
36860 9143119 15246575 16809145 11678003 5874940 3894798 3562644 1389303 -2192111
36852 -2192111 -4957902 -6692879 -8696550 -11420730 -13692416 -13019425 -7289856 1452568
36844 1452568 6255044 2513222 -4536634 -5067843 1783763 6012299 1210481 -5633747
36836 -5633747 -4293843 3848102 8508841 5485854 1060148 1461749 5114156 7419751
36828 7419751 7762811 8668023 11375764 14877844 17343741 17155967 14514814 12551122 14248447
36819 14248447 17751120 17778020 12495086 5670670 808608 -3238754 -8669749 -13960575
36811 -13960575 -15673870 -13092209 -8416705 -3732105 -39287 1817906 1374350 -868044
36803 -868044 -4264020 -8352819 -11297356 -9728221 -2247111 7639888 13995784 14032371 10397074
36794A0397074k538519J59540m77561n019913p515864j938979Q892532J4607271
36786A6565581R387541j016380p166579o878274m464943k953345k206040j982730
36778g15169j549996J413547O270650O572093j816834j1888315j2174424j560619
36770a5449067R592147J2886324R481032M234587k89735k742163k616194k501649
36762A2595282n043223p337431m767553q4011n02024n298725n799430L23865M940306
36753a0972944L267968J301066L851372N429382Q45887m206223k690384J172210
36745b001666m10778m349954j941898M763764M621156m467688j0735934n123633
36737a9646631O188372J0544349M563217l404381l910725L548583J0491480Q781139
$$ plain form
36794 10397074 7858555 8018095 7540534 2520621 -4995243 -6934222 1958310 16565581
36786 16565581 25953122 24936742 17770163 10891889 6426946 3473601 1267561 -715169
36778 -715169 -2265165 -851618 5419032 11991125 10174291 -1714024 -13888448 -15449067
36770 -15449067 -5856920 7029404 16510436 20745023 20455288 17713125 15096931 12595282
36762 12595282 7552059 214628 -4552925 -4636936 -5138960 -10437685 -16237115 -15913250 -10972944
36753 -10972944 -7704976 -6403910 -2552538 2876844 3722731 -483492 -3173876 -2001666
36745 -2001666 -2412444 -6762398 -8704296 -3940532 680624 -3787064 -14522998 -19646631
36737 -19646631 -13458259 -2913910 1649307 -1755074 -5665799 -2117216 8374264 17155403
36729A7155403j3299o420536m853481K53591K315385J579644J690387J968459
36721A3675553l46330l242711k389517J200562K484166J67087k880314n413142
36713C255354p453016n736296K679791J2403602J3219558L239830p805579j0109296
36705C693948l439135N430532R522867N477240l719122r276851n393612K550640
36697D846507M535580j98901l454760j930939j217399m130566n106534n94106
36689g251118L838380K606805r46178r85050J374944J395595j153653k982011
36681d102286k682353n86580K853027M885279J688276m506230n683645J1860L690299
36672d432353q59938o635938m509583J948851K996887j049149j788009J922413
$$ plain form
36729 17155403 17142104 10721568 5868087 6121678 8437063 10016707 11707094 13675553
36721 13675553 13329223 10086512 7696995 8897557 11381723 11548810 8668496 3255354
36713 3255354 -4197662 -9933958 -7254167 5149435 18368993 21608823 13803244 3693948
36705 3693948 254813 5685345 15208212 20685452 16966330 7689479 2295867 4846507
36697 4846507 9382087 9183186 5728426 3797487 2580088 -1550478 -6657012 -7251118
36689 -7251118 -3412738 -805933 -1752111 -2737161 -1362217 33378 -1120275 -4102286
36681 -4102286 -6784639 -7371219 -4518192 367087 2055363 -2450867 -8134512 -8122652 -4432353
36672 -4432353 -5292291 -11928229 -16437812 -14488961 -11492074 -12541223 -14329232 -12406819
36664a2406819K929986j68828k8532N987793R954933N436225k783999o124540
36656B796219l545397o59492j319513l911476m032584P32312P072550P902519
36648E035138J060932o254456o621300k956700k721880m436330k94100Q390616
36640h798080J0658639L591314j899428J255152M590115j129169r523681q461674
36632i716812O04259N651434K677518r94306p72284n38134l123736n034474l463660
36623a4710195p85765P56941K315893L902324K793064p53061j939823J176657
36615g243965L896038K168994p66047N76198N320062P265446L408402k184533
36607A2440595l425252N14313L820522O14184p051517j0310948m613399L569105
$$ plain form
36664 -12406819 -9476833 -9645661 -9674193 -3686400 6268533 11704758 8920759 2796219
36656 2796219 -749178 -1408670 -2728183 -6639659 -10672243 -9939931 -2867381 5035138
36648 5035138 6096070 -158386 -6779686 -9736386 -12458266 -16894596 -17188696 -8798080
36640 -8798080 1860559 5451873 3552445 4807597 9397712 8268543 -1255138 -9716812
36632 -9716812 -9112553 -3461119 -783601 -1777907 -2550191 -3088325 -6212061 -11246535 -14710195
36623 -14710195 -15495960 -14739019 -12423126 -8520802 -5727738 -6480799 -8420622 -7243965
36615 -7243965 -3347927 -1178933 -1944980 -1368782 3951280 11216726 14625128 12440595
36607 12440595 9015343 9529656 13350178 13964362 6912845 -3398103 -8011502 -4442397
36599d442397N398997J842070N34049K504098R97466n635103r475989n274760
36591a3551569J402259L772662L942044O287481P357917J598240o826345p800411
36583c817722J06566P338446O290576m15821n543211n122133K70759O658795Q023620
36574A3789875J595163p092298r191292l579442J954210J655544j407905j656861
36566c933006R13129K329643Q83002j584514k657108j317457J583380L554187
36558b28744K675872P5193j516069j325125l58300J323245L795847M842384K622529
36549A1906832j31571L83350K221823N46893l185976k629546J958395K429769
36541A3499969l962525q786972n096988K048344M318348K479516K204644L033006
$$ plain form
36599 -4442397 956600 2798670 3332719 5836817 6834283 1199180 -8276809 -13551569
36591 -13551569 -12149310 -8376648 -4434604 1852877 9210794 10809034 3982689 -3817722
36583 -3817722 -3711156 3627290 9917866 9502045 3958834 -1163299 -892540 5766255 13789875
36574 13789875 15385038 8292740 -898552 -4477994 -2523784 -868240 -2276145 -3933006
36566 -3933006 -3019877 -690234 192768 -1391746 -4048854 -5366311 -3782931 -228744
36558 -228744 2447128 2522321 1006252 -318873 -677173 646072 4441919 9284303 11906832
36549 11906832 11775261 12158611 14380434 14927327 11741351 9111805 11070200 13499969
36541 13499969 9537444 750472 -4346516 -2298172 2020176 4499692 6704336 9737342
36533I737342L71768m803913o730328l662458J130003N429503Q573533Q002333
36525A8047783K390245l315981l070038J178951K405353p59136l555045m301972
36517I020160n839060p663473n198921J324026N004776K076347k801374l782790
36509g860309q37754K845265N208376M858981J210673k898523l376258j061350
36501a910899p75870l235328l806521q04650J385539j70443k474563k373218r87867
36492a5153820L11650K463099M608050L694113Q42961J060345L484777L16159
36484A627334r554651j4657159o286427P623474J3072988Q802197M548054M425848
36476I601658K973990l093403r062808r657544n195036J021071N895145O534424
$$ plain form
36533 9737342 10109110 5305197 -1425131 -5087589 -3957586 1471917 10045450 18047783
36525 18047783 20438028 17122047 14052009 15230960 17636313 16877177 13322132 9020160
36517 9020160 3181100 -4482373 -9681294 -8357268 -3352492 -1276145 -4077519 -7860309
36509 -7860309 -8698063 -5852798 -644422 4214559 5425232 2526709 -849549 -1910899
36501 -1910899 -2686769 -5922097 -9728618 -10533268 -9147729 -9318172 -11792735 -14165953 -15153820
36492 -15153820 -14842170 -12379071 -7771021 -4076908 -3233947 -2173602 1311175 1627334
36484 1627334 -7927317 -22584476 -28870903 -21247429 -8174441 627756 5175810 9601658
36476 9601658 12575648 9482245 419437 -9238107 -14433143 -13412072 -7516927 -982503
36468i82503K206546l144565m547550j919954J334591L823353N523716M101521
36460F395155j686444o528710l845514L891862P617097M728991J742555K530386
36452A4845378K514891j760116n122797j764383M709421N784338l88913p698105
36444A1119714j0610497q895161m743014n3837L085059L294655K481069M357469
36436C5457Q702845R812297L523352n779047r093435m081083J782911J573384
36428F476681j849197j646173J441652P87111l855932m754787Q91771N292708
36420B783834K223056l041092k784112R04025J405651l09963J192748M115431
36412F489578J822336m261688n274937M70196M040135J21246m756100l112577
$$ plain form
36468 -982503 1224043 -1920522 -6468072 -8388026 -7053435 -3230082 2293634 6395155
36460 6395155 4708711 -1819999 -5665513 -1773651 5843446 10572437 12314992 14845378
36452 14845378 17360269 15600153 10477356 8712973 13422394 19206732 18817819 11119714
36444 11119714 509217 -8385944 -13128958 -13182795 -10097736 -6803081 -4322012 35457
36436 35457 8738302 18550599 22073951 16294904 7201469 3120386 4903297 6476681
36428 6476681 4627484 2981311 4422963 5210074 1354142 -3400645 -2508874 2783834
36420 2783834 5006890 1965798 -818314 85711 1491362 1181399 2374147 6489578
36412 6489578 8311914 4050226 -1224711 -754515 3285620 3406866 -1349234 -4461811
36404d461811K011970K616892k243408o015881l834570K232000O269465M776623
36396A351280L99293q95832K166161L394858j857693q030887o251880K104741
36388g619959P047110M820814J987683L248457M617373K116088j332585k202113
36380A2682868k123878k801204k125011J41199j53058l629963m249033N93934
36372a664146M341590J807362k153831j703822j84961k586605m892928j232512
36364h269853M023768K684716k855190l649054J3362l03163m872327l968231N217763
36355a1978209J2178495Q655582M62143k556166k75309J069045q7296n89154j2202
36346F866929j093726l926363n063074k323220K836056P235357P852619L153555
$$ plain form
36404 -4461811 -2449841 167051 -2076357 -8092238 -11926808 -9694808 -3425343 1351280
36396 1351280 1750573 854741 3020902 6415760 4558067 -3472820 -9724700 -7619959
36388 -7619959 -572849 4247965 6235648 9484105 14101478 16217566 14884981 12682868
36380 12682868 10558990 7757786 5632775 5773974 5620916 1990953 -2258080 -1664146
36372 -1664146 2677444 4484806 2330975 627153 442192 -2144413 -7037341 -8269853
36364 -8269853 -4246085 -1561369 -4416559 -8065613 -8052251 -8355414 -13227741 -17195972 -11978209
36355 -11978209 200286 8855868 9318011 6761845 6486536 7555581 7468285 6879131 6866929
36346 6866929 5773203 1846840 -3216234 -5539454 -2703398 4531959 12384578 15538133
36338A5538133m502735q796195n178968L151435P890978N082000n75206k413531
36330A0195911l98460K00157k377126l686363p36020K496592J260890k053003
36322D902578j987706O36271P20227j129945N48459M703195L354448m209791p272574
36313B65162O2825Q068520N600502k900603n340756r13458J160442j450376j461296
36304C090962L831527P438956M238404j793117m950926m795234l055943k55846
36296C748783J986482J034794k311706m358956m236111l787191k129101K880258
36288g172748P834635O473583K09222k416499J266240M212779J755826j263896
36280A0899142J23662K723767J927025l42881p29014j347341m663891o483681
$$ plain form
36338 15538133 11035398 2239203 -2939765 211670 8102648 13184648 12609442 10195911
36330 10195911 9797451 9997608 7620482 3934119 3198099 5694691 6955581 4902578
36322 4902578 2914872 3551143 4271370 3141425 3689884 8393079 11747527 7537736 265162
36313 265162 327987 8396507 13997009 11096406 5755650 4842192 6002634 4552258 3090962
36304 3090962 6922489 14361445 18599849 16806732 11855806 7060572 4004629 3748783
36296 3748783 5735265 6770059 4458353 99397 -4136714 -7923905 -10053006 -7172748
36288 -7172748 661887 7135470 7344692 4928193 6194433 10407212 12163038 10899142
36280 10899142 11022804 13746571 15673596 15330715 14601701 13254360 8590469 2106788
36272B106788j722429N885568P371623R21741n517111m647784J412392M234248
$$ plain form
36272 2106788 384359 6269927 13641550 14563291 9046180 4398396 5810788 10045036
$$ [...]
##END NTUPLES=NMR SPECTRUM
##END=
