##TITLE=31Pdec_IPACAT-34a
 CDCl3 
  64 sc
 26.10.2023
##JCAMPDX= 6.0         $$ Bruker NMR JCAMP-DX V2.0
##DATA TYPE= NMR SPECTRUM
##DATA CLASS= NTUPLES
##ORIGIN= UXNMR, Bruker Analytische Messtechnik GmbH
##OWNER= root
$$ XWIN-NMR		Version 3.5
$$ Thu Oct 26 13:53:04 2023 Russian Standard Time (UT+4h)  she@DPX200
##.OBSERVE FREQUENCY= 81.013821
##.OBSERVE NUCLEUS= ^31P
##.ACQUISITION MODE= SIMULTANEOUS
##.ACQUISITION SCHEME= undefined
##.AVERAGES= 64
##.DIGITISER RES= 16
##SPECTROMETER/DATA SYSTEM= spect
##.PULSE SEQUENCE= zgpg30
##.SOLVENT NAME= CDCl3
##.SHIFT REFERENCE= (INTERNAL, CDCl3, 0, 248.564)
##AUDIT TRAIL= $$ (NUMBER, WHEN, WHO, WHERE, WHAT)
$$ ##TITLE= Audit trail, XWIN-NMR		Version 3.5
$$ ##JCAMPDX= 5.01
$$ ##ORIGIN= Bruker BioSpin GmbH
$$ ##OWNER= she
$$ F:/spectra/data/she/nmr/P31/1/pdata/1/auditp.txt
$$ ##AUDIT TRAIL=  $$ (NUMBER, WHEN, WHO, WHERE, WHAT)
(   1,<2023-10-26 13:51:53.93 +0400>,<she>,<DPX200>,
      <continue with go, POWCHK disabled, PULCHK disabled
       configuration hash MD5:
       00 E9 B6 7A A2 85 ED C7 34 08 36 98 17 FE 4E 26
       data hash MD5: 32K
       52 B7 70 88 49 5A 7B 0D 6E 71 EF B5 42 04 31 FF>)
(   2,<2023-10-26 13:51:55.93 +0400>,<she>,<DPX200>,
      <Start of raw data processing
       efp BC_mod = 2 LB = 5 FT_mod = 6 PKNL = 1 PHC0 = -11357.83 PHC1 = 1676.289 SI = 64K 
       data hash MD5: 64K
       B5 38 B0 03 C6 FC 86 AA C2 5E 9D F7 97 FA 31 95>)
(   3,<2023-10-26 13:52:30.25 +0400>,<she>,<DPX200>,
      <pk PHC0 = 732.8065 PHC1 = -1636.199 
       data hash MD5: 64K
       9B CF 52 F6 EE 07 91 F9 A6 43 8A 5D DE F0 8C DC>)
$$ ##END=
$$ 
$$ hash MD5
$$ 63 D9 B2 4F E9 AF 86 F4 A0 49 48 39 B3 F3 9A BC
##$RELAX= 
##$RELAX= 
##$RELAX= 
##$RELAX= 
##$RELAX= 
##$RELAX= 
##$RELAX= 
##$RELAX= 
##$RELAX= 
$$ Bruker specific parameters
$$ --------------------------
##$DU= <F:/spectra>
##$EXPNO= 1
##$NAME= <P31>
##$PROCNO= 1
##$TYPE= <nmr>
##$USER= <she>
##$AMP= (0..31)
100 100 100 100 100 100 100 100 100 100 100 100 100 100 100 100 100 100 
100 100 100 100 100 100 100 100 100 100 100 100 100 100 
##$AQSEQ= 0
##$AQ_mod= 1
##$AUNM= <au_zg>
##$AUTOPOS= <>
##$BF1= 81.014009
##$BF2= 200.13
##$BF3= 200.13
##$BF4= 200.13
##$BF5= 200.13
##$BF6= 200.13
##$BF7= 200.13
##$BF8= 200.13
##$BYTORDA= 1
##$CFDGTYP= 0
##$CFRGTYP= 5
##$CHEMSTR= <none>
##$CNST= (0..31)
1 1 145 1 1 1 1 1 1 1 1 1 1 1 1 1 1 1 1 1 1 1 1 1 1 1 1 1 1 1 1 1 
##$CPDPRG= <waltz16>
##$CPDPRG1= <>
##$CPDPRG2= <waltz16>
##$CPDPRG3= <>
##$CPDPRG4= <mlev>
##$CPDPRG5= <mlev>
##$CPDPRG6= <mlev>
##$CPDPRG7= <mlev>
##$CPDPRG8= <mlev>
##$CPDPRGB= <>
##$CPDPRGT= <>
##$D= (0..31)
0 1 0 0 0 0 0 0 0 0 0 0.03 2e-05 3e-06 0 0 0 0 0 0 0 0 0 0 0 0 0 0 0 0 
0 0 
##$DATE= 1698313832
##$DBL= (0..7)
120 120 120 11 120 120 24 19 
##$DBP= (0..7)
150 150 150 150 150 150 150 150 
##$DBP07= 0
##$DBPNAM0= <>
##$DBPNAM1= <>
##$DBPNAM2= <>
##$DBPNAM3= <>
##$DBPNAM4= <>
##$DBPNAM5= <>
##$DBPNAM6= <>
##$DBPNAM7= <>
##$DBPOAL= (0..7)
0.5 0.5 0.5 0.5 0.5 0.5 0.5 0.5 
$$ [...]
##$SUBNAM2= <"">
##$SUBNAM3= <"">
##$SUBNAM4= <"">
##$SUBNAM5= <"">
##$SUBNAM6= <"">
##$SUBNAM7= <"">
##$SUBNAM8= <"">
##$SUBNAM9= <"">
##$SW= 501.771253377433
##$SWIBOX= (0..15)
0 1 3 0 0 0 0 0 0 0 0 0 0 0 0 0 
##$SW_h= 40650.406504065
##$TD= 32768
##$TD0= 1
##$TE= 0
##$TE2= 300
##$TE3= 300
##$TEG= 300
##$TL= (0..7)
0 120 53 12 22 120 120 120 
##$TP= (0..7)
150 150 150 150 150 150 150 150 
##$TP07= 0
##$TPNAME0= <>
##$TPNAME1= <>
##$TPNAME2= <>
##$TPNAME3= <>
##$TPNAME4= <>
##$TPNAME5= <>
##$TPNAME6= <>
##$TPNAME7= <>
##$TPOAL= (0..7)
0.5 0.5 0.5 0.5 0.5 0.5 0.5 0.5 
##$TPOFFS= (0..7)
0 0 0 0 0 0 0 0 
##$TUNHIN= 0
##$TUNHOUT= 0
##$TUNXOUT= 0
##$USERA1= <user>
##$USERA2= <user>
##$USERA3= <user>
##$USERA4= <user>
##$USERA5= <user>
##$V9= 5
##$VALIST= <valist>
##$VCLIST= <CCCCCCCCCCCCCCC>
##$VD= 0
##$VDLIST= <DDDDDDDDDDDDDDD>
##$VPLIST= <PPPPPPPPPPPPPPP>
##$VTLIST= <TTTTTTTTTTTTTTT>
##$WBST= 1024
##$WBSW= 4
##$XGAIN= (0..3)
0 0 0 0 
##$XL= 0
##$YL= 0
##$YMAX_a= 1856
##$YMIN_a= -1685
##$ZGOPTNS= <>
##$ZL1= 120
##$ZL2= 120
##$ZL3= 120
##$ZL4= 120
##$ABSF1= 0
##$ABSF2= 0
##$ABSG= 0
##$ABSL= 0
##$ALPHA= 0
##$AQORDER= 0
##$ASSFAC= 0
##$ASSFACI= 0
##$ASSFACX= 0
##$ASSWID= 0
##$AUNMP= <proc_1d>
##$AZFE= 0.1
##$AZFW= 0.5
##$BCFW= 0
##$BC_mod= 2
##$BYTORDP= 0
##$COROFFS= 0
##$CY= -3
##$DATMOD= 1
##$DC= 0
##$DFILT= <>
##$DTYPP= 0
##$F1P= 0
##$F2P= 0
##$FCOR= 1
##$FTSIZE= 65536
##$FT_mod= 6
##$GAMMA= 0
##$GB= 0
##$INTBC= 1
##$INTSCL= 6.047779e-11
##$ISEN= 30
##$LB= 5
##$LEV0= 0
##$LPBIN= 0
##$MAXI= 10000
##$MC2= 0
##$MEAN= 0
##$ME_mod= 0
##$MI= 50
##$NCOEF= 0
##$NC_proc= -10
##$NLEV= 6
##$NOISF1= 182.463
##$NOISF2= 159.3651
##$NSP= 0
##$NTH_PI= 0
##$NZP= 0
##$OFFSET= 248.5645
##$PC= 4
##$PHC0= -10625.02
##$PHC1= 40.08997
##$PH_mod= 1
##$PKNL= yes
##$PPARMOD= 0
##$PSCAL= 0
##$PSIGN= 0
##$REVERSE= no
##$SF= 81.0140089999694
##$SI= 65536
##$SIGF1= 159.3651
##$SIGF2= -187.1042
##$SINO= 113.3802
##$SIOLD= 16384
##$SREGLST= <1H.CDCl3>
##$SSB= 0
##$STSI= 65536
##$STSR= 0
##$SW_p= 40650.406504065
##$SYMM= 0
##$S_DEV= 0
##$TDeff= 32768
##$TDoff= 0
##$TI= <>
##$TILT= no
##$TM1= 0
##$TM2= 0
##$TOPLEV= 0
##$USERP1= <user>
##$USERP2= <user>
##$USERP3= <user>
##$USERP4= <user>
##$USERP5= <user>
##$WDW= 1
##$XDIM= 65536
##$YMAX_p= 462751830
##$YMIN_p= -173148540
$$ End of Bruker specific parameters
$$ ---------------------------------
##NTUPLES= NMR SPECTRUM
##VAR_NAME=  FREQUENCY,     SPECTRUM/REAL,   SPECTRUM/IMAG
##SYMBOL=    X,             R,               I
##VAR_TYPE=  INDEPENDENT,   DEPENDENT,       DEPENDENT
##VAR_FORM=  AFFN,          ASDF,            ASDF
##VAR_DIM=   65536,         65536,           65536
##UNITS=     HZ,            ARBITRARY UNITS, ARBITRARY UNITS
##FACTOR=    0.620285442955139, 1,           1
##FIRST=     20137.2065510682, 0,            0
##LAST=      -20513.1999529968, 0,           0
##MIN=       -20513.1999529968, -173148540,  0
##MAX=       20137.2065510682, 462751830,    0
$$ Real data points
##PAGE= N=1
##DATA TABLE= (X++(R..R)), XYDATA
$$ [...]
$$ plain form
40009 9902780 9814906 9895261 9583240 8710817 7437334 6318205 6169824 7455544 9719119
40000 9719119 11760789 12422223 11194768 8208695 3888429 -1256409 -6617177 -11493796
39992 -11493796 -15275839 -17639942 -18530098 -17971176 -16000654 -12799308 -8756312 -4306918
39984 -4306918 207919 4418500 7778485 9766224 10298587 9858791 9193182 8905437 9200670
39975 9200670 9759688 9805650 8534928 5736322 2054451 -1368237 -3528579 -3996592 -2995516
39966 -2995516 -1204444 610862 1935915 2591160 2623020 2263562 1944060 2081532 2679315
39957 2679315 3197269 2879710 1185220 -1966307 -6028081 -9826699 -12150000 -12735486 -12526554
39948 -12526554 -12591260 -12871795 -12379982 -10596397 -8204004 -6259923 -5032420 -3974589 -2592281
$$ packed form
40009I902780q7874Q0355l12021q72423j273483j119129j48381J285720K263575
40000I719119K041670O61434j227455k986073m320266n144838n360768m876619
39992a1493796l782043k364103q90156N58922J970522L201346M042996M449394
39984d306918M514837M210581L359985J987739N32363m39796o65609k87745K95233
39975I200670N59018M5962j270722k798606l681871l422688k160342m68013J001076
39966b995516J791072J815306J325053O55245L1860l59458l19502J37472N97783
39957B679315N17954l17559j694490l151527m061774l798618k323301n85486K08932
39948a2526554o4706k80535M91813J783585K392393J944081J227503J057831J382308
$$ plain form
39939 -2592281 -932303 727880 2283425 3740075 4938127 5522559 5199355 3995521
39931 3995521 2271120 444942 -1334251 -3225524 -5384122 -7655838 -9589679 -10658767
39923 -10658767 -10464831 -8974031 -6807257 -5200150 -5320601 -7424732 -10730909 -14132033
39915 -14132033 -16923003 -18882240 -19949921 -20066020 -19244708 -17608110 -15312266 -12529748
39907 -12529748 -9533109 -6744913 -4641966 -3523728 -3304958 -3604152 -4179739 -5240831
39899 -5240831 -7094834 -9412669 -11086171 -11038481 -9100145 -5959738 -2396263 1236715
39891 1236715 4895924 8530448 11915784 14599729 15998806 15784180 14274123 12293480
39883 12293480 10557861 9293348 8448802 8036911 8116638 8595604 9241499 9857878 10368177
$$ packed form
39939b592281J659978J660183J555545J456650J198052N84432l23204j203834
39931C995521j724401j826178j779193j891273k158598k271716j933841j069088
39923a0658767J93936J490800K166774J607107j20451k104131l306177l401124
39915a4132033k790970j959237j067681j16099Q21312J636598K295844K782518
39907a2529748K996639K788196K102947J118238K18770k99194n75587j061092
39899e240831j854003k317835j673502M7690J938336L140407L563475L632978
39891A236715L659209L634524L385336K683945J399077k14626j510057j980643
39883A2293480j735619j264513q44546m11891P9727M78966O45895O16379N10299
$$ plain form
39874 10368177 10816991 11407786 12480469 14325954 17007284 20355711 24004369 27321732
39866 27321732 29462379 29765963 28230626 25523042 22440398 19350741 16162638 12824045
39858 12824045 9804705 7995401 8040239 9762175 12261940 14489666 15658327 15360376
39850 15360376 13734890 11609202 10047362 9395042 8906575 7566323 5147196 2216604
39842 2216604 -714120 -3623839 -6571102 -9281977 -11371129 -12761007 -13675637 -14308912
39834 -14308912 -14635878 -14522895 -13984206 -13366508 -13212559 -13762052 -14580465 -14895198 -14388791
39825 -14388791 -13496169 -12839977 -12573378 -12429072 -12226113 -12066085 -12073954 -12184908 -12264319 -12325959
39815 -12325959 -12566671 -13223376 -14394306 -15928400 -17455260 -18566484 -19025237 -18812942 -17927994
$$ packed form
39874A0368177M48814N90795J072683J845485K681330L348427L648658L317363
39866B7321732K140647L03584j535337k707584l082644l089657l188103l338593
39858A2824045l019340j809304M4838J721936K499765K227726J168661k97951
39850A5360376j625486k125688j561840o52320m88467j340252k419127k930592
39842B216604k930724k909719k947263k710875k089152j389878r14630o33275
39834a4308912l26966J12983N38689O17698J53949n49493q18413l14733N06407
39825a4388791Q92622O56192K66599J44306K02959J60028p869j10954p9411o1640
39815a2325959k40712o56705j170930j534094j526860j111224m58753K12295Q84948
$$ plain form
39806 -17927994 -16090797 -12724714 -7462943 -830733 5723316 10742982 13747965 15197128
39798 15197128 15623756 15169473 13999883 12728736 12100439 12441518 13668370 15612045 17973491
39789 17973491 20083298 21172145 21017503 20034738 18573800 16370270 12950019 8497065
39781 8497065 4068294 835934 -830102 -1470392 -1766037 -1776065 -1032248 686168 2890821
39772 2890821 4781899 5937610 6471460 6675089 6756475 6867705 7109217 7448526 7853188
39763 7853188 8589905 10172155 12811534 16004861 18850050 20785706 21908541 22546373
39755 22546373 22670427 21917134 20221032 18212176 16699169 15723475 14399167 11892971
39747 11892971 8407909 4958990 2271876 193497 -1803667 -3838130 -5491878 -6293442
$$ packed form
39806a7927994J837197L366083N261771O632210O554049N019666L004983J449163
39798A5197128M26628m54283j169590j271147o28297L41079J226852J943675K361446
39789A7973491K109807J088847j54642r82765j460938k203530l420251m452954
39781H497065m428771l232360j666036o40290k95645j0028P43817J718416K204653
39772B890821J891078J155711N33850K03629Q1386J11230K41512L39309M04662
39763G853188P36717J582250K639379L193327K845189J935656J122835O37832
39755B2546373J24054p53293j696102k008856j513007r75694j324308k506196
39747A1892971l485062l448919k687114k078379j997164k034463j653748q01564
$$ plain form
39739 -6293442 -6162609 -5433084 -4540244 -3685899 -2785889 -1727470 -586856 454325 1229765
39730 1229765 1429374 486795 -1981064 -5536083 -8997712 -11302347 -12154144 -11869162 -10933375
39721 -10933375 -9844380 -9012097 -8471007 -7836143 -6789275 -5464625 -4116037 -2581866
39713 -2581866 -456278 2201788 4652007 6128917 6634596 7032164 8374982 11065892
39705 11065892 14566754 17936388 20641593 22727224 24263357 25014542 24866135 24233875
39697 24233875 23656474 23160360 22419390 21396199 20345071 19211774 17569226 15335438
39689 15335438 13170488 11918826 11859823 12590309 13366909 13505774 12854829 12089289 12183982
39680 12183982 13301346 14480423 14717860 14088921 13485822 13558925 14395064 16048278 18776402
$$ packed form
39739f293442J30833P29525Q92840Q54345R00010J058419J140614J041181P75440
39730A229765J99609r42579k467859l555019l461629k304635q51797K84982R35787
39721a0933375J088995Q32283N41090O34864J046868J324650J348588J534171
39713b581866K125588K658066K450219J476910N05679L97568J342818K690910
39705A1065892L500862L369634K705205K085631J536133P51185j48407o32260
39697B4233875n77401m96114p40970j023191j051128j133297j642548k233788
39689A5335438k164950j251662n9003P30486P76600J38865o50945p65540R4693
39680A2183982J117364J179077K37437o28939o03099P3103Q36139J653214K728124
$$ plain form
39671 18776402 22632737 27211156 31903378 36112798 39213849 40776340 41081633 41078417 41450743
39662 41450743 41790356 40889802 37833184 32785291 26939291 21844555 18540360 16997580
39654 16997580 16376762 15965540 15785422 16126043 16655647 16388407 14660228 11915072 9380271
39645 9380271 8099327 8368000 9864618 11973621 13941354 15022997 14783103 13310509
39637 13310509 11039927 8305644 5087107 1179223 -3458523 -8539584 -13534611 -17830044
39629 -17830044 -20889152 -22443530 -22577190 -21489042 -19094337 -15005182 -9099818 -2108162
39621 -2108162 4519622 9414777 11993698 12524240 11742436 10458341 9293155 8499897 7929724
39612 7929724 7222992 6113081 4640879 3166117 2127963 1615470 1102881 -216466 -2655062
$$ packed form
39671A8776402L856335M578419M692222M209420L101051J562491L05293l216L72326
39662D1450743L39613r00554l056618n047893n846000n094736l304195j542780
39654A6997580o20818m11222j80118L40621N29604k67240j728179k745156k534801
39645I380271j280944K68673J496618K109003J967733J081643k39894j472594
39637A3310509k270582k734283l218537l907884m637746n081061m995027m295433
39629a7830044l059108j554378j33660J088148K394705M089155N905364O991656
39621b108162O627784M895155K578921N30542p81804j284095j165186p93258n70173
39612G929724p06732j109911j472202j474762j038154n12493n12589j319347k438596
$$ plain form
39603 -2655062 -5648777 -8273352 -10057183 -11133583 -11727059 -11815127 -11345359 -10487237 -9492111
39594 -9492111 -8489590 -7606379 -7134062 -7318142 -7967816 -8430000 -8011471 -6439109 -4040614
39585 -4040614 -1623020 -109414 -69407 -1433047 -3568463 -5566501 -6535267 -5955001 -4067406
39576 -4067406 -1902229 -680388 -1045610 -2829898 -5408437 -8106101 -10356013 -11782833
39568 -11782833 -12323950 -12233725 -11907279 -11664932 -11583306 -11416136 -10774928 -9571575 -8248109
39559 -8248109 -7398107 -7198719 -7403976 -7839559 -8614168 -9772389 -10971998 -11620513 -11211047
39550 -11211047 -9561380 -7019362 -4529695 -3201607 -3564684 -5315515 -7797368 -10466335
39542 -10466335 -12848572 -14524731 -15578221 -16828981 -19127673 -22345581 -25308436 -26767308
$$ packed form
39603b655062k993715k624575j783831j076400n93476q8068M69768Q58122R95126
39594i492111J002521Q83211M72317j84080o49674m62184M18529J572362K398495
39585d040614K417594J513606M0007j363640k135416j998038r68766N80266J887595
39576d067406K165177J221841l65222j784288k578539k697664k249912j426820
39568a1782833n41117R0225L26446K42347Q1626J67170O41208J203353J323466
39559h248109Q50002J99388k05257m35583p74609j158221j199609o48515M09466
39550a1211047J649667K542018K489667J328088l63077j750831k481853k668967
39542a0466335k382237j676159j053490j250760k298692l217908k962855j458872
$$ plain form
39534 -26767308 -26329419 -24602281 -22723483 -21669447 -21622522 -21833184 -21255115 -19428656 -16728687
39525 -16728687 -13873211 -11396673 -9528153 -8276615 -7546703 -7355384 -7965786 -9586852
39517 -9586852 -11878446 -13992453 -15250914 -15625021 -15406095 -14553245 -12587394 -9161545 -4668638
39508 -4668638 -270716 2710927 3580695 2634579 914386 -293839 139775 2800231 7289392
39499 7289392 12244171 16211697 18686903 20143853 21062593 21210392 19955036 17003911
39491 17003911 12695537 7796783 3161720 -613317 -3344027 -4929527 -4912560 -2829924
39483 -2829924 748710 3966945 4981445 3420790 275722 -3350125 -6833769 -9550249
39475 -9550249 -10569842 -9189076 -5470553 -142757 5658964 10454637 12841912 12452758
$$ packed form
39534b6767308M37889J727138J878798J054036M6925k10662N78069J826459K699969
39525a6728687K855476K476538J868520J251538P29912J91319o10402j621066
39517i586852k291594k114007j258461l74107K18926Q52850J965851L425849M492907
39508d668638M397922K981643Q69768r46116j720193j208225M33614K660456M489161
39499G289392M954779L967526K475206J456950R18740J47799j255356k951125
39491A7003911m308374m898754m635063l775037k730710j585500J6967K082636
39483b829924L578634L218235J014500j560655l145068l625847l483644k716480
39475i550249j019593J380766L718523N327796N801721M795673K387275l89154
$$ plain form
39467 12452758 10370209 8193567 6704879 5671910 4778491 4323878 4965720 7083783
39459 7083783 10462581 14334147 17656954 19650417 20304754 20322024 20484481 21117831 22036630
39450 22036630 22647184 22003002 19228176 14429809 9179431 5650508 4991538 6536974
39442 6536974 8532068 9419154 8478316 5701075 1512001 -3361483 -8036852 -11716858
39434 -11716858 -13866111 -14274548 -13121010 -11010022 -8779101 -7051541 -5857371 -4679747
39426 -4679747 -2914541 -346582 2759088 5973125 9064312 12057061 14999931 17745692
39418 17745692 19961011 21335680 21843432 21897119 22240251 23542557 25946942 28925373 31538655
39409 31538655 32880430 32465174 30435689 27478819 24423629 21773472 19514521 17232953
$$ packed form
39467A2452758k082549k176642j488688j032969q93419m54613O41842K118063
39459G083783L378798L871566L322807J993463O54337J7270J62457O33350R18799
39450B2036630O10554o44182k774826m798367n250378l528923o58970J545436
39442F536974J995094Q87086r40838k777241m189074m873484m675369l680006
39434a1716858k149253m08437J153538K110988K230921J727560J194170J177624
39426d679747J765206K567959L105670L214037L091187K992749K942870K745761
39418A7745692K215319J374669N07752N3687L43132J302306K404385K978431K613282
39409C1538655J341775m15256k029485k956870l055190k650157k258951k281568
$$ plain form
39401 17232953 14344184 10421729 5677042 1211987 -1499026 -1679976 127072 2480851
39393 2480851 3988599 3985851 2732637 1206376 462415 868806 1991716 3322226 4873781
39384 4873781 6827813 8854304 10200736 10361166 9282940 7026292 3751255 130385
39376 130385 -2755560 -4270118 -4712953 -4731465 -4511462 -3851611 -2854922 -2187328 -2625984
39367 -2625984 -4506830 -7555201 -11078789 -14345393 -16928647 -18760193 -19911223 -20474803
39359 -20474803 -20659516 -20694797 -20407512 -19080509 -16072253 -11613584 -6824200 -2966262 -821574
39350 -821574 -630342 -2165856 -4624008 -6720950 -7379435 -6540598 -5210043 -4555768 -4920434
39341 -4920434 -5729130 -6293133 -6558409 -7020470 -8045862 -9420984 -10506780 -10690946 -9727725
$$ packed form
39401A7232953k888769l922455m744687m465055k711013j80950J807048K353779
39393B480851J507748k748j253214j526261p43961M06391J122910J330510J551555
39384D873781J954032K026491J346432J60430j078226k256648l275037l620870
39376A30385k885945j514558m42835j8512K20003O59851R96689O67594m38656
39367b625984j880846l048371l523588l266604k583254j831546j151030n63580
39359b0474803j84713l5281K87285J327003L008256M458669M789384L857938K144688
39350h21574J91232j535514k458152k096942o58485Q38837J330555O54275l64666
39341d920434q08696n64003k65276m62061j025392j375122j085796j84166R63221
$$ plain form
39332 -9727725 -7810311 -5323842 -2365361 1514161 6888822 13649046 20699208 26546186
39324 26546186 30166484 31385288 30691575 28864869 26661310 24652425 23264002 22844724
39316 22844724 23500616 24859063 26252399 27278345 28022249 28633892 28921079 28563341 27534437
39307 27534437 26045496 24199548 22038012 19943269 18675795 18787534 20019420 21343276
39299 21343276 21630948 20390063 18000715 15317864 13060730 11546573 10803846 10629955
39291 10629955 10484818 9644947 7738875 5080860 2401013 408838 -322818 574782 2905133
39282 2905133 5715819 7828094 8596159 7980788 6045552 2788551 -1496301 -6079168
39274 -6079168 -10228693 -13640202 -16376436 -18612444 -20561358 -22441198 -24301138 -25941109
$$ packed form
39332i727725J917414K486469K958481L879522N374661O760224P050162N846978
39324B6546186L620298J218804o93713j826706k203559k008885j388423m19278
39316B2844724O55892J358447J393336J025946P43904O11643K87187l57738j028904
39307B7534437j488941j845948k161536k094743j267474J11739J231886J323856
39299B1343276K87672j240885k389348k682851k257134j514157p42727j73891
39291A0629955j45137q39871j906072k658015k679847j992175p31656Q97600K330351
39282B905133K810686K112275P68065o15371j935236l257001m284852m582867
39274f079168m149525l411509k736234k236008j948914j879840j859940j639971
$$ plain form
39266 -25941109 -27131107 -27859540 -28252910 -28266951 -27551566 -25674004 -22498297 -18376851 -14005526
39257 -14005526 -10134848 -7416169 -6339097 -7014114 -8934901 -11195288 -13109492 -14467466
39249 -14467466 -15099368 -14544040 -12522444 -9556823 -6666695 -4433971 -2715071 -1284541
39241 -1284541 -343114 -208552 -812226 -1756539 -2727860 -3677102 -4699072 -5876725 -7180454
39232 -7180454 -8435645 -9449100 -10204894 -10859024 -11538456 -12256099 -13009333 -13794860 -14494199
39223 -14494199 -14903309 -14920227 -14550703 -13685606 -12057243 -9536471 -6371383 -3029807 154395
39214 154395 3148225 6080428 8925800 11291717 12627952 12794782 12349130 12103136 12464729
39205 12464729 13349747 14544057 15817598 16808903 17282488 17598645 18531856 20454734 22996077
$$ packed form
39266b5941109j189998p28433l93370j4041P15385J877562L175707M121446M371325
39257a4005526L870678K718679J077072o75017j920787k260387j914204j357974
39249a4467466o31902N55328K021596K965621K890128K232724J718900J430530
39241a284541R41427J34562o03674r44313r71321r49242j021970j177653j303729
39232g180454j255191j013455p55794o54130o79432p17643p53234p85527o99339
39223a4494199m09110j6918L69524Q65097J628363K520772L165088L341576L184202
39214A54395K993830K932203K845372K365917J336235J66830m45652k45994L61593
39205A2464729Q85018J194310J273541R91305M73585L16157R33211J922878K541343
$$ plain form
39196 22996077 25591265 27952274 29785891 30521004 29805993 28089096 26249162 24649561
39188 24649561 22848468 20223537 16592668 12166052 7148644 1624190 -4121588 -9255678
39180 -9255678 -12619069 -13587659 -12750659 -11491104 -10778201 -10510154 -10002396 -8757714 -6656471
39171 -6656471 -3866790 -961583 1169652 2014259 1981012 1903211 2069147 2099914 1733964
39162 1733964 1285847 1173176 1300419 1156671 424268 -664489 -1587384 -2157337 -2917776
39153 -2917776 -4804913 -8248190 -12618933 -16683620 -19560969 -21148987 -21791922 -21838222 -21524395
39144 -21524395 -20983307 -20208842 -19166333 -18065317 -17411488 -17638119 -18673317 -19894616 -20487707
39135 -20487707 -19894465 -18082942 -15546556 -13049266 -11209748 -10107072 -9176955 -7610496
$$ packed form
39196B2996077K595188K361009J833617P35113p15011j716897j839934j599601
39188B4649561j801093k624931l630869m426616n017408n524454n745778n134090
39180i255678l363391r68590Q37000J259555P12903K68047N07758J244682K101243
39171f656471K789681K905207K131235Q44607l3247p7801J65936L0767l65950
39162A733964m48117j12671J27243j43748p32403j088757r22895n69953p60439
39153b917776j887137l443277m370743m064687k877349j588018o42935m6300L13827
39144b1524395N41088P74465J042509J101016O53829k26631j035198j221299n93091
39135b0487707N93242J811523K536386K497290J839518J102676R30117J566459
$$ plain form
39127 -7610496 -5082625 -2176051 -13952 568420 -485651 -2578824 -4822241 -6387692
39119 -6387692 -6898957 -6581824 -5747823 -4092351 -935196 3631510 8255754 11368151 12479052
39110 12479052 12162535 11115206 9711481 8241307 6984274 6047850 5554630 5884365 7178210
39101 7178210 8618272 8873726 7550831 5748220 4869978 5209470 5917442 5964047 4816790
39092 4816790 2598310 160924 -1101327 -62990 3304829 8066320 13242223 18363416
39084 18363416 23159570 27098710 29498154 29966719 28535116 25405866 20809356 15215180
39076 15215180 9527943 4795042 1573809 -346092 -1502372 -2122815 -2072975 -1403311 -716248
39067 -716248 -793383 -1844497 -3222892 -3976181 -3708831 -2854935 -2061898 -1408211 -392270
$$ packed form
39127g610496K527871K906574K162099N82372j054071k093173k243417j565451
39119f387692n11265L17133Q34001J655472L157155M566706M624244L112397J110901
39110A2479052l16517j047329j403725j470174j257033r36424m93220L29735J293845
39101G178210J440062K55454j322895j802611q78242L39492P07972M6605j147257
39092D816790k218480k437386j262251J038337L367819M761491N175903N121193
39084A8363416M796154L939140K399444M68565j431603l129250m596510n594176
39076A5215180n687237m732901l221233j919901j156280o20443M9840O69664O87063
39067g16248p7135j051114j378395p53289K67350Q53896P93037O53687J015941
$$ plain form
39058 -392270 1358598 3620928 5848954 7604229 8561998 8452980 7406580 6217724 5856435
39049 5856435 6649431 8159157 9798019 11245472 12279346 12596279 12004519 10629990 8828776
39040 8828776 6997723 5418407 4030326 2331235 -203925 -3448536 -6523510 -8476571
39032 -8476571 -8979649 -8385813 -7290828 -6022332 -4307069 -1408217 3129383 8753474
39024 8753474 14119660 18121714 20566378 21884037 22515552 22662456 22258214 20929744 18222504
39015 18222504 14135606 9362935 4911947 1613855 -19923 143741 1676342 3662468
39007 3662468 5180624 5621862 4563724 1779295 -2322207 -6571468 -9755791 -11368935
38999 -11368935 -11466123 -10093210 -7299979 -3577743 201979 3376700 5776302 7460218
$$ packed form
39058c92270J750868K262330K228026J755275R57769j09018j046400j188856l61289
39049E856435P92996J509726J638862J447453J033874L16933n91760j374529j801214
39040H828776j831053j579316j388081j699091k535160l244611l074974j953061
39032h476571n03078N93836J094985J268496J715263K898852M537600N624091
39024H753474N366186M002054K444664J317659O31515J46904m04242j328470k707240
39015A8222504m086898m772671m450988l298092j633778J63664J532601J986126
39007C662468J518156M41238j058138k784429m101502m249261l184323j613144
38999a1368935r7188J372913K793231L722236L779722L174721K399602J683916
$$ plain form
38991 7460218 8493087 9020795 9277879 9395099 9357852 9222058 9236752 9672284 10543833 11452226
38981 11452226 11664414 10514624 7899197 4320168 386745 -3515018 -6924527 -9037816
38973 -9037816 -9221471 -7779603 -5855222 -4513600 -4140691 -4652893 -5861456 -7447703 -8845861
38964 -8845861 -9410043 -8709169 -6679344 -3610576 22160 3836189 7622581 11067454
38956 11067454 13582727 14719459 14695627 14213413 13779969 13532260 13701456 14766462 16908598
38947 16908598 19615653 22090039 23899649 25104249 25988799 26867211 27906440 28847720
38939 28847720 29004536 27786038 25210319 21796971 18060262 14210689 10173480 5723942
38931 5723942 791799 -4117174 -7960990 -9970440 -10412105 -10272912 -10178654 -9876159 -8766803
$$ packed form
38991G460218J032869N27708K57084J17220l7247j35794J4694M35532Q71549R08393
38981A1452226K12188j149790k615427l579029l933423l901763l409509k113289
38973i037816j83655J441868J924381J341622L72909n12202j208563j586247j398158
38964h845861n64182P00874K029825L068768L632736L814029L786392L444873
38956A1067454K515273J136732k3832m82214m33444k47709J69196J065006K142136
38947A6908598K707055K474386J809610J204600Q84550Q78412J039229R41280
38939B8847720J56816j218498k575719l413348l736709l849573m037209m449538
38931E723942m932143m908973l843816k009450m41665J39193R4258L02495J109356
$$ plain form
38922 -8766803 -6601952 -3545941 89681 3908987 7483575 10701153 13959570 17629771
38914 17629771 21261066 23644545 23875845 22209162 19702000 17156909 14626955 11876792
38906 11876792 9017512 6543778 4901633 4205254 4349046 5218120 6668521 8352281
38898 8352281 9742345 10475331 10615759 10399171 9713032 8109836 5500934 2554364 16399
38889 16399 -2273638 -5279583 -9644278 -15064743 -20864707 -26659788 -32082006 -36238357
38881 -36238357 -38038454 -37046694 -33643876 -28417190 -21845817 -14669170 -8108086 -3348971
38873 -3348971 -841085 -188215 -636820 -1623268 -2965463 -4613232 -6248015 -7302423 -7569043
38864 -7569043 -7645915 -8408015 -9970979 -11478157 -12044097 -11679933 -11171408 -11276518 -12160459
$$ packed form
38922h766803K164851L056011L635622L819306L574588L217578L258417L670201
38914A7629771L631295K383479K31300j666683k507162k545091k529954k750163
38906A1876792k859280k473734j642145o96379J43792Q69074J450401J683760
38898H352281J390064P32986J40428k16588o86139j603196k608902k946570k537965
38889A6399k290037l005945m364695n420465n799964n795081n422218m156351
38881c6238357j800097R91760L402818N226686O571373P176647O561084M759115
38873c348971K507886O52870m48605r86448j342195j647769j634783j054408k66620
38864g569043p6872p62100j562964j507178n65940L64164N08525j05110q83941
$$ plain form
38855 -12160459 -13307370 -13699093 -12301726 -8830697 -4176939 91306 2783609 3714703
38847 3714703 3443664 2549549 1137992 -1051379 -4069486 -7290360 -9630776 -10347321 -9604433
38838 -9604433 -8273945 -7331676 -7466273 -8906229 -11181295 -13046986 -13061412 -10604753 -6428753
38829 -6428753 -2214517 404725 585605 -1500866 -4838197 -8052769 -10145594 -11058662
38821 -11058662 -11544141 -12376972 -13696774 -15166810 -16642211 -18394263 -20583709 -22766180
38813 -22766180 -24164808 -24319219 -23235011 -21027911 -17827112 -14128945 -10903627 -9088723
38805 -9088723 -9072898 -10731806 -13674305 -17208602 -20325528 -22174735 -22634241 -22181432 -21203400
38796 -21203400 -19721254 -17881919 -16422404 -16341787 -18080451 -21063381 -23975543 -25490858
$$ packed form
38855a2160459j146911l91723J397367L471029M653758M268245K692303R31094
38847C714703k71039q94115j411557k189371l018107l220874k340416p16545P42888
38838i604433J330488R42269j34597j439956k275066j865691j4426K456659M176000
38829f428753M214236K619242J80880k086471l337331l214572k092825r13068
38821a1058662m85479q32831j319802j470036j475401j752052k189446k182471
38813b2766180j398628j54411J084208K207100L200799L698167L225318J814904
38805i088723J5825j658908k942499l534297l116926j849207m59506M52809R78032
38796b1203400J482146J839335J459515Q0617j738664k982930k912162j515315
$$ plain form
38788 -25490858 -25015054 -23042120 -20784128 -19172412 -18040143 -16339649 -13204298 -8676783
38780 -8676783 -3370828 2267514 8009265 13295822 17204132 19252953 19933760 20053231
38772 20053231 19684012 18161109 15088547 10931636 6501839 2244193 -1712512 -5096357
38764 -5096357 -7473828 -8646354 -8811969 -8336498 -7522237 -6519685 -5214175 -3187364 -55253
38755 -55253 3984867 8014610 10886704 11845710 10734025 7844031 3805688 -416185 -3719111
38746 -3719111 -5405458 -5693067 -5597871 -6092898 -7238652 -8135251 -7759690 -5863892 -3124952
38737 -3124952 -549188 1234448 2230928 2791899 3094395 2856190 1571725 -930939 -4144524
38728 -4144524 -7070360 -8774934 -8919229 -7933680 -6663519 -5635226 -4567140 -2718870
$$ packed form
38788b5490858M75804J972934K257992J611716J132269J700494L135351M527515
38780h676783N305955N638342N741751N286557L908310K048821O80807J19471
38772B0053231l69219j522903l072562m156911m429797m257646l956705l383845
38764e096357k377471j172526j65615M75471Q14261J002552J305510K026811L132111
38755e5253M040120M029743K872094R59006j111685k889994m038343m221873l302926
38746c719111j686347k87609R5196m95027j145754q96599L75561J895798K738940
38737c124952K575764J783636R96480N60971L02496k38205j284465k502664l213585
38728d144524k925836j704574j44295R85549J270161J028293J068086J848270
$$ plain form
38720 -2718870 192419 3521354 6183674 7461701 7251691 5777298 3397431 684300
38712 684300 -1635092 -3061208 -3645028 -3840795 -3987005 -3911011 -3050822 -997129 2080229
38703 2080229 5536604 8673971 10947638 11904644 11296686 9434517 7206595 5476890
38695 5476890 4479362 3897203 3416636 3059006 3080623 3709871 4886542 6096736 6576097
38686 6576097 5890838 4282863 2318564 339499 -1552878 -3188646 -4392382 -5267764
38678 -5267764 -5960933 -6064843 -4718462 -1580401 2564005 6437826 9330109 11278293
38670 11278293 12399749 12440026 11041449 8210065 4395960 219479 -3823267 -7505747
38662 -7505747 -10871260 -14120561 -17428219 -20760898 -23804657 -26100648 -27332809 -27489281
$$ packed form
38720b718870K911289L328935K662320J278027k10010j474393k379867k713131
38712F84300k319392j426116n83820j95767j46210P5994Q60189K053693L077358
38703B080229L456375L137367K273667R57006o07958j862169k227922j729705
38695E476890r97528n82159m80567l57630K1617O29248J176671J210194M79361
38686F576097o85259j607975j964299j979065j892377j635768j203736q75382
38678e267764o93169j03910J346381L138061M144406L873821K892283J948184
38670A1278293J121456M0277j398577k831384l814105m176481m042746l682480
38662g505747l365513l249301l307658l332679l043759k295991j232161j56472
$$ plain form
38654 -27489281 -26688876 -24878991 -21816846 -17379961 -11822313 -5715245 274530 5544587
38646 5544587 9648309 12356683 13624241 13472550 11944618 9159765 5309837 566652
38638 566652 -4897822 -10705683 -16139338 -20338303 -22737928 -23409912 -23015876 -22344420 -21760464
38629 -21760464 -21076154 -19976955 -18480458 -16884687 -15421678 -14228592 -13608018 -13937838
38621 -13937838 -15132724 -16433256 -16990243 -16581940 -15588969 -14377761 -12961440 -11281925
38613 -11281925 -9620636 -8622258 -8971705 -11054033 -14777376 -19544277 -24343794 -28011843
38605 -28011843 -29674268 -29155385 -26954617 -23688697 -19520475 -14219408 -7786512 -895665
38597 -895665 5358881 10152247 13453840 15996153 18645583 21558623 23890025 24494314
$$ packed form
38654b7489281Q00405J809885L062145M436885N557648O107068N989775N270057
38646E544587M103722K708374J267558j51691j527932k784853l849928m743185
38638E66652n464474n807861n433655m198965k399625o71984L94036O71456N83956
38629b1760464O84310J099199J496497J595771J463009J193086O20574l29820
38621a3937838j194886j300532n56987M08303R92971J211208J416321J679515
38613a1281925J661289R98378l49447k082328l723343m766901m799517l668049
38605b8011843j662425N18883K200768L265920M168222N301067O432896O890847
38597h95665O254546M793366L301593K542313K649430K913040K331402O04289
$$ plain form
38589 24494314 22979528 19981683 16508720 13319560 10914194 9608835 9261947 9189664
38581 9189664 8725656 7759077 6472107 4758479 2316535 -730623 -3702691 -5918346
38573 -5918346 -7110903 -7284678 -6526115 -5130194 -3667487 -2712094 -2590427 -3458817 -5428131
38564 -5428131 -8436422 -12094450 -15811997 -19065855 -21505825 -22898743 -23102197 -22140597
38556 -22140597 -20325800 -18287764 -16719567 -15865226 -15240285 -14024984 -11775258 -8638888
38548 -8638888 -4950598 -922150 3169443 6788175 9402193 10833201 11168776 10479583
38540 10479583 8892585 6876251 5112106 3934813 3076764 2136372 1214547 897860 1567996
38531 1567996 2852635 3879816 4048514 3424377 2367466 997634 -712500 -2356361
$$ packed form
38589B4494314j514786k997845l472963l189160k405366j305359l46888p2283
38581I189664m64008r66579j286970j713628k441944l047158k972068k215655
38573e918346j192557j73775P58563J395921J462707R55393J21667q68390j969314
38564e428131l008291l658028l717547l253858k439970j392918k03454R61600
38556b2140597J814797K038036J568197Q54341O24941J215301K249726L136370
38548h638888L688290M028448M091593L618732K614018J431008L35575o89193
38540A0479583j586998k016334j764145j177293q58049r40392r21825l16687O70136
38531A567996J284639J027181J68698o24137j056911j369832j710134j643861
$$ plain form
38523 -2356361 -2949783 -1653796 1363874 4920638 7695398 9080052 9253690 8639701 7478302
38514 7478302 5934803 4415434 3475944 3270903 3221457 2437627 484608 -2384369 -5691283
38505 -5691283 -9170400 -12651117 -15740215 -17890325 -18809923 -18696963 -18027184 -17107765 -15802937
38496 -15802937 -13733893 -10873866 -7937405 -5964135 -5394168 -5717793 -6168543 -6534141 -6993565
38487 -6993565 -7322297 -6774123 -4977828 -2675881 -1258434 -1580046 -3349766 -5550521 -7205878
38478 -7205878 -7772606 -7160041 -5696026 -4048342 -2923563 -2674618 -3197865 -4182419 -5319068
38469 -5319068 -6215047 -6314856 -5197216 -3019071 -528257 1432901 2374339 2152235 761193
38460 761193 -1650024 -4567316 -7082510 -8259575 -7715720 -5975076 -4196158 -3345501 -3503913
$$ packed form
38523b356361n93422J295987L017670L556764K774760J384654J73638o13989j161399
38514G478302j543499j519369r39490k05041m9446p83830j953019k868977l306914
38505e691283l479117l480717l089098k150110r19598J12960O69779R19419J304828
38496a5802937K069044K860027K936461J973270N69967l23625m50750l65598m59424
38487f993565l28732N48174J796295K301947J417447l21612j769720k200755j655357
38478g205878n66728O12565J464015J647684J124779K48945n23247r84554j136649
38469e319068q95979r9809J117640K178145K490814J961158R41438k22104j391042
38460G61193k411217k917292k515194j177065N43855J740644J778918Q50657j58412
$$ plain form
38451 -3503913 -3969220 -3968175 -3162185 -1600709 436855 2394920 3524364 3323661 1879374
38442 1879374 -311897 -2686076 -4644087 -5535746 -5032314 -3523733 -1852658 -569020
38434 -569020 428484 1587214 3271447 5578071 8246009 10647840 12125023 12526375 12382869
38425 12382869 12554679 13754306 16178007 19177812 21267579 20933942 17812499 12988558
38417 12988558 8032652 3868981 540102 -2370408 -5364640 -8733729 -12169233 -14702474
38409 -14702474 -15304430 -13560478 -9724534 -4439378 1278029 6057889 8748785 9071242
38401 9071242 7472817 4461480 468181 -3747571 -7163960 -9204971 -10057300 -10186000
38393 -10186000 -9944855 -9779322 -10212072 -11142776 -11510597 -10212678 -7288277 -3858376 -1083555
$$ packed form
38451c503913m65307J045Q05990J561476K037564J958065J129444k00703j444287
38442A879374k191271k374179j958011q91659N03432J508581J671075J283638
38434e69020R97504J158730J684233K306624K667938K401831J477183M01352j43506
38425A2382869J71810J199627K423701K999805K089767l33637l121443m823941
38417A2988558m955906m163671l328879k910510k994232l369089l435504k533241
38409a4702474o01956J743952L835944N285156N717407M779860K690896L22457
38401I071242j598425l011337l993299m215752l416389k041011q52329j28700
38393a0186000K41145J65533m32750r30704l67821J297919K924401L429901K774821
$$ plain form
38384 -1083555 411199 345946 -1211452 -3443478 -4929208 -4592832 -2341346 1330120 5964948
38375 5964948 11083858 15856160 19384653 21405083 22473970 23409954 24606064 25739333
38367 25739333 25976477 24632972 21943944 19159597 17605309 17602666 18455927 19339947 19807619
38358 19807619 19466966 17786529 14687536 11113413 8568287 8017002 9352204 11769322
38350 11769322 14357035 16393638 17489690 17696265 17395329 16997022 16777071 16914556 17433215
38341 17433215 18052582 18369673 18381288 18643798 19653069 21121442 22110387 21904226 20557026
38332 20557026 18537987 16104779 13287398 10408230 8260598 7493268 7842672 8199665
38324 8199665 7584911 5996654 4181644 2641908 1089595 -1047261 -3794209 -6519872
$$ packed form
38384a083555J494754o5253j557398k232026j485730L36376K251486L671466M634828
38375E964948N118910M772302L528493K020430J068887R35984J196110J133269
38367B5739333K37144j343505k689028k784347j554288k643Q53261Q84020M67672
38358A9807619l40653j680437l098993l574123k545126n51285J335202K417118
38350A1769322K587713K036603J096052K06575l00936l98307k19951J37485N18659
38341A7433215O19367L17091J1615K62510J009271J468373R88945k06161j347200
38332B0557026k019039k433208k817381k879168k147632p67330L49404L56993
38324H199665o14754j588257j815010j539736j552313k136856k746948k725663
$$ plain form
38316 -6519872 -8555165 -9643299 -9741002 -8708559 -6520946 -3717174 -1298506 11348
38308 11348 318672 298136 510486 1096719 1978568 3057464 4168496 5074965 5647845 5923274
38298 5923274 5895649 5433478 4562840 3662928 3110125 2788182 2231551 1267861 222237
38289 222237 -635185 -1575516 -3081575 -5099965 -6800800 -7072956 -5186771 -1093674 4680149
38280 4680149 11320721 17971273 23838491 28274579 30990359 32220178 32457778 31898143
38272 31898143 30335846 27817961 25192785 23602740 23368429 23679091 23542865 22846362 22334602
38263 22334602 22748290 24198902 26235082 28181552 29354216 29213385 27558152 24646403
38255 24646403 21180965 18242612 17066072 18419804 21838824 25558004 27581297 27057949
$$ packed form
38316f519872k035293j088134r7703J032443K187613K803772K418668J309854
38308A1348L07324k0536K12350N86233Q81849J078896J111032R06469N72880K75429
38298E923274k7625m62171q70638q99912n52803l21943n56631r63690j045624
38289B22237q57422r40331j506059k018390j700835k72156J886185M093097N773823
38280D680149O640572O650552N867218M436088K715780J229819K37600n59635
38272C1898143j562297k517885k625176j590045k34311L10662j36226o96503n11760
38263B2334602M13688J450612K036180J946470J172664j40831j655233k911749
38255B4646403l465438k938353j176540J353732L419020L719180K023293n23348
$$ plain form
38247 27057949 24645405 21639901 18968183 16961149 15635324 14803504 14050611 12987227
38239 12987227 11596025 10124045 8633690 6891167 4713285 2167210 -621660 -3564079
38231 -3564079 -6373935 -8509504 -9537259 -9327786 -7707529 -4240407 1213403 7806984
38223 7806984 13980892 18542209 21327594 22881109 23744987 24023978 23317178 21019315 16989170
38214 16989170 12047619 7593931 4606913 3147748 2752778 2878652 2818990 1702896 -868102
38205 -868102 -4262175 -7289373 -9269380 -10428395 -11374689 -12588197 -14443244 -17220825
38197 -17220825 -20707066 -23958445 -25854114 -25978746 -24848581 -23301336 -21804766 -20280900
38189 -20280900 -18306971 -15388415 -11327007 -6625162 -2438570 166284 948700 325134
$$ packed form
38247B7057949k412544l005504k671718k007034j325825q31820p52893j063384
38239A2987227j391202j471980j490355j742523k177882k546075k788870k942419
38231c564079k809856k135569j027755K09473J620257L467122N453810O593581
38223G806984O173908M561317K785385J553515Q63878K78991p06800k297863m030145
38214A6989170m941551m453688k987018j459165l94970J25874n9662j116094k570998
38205h68102l394073l027198j980007j159015r46294j213508j855047k777581
38197a7220825l486241l251379j895669j24632J130165J547245J496570J523866
38189b0280900J973929K918556M061408M701845M186592K604854P82416o23566
$$ plain form
38181 325134 -1427355 -4390694 -8328209 -12262755 -15158332 -16824482 -17753918 -18227819 -18086102
38172 -18086102 -17380537 -16698486 -16560025 -16790629 -16701715 -15648162 -13279620 -9647956 -5455786
38163 -5455786 -1980584 -289211 -442298 -1616811 -2907283 -3813983 -4131734 -3773869 -2807928
38154 -2807928 -1452990 46781 1464390 2569671 3246936 3627744 3985354 4563959 5639646
38145 5639646 7566383 10415474 13564522 15947226 16807207 16047472 13925619 10816712
38137 10816712 7414518 4751081 3577529 3743836 4413163 4891587 5131582 5503281 6296557
38128 6296557 7516980 9009426 10563458 11803439 12101954 10874364 8089079 4311458
38120 4311458 69172 -4635732 -9890757 -15100513 -19103005 -21127872 -21273095 -19960125
$$ packed form
38181C25134j752489k963339l937515l934546k895577j666150r29436m73901J41717
38172a8086102P05565O82051J38461k30604Q8914J053553K368542L631664M192170
38163e455786L475202J691373j53087j174513j290472r06700l17751L57865R65941
38154b807928J354938J499771J417609J105281O77265L80808L57610N78605J075687
38145E639646J926737K849091L149048K382704Q59981p59735k121853l108907
38137A0816712l402194k663437j173552J66307O69327M78424K39995L71699P93276
38128F296557J220423J492446J554032J239981K98515j227590k785285l777621
38120D311458m242286m704904n255025n209756m002492k024867j45223J312970
$$ plain form
38112 -19960125 -17385961 -13773216 -9743066 -6019210 -2995336 -947044 -364910 -1516046
38104 -1516046 -3773992 -5948576 -7342777 -8024928 -8066186 -7222137 -5742441 -4887962 -5868739
38095 -5868739 -8294931 -10218682 -9895024 -7298822 -3922429 -1387521 -307096 -138617
38087 -138617 150537 1168038 2577464 3407521 2944657 1380154 -339895 -1176265 -534804
38078 -534804 1554517 4462292 7123246 8435751 7814463 5549255 2676530 387678
38070 387678 -688795 -845776 -973193 -1768668 -3193104 -4663928 -5670202 -6093136 -6032358
38061 -6032358 -5579963 -4860151 -4128041 -3693100 -3806236 -4663598 -6374626 -8814029 -11628446
38052 -11628446 -14513817 -17363353 -20029638 -22180211 -23702863 -25116264 -27141979 -29791617
$$ packed form
38112a9960125K574164L612745M030150L723856L023874K048292N82134j151136
38104a516046k257946k174584j394201o82151m1258Q44049J479696Q54479r80777
38095e868739k426192j923751L23658K596202L376393K534908J080425J68479
38087a38617K89154J017501J409426Q30057m62864j564503j720049q36370O41461
38078e34804K089321K907775K660954J312505o21288k265208k872725k288852
38070C87678j076473j56981j27417p95475j424436j470824j006274m22934O0778
38061f032358M52395P19812P32110M34941j13136q57362j711028k439403k814417
38052a1628446k885371k849536k666285k150573j522652j413401k025715k649638
$$ plain form
38044 -29791617 -32225731 -33641971 -33980397 -33600969 -32659758 -31155691 -29326941 -27555980
38036 -27555980 -25962881 -24457058 -23110240 -22042958 -20916679 -19021782 -16118289 -12884409
38028 -12884409 -10252625 -8466904 -6999739 -5235113 -3030900 -789642 737999 815020
38020 815020 -781123 -3522702 -6534659 -9256133 -11620887 -13696083 -15389928 -16526288
38012 -16526288 -16971558 -16592975 -15256447 -12983340 -10032826 -6778966 -3579612 -747389
38004 -747389 1525036 3279382 4697892 5833523 6564686 6855592 6854952 6611346 5885943
37995 5885943 4454237 2491787 503749 -993323 -1552890 -810614 1158527 3519168
37987 3519168 5155803 5662554 5569292 5396633 4773611 2817802 -724590 -5000454 -8657637
$$ packed form
38044b9791617k434114j416240l38426L79428R41211J504067J828750J770961
38036b7555980J593099J505823J346818J067282J126279J894897K903493L233880
38028a2884409K631784J785721J467165J764626K204213K241258J527641P7021
38020H15020j596143k741579l011957k721474k364754k075196j693845j136360
38012a6526288m45270L78583J336528K273107K950514L253860L199354K832223
38004g47389K272425J754346J418510J135631P31163K90906o40k43606p25403
37995E885943j431706j962450j988038j497072n59567P42276J969141K360641
37987C519168J636635N06751r3262j72659o23022j955809l542392m275864l657183
$$ plain form
37978 -8657637 -10690407 -10766508 -9142589 -6534042 -3944580 -2331032 -2222574 -3532657 -5670853
37969 -5670853 -7917626 -9881556 -11692453 -13698640 -15942259 -18003329 -19400498 -20060587
37961 -20060587 -20310668 -20460498 -20501364 -20223364 -19530091 -18547391 -17407774 -15980730 -13916460
37952 -13916460 -11068373 -7922651 -5549017 -4990439 -6564442 -9669661 -13238608 -16419417
37944 -16419417 -18942736 -20982256 -22746750 -24181878 -24996725 -24964566 -24235139 -23339004 -22783015
37935 -22783015 -22560549 -22095336 -20748005 -18404659 -15596663 -13138228 -11655085 -11228367
37927 -11228367 -11227908 -10581910 -8594501 -5664313 -2959937 -1201441 21187 1469732 2997303
37918 2997303 3484082 2092986 -723709 -3631331 -5622226 -6628237 -7051870 -6958396 -5887513
$$ packed form
37978h657637k032770p6101J623919K608547K589462J613548J08458j310083k138196
37969e670853k246773j963930j810897k006187k243619k061070j397169o60089
37961b0060587k50081j49830m0866K78000O93273R82700J139617J427044K064270
37952a3916460K848087L145722K373634N58578j574003l105219l568947l180809
37944a6419417k523319k039520j764494j435128q14847L2159P29427Q96135N55989
37935b2783015K22466M65213J347331K343346K807996K458435J483143M26718
37927a1228367M59O45998J987409K930188K704376J758496J222628J448545J527571
37918B997303M86779j391096k816695k907622j990895j006011m23633R3474J070883
$$ plain form
37909 -5887513 -3495715 -357862 1984164 1954573 -927857 -5739588 -10814587 -14644979
37901 -14644979 -16357527 -15733982 -13010606 -8592351 -2853621 3778084 10609052 16757221
37893 16757221 21537181 24651877 25984935 25466521 23352770 20460050 17797725 15903460
37885 15903460 14645439 13599569 12405690 10768241 8387256 5083423 945642 -3720574
37877 -3720574 -8566805 -13330459 -17880818 -22170874 -26095204 -29419517 -31950695 -33757652
37869 -33757652 -35076944 -35972938 -36249002 -35770204 -34740039 -33572576 -32621676 -32111223 -32107083
37860 -32107083 -32315228 -32051054 -30772032 -28715538 -26751474 -25472992 -24606267 -23418968
37852 -23418968 -21495500 -18917278 -15869720 -12407887 -8622660 -4750121 -952320 2887061
$$ packed form
37909e887513K391798L137853K342026k9591k882430m811731n074999l830392
37901a4644979j712548O23545K723376M418255N738730O631705O830968O148169
37893A6757221M779960L114696J333058n18414k113751k892720k662325j894265
37885A5903460j258021j045870j193879j637449k380985l303833m137781m666216
37877c720574m846231m763654m550359m290056l924330l324313k531178j806957
37869c3757652j319292q95994k76064M78798J030165J167463R50900N10453M140
37860c2107083k08145K64174J279022K056494J964064J278482Q66725J187299
37852b3418968J923468K578222L047558L461833L785227L872539L797801L839381
$$ plain form
37844 2887061 6978036 11203516 14932619 17337520 18034674 17500867 16765513 16555298 16777058
37835 16777058 16927024 16844416 16771217 16707870 16097751 14362015 11567178 8423197 5802970
37826 5802970 4373662 4387211 5469959 6708904 7283781 7089373 6606347 6228034 5898480
37817 5898480 5303496 4104018 1964676 -1314024 -5469389 -9656912 -12770254 -13959087
37809 -13959087 -13063935 -10808127 -8477564 -7039673 -6418526 -5779714 -4530497 -2802207
37801 -2802207 -940958 1107748 3681795 6872381 10312987 13387381 15550304 16600456
37793 16600456 16721977 16084547 14404186 11281582 7143441 3388301 1137975 82007
37785 82007 -954974 -2435585 -3643432 -3818431 -3225931 -2885655 -3629654 -5663798 -8653915
$$ packed form
37844B887061M090975M225480L729103K404901O97154n33807p35354k10215K21760
37835A6777058J49966q2608p3199o3347o10119j735736k794837l143981k620227
37826E802970j429308J3549J082748J238945N74877j94408m83026l78313l29554
37817E898480n94984j199478k139342l278700m155365m187523l113342j188833
37809a3959087Q95152K255808K330563J437891O21147O38812J249217J728290
37801b802207J861249K048706K574047L190586L440606L074394K162923J050152
37793A6600456J21521o37430j680361l122604m138141l755140k250326j055968
37785H2007j036981j480611j207847j74999N92500L40276p43999k034144k990117
$$ plain form
37776 -8653915 -11763839 -13726528 -13395229 -10543797 -6140388 -1817801 951434 1404000
37768 1404000 -353026 -3452756 -6637156 -8853969 -9784914 -9885453 -9864002 -10062187 -10279689
37759 -10279689 -10079608 -9159548 -7519236 -5517727 -3865489 -3367748 -4452389 -6928724
37751 -6928724 -10232778 -13787238 -17054483 -19482932 -20751935 -21119014 -21308354 -21942052 -23143423
37742 -23143423 -24667866 -26218106 -27507495 -28132052 -27596662 -25606303 -22374787 -18626008
37734 -18626008 -15232626 -12800347 -11525695 -11256588 -11481381 -11363833 -10207194 -8123758
37726 -8123758 -6046741 -4868176 -4721818 -5260127 -6288975 -7688343 -8908683 -9184479 -8423603
37717 -8423603 -7454286 -7132624 -7476792 -7901605 -8050979 -8100457 -8353708 -8801729 -9090614 -8838834
$$ packed form
37776h653915l109924j962689L31299K851432M403409M322587K769235M52566
37768A404000j757026l099730l184400k216813r30945j00539K1451j98185k17502
37759a0279689K00081R20060J640312K001509J652238M97741j084641k476335
37751f928724l304054l554460l267245k428449j269003l67079j89340o33698j201371
37742b3143423j524443j550240j289389o24557N35390J990359L231516L748779
37734a8626008L393382K432279J274652K69107k24793J17548J156639K083436
37726h123758K077017J178565J46358n38309j028848j399368j220340k75796P60876
37717h423603R69317L21662l44168m24813j49374m9478k53251m48021k88885K51780
$$ plain form
37707 -8838834 -8070258 -7403732 -7645371 -9012003 -10830906 -12145751 -12563763 -12422080 -12253071
37698 -12253071 -12262670 -12271151 -11976900 -11240895 -10198853 -9128733 -8227170 -7588684 -7371490 -7763941
37688 -7763941 -8663962 -9582985 -10095858 -10310993 -10700348 -11533825 -12715096 -14157020 -16036821
37679 -16036821 -18541744 -21506035 -24410819 -26630172 -27576774 -26754434 -23926530 -19330230
37671 -19330230 -13650071 -7713492 -2194568 2479850 6129886 8828792 10771852 11952913
37663 11952913 12016783 10628989 7981437 4693290 1185973 -2491483 -6021632 -8397465
37655 -8397465 -8639501 -6824564 -3924183 -616615 3244905 7855508 12671435 16747745
37647 16747745 19531725 20963646 21062049 19851177 17583532 14629562 11179566 7411726
$$ packed form
37707h838834P68576O66526k41639j366632j818903j314845m18012J41683J69009
37698a2253071r599q481K94251P36005J042042J070120R01563O38486K17194l92451
37688g763941r00021r19023n12873k15135l89355q33477j181271j441924j879801
37679a6036821k504923k964291k904784k219353r46602Q22340K827904M596300
37671a9330230N680159N936579N518924M674418L650036K698906J943060J181061
37663A1952913O3870j387794k647552l288147l507317l677456l530149k375833
37655h397465k42036J814937K900381L307568L861520M610603M815927M076310
37647A6747745K783980J431921R8403j210872k267645k953970l449996l767840
$$ plain form
37639 7411726 3947931 1754986 1440757 2829607 5230488 7847923 9929995 10962499
37631 10962499 11039754 10859225 11063889 11635701 12073656 12001789 11323699 9853030 7183559
37622 7183559 3157055 -1669510 -6225990 -9607969 -11497046 -12030405 -11514225 -10349989
37614 -10349989 -9005539 -7761707 -6464156 -4706753 -2309866 494239 3293320 5632421
37606 5632421 6869332 6313373 3929783 805179 -1471098 -1969329 -807505 1444001
37598 1444001 4234264 6777883 7893715 6721590 3629415 71301 -2544842 -3686142
37590 -3686142 -3481749 -2113079 295843 3339444 6193915 7900754 7728765 5383185
37582 5383185 1168571 -3903247 -8358305 -10933740 -11186660 -9496196 -6574930 -3100361
$$ packed form
37639G411726l463795k192945l14229J388850K400881K617435K082072J032504
37631A0962499P7255j80529K04664N71812M37955p1867o78090j470669k669471
37622G183559m026504m826565m556480l381979j889077n33359N16180J164236
37614a0349989J344450J243832J297551J757403K396887K804105K799081K339101
37606E632421J236911n55959k383590l124604k276277m98231J161824K251506
37598A444001K790263K543619J115832j172125l092175l558114k616143j141300
37590c686142K04393J368670K408922L043601K854471J706839j71989k345580
37582E383185m214614n071818m455058k575435k52920J690464K921266L474569
$$ plain form
37574 -3100361 266453 2850709 4279325 4858669 5446312 6802789 9077739 11939209
37566 11939209 15059339 18278260 21295526 23440881 23974201 22629995 19810877 16306874
37558 16306874 12877730 9922469 7294991 4507829 1437892 -1126299 -1967826 -595431
37550 -595431 2395163 6232302 10770161 16024307 21388427 26030613 29945296 33882260
37542 33882260 38082937 41679142 43618548 43756044 42789187 41559071 40767433 41033380 42766957
37533 42766957 46036293 50724021 56642371 63415244 70637828 78477659 87945034 100425250
37525 100425250 117197184 139425504 168076246 203623517 246318980 296486361 352643346
37518 352643346 407774174 448757429 462751830 446197158 407404639 359995266 314197834
$$ packed form
37574c100361L366814K584256J428616N79344N87643J356477K274950K861470
37566A1939209L120130L218921L017266K145355N33320j344206k819118l504003
37558A6306874l429144k955261k627478k787162l069937k564191q41527J372395
37550e95431K990594L837139M537859N254146N364120M642186L914683L936964
37542C3882260M200677L596205J939406J37496r66857j230116p91638K65947J733577
37533D2766957L269336M687728N918350O772873P222584P839831R467375J2480216
37525A00425250J6771934K2228320K8650742L5547271M2695463N0167381N6156985
37518C52643346N5130828M0983255J3994401j6554672l8792519m7409373m5797432
$$ plain form
37511 314197834 273857529 239151357 209649034 184900940 164107837 146464015 131525264
37504 131525264 118864245 107741304 97508687 88152391 80105228 73538765 68035060
37497 68035060 63021181 58421017 54691119 52107203 50182840 48090770 45626697 43373574
37489 43373574 41796130 40563952 39005469 36849768 34154975 30842958 26847477 22594843
37481 22594843 18796037 15724510 13149126 11062703 10016954 10481697 12146385 14091783
37473 14091783 15485061 15954378 15516528 14465182 13344751 12803097 13246876 14491020 15705988
37464 15705988 15871503 14528472 12146732 9657845 7654638 6189387 5285277 5339787 6869550
37455 6869550 9985635 14191226 18538342 21917679 23455955 22943256 20923459 18283792
$$ packed form
37511C14197834m0340305l4706172k9502323k4748094k0793103j7643822j4938751
37504A31525264j2661019j1122941j0232617r356296q047163o566463n503705
37497F8035060n013879m600164l729898k583916j924363k092070k464073k253123
37489D3373574j577444j232178j558483k155701k694793l312017l995481m252634
37481B2594843l798806l071527k575384k086423j045749M64743J664688J945398
37473A4091783J393278M69317m37850j051346j120431n41654M43779J244144J214968
37464A5705988J65515j343031k381740k488887k003207j465251r04110N4510J529763
37455F869550L116085M205591M347116L379337J538276n12699k019797k639667
$$ plain form
37447 18283792 15768089 13862134 12864134 12710254 12708588 11769698 9189590 5234846 884987
37438 884987 -2971499 -6027409 -8355790 -9965724 -10686388 -10353929 -8877516 -6088556 -1757327
37429 -1757327 3998798 10319302 15809405 19344331 20760060 20762272 20148153 19124091 17393383
37420 17393383 14862121 12134292 10218608 9778332 10730608 12518569 14643218 16921269
37412 16921269 19336633 21687698 23354375 23496770 21660968 18214376 14041313 9774482
37404 9774482 5447705 891635 -3740490 -7909718 -10973919 -12490154 -12495761 -11655213 -10952471
37395 -10952471 -11073050 -12175559 -14219005 -17090701 -20190187 -22338171 -22634282 -21274064
37387 -21274064 -19101104 -16514135 -13345980 -9749290 -6514543 -4238702 -2653698 -1112683
$$ packed form
37447A8283792k515703j905955r98000j53880j666r38890k580108l954744m349859
37438H84987l856486l055910k328381j609934p20664L32459J476413K788960M331229
37429a757327N756125O320504N490103L534926J415729K212o14119j024062j730708
37420A7393383k531262k727829j915684m40276R52276J787961K124649K278051
37412A6921269K415364K351065J666677J42395j835802l446592m173063m266831
37404I774482m326777m556070m632125m169228l064201j516235n607Q40548P02742
37395a0952471j20579j102509k043446k871696l099486k147984k96111J360218
37387b1274064K172960K586969L168155L596690L234747K275841J585004J541015
$$ plain form
37379 -1112683 619048 2440160 4502640 7211859 10589465 13929597 16208574 16786726
37371 16786726 15796714 14006827 12280986 11028844 10129918 9359551 8746105 8445543 8450920
37362 8450920 8616249 8870013 9196211 9425914 9230612 8358079 6769178 4544498 1783261
37353 1783261 -1362223 -4621733 -7592785 -9739427 -10447454 -9242304 -6073080 -1380529
37345 -1380529 4147664 9881827 15326998 20007471 23446698 25370653 25895583 25410253
37337 25410253 24257614 22599732 20540737 18154290 15276759 11481070 6524077 824316
37329 824316 -4616782 -8712648 -10691882 -10371371 -8482250 -6620560 -6316273 -7881971 -10361688
37320 -10361688 -12631741 -14245890 -15241141 -15729587 -16045690 -16865780 -18659529 -21153112 -23671367
$$ packed form
37379a112683J731731J821112K062480K709219L377606L340132K278977N78152
37371A6786726r90012j789887j725841j252142q98926p70367o13446l00562N377
37362H450920J65329K53764L26198K29703j95302q72533j588901k224680k761237
37353A783261l145484l259510k971052k146642p08027J205150L169224M692551
37345a380529N528193N734163N445171M680473L439227J923955N24930m85330
37337B5410253j152639j657882k058995k386447k877531l795689m956993n699761
37329H24316n441098m095866j979234L20511J889121J861690L04287j565698k479717
37320a0361688k270053j614149r95251m88446l16103q20090j793749k493583k518255
$$ plain form
37311 -23671367 -25852845 -27739622 -29422316 -31015651 -32765055 -34657136 -36058104 -36343372
37303 -36343372 -35892042 -35807745 -36441441 -36747007 -35445175 -32434906 -28743042 -25471680 -23183692
37294 -23183692 -21949999 -21402521 -20817035 -19654989 -18113156 -16800779 -15799021 -14340839
37286 -14340839 -11555301 -7344246 -2453394 2112962 5625647 7779274 8589922 8265670
37278 8265670 7164408 5781599 4604024 3863102 3504260 3469766 3861445 4660316 5447167
37269 5447167 5709792 5407044 4929270 4462237 3721786 2477312 1045973 -13361 -554884
37260 -554884 -949731 -1641890 -2847069 -4589063 -6662966 -8456937 -9111324 -8142582 -5896052
37251 -5896052 -3259332 -935246 960135 2687785 4469730 6355465 8402149 10824482
$$ packed form
37311b3671367k181478j886777j682694j593335j749404j892081j400968k85268
37303c6343372M51330Q4297o33696l05566J301832L010269L691864L271362K287988
37294b3183692J233693N47478N85486J162046J541833J312377J001758J458182
37286a4340839K785538M211055M890852M566356L512685K153627Q10648l24252
37278H265670j101262j382809j177575p40922l58842l4494L91679P98871P86851
37269E447167K62625l02748m77774m67033p40451j244474j431339j059334n41523
37260e54884l94847o92159j205179j741994k073903j793971o54387R68742K246530
37251e896052K636720K324086J895381J727650J781945J885735K046684K422333
$$ plain form
37243 10824482 13863402 17520713 21511735 25508708 29327376 32766506 35329250 36289756
37235 36289756 35136496 31944546 27370438 22408770 18111213 15252592 14003791 13912938
37227 13912938 14301207 14690940 14879338 14777763 14318495 13380440 11602240 8390819 3475274
37218 3475274 -2417887 -7647808 -10585977 -10442841 -7299262 -1749306 5177992 11972196
37210 11972196 17051765 19546886 19728543 18712848 17789007 17832061 18959850 20521458 21518822
37201 21518822 21244939 19619005 16995916 13813638 10504070 7602841 5703918 5164395
37193 5164395 5823607 7013965 7900128 7958931 7301466 6584724 6516310 7288604 8384378
37184 8384378 8928643 8320160 6638354 4522932 2697807 1570348 1119655 954895 454385
$$ packed form
37243A0824482L038920L657311L991022L996973L818668L439130K562744R60506
37235C6289756j153260l191950m574108m961668m297557k858621j248801r0853
37227A3912938L88269L89733J88398j01575m59268r38055j778200l211421m915545
37218C475274n893161n229921k938169J43136L143579N549956O927298O794204
37210A1972196N079569K495121J81657j015695r23841M3054J127789J561608R97364
37201B1518822k73883j625934k623089l182278l309568k901229j898923n39523
37193E164395O59212J190358Q86163N8803o57465p16742o8414P72294J095774
37184H384378N44265o08483j681806k115422j825125j127459m50693j64760n00510
$$ plain form
37175 454385 -904752 -3096825 -5440662 -7119596 -7851775 -7960415 -7829918 -7484248 -6739621
37166 -6739621 -5572900 -4194808 -2849998 -1663075 -637442 268571 1028888 1486473 1470248
37157 1470248 968010 47657 -1375412 -3401380 -5616510 -7003239 -6783922 -5318100 -3839124
37148 -3839124 -3283795 -3675791 -4656020 -6139118 -8130961 -10211684 -11695478 -12329097 -12492837
37139 -12492837 -12580943 -12391767 -11281922 -8828496 -5278232 -1521914 1205459 1779365 -205827
37130 -205827 -3973445 -7789313 -9956125 -9816556 -7860014 -4949574 -1629919 1767165
37122 1767165 4631696 6098681 5680429 3685353 893733 -2005825 -4488799 -5922664
37114 -5922664 -5694596 -3839227 -1315295 688860 1785633 2541501 3558731 4655966
$$ packed form
37175D54385j359137k192073k343837j678934p32179j08640J30497L45670P44627
37166f739621J166721J378092J344810J186923J025633R06013P60317M57585j6225
37157A470248n02238r20353j423069k025968k215130j386729K19317J465822J478976
37148c839124N55329l91996r80229j483098j991843k080723j483794o33619j63740
37139a2492837q8106J89176J109845K453426L550264L756318K727373N73906j985192
37130b05827l767618l815868k166812J39569J956542K910440L319655L397084
37122A767165K864531J466985m18252j995076k791620k899558k482974j433865
37114e922664K28068J855369K523932K004155J096773P55868J017230J097235
$$ plain form
37106 4655966 5174286 4888063 4160696 3109066 1087171 -2540239 -7242437 -11398585 -13619460
37097 -13619460 -13682970 -12101270 -9235650 -5247418 -695396 3371478 6123634 7567500
37089 7567500 8331260 8922958 9251497 8814769 7345390 5309750 3689520 3123024 3280342
37080 3280342 3224456 2374439 976844 -301487 -974105 -898133 -187683 769072 1382593
37071 1382593 1282238 713519 357470 716309 1748264 3041050 4175365 4931622 5361899
37062 5361899 5777888 6514107 7493984 8046979 7386965 5477007 3411277 2739639 4193802
37053 4193802 6978508 9315664 9710720 7795896 4223053 45902 -3790264 -6710967
37045 -6710967 -8607348 -9674163 -9997276 -9300712 -7219912 -3829205 187785 3868713
$$ packed form
37106D655966N18320k86223p27367j051630k021895l627410m702198m156148k220875
37097a3619460o3510J581700K865620L988232M552022M066874K752156J443866
37089G567500P63760N91698L28539m36728j469379k035640j620230n66496J57318
37080C280342n5886q50017j397595j278331o72618P5972P10450R56755O13521
37071A382593j00355n68719l56049L58839J031955J292786J134315P56257M30277
37062E361899M15989P36219R79877N52995o60014j909958k065730o71638J454163
37053D193802K784706K337156L95056j914824l572843m177151l836166k920703
37045f710967j896381j066815l23113O96564K080800L390707M016990L680928
$$ plain form
37037 3868713 6393277 7288216 6503067 4434220 1754236 -951046 -3402521 -5485149
37029 -5485149 -7004856 -7718550 -7562897 -6689652 -5227353 -3168102 -671071 1553607 2401541
37020 2401541 1127953 -2023673 -5992459 -9650575 -12314311 -13648758 -13393186 -11373274
37012 -11373274 -7685211 -2725103 2923253 8583132 13641178 17816763 21224918 24013275
37004 24013275 26021538 27014610 27159319 26909989 26354023 25062408 22874534 20589608 19498480
36995 19498480 20245106 22375450 24909363 27011200 28118312 27916542 26534687 24502573
36987 24502573 22101735 18849567 14098618 8297443 3268341 849929 1314403 3310506
36979 3310506 5220870 6277036 6452262 5807378 4321433 2230344 234413 -702859 225995
$$ packed form
37037C868713K524564Q94939p85149k068847k679984k705282k451475k082628
37029e485149j519707p13694J55653Q73245J462299K059251K497031K224678Q47934
37020B401541j273588l151626l968786l658116k663736j334447K55572K019912
37012a1373274L688063M960108N648356N659879N058046M175585L408155K788357
37004B4013275K008263R93072J44709k49330n55966j291615k187874k284926j091128
36995A9498480P46626K130344K533913K101837J107112k01770j381855k032114
36987B4502573k400838l252168m750949n801175n029102k418412M64474J996103
36979C310506J910364J056166J75226o44884j485945k091089j995931r37272R28854
$$ plain form
36970 225995 3235980 7713985 12521206 16784846 20424101 23783382 26834626 28962952
36962 28962952 29533240 28480475 26372228 24135276 22720535 22672807 23748106 25013862
36954 25013862 25448248 24439221 21824109 17799513 12975421 8265760 4406985 1562225
36946 1562225 -560725 -2390348 -4423479 -7208198 -11033769 -15656965 -20549504 -25337391
36938 -25337391 -29745386 -33201820 -34887439 -34301827 -31569817 -27157891 -21593863 -15597929
36930 -15597929 -10158896 -6110495 -3632546 -2316974 -1661526 -1357340 -1191856 -944860 -523322
36921 -523322 -132128 -172080 -834949 -1727836 -2009885 -1149883 361202 1245546 573140 -1396369
36911 -1396369 -3570487 -4992445 -5188517 -3767799 -308356 5000205 10892117 15691637
$$ packed form
36970B25995L009985M478005M807221M263640L639255L359281L051244K128326
36962B8962952N70288j052765k108247k236952j414741m7728J075299J265756
36954B5013862M34386j009027k615112m024596m824092m709661l858775k844760
36946A562225k122950j829623k033131k784719l825571m623196m892539m787887
36938b5337391m407995l456434j685619N85612K732010M411926N564028N995934
36930a5597929N439033M048401K477949J315572O55448L04186J65484K46996M21538
36921e23322L91194l9952o62869q92887k82049Q60002J511085Q84344o72406j969509
36911a396369k174118j421958j96072J420718L459443N308561N891912M799520
$$ plain form
36903 15691637 18534800 19709564 19798171 18866160 16761578 13968778 11698543 10976330 11801255
36894 11801255 13239072 14128147 13649179 11589516 8467671 5342282 3121031 1906843
36886 1906843 1178654 632248 561613 1249506 2248439 2659147 2200344 1791265 2897701
36877 2897701 6273267 11329763 16660644 21095924 24269152 26365571 27645687 28360960
36869 28360960 28858762 29327616 29375042 28223252 25556068 21970755 18398844 15303762 12702773
36860 12702773 10705527 9521301 8946677 8357770 7416111 6396449 5520276 4288954 1962680
36851 1962680 -1330618 -4371692 -5888907 -5623642 -4277482 -2654652 -1123277 147482
36843 147482 760530 187608 -1669777 -4156761 -6232094 -7181954 -6988277 -6145833 -5308953
$$ packed form
36903A5691637K843163J174764Q8607r32011k104582k792800k270235p22213Q24925
36894A1801255J437817Q89075m78968k059663l121845l125389k221251j214188
36886A906843p28189n46406p0635O87893R98933M10708m58803m09079J106436
36877B897701L375566N056496N330881M435280L173228K096419J280116P15273
36869B8360960M97802M68854M7426j151790k667184l585313l571911l095082k600989
36860A2702773j997246j184226n74624n88907r41659j019662q76173j231322k326274
36851A962680l293298l041074j517215K65265J346160J622830J531375J270759
36843A47482O13048n72922j857385k486984k075333r49860J93677Q42444Q36880
$$ plain form
36834 -5308953 -5059289 -5665132 -6788155 -7538157 -7136092 -5651420 -3973650 -2974912 -2752732
36825 -2752732 -2712848 -2289525 -1502466 -868504 -890977 -1693222 -3105888 -4976105 -7224258
36816 -7224258 -9542026 -11166011 -11132629 -8837129 -4392552 1418571 7458484 12695675
36808 12695675 16687933 19700812 22181459 24046759 24629406 23376146 20456433 16663322
36800 16663322 12940206 10079681 8551212 8263243 8551870 8681301 8417331 8032570 7882082
36791 7882082 8206265 9274929 11396216 14651033 18752614 23198222 27403302 30691684
36783 30691684 32424992 32337365 30696899 28099652 25174436 22400999 19923500 17434892
36775 17434892 14483947 11078079 7841718 5457145 4125794 3689526 3957736 4557297
$$ packed form
36834e308953K49664o05843j123023p50002M02065J484672J677770R98738K22180
36825b752732L9884M23323P87059O33962k2473q02245j412666j870217k248153
36816g224258k317768j623985L3382K295500M444577N811123O039913N237191
36808A2695675L992258L012879K480647J865300N82647j253260k919713l793111
36800A6663322l723116k860525j528469k87969K88627J29431k63970l84761j50488
36791G882082L24183J068664K121287L254817M101581M445608M205080L288382
36783C0691684J733308q7627j640466k597247k925216k773437k477499k488608
36775A7434892k950945l405868l236361k384573j331351m36268K68210N99561
$$ plain form
36767 4557297 4671086 3499219 1191956 -962453 -1538987 -154487 2316403 4471997
36759 4471997 5248419 4341110 2126223 -724438 -3620903 -6140685 -7908581 -8663728 -8572798
36750 -8572798 -8277293 -8344067 -8641652 -8436391 -7154910 -4920467 -2323013 101554 1988072
36741 1988072 2957169 2733947 1582108 359118 -85983 530434 2082940 4497170 7706187
36732 7706187 11263188 14478321 17091637 19428326 21609161 22879787 22096597 18829922
36724 18829922 13811814 8485136 4369480 2578881 3334357 5781670 8667467 11409642
36716 11409642 14296144 17580382 20778989 23134226 24477698 25261105 25863769 26236362
36708 26236362 26200684 25722514 24735769 22947201 20075742 16272793 12171012 8481316 5591201
$$ packed form
36767D557297J13789j171867k307263k154409n76534J384500K470890K155594
36759D471997P76422r07309k214887k850661k896465k519782j767896p55147R0930
36750h572798K95505o6774k97585K05261J281481K234443K597454K424567J886518
36741A988072R69097k23222j151839j222990m45101O16417J552506K414230L209017
36732G706187L557001L215133K613316K336689K180835J270626p83190l266675
36724A8829922n018108n326678m115656j790599P55476K447313K885797K742175
36716A1409642K886502L284238L198607K355237J343472P83407O02664L72593
36708B6236362l5678m78170r86745j788568k871459l802949m101781l689696k890115
$$ plain form
36699 5591201 3560829 2392763 2111154 2474576 2741218 1980121 -233842 -3435248 -6558805
36690 -6558805 -8582206 -9054152 -8344800 -7538882 -7844438 -9745572 -12571913 -14900546 -15453058
36681 -15453058 -13857351 -10935772 -8385766 -7821824 -9662125 -12815258 -15530541 -16563677
36673 -16563677 -15630932 -13181900 -10130177 -7604026 -6391767 -6422123 -7017604 -7727681 -8655400
36664 -8655400 -9917128 -11167933 -11930266 -12143758 -12053052 -11653038 -10574214 -8559654 -5836887
36655 -5836887 -2945792 -342763 1752718 3226551 3914598 3664714 2649893 1617548
36647 1617548 1578936 2938514 4913958 6081320 5640644 4024319 2207045 670488 -713454
36638 -713454 -1965516 -2600260 -2071466 -356087 2068045 4612170 6716944 7788238 7407225
$$ packed form
36699E591201k030372j168066k81609L63422K66642p61097k213963l201406l123557
36690f558805k023401m71946P09352Q05918l05556j901134k826341k328633n52512
36681a5453058J595707K921579K550006N63942j840301l153133k715283j033136
36673a6563677R32745K449032L051723K526151J212259l0356n95481p10077r27719
36664h655400j261728j250805p62333k13492R0706M00014J078824K014560K722767
36655e836887K891095K603029K095481J473833O88047k49884j014821j032345
36647A617548l8612J359578J975444J167362m40676j616325j817274j536557j383942
36638g13454j252062o34744N28794J715379K424132K544125K104774J071294l81013
$$ plain form
36629 7407225 5758753 3679491 2127993 1597955 1975201 2784899 3552443 4112385 4651045
36620 4651045 5303675 5669944 4978842 2929083 217292 -1962536 -2847462 -2427525 -1120770
36611 -1120770 503029 1790666 2262804 1952832 1231087 202751 -1434165 -3768611 -6155766
36602 -6155766 -7555585 -7318034 -5557074 -2946343 -304184 1829257 3500722 5212384
36594 5212384 7304672 9488754 11099859 11723165 11437968 10597293 9625826 8966092 8906905
36585 8906905 9368935 10029547 10691021 11348472 11903156 12101241 11889077 11572356 11375250
36576 11375250 10966309 9665626 7092885 3440789 -814162 -5186457 -9099026 -11817242
36568 -11817242 -12793185 -12142893 -10661678 -9285827 -8535596 -8421426 -8706467 -9098163 -9246073
$$ packed form
36629G407225j648472k079262j551498n30038L77246Q09698P67544N59942N38660
36620D651045O52630L66269o91102k049759k711791k179828q84926M19937J306755
36611a120770J623799J287637M72138l09972p21745j028336j636916k334446k387155
36602f155766j399819K37551J760960K610731K642159K133441J671465J711662
36594E212384K092288K184082J611105O23306k85197q40675r71467o59734n9187
36585H906905M62030O60612O61474O57451N54684J98085k12164l16721j97106
36576A1375250m08941j300683k572741l652096m254951m372295l912569k718216
36568a1817242r75943O50292J481215J375851P50231J14170k85041l91696j47910
$$ plain form
36559 -9246073 -8810669 -7713114 -6241411 -4760820 -3368925 -2008057 -882269 -479066
36551 -479066 -1007276 -1961381 -2434443 -1808101 -12811 2753820 6280003 10271811 14254819
36542 14254819 17663496 19945265 20602669 19395640 16658039 13220654 9781146 6419391
36534 6419391 2915736 -571308 -3455355 -5375176 -6605696 -7681324 -8821590 -9892876
36526 -9892876 -10750685 -11381587 -11796449 -12010077 -12077451 -11916534 -11119789 -9261019 -6574629
36517 -6574629 -4191292 -3522649 -5381272 -9595015 -15159696 -20570823 -24273188 -25291582
36509 -25291582 -23686250 -20357175 -16367446 -12474186 -9143449 -6651488 -4977433 -3774202
36501 -3774202 -2701709 -1801921 -1416116 -1735716 -2556007 -3480900 -4228851 -4657350 -4601246
$$ packed form
36559i246073M35404J097555J471703J480591J391895J360868J125788M03203
36551d79066n28210r54105m73062O26342J795290K766631L526183L991808L983008
36542A4254819L408677K281769O57404j207029k737601l437385l439508l361755
36534F419391l503655l487044k884047j919821j230520j075628j140266j071286
36526i892876q57809o30902m14862k13628o7374J60917P96745J858770K686390
36517f574629K383337O68643j858623m213743n564681n411127l702365j018394
36509b5291582J605332L329075L989729L893260L330737K491961J674055J203231
36501c774202J072493Q99788L85805l19600q20291r24893p47951m28499N6104
$$ plain form
36492 -4601246 -3884195 -2583595 -1211230 -463308 -658084 -1412054 -1938026 -1664598 -495831
36483 -495831 1484503 4308549 7917365 11768108 14952879 16862904 17659103 18015801 18459627
36474 18459627 19000741 19340532 19379175 19529487 20476724 22479488 24880848 26496481 26635035
36465 26635035 25667896 24527672 23797047 23422132 23112380 22674238 21941726 20717903 19012983
36456 19012983 17234549 15953356 15432714 15405842 15319946 14846557 14198155 13852531 13845093 13441778
36446 13441778 11764556 8760164 5314508 2346221 44337 -1850189 -3265700 -3625144
36438 -3625144 -2447972 32759 2859552 4910618 5601030 5198551 4444309 3818736 3250133
36429 3250133 2510254 1597950 543971 -872140 -2779401 -4601246 -5153411 -3562173 -53685
$$ packed form
36492d601246P17051J300600J372365P47922j94776p53970n25972K73428J168767
36483d95831J980334K824046L608816L850743L184771J910025P96199L56698M43826
36474A8459627N41114L39791L8643J50312R47237K002764K401360J615633J38554
36465B6635035r67139j140224p30625l74915l09752m38142p32512j223823j704920
36456A9012983j778434j281193n20642k6872q5896m73389o48402l45624p438m03315
36446A3441778j677222l004392l445656k968287k301884j894526j415511l59444
36438c625144J177172K480731K826793K051066O90412m02479p54242o25573n68603
36429C250133p39879r12304j053979j416111j907261j821845n52165J591238L508488
$$ plain form
36420 -53685 4120221 7447344 9055422 9267741 9401610 10807232 13942284 18344217 23271590
36411 23271590 28051737 31926169 34099702 34198755 32421469 29111000 24564154 19543506
36403 19543506 15588985 14204623 15603132 18489858 21143125 22610743 23007653 22994824
36395 22994824 23053427 23043247 22335959 20470915 17731003 14986518 12954718 11723222 11027386
36386 11027386 10849174 11595954 13663572 16850361 20229982 22670959 23589898 23294958 22673486
36377 22673486 22555725 23213370 24202180 24625721 23811149 21984355 20237472 19652536 20415268
36368 20415268 21781165 22745091 22630998 21254001 18849298 15864870 12607752 9074552
36360 9074552 5300847 1823186 -502685 -1225049 -592040 996353 3602869 7624346
$$ packed form
36420e3685M173906L327123J608078K12319J33869J405622L135052M401933M927373
36411B3271590M780147L874432K173533R9053j777286l310469m546846n020648
36403A9543506l954521j384362J398509K886726K653267J467618L96910j2829
36395B2994824N8603j0180p07288j865044k739912k744485k031800j231496o95836
36386A1027386j78212P46780K067618L186789L379621K440977R18939k94940o21472
36377B2673486j17761O57645R88810M23541q14572j826794j746883n84936P62732
36368B0415268J365897R63926j14093j376997k404703k984428l257118l533200
36360I074552l773705l477661k325871p22364O33009J588393K606516M021477
$$ plain form
36352 7624346 13189521 19860236 26787964 32928787 37219687 38975816 38408372 36672877
36344 36672877 35160543 34590942 34760890 35120538 35465573 35986352 36739887 37288922 36964512
36335 36964512 35402571 32762706 29547359 26346588 23661718 21740408 20506479 19747275
36327 19747275 19387136 19474585 19905694 20316809 20319755 19745073 18614450 17002105 15001757
36318 15001757 12707684 10094776 6973603 3198000 -1068393 -5359734 -9192399 -12318223
36310 -12318223 -14737730 -16554101 -17860969 -18743018 -19303258 -19600964 -19547156 -18950977 -17762663
36301 -17762663 -16264551 -14983565 -14431888 -14887509 -16198134 -17598449 -17872190 -16098164
36293 -16098164 -12460518 -8242922 -4918765 -3229571 -3010760 -3620329 -4421959 -5063394 -5519504
$$ packed form
36352G624346N565175O670715O927728O140823M290900J756129n67444j735495
36344C6672877j512334n69601J69948L59648L45035N20779P53535N49035l24410
36335C6964512j561941k639865l215347l200771k684870j921310j233929p59204
36327A9747275l60139Q7449M31109M11115K946n74682j130623j612345k000348
36318A5001757k294073k612908l121173l775603m266393m291341l832665l125824
36310a2318223k419507j816371j306868q82049n60240k97706N3808N96179J188314
36301a7762663J498112J280986N51677m55621j310625j400315k73741J774026
36293a6098164L637646M217596L324157J689194K18811o09569q01630o41435m56110
$$ plain form
36284 -5519504 -5893473 -6185740 -6385703 -6805934 -8095105 -10732252 -14573649 -18973042 -23222849
36275 -23222849 -26809471 -29459521 -31167225 -32093078 -32260067 -31424680 -29402384 -26444677
36267 -26444677 -23175868 -20297110 -18474313 -18197262 -19289783 -20628586 -20861271 -19621531
36259 -19621531 -17760241 -16204486 -14838746 -12734120 -9313864 -5068529 -1217974 1134151
36251 1134151 1585522 447497 -1657302 -4179602 -6670914 -8622909 -9582107 -9527495 -8928554
36242 -8928554 -8259633 -7584072 -6777204 -6030179 -5894860 -6821700 -8782376 -11321886 -13855457
36233 -13855457 -15941548 -17406806 -18252254 -18437881 -17861089 -16599275 -14981879 -13231486
36225 -13231486 -11195972 -8735205 -6291916 -4680384 -4177111 -4095063 -3433498 -1786471 470663
$$ packed form
36284e519504l73969k92267j99963m20231j289171k637147l841397m399393m249807
36275b3222849l586622k650050j707704r25853j66989Q35387K022296K957707
36267b6444677L268809K878758J822797K77051j092521j338803k32685J239740
36259a9621531J861290J555755J365740K104626L420256M245335L850555K352125
36251A134151M51371j138025k104799k522300k491312j951995r59198N4612N98941
36242h928554O68921O75561Q06868P47025J35319r26840j960676k539510k533571
36233a3855457k086091j465258q45448j85627N76792J261814J617396J750393
36225a3231486K035514K460767K443289J611532N03273Q2048O61565J647027K257134
$$ plain form
36216 470663 2621051 4023584 4335882 3691841 2692030 2056150 2271453 3577471 6012444
36207 6012444 9177477 12099780 13726419 13642382 12114453 9498745 5955963 1792942
36199 1792942 -2326512 -5764844 -8275813 -9784319 -10046294 -8829437 -6320261 -3098747
36191 -3098747 221923 3154505 5320051 6603136 7253110 7471108 6870312 4706648 800085
36182 800085 -4005202 -8396680 -11347667 -12236529 -10693262 -6867655 -1796626 2989825
36174 2989825 6523913 8997202 11257601 13853867 16636248 19069869 20640656 20933986
36166 20933986 19616172 16656604 12607087 8454686 5032243 2590863 956185 -94188
36158 -94188 -793019 -1541485 -2695339 -4066246 -4922422 -4736509 -3826783 -3053990 -2918315
$$ packed form
36216D70663K150388J402533L12298o44041r99811o35880K15303J306018K434973
36207F012444L165033K922303J626639q4037j527929k615708l542782m163021
36199A792942m119454l438332k510969j508506k61975J216857K509176L221514
36191c098747L320670K932582K165546J283085O49974K17998o00796k163664l906563
36182H00085m805287m391478k950987q88862J543267L825607N071029M786451
36174B989825L534088K473289K260399K596266K782381K433621J570787K93330
36166B0933986j317814k959568m049517m152401l422443k441380j634678j050373
36158i4188o98831p48466j153854j370907q56176J85913R09726P72793J35675
$$ plain form
36149 -2918315 -3091846 -2794130 -1490723 738520 3352642 5819387 8018924 10238397
36141 10238397 12793136 15725342 18881658 22109818 25204471 27731495 29109023 28922772
36133 28922772 27117961 23950347 19871073 15401781 10939558 6632247 2508029 -1317255
36125 -1317255 -4661376 -7407428 -9402118 -10236767 -9372000 -6593330 -2243350 3002944
36117 3002944 8430782 13371781 17311729 20121934 22032050 23194259 23422053 22608358
36109 22608358 21328283 20694161 21419160 23083401 24407617 24227592 22203378 18736574
36101 18736574 14457785 9953364 5846544 2724710 655729 -1107350 -3526176 -6683358
36093 -6683358 -9475838 -10604689 -9814322 -8053732 -6524218 -5690238 -5086878 -3864948 -1524907
$$ packed form
36149b918315j73531K97716J303407K229243K614122K466745K199537K219473
36141A0238397K554739K932206L156316L228160L094653K527024J377528j86251
36133B8922772j804811l167614m079274m469292m462223m307311m124218l825284
36125a317255l344121k746052j994690q34649Q64767K778670M349980N246294
36117C002944N427838M940999L939948K810205J910116J162209K27794q13695
36109B2608358j280075o34122P24999J664241J324216j80025k024214l466804
36101A8736574m278789m504421m106820l121834k068981j763079k418826l157182
36093f683358k792480j128851P90367J760590J529514Q33980O03360J221930K340041
$$ plain form
36084 -1524907 1708525 5155015 8337615 11346412 14548813 18081727 21702855 24941041
36076 24941041 27204825 27949627 27096842 25260579 23239651 21257698 19009027 16489054
36068 16489054 14375670 13347352 13270112 13284874 12489391 10313536 6484294 1046546 -5549129
36059 -5549129 -12584043 -19263710 -24655718 -27703315 -27767198 -25213625 -21166341 -16642600
36051 -16642600 -12204821 -8360974 -5670843 -4082146 -2565675 22135 3729354 7496191
36043 7496191 10314150 12055356 13131519 13738022 13708970 12945110 11687757 10321950 9053703
36034 9053703 7873687 6780479 5882674 5176022 4349999 3123650 1868929 1561549 2729772
36025 2729772 4539651 5330346 4196952 1839493 -202489 -896400 -238978 1154329 2593172
$$ packed form
36084a524907L233432L446490L182600L008797L202401L532914L621128L238186
36076B4941041K263784P44802q52785j836263k020928j981953k248671k519973
36068A6489054k113384j028318p7240J4762p95483k175855l829242n437748o595675
36059e549129p034914o679667n392008l047597o3883K553573M047284M523741
36051a6642600M437779L843847K690131J588697J516471K587810L707219L766837
36043G496191K817959J741206J076163O06503k9052p63860j257353j365807j268247
36034I053703j180016j093208q97805p06652q26023j226349j254721l07380J168223
36025B729772J809879P90695j133394k357459k041982o93911O57422J393307J438843
$$ plain form
36016 2593172 3583686 3994006 4165639 4785415 6520899 9645377 13809139 18050724 21168503
36007 21168503 22342838 21551569 19456551 16961662 14808887 13318070 12311765 11373126
35999 11373126 10277337 9052883 7590460 5540500 2902520 448717 -932721 -1287621
35991 -1287621 -1538077 -2293228 -3137109 -3297251 -2686789 -2021682 -2120971 -3303029 -5238803
35982 -5238803 -7107857 -8028038 -7617759 -6140934 -4023318 -1423247 1533382 4345817
35974 4345817 6356081 7321596 7440687 6830408 5362749 3162450 990315 -106897 506570
35965 506570 2719951 5884162 9315000 12749297 16359784 20199608 23677598 25874408
35957 25874408 26497676 26292181 26339013 27119540 28391289 29721313 30875321 31888075 33135841
$$ packed form
36016B593172R90514M10320J71633O19776J735484L124478M163762M241585L117779
36007B1168503J174335p91269k095018k494889k152775j490817j006305r38639
35999A1373126j095789j224454j462423k049960k637980k453803j381438l54900
35991a287621k50456p55151q43881j60142O10462O65107r9289j182058j935774
35982e238803j869054r20181M10279J476825K117616K600071K956629K812435
35974D345817K010264R65515J19091o10279j467659k200299k172135j097212O13467
35965E06570K213381L164211L430838L434297L610487L839824L477990K196810
35957B5874408O23268k05495M6832P80527J271749J330024J154008J012754J247766
$$ plain form
35948 33135841 35292418 38808010 43259203 47402747 50004868 50567091 49334695 46903261
35940 46903261 43910393 40796592 37552804 33745548 28976745 23334811 17355942 11664061
35932 11664061 6762534 3034781 701413 -272648 -149169 664372 1598791 1994418 1478679
35923 1478679 322995 -766822 -1309913 -1438513 -1682855 -2546505 -4250848 -6586939 -8869654
35914 -8869654 -10273903 -10493987 -10089579 -10128583 -11529002 -14607288 -18808839 -22608284 -24045009
35905 -24045009 -21952953 -16791696 -10052009 -2915589 4199458 10935612 16522182 20359206
35897 20359206 22708619 24373748 25813227 26891940 27411905 27517837 27481631 27288248 26535907
35888 26535907 24683011 21439116 17071397 12338173 7980072 4223735 833069 -2403125
$$ packed form
35948C3135841K156577L515592M451193M143544K602121N62223j232396k431434
35940D6903261k992868l113801l243788l807256m768803n641934n978869n691881
35932A1664061m901527l727753k333368r74061J23479Q13541R34419L95627n15739
35923A478679j155684j089817n43091j28600k44342q63650j704343k336091k282715
35914h869654j404249k20084M04408l9004j400419l078286m201551l799445j436725
35905b4045009K092056N161257O739687P136420P115047O736154N586570L837024
35897B0359206K349413J665129J439479J078713N19965J05932l6206j93383p52341
35888B6535907j852896l243895m367719m733224m358101l756337l390666l236194
$$ plain form
35880 -2403125 -5338908 -7535850 -8451655 -7593392 -4791085 -532486 4066621 7805318
35872 7805318 9975917 10479660 9581430 7703474 5320653 2744172 -136297 -3743522
35864 -3743522 -8213381 -12858798 -16397224 -17879585 -17404795 -15880970 -14195070 -12766062
35856 -12766062 -11754231 -11248716 -11006738 -10303222 -8457859 -5520957 -2208357 787938
35848 787938 3161253 4755898 5438341 5408990 5344282 5962470 7592570 10323169 14307057
35839 14307057 19558476 25520974 31185086 35768314 39208330 42045618 44942647 48175971
35831 48175971 51331041 53558750 54478244 54915357 56455385 60073752 65348518 71098417
35823 71098417 76543032 81643638 86550964 91086485 94744369 96912313 97055135 94988448
$$ packed form
35880b403125k935783k196942r15805Q58263K802307M258599M599107L738697
35872G805318K170599N03743q98230j877956k382821k576481k880469l607225
35864c743522m469859m645417l538426j482361M74790J523825J685900J429008
35856a2766062J011831N05515K41978P03516J845363K936902L312600K996295
35848G87938K373315J594645O82443k9351o4708O18188J630100K730599L983888
35839A4307057N251419N962498N664112M583228L440016K837288K897029L233324
35831D8175971L155070K227709R19494M37113J540028L618367N274766N749899
35823G1098417N444615N100606M907326M535521L657884K167944J42822k066687
$$ plain form
35815 94988448 91206296 86863299 83229175 80996477 79946356 79123933 77390011 74112053
35807 74112053 69592614 64804716 60514048 56570555 52120345 46549518 40169018 33974025
35799 33974025 28881004 25352966 23684772 24308689 27494690 32723613 38580999 43483045
35791 43483045 46600871 48167471 49033127 49976825 51302743 52894107 54537408 56113147
35783 56113147 57395284 57775664 56553274 53767340 50574165 48426139 47809701 48004392
35775 48004392 48075307 47782824 47410759 47056159 46408462 45064709 42740216 39219379 34418317
35766 34418317 28624263 22576652 17280456 13736385 12611818 13819300 16368098 18902789
35758 18902789 20571716 21334626 21477911 21066347 19934783 17967075 15212198 11928368
$$ packed form
35815I4988448l782152m342997l634124k232698j050121q22423j733922l277958
35807G4112053m519439m787898m290668l943493m450210n570827o380500o194993
35799C3974025n093021l528038j668194O23917L186001N228923N857386M902046
35791D3483045L117826J566600Q65656R43698J325918J591364J643301J575739
35783E6113147J282137L80380j222390k785934l193175k148026o16438J94691
35775D8004392P0915k92483l72065l54600o47697j343753k324493l520837m801062
35766C4418317n794054o047611n296196l544071j124567J207482K548798K534691
35758A8902789J668927P62910J43285m11564j131564j967708k754877l283830
$$ plain form
35750 11928368 8759216 6704093 6469650 7638988 8692906 8173808 5924332 3088999
35742 3088999 915465 -212553 -425587 611030 3737826 9171150 15759080 21795568
35734 21795568 26438124 29988092 32965836 35458498 37431230 39131616 40886677 42834594
35726 42834594 45138351 48182139 52240817 57153793 62601124 68480232 74691999 80815581
35718 80815581 86519569 92264807 99083782 107455529 116654180 125304461 132305094 137103822
35710 137103822 139425924 139112040 136220939 131100910 124266719 116166289 107026884 97008207
35702 97008207 86643934 77059749 69492704 64478455 61598876 60005673 59001938 58108434
35694 58108434 56857779 54760968 51462241 46932148 41660893 36652216 32917371 30724263
$$ packed form
35750A1928368l169152k055123k34443J169338J053918n19098k249476k835333
35742C088999k173534j128018k13034J036617L126796N433324O587930O036488
35734B1795568M642556L549968K977744K492662J972732J700386J755061J947917
35726D2834594K303757L043788M058678M912976N447331N879108O211767O123582
35718H0815581N703988N745238O818975Q371747R198651Q650281P000633M798728
35710A37103822K322102l13884k891101n120029o834191q100430r139405j0018677
35702I7008207j0364273r584185p567045n014249k879579j593203j003735q93504
35694E8108434j250655k096811l298727m530093n271255n008677l734845k193108
$$ plain form
35686 30724263 29390067 27888268 25588966 22489256 19102338 16324558 15057266 15475797
35678 15475797 16661452 17276092 16714733 15491612 14565903 14512719 15309516 16581917 17858476
35669 17858476 18763037 19215660 19502126 20092177 21353896 23344116 25684724 27583935 28206723
35660 28206723 27327718 25674371 24430294 24242829 24760786 25207933 25271690 25230026 25300586
35651 25300586 25248000 24812396 24210832 23829345 23526589 22678890 21036884 19244489 18350426
35642 18350426 18997725 21164064 24365563 27835385 30710525 32432084 33047508 33018332 32780213
35633 32780213 32549110 32344730 31971481 31133020 29890075 28972883 29330914 31297013 34364745
35624 34364745 37745200 40873312 43388691 45035773 45835897 46149681 46326213 46376116 46122031
$$ packed form
35686C0724263j334196j501799k299302l099710l386918k777780j267292M18531
35678A5475797J185655O14640n61359j223121r25709n3184P96797J272401J276559
35669A7858476R04561M52623K86466N90051J261719J990220K340608J899211O22788
35660B8206723q79005j653347j244077j87465N17957M47147O3757m1664P0560
35651B5300586n2586m35604o01564l81487l02756q47699j642006j792395q94063
35642A8350426O47299K166339L201499L469822K875140J721559O15424k9176k38119
35633C2780213k31103k04380l73249q38461j242945r17192L58031J966099L067732
35624C4364745L380455L128112K515379J647082Q00124L13784J76532M9903k54085
$$ plain form
35615 46122031 45520526 44650554 43521910 42161235 40869308 40146780 40253617 40902293 41368001
35606 41368001 40820433 38687379 35040926 30771638 27124395 24745438 23186957 21526058
35598 21526058 19447559 17528817 16487703 16442581 17026224 17942013 19140818 20611985 22289601
35589 22289601 24045447 25413799 25380924 22977069 18388368 13234985 9437316 7843682
35581 7843682 8011431 8993588 9995477 10464985 10081480 8902373 7382341 6119759 5559170
35572 5559170 5802697 6529402 7162083 7342636 7296037 7616019 8710490 10563102 12944130
35563 12944130 15644790 18541506 21666780 25243014 29418818 33859676 37696848 39923481
35555 39923481 39814040 37118620 32129923 25590145 18326014 10925274 3883662 -2051057
$$ packed form
35615D6122031o01505q69972j128644j360675j291927p22528J06837O48676M65708
35606D1368001n47568k133054l646453m269288l647243k378957j558481j660899
35598B1526058k078499j918742j041114m5122N83643R15789J198805J471167J677616
35589B2289601J755846J368352l2875k403855m588701n153383l797669j593634
35581G843682J67749R82157J001889M69508l83505j179107j520032j262582n60589
35572E559170K43527P26705O32681J80553m6599L19982J094471J852612K381028
35563A2944130K700660K896716L125274L576234M175804M440858L837172K226633
35555C9923481j09441k695420m988697o539778p264131p400740p041612n934719
$$ plain form
35547 -2051057 -6012300 -7558245 -6876158 -4488018 -1094214 2273445 4452360 4903492
35539 4903492 4162529 3376278 3523682 5128839 8344364 12923815 18185788 23271919 27508894
35530 27508894 30587632 32670006 34426355 36619119 39346628 41896329 43590193 44529777
35522 44529777 45212127 45728542 45865280 45839921 46277274 47265334 47875806 46879866 43691164
35513 43691164 38473491 31694870 23943700 16032994 8883475 3153499 -912771 -3229472
35505 -3229472 -3607073 -1964515 1094322 4110931 5617345 5435412 4983061 5989991 8890826
35496 8890826 12622051 15879339 18288757 20364614 22651501 25083592 27071830 28141767
35488 28141767 28528101 29050483 30223077 31556966 31989035 30981295 28943921 26604940
$$ packed form
35547b051057l961243j545945O82087K388140L393804L367659K178915M51132
35539D903492p40963p86251J47404J605157L215525M579451N261973N086131M236975
35530B7508894L078738K082374J756349K192764K727509K549701J693864R39584
35522D4529777O82350N16415J36738k5359M37353R88060O10472r95940l188702
35513D3691164n217673o778621p751170p910706p149519n729976m066270k316701
35505c229472l77601J642558L058837L016609J506414j81933m52351J006930K900835
35496H890826L731225L257288K409418K075857K286887K432091J988238J069937
35488B8141767L86334N22382J172594J333889M32069j007740k037374k338981
$$ plain form
35480 26604940 24321655 22114536 20031679 18227093 16832348 15901958 15356525 14924910
35472 14924910 14371188 13878724 13949201 14760356 15867427 16729748 17293456 17829359 18429046
35463 18429046 18927651 19090401 18533812 16685736 13350354 9357374 6213653 4891821
35455 4891821 5136009 6002157 6796494 7343887 7620393 7472982 6752784 5599429 4519267
35446 4519267 4118452 4631424 5631437 6253814 5805187 4246521 2174141 368073 -725514
35437 -725514 -1188890 -1353161 -1338269 -935597 62557 1582183 3395734 5337753 7211262
35428 7211262 8647263 9340907 9367577 8985293 8146545 6531474 4144207 1558075 -642158
35419 -642158 -2475315 -4413554 -6719669 -9099046 -10937031 -11745575 -11460461 -10499429 -9595083
$$ packed form
35480B6604940k283285k207119k082857j804586j394745r30390n45433m31615
35472A4924910n53722m92464P0477Q11155J107071Q62321N63708N35903N99687
35463A8429046M98605J62750n56589j848076l335382l992980l143721j321832
35455D891821K44188Q66148P94337N47393K76506j47411p20198j153355j080162
35446D519267m00815N12972J000013O22377m48627j558666k072380j806068j093587
35437g25514m63376j64271J4892M02672R98154J519626J813551J942019J873509
35428G211262J436001O93644K6670l82284q38748j615071k387267k586132k200233
35419f42158j833157j938239k306115k379377j837985q08544K85114R61032R04346
$$ plain form
35410 -9595083 -9507056 -10785982 -13584797 -17391169 -20903354 -22549303 -21535261 -18410318
35402 -18410318 -14435068 -10449034 -6519573 -2530912 1337948 4878251 8228942 11607906
35394 11607906 14750659 16961168 17815069 17608831 17013527 16454714 15944769 15317183 14368954
35385 14368954 12867957 10735502 8267764 5906999 3711438 1366545 -1069342 -2746556
35377 -2746556 -2776961 -1325650 442703 1529312 1847751 1751410 1290974 285682 -1126914
35368 -1126914 -2415891 -3084765 -2904654 -1797529 150313 2442082 4189516 4620343 3606076
35359 3606076 1698232 -286061 -1734129 -2448574 -2508367 -1945637 -604665 1625393 4507538
35350 4507538 7512214 10137632 12012229 12695325 11657220 8696857 4331969 -416881
$$ packed form
35410i595083Q8027j278926k798815l806372l512185j645949J014042L124943
35402a8410318L975250L986034L929461L988661L868860L540303L350691L378964
35394A1607906L142753K210509Q53901k06238n95304n58813n09945o27586r48229
35385A4368954j500997k132455k467738k360765k195561k344893k435887j677214
35377b746556l0405J451311J768353J086609L18439r6341m60436j005292j412596
35368a126914j288977o68874J80111J107125J947842K291769J747434M30827j014267
35359C606076j907844j984293j448068p14445n9793N62730J340972K230058K882145
35350D507538L004676K625418J874597O83096j038105k960363m364888m748850
$$ plain form
35342 -416881 -4717951 -8391773 -11708789 -14792117 -17247122 -18356174 -17609747 -15056527
35334 -15056527 -11227757 -6879721 -2848526 116454 1808082 3012399 5224790 9509196
35326 9509196 15465812 21366472 25351763 26565080 25370776 22811500 19954311 17491454
35318 17491454 15590162 13951141 12084731 9685941 6847965 3945635 1292592 -1132707
35310 -1132707 -3660602 -6633118 -10089400 -13671292 -16776961 -18818095 -19425998 -18525389
35302 -18525389 -16282110 -13041254 -9398173 -6323335 -4984298 -6074523 -9097460 -12385683
35294 -12385683 -14045708 -13088623 -9862066 -5651940 -1951725 204946 723109 497218
35286 497218 775355 2194660 4413291 6732010 8907730 11132632 13312206 14740386
$$ packed form
35342d16881m301070l673822l317016l083328k455005j109052P46427K553220
35334a5056527L828770M348036M031195K964980J691628J204317K212391M284406
35326I509196N956616N900660L985291J213317j194304k559276k857189k462857
35318A7491454j901292j639021j866410k398790k837976k902330k653043k425299
35310a132707k527895k972516l456282l581892l105669k041134o07903R00609
35302a8525389K243279L240856L643081L074838J339037j090225l022937l288223
35294a2385683j660025R57085L226557M210126L700215K156671N18163k25891
35286D97218K78137J419305K218631K318719K175720K224902K179574J428180
$$ plain form
35278 14740386 14674726 13032672 10306673 6950053 3188979 -531384 -3299750 -4300004
35270 -4300004 -3617471 -2293111 -1537480 -1974371 -3539237 -5757201 -7929824 -9327136 -9632327
35261 -9632327 -9277289 -9074535 -9371684 -9711965 -9425778 -8397608 -7116257 -6115816 -5544506
35252 -5544506 -5172592 -4612743 -3592431 -2232351 -1042995 -426202 -162239 379721 1457960
35243 1457960 2615493 3247658 3312311 3285557 3541717 3994582 4322398 4396535 4510111 5280570
35233 5280570 7207632 10075182 12759759 13871095 12785918 10061903 6828950 3877341
35225 3877341 1397165 -555687 -1621264 -1295295 570594 3569239 7006256 10198628
35217 10198628 12482728 13211996 12093354 9548756 6475034 3498787 589784 -2542212
$$ packed form
35278A4740386o5660j642054k725999l356620l761074l720363k768366j000254
35270d300004O82533J324360P55631m36891j564866k217964k172623j397312l05191
35261i632327L55038K02754k97149l40281K86187J028170J281351J000441N71310
35252e544506L71914N59849J020312J360080J189356O16793K63963N41960J078239
35243A457960J157533O32165O4653k6754K56160M52865L27816P4137J13576P70459
35233E280570J927062K867550K684577J111336j085177k724015l232953k951609
35225C877341k480176j952852j065577L25969J865889K998645L437017L192372
35217A0198628K284100P29268j118642k544598l073722k976247k909003l131996
$$ plain form
35209 -2542212 -5919385 -9381815 -13021348 -17165742 -21835883 -26397147 -29840449 -31324066
35201 -31324066 -30455116 -27283382 -22263713 -16236720 -10256202 -5200023 -1378707 1536585
35193 1536585 4182384 7063256 10346572 13855633 17039089 19065070 19375914 18368544
35185 18368544 17266737 17041820 17605069 18280715 18808725 19423286 20037863 19939703 18545411
35176 18545411 16132284 13577905 11606983 10496789 10240947 10610970 11104530 11180012 10699408
35167 10699408 10034565 9629413 9449356 8904157 7410962 5116376 2969462 1908461 2041622
35158 2041622 2870835 4241412 6601297 10118322 13959458 16880555 18371905 18849750
35150 18849750 18829134 18335210 17176797 15441830 13566263 12108595 11527530 11948615 12992627
$$ packed form
35209b542212l377173l462430l639533m144394m670141m561264l443302j483617
35201c1324066Q68950L171734N019669O026993N980518N056179L821316K915292
35193A536585K645799K880872L283316L509061L183456K025981L10844j007370
35185A8368544j101807k24917N63249O75646N28010O14561O14577r8160j394292
35176A8545411k413127k554379j970922j110194k55842L70023M93560P5482m80604
35167A0699408o64843m05152j80057n45199j493195k294586k146914j061001J33161
35158B041622Q29213J370577K359885L517025L841136K921097J491350M77845
35150A8849750k0616m93924j158413j734967j875567j457668n81065M21085J044012
$$ plain form
35141 12992627 13952743 14261602 13751063 12481199 10482559 7723507 4191317 -64806
35133 -64806 -4845283 -9664544 -13802805 -16632902 -17966651 -18157003 -17922231 -17966063 -18568928
35124 -18568928 -19499849 -20397317 -21158903 -21784983 -21932610 -20982262 -18715525 -15741505 -13093454
35115 -13093454 -11505569 -11152944 -11894335 -13551767 -15997836 -19096194 -22523535 -25596842
35107 -25596842 -27389129 -27157787 -24698147 -20375228 -15020203 -9795994 -5802050 -3484947
35099 -3484947 -2471047 -2083361 -1899059 -1767596 -1664214 -1867281 -2994803 -5319276 -8062859
35090 -8062859 -9883616 -10241817 -9950801 -10214459 -11407183 -12929662 -13892471 -13663893 -12069863
35081 -12069863 -9507620 -6797147 -4562138 -2697747 -625820 1952909 4710191 6956187
$$ packed form
35141A2992627R60116L08859n10539j269864j998640k759052l532190m256123
35133f4806m780477m819261m138261k830097j333749j90352K34772m3832o02865
35124a8568928r30921q97468p61586o26080j47627R50348K266737K974020K648051
35115a3093454J587885L52625p41391j657432k446069l098358l427341l073307
35107b5596842j792287K31342K459640M322919N355025N224209L993944K317103
35099c484947J013900L87686J84302J31463J03382k03067j127522k324473k743583
35090h062859j820757l58201K91016k63658j192724j522479r62809K28578J594030
35081a2069863K562243K710473K235009J864391K071927K578729K757282K245996
$$ plain form
35073 6956187 7980965 7235004 4596426 633863 -3605837 -7211792 -9732382 -10988349
35065 -10988349 -10952415 -9975401 -8801980 -8043767 -7767272 -7809283 -8268579 -9298480 -10501010
35056 -10501010 -11006717 -10365164 -9118471 -8293975 -8436749 -9241415 -9993633 -10238853 -10110699
35047 -10110699 -10113570 -10503670 -10810493 -10112614 -7957249 -4956906 -2350165 -1011687 -949760
35038 -949760 -1562847 -2057988 -1612521 493011 4545982 10155740 16440691 22523551 27907730
35029 27907730 32495526 36322498 39244011 40857049 40808969 39264683 37034329 35142660
35021 35142660 34195070 34056586 33981639 33002429 30421300 26288215 21544578 17531276 15127784
$$ packed form
35073F956187J024778p45961k638578l962563m239700l605955k520590j255967
35065a0988349L5934R77014J173421P58213K76495m2011m59296j029901j202530
35056a0501010n05707O41553J246693Q24496j42774q04666p52218k45220J28154
35047a0110699k871l90100l06823O97879K155365L000343K606741J338478O1927
35038i49760o13087m95141M45467K105532M052971N609758O284951O082860N384179
35029B7907730M587796L826972K921513J613038m8080j544286k230354j891669
35021C5142660r47590j38484p4947r79210k581129m133085m743637m013302k403492
$$ [...]
##END NTUPLES=NMR SPECTRUM
##END=
