##TITLE=31Pdec_IPACAT-34E
 CDCl3
  64 sc
 2.11.2023
##JCAMPDX= 6.0         $$ Bruker NMR JCAMP-DX V2.0
##DATA TYPE= NMR SPECTRUM
##DATA CLASS= NTUPLES
##ORIGIN= UXNMR, Bruker Analytische Messtechnik GmbH
##OWNER= root
$$ XWIN-NMR		Version 3.5
$$ Thu Nov  2 17:20:25 2023 Russian Standard Time (UT+4h)  she@DPX200
##.OBSERVE FREQUENCY= 81.013821
##.OBSERVE NUCLEUS= ^31P
##.ACQUISITION MODE= SIMULTANEOUS
##.ACQUISITION SCHEME= undefined
##.AVERAGES= 88
##.DIGITISER RES= 16
##SPECTROMETER/DATA SYSTEM= spect
##.PULSE SEQUENCE= zgpg30
##.SOLVENT NAME= CD2Cl2
##.SHIFT REFERENCE= (INTERNAL, CD2Cl2, 0, 248.564)
##AUDIT TRAIL= $$ (NUMBER, WHEN, WHO, WHERE, WHAT)
$$ ##TITLE= Audit trail, XWIN-NMR		Version 3.5
$$ ##JCAMPDX= 5.01
$$ ##ORIGIN= Bruker BioSpin GmbH
$$ ##OWNER= she
$$ F:/spectra/data/she/nmr/P31/1/pdata/1/auditp.txt
$$ ##AUDIT TRAIL=  $$ (NUMBER, WHEN, WHO, WHERE, WHAT)
(   1,<2023-11-02 17:18:15.15 +0400>,<she>,<DPX200>,
      <continue with go, POWCHK disabled, PULCHK disabled
       configuration hash MD5:
       00 E9 B6 7A A2 85 ED C7 34 08 36 98 17 FE 4E 26
       data hash MD5: 32K
       7D F8 67 AF CC 59 82 59 B2 0F 80 BE 0D 37 82 99>)
(   2,<2023-11-02 17:18:23.68 +0400>,<she>,<DPX200>,
      <Start of raw data processing
       efp BC_mod = 2 LB = 5 FT_mod = 6 PKNL = 1 PHC0 = -10701.73 PHC1 = 162.6901 SI = 64K 
       data hash MD5: 64K
       A1 1B 68 00 2D ED C6 C9 A7 4C D7 87 09 E1 90 55>)
(   3,<2023-11-02 17:18:58.39 +0400>,<she>,<DPX200>,
      <pk PHC0 = -212.0221 PHC1 = 513.6001 
       data hash MD5: 64K
       DA 34 E1 8D 4A 16 48 47 68 08 01 8A 11 62 7A D2>)
$$ ##END=
$$ 
$$ hash MD5
$$ CB C6 2F 31 07 98 6A B1 AB 9F D5 04 3E 0C C2 AD
##$RELAX= 
##$RELAX= 
##$RELAX= 
##$RELAX= 
##$RELAX= 
##$RELAX= 
##$RELAX= 
##$RELAX= 
##$RELAX= 
$$ Bruker specific parameters
$$ --------------------------
##$DU= <F:/spectra>
##$EXPNO= 1
##$NAME= <P31>
##$PROCNO= 1
##$TYPE= <nmr>
##$USER= <she>
##$AMP= (0..31)
100 100 100 100 100 100 100 100 100 100 100 100 100 100 100 100 100 100 
100 100 100 100 100 100 100 100 100 100 100 100 100 100 
##$AQSEQ= 0
##$AQ_mod= 1
##$AUNM= <au_zg>
##$AUTOPOS= <>
##$BF1= 81.014009
##$BF2= 200.13
##$BF3= 200.13
##$BF4= 200.13
##$BF5= 200.13
##$BF6= 200.13
##$BF7= 200.13
##$BF8= 200.13
##$BYTORDA= 1
##$CFDGTYP= 0
##$CFRGTYP= 5
##$CHEMSTR= <none>
##$CNST= (0..31)
1 1 145 1 1 1 1 1 1 1 1 1 1 1 1 1 1 1 1 1 1 1 1 1 1 1 1 1 1 1 1 1 
##$CPDPRG= <waltz16>
##$CPDPRG1= <>
##$CPDPRG2= <waltz16>
##$CPDPRG3= <>
##$CPDPRG4= <mlev>
##$CPDPRG5= <mlev>
##$CPDPRG6= <mlev>
##$CPDPRG7= <mlev>
##$CPDPRG8= <mlev>
##$CPDPRGB= <>
##$CPDPRGT= <>
##$D= (0..31)
0 1 0 0 0 0 0 0 0 0 0 0.03 2e-05 3e-06 0 0 0 0 0 0 0 0 0 0 0 0 0 0 0 0 
0 0 
##$DATE= 1698930957
##$DBL= (0..7)
120 120 120 11 120 120 24 19 
##$DBP= (0..7)
150 150 150 150 150 150 150 150 
##$DBP07= 0
##$DBPNAM0= <>
##$DBPNAM1= <>
##$DBPNAM2= <>
##$DBPNAM3= <>
##$DBPNAM4= <>
##$DBPNAM5= <>
##$DBPNAM6= <>
##$DBPNAM7= <>
##$DBPOAL= (0..7)
0.5 0.5 0.5 0.5 0.5 0.5 0.5 0.5 
$$ [...]
##$SUBNAM2= <"">
##$SUBNAM3= <"">
##$SUBNAM4= <"">
##$SUBNAM5= <"">
##$SUBNAM6= <"">
##$SUBNAM7= <"">
##$SUBNAM8= <"">
##$SUBNAM9= <"">
##$SW= 501.771253377433
##$SWIBOX= (0..15)
0 1 3 0 0 0 0 0 0 0 0 0 0 0 0 0 
##$SW_h= 40650.406504065
##$TD= 32768
##$TD0= 1
##$TE= 0
##$TE2= 300
##$TE3= 300
##$TEG= 300
##$TL= (0..7)
0 120 53 12 22 120 120 120 
##$TP= (0..7)
150 150 150 150 150 150 150 150 
##$TP07= 0
##$TPNAME0= <>
##$TPNAME1= <>
##$TPNAME2= <>
##$TPNAME3= <>
##$TPNAME4= <>
##$TPNAME5= <>
##$TPNAME6= <>
##$TPNAME7= <>
##$TPOAL= (0..7)
0.5 0.5 0.5 0.5 0.5 0.5 0.5 0.5 
##$TPOFFS= (0..7)
0 0 0 0 0 0 0 0 
##$TUNHIN= 0
##$TUNHOUT= 0
##$TUNXOUT= 0
##$USERA1= <user>
##$USERA2= <user>
##$USERA3= <user>
##$USERA4= <user>
##$USERA5= <user>
##$V9= 5
##$VALIST= <valist>
##$VCLIST= <CCCCCCCCCCCCCCC>
##$VD= 0
##$VDLIST= <DDDDDDDDDDDDDDD>
##$VPLIST= <PPPPPPPPPPPPPPP>
##$VTLIST= <TTTTTTTTTTTTTTT>
##$WBST= 1024
##$WBSW= 4
##$XGAIN= (0..3)
0 0 0 0 
##$XL= 0
##$YL= 0
##$YMAX_a= 2421
##$YMIN_a= -1024
##$ZGOPTNS= <>
##$ZL1= 120
##$ZL2= 120
##$ZL3= 120
##$ZL4= 120
##$ABSF1= 0
##$ABSF2= 0
##$ABSG= 0
##$ABSL= 0
##$ALPHA= 0
##$AQORDER= 0
##$ASSFAC= 0
##$ASSFACI= 0
##$ASSFACX= 0
##$ASSWID= 0
##$AUNMP= <proc_1d>
##$AZFE= 0.1
##$AZFW= 0.5
##$BCFW= 0
##$BC_mod= 2
##$BYTORDP= 0
##$COROFFS= 0
##$CY= -3
##$DATMOD= 1
##$DC= 0
##$DFILT= <>
##$DTYPP= 0
##$F1P= 0
##$F2P= 0
##$FCOR= 1
##$FTSIZE= 65536
##$FT_mod= 6
##$GAMMA= 0
##$GB= 0
##$INTBC= 1
##$INTSCL= 6.047779e-11
##$ISEN= 30
##$LB= 5
##$LEV0= 0
##$LPBIN= 0
##$MAXI= 10000
##$MC2= 0
##$MEAN= 0
##$ME_mod= 0
##$MI= 50
##$NCOEF= 0
##$NC_proc= -11
##$NLEV= 6
##$NOISF1= 182.463
##$NOISF2= 159.3651
##$NSP= 0
##$NTH_PI= 0
##$NZP= 0
##$OFFSET= 248.5645
##$PC= 4
##$PHC0= -10913.75
##$PHC1= 676.2902
##$PH_mod= 1
##$PKNL= yes
##$PPARMOD= 0
##$PSCAL= 0
##$PSIGN= 0
##$REVERSE= no
##$SF= 81.0140089999694
##$SI= 65536
##$SIGF1= 159.3651
##$SIGF2= -187.1042
##$SINO= 113.3802
##$SIOLD= 16384
##$SREGLST= <1H.CDCl3>
##$SSB= 0
##$STSI= 65536
##$STSR= 0
##$SW_p= 40650.406504065
##$SYMM= 0
##$S_DEV= 0
##$TDeff= 32768
##$TDoff= 0
##$TI= <>
##$TILT= no
##$TM1= 0
##$TM2= 0
##$TOPLEV= 0
##$USERP1= <user>
##$USERP2= <user>
##$USERP3= <user>
##$USERP4= <user>
##$USERP5= <user>
##$WDW= 1
##$XDIM= 65536
##$YMAX_p= 454272481
##$YMIN_p= -107910985
$$ End of Bruker specific parameters
$$ ---------------------------------
##NTUPLES= NMR SPECTRUM
##VAR_NAME=  FREQUENCY,     SPECTRUM/REAL,   SPECTRUM/IMAG
##SYMBOL=    X,             R,               I
##VAR_TYPE=  INDEPENDENT,   DEPENDENT,       DEPENDENT
##VAR_FORM=  AFFN,          ASDF,            ASDF
##VAR_DIM=   65536,         65536,           65536
##UNITS=     HZ,            ARBITRARY UNITS, ARBITRARY UNITS
##FACTOR=    0.620285442955139, 1,           1
##FIRST=     20137.2065510682, 0,            0
##LAST=      -20513.1999529968, 0,           0
##MIN=       -20513.1999529968, -107910985,  0
##MAX=       20137.2065510682, 454272481,    0
$$ Real data points
##PAGE= N=1
##DATA TABLE= (X++(R..R)), XYDATA
$$ [...]
12910a1104640k452471j435187j229273k187147l285288l114532j479646M36084
12902b5852100J432898J386818R84608Q66032J248131K013875K773153K953990
12894a2192595K210196Q71718j61104j50183P70502J635071J504300L68349q59949
12885f003695j302780r48366m43121k79445m46549o96087p25693j20898J412544
12876i554090L571359N508041O500452O319968M951557K487786m40935k656433
12868A6687705l385334l008345k463108k126801j705661r85404j25754P24792
12860C612090J570772K268346K519228K263968J762579J277825J010408J248838
12852A7534054K042870K673708K061060m662k465453m105419m645027m433327
$$ plain form
12910 -11104640 -13557111 -14992298 -16221571 -18408718 -21694006 -24808538 -26288184 -25852100
12902 -25852100 -24419202 -23032384 -22047776 -21181744 -19933613 -17919738 -15146585 -12192595
12894 -12192595 -9982399 -9110681 -9271785 -9421968 -8651466 -7016395 -5512095 -5143746 -6003695
12885 -6003695 -7306475 -8254841 -8697962 -8977407 -9423956 -10120043 -10845736 -10966634 -9554090
12876 -9554090 -5982731 -474690 6025762 12345730 17297287 19785073 19344138 16687705
12868 16687705 13302371 10294026 7830918 5704117 3998456 3013052 2887298 3612090
12860 3612090 5182862 7451208 9970436 12234404 13996983 15274808 16285216 17534054
12852 17534054 19576924 22250632 24311692 24307030 21841577 17736158 13091131 8657804
12844H657804l552250j822741M99100K615681L834175L994855L304924K119441
12836A9650989R02020J5657o11750j384887k468343l477199l835253l292667k015872
12827C482695l70394J200657K220712K386512J808070R12083M6700p19164j377001
12818I590870j757569j717139j428397j218620j134035r57145p01503p19654j117503
12809a160695j419808j181812o73309m85880n84250k63014R05300K498553L700311
12800A335396L980802L322194K215528J498087J669630K171588J847609L90079
12792A8430913j195793j954555k240434k945304l840443l612421j696119O36252
12784A582096J467344K58214j644380k454783j709691n58064l85416j314657k264845
$$ plain form
12844 8657804 5105554 3282813 3781913 6397594 10231769 14226624 17531548 19650989
12836 19650989 20553009 20568666 19956916 18572029 16103686 12626487 8791234 5498567 3482695
12827 3482695 3112301 4312958 6533670 8920182 10728252 11640335 11687035 10967871 9590870
12818 9590870 7833301 6116162 4687765 3469145 2335110 1377965 676462 -43192 -1160695
12809 -1160695 -2580503 -3762315 -4435624 -4921504 -5505754 -5768768 -4863468 -2364915 1335396
12800 1335396 5316198 8638392 10853920 12352007 14021637 16193225 18040834 18430913
12792 18430913 17235120 15280565 13040131 10094827 6254384 2641963 945844 1582096
12784 1582096 3049440 3307654 1663274 -791509 -2501200 -3059264 -3444680 -4759337 -7024182
12775g024182k432667k297992k875560m229831n163142m411661j931549J014850
12767b9351734K926155L260670K665016J980261J175233l11309k168896k908583
12759b2733187j508629J122491L046594L409709K962868K698594K849372L265945
12751d886243L857967M299467M014348K937250J807947J299592J268216J217706
12743A5816250J031376P71428J77007j011563k400148l147034k790716j536093
12735F910507J45504J818419L087855L705385L701702L226816K404244J558770
12727B6559202J271527J720478K119219J367539p07960l208509n257015o703213
12719A7161268p614059p661764o478481m358864k185967o76986J14577O40868
$$ plain form
12775 -7024182 -9456849 -11754841 -14630401 -18860232 -24023374 -28435035 -30366584 -29351734
12767 -29351734 -26425579 -23164909 -20499893 -18519632 -17344399 -17655708 -19824604 -22733187
12759 -22733187 -24241816 -23119325 -20072731 -16663022 -13700154 -11001560 -8152188 -4886243
12751 -4886243 -1028276 3271191 7285539 10222789 12030736 13330328 14598544 15816250
12743 15816250 16847626 17619054 17796061 16784498 14384350 11237316 8446600 6910507
12735 6910507 7056011 8874430 11962285 15667670 19369372 22596188 25000432 26559202
12727 26559202 27830729 29551207 31670426 33037965 32330005 29121496 23864481 17161268
12719 17161268 9547209 1885445 -4593036 -8951900 -11137867 -11814853 -11700276 -11059408
12711a1059408J376559K405738L327069L608264L119457K243958J411009O50896
12703G083542l03703j622361l206083m776933n969381o392498n751050l951519
12695b4889986j165892K018190M518857N228539L930618J649948k09891j057784
12687i977401j244233j163388o78164M69195K085056L629770M650118M865783
12679B636736M094218K499380Q24465p8363j04926k2862n91679j764358k909698
12670D582913l599804l893045l914714l483410k329754o10691R43876J520868
12662a0783761R44921j13598p61525p15684l81762j43544R4714M75822O41142
12653a0743275P3501j073510j923845j763938o73464Q10278K293934L569009M333856
$$ plain form
12711 -11059408 -9682849 -7277111 -3950042 -341778 2777679 5021637 6432646 7083542
12703 7083542 6779839 5157478 1951395 -2825538 -8794919 -15187417 -20938467 -24889986
12695 -24889986 -26055878 -24037688 -19518831 -14290292 -10359674 -8709726 -8919617 -9977401
12687 -9977401 -11221634 -12385022 -13063186 -12593991 -10508935 -6879165 -2229047 2636736
12679 2636736 6730954 9230334 10054799 9976436 9871510 9848648 9256969 7492611 4582913
12670 4582913 983109 -2909936 -6824650 -10308060 -12637814 -13248505 -12304629 -10783761
12662 -10783761 -9838840 -9952438 -10713963 -11429647 -11811409 -11954953 -11860239 -11384417 -10743275
12653 -10743275 -10669774 -11743284 -13667129 -15431067 -16104531 -15294253 -13000319 -9431310 -5097454
12644e097454M211795L018165R23328j469713l135348l109045j367484R34490
12636e091266K483081K971115K924373K577922J531176m13355k677551m498177
12628a92682n693405o517109p089696p332700p159967o307851m268737r99211
12620d5561358K398199M369473M486998L880865L893328M707094N527795N666273
12612a0631333N010318L722410K012154K05221j323090k346683k762252k485600
12604h598855j633753o75148j4822N63791J664883L387184M961562N418967M440851
12595I514660K530435O07658n36716p40338n92359q13716j426987j852420j880409
12586D809808k018607k574572k945380k421127j358709q17538j103271j417428
$$ plain form
12644 -5097454 -885659 2132506 3055834 1586121 -1549227 -4658272 -6025756 -5091266
12636 -5091266 -2608185 362930 3287303 5865225 7396401 6983046 4305495 -192682
12628 -192682 -5886087 -12403196 -19492892 -26825592 -33985559 -40293410 -44562147 -45561358
12620 -45561358 -43163159 -38793686 -34306688 -30425823 -26532495 -21825401 -16297606 -10631333
12612 -10631333 -5621015 -1898605 113549 318770 -1004320 -3351003 -6113255 -8598855
12604 -8598855 -10232608 -10907756 -10922578 -10358787 -8693904 -5306720 -345158 5073809 9514660
12595 9514660 12045095 12652753 12116037 11375699 10783340 9969624 8542637 6690217 4809808
12586 4809808 2791201 216629 -2728751 -5149878 -6508587 -7326125 -8429396 -9846824
12578i846824j113460o27174p72948j593962k411064k763863k791389k689187
12570b4609871k186781p54166J755996M728768P065836P958074P464966O261087
12562G683909M813791L029445Q11191j332904k582953k627310j883920r22645
12554F988604j68P48977J042282P29482K13121J89089Q46873J597252J810448
12545A4165960J642136J807560K572975L331804L312722K399902J030264m16112
12537B9847211j724309k527992k425223j503380l36781O74360J561821K199978
12529B5765685J953515M13664j742710l179352l225314k417089j710281j531054
12521A4327064j692171j847857j766139j377387q30904m24345l04567l14476k64306
$$ plain form
12578 -9846824 -10960284 -11587458 -12360406 -13954368 -16365432 -19129295 -21920684 -24609871
12570 -24609871 -26796652 -27550818 -25794822 -21066054 -14000218 -6042144 1422822 7683909
12562 7683909 12497700 15527145 16338336 15005432 12422479 9795169 7911249 6988604
12554 6988604 6988436 7737413 8779695 9509177 9722298 9911387 10758260 12355512 14165960
12545 14165960 15808096 17615656 20188631 23520435 26833157 29233059 30263323 29847211
12537 29847211 28122902 25594910 23169687 21666307 21329526 22003886 23565707 25765685
12529 25765685 27719200 28132864 26390154 23210802 19985488 17568399 15858118 14327064
12521 14327064 12634893 10787036 9020897 7643510 6812606 6388261 6083694 5769218 5504912
12512E504912k45610n22521j196761k110712k964802l392405l127672k400084
12504a0455655k005626k527792l452433l521586k156823j28657J427491K198191
12496b0622890K472577K203693J068454o27241j906003k222054k024148j944331
12488b3601943j973343j808238j485339j116100l83504J009380K514769L001062
12480b3843256J934316p7843j896510k622489j866387J59013K634036M618615
12472b0960505N757085O305790O488086O191398N337935M131578K794976J402326
12464A7448669P5953j002213j848898k546250k801745k198315j069492m88479
12456E569230r65502j688697j597128p66323p2537K02472O31011J529165K328584
$$ plain form
12512 5504912 5259302 4736781 3540020 1429308 -1535494 -4927899 -8055571 -10455655
12504 -10455655 -12461281 -14989073 -18441506 -21963092 -24119915 -24248572 -22821081 -20622890
12496 -20622890 -18150313 -15946620 -14878166 -15505407 -17411410 -19633464 -21657612 -23601943
12488 -23601943 -25575286 -27383524 -28868863 -29984963 -30368467 -29359087 -26844318 -23843256
12480 -23843256 -21908940 -21986783 -23883293 -26505782 -28372169 -28213156 -25579120 -20960505
12472 -20960505 -15203420 -8897630 -2409544 3781854 9119789 13251367 16046343 17448669
12464 17448669 17524622 16522409 14673511 12127261 9325516 7127201 6057709 5569230
12456 5569230 4603728 2915031 1317903 551580 479043 681515 1312526 2841691 5170275
12447E170275K312192J512184N96521J28056J36033K23651r3847j072399k589933
12438F322733m191191n195314m897621l078939n07022J435584K001422J765757
12430f344591J764538K219144K542022K339937J785962J050925J9336j240715
12422D136558k191081k246699j244325N26678K409762L523770L337165K244644
12414A0496472J124893J98281j143231l145563m949771n533042m962544m136055
12406a2050560l543353k896072j872886n99288P14907K083295L409832M167132
12398a0586993L735342K001179n14122l019730m805748n345353m378148k174355
12390b5087928K72541J613274J072166q73166k875678l854674l681525k831084
$$ plain form
12447 5170275 7482467 8994651 9591172 9719228 9855261 10078912 9985065 8912666 6322733
12438 6322733 2131542 -3063772 -7961393 -11040332 -11547354 -10111770 -8110348 -6344591
12430 -6344591 -4580053 -2360909 181113 2521050 4307012 5357937 5377273 4136558
12422 4136558 1945477 -301222 -1545547 -1018869 1390893 4914663 8251828 10496472
12414 10496472 11621365 11819646 10676415 7530852 2581081 -2951961 -7914505 -12050560
12406 -12050560 -15593913 -18489985 -20362871 -20962159 -20247252 -18163957 -14754125 -10586993
12398 -10586993 -6851651 -4850472 -5364594 -8384324 -13190072 -18535425 -22913573 -25087928
12390 -25087928 -24815387 -23202113 -22129947 -23003113 -25878791 -29733465 -33414990 -36246074
12382c6246074j687895l46020J191043K909489M750149O387543P119389O309801
12374i612575M038087J122984j552251l564085m776679m972391l990908k191300
12366b5499118m31672O27381J083234J485966K104738K797593L561384M708464
12358i562030O176065P028497O241376M009841J827675J093964J876194L074392
12350B1765974L464675K520355O66949r81618j463098q96901m02954q36488j813189
12341B2023705k266057j710874n55549O41358J652609K290406K187930J194043
12333B5457571k67230j524973k289467k817807l517161m467334n276019n366936
12325f9356m508494l123579k001252j625516j801241j934016j604252q55560k0732
$$ plain form
12382 -36246074 -37933969 -38279989 -37088946 -34179457 -29429308 -23041765 -15922376 -9612575
12374 -9612575 -5574488 -4451504 -6003755 -9567840 -14344519 -19316910 -23307818 -25499118
12366 -25499118 -25930790 -25303409 -24220175 -22734209 -20629471 -17831878 -14270494 -9562030
12358 -9562030 -3385965 3642532 9883908 13893749 15721424 16815388 18691582 21765974
12350 21765974 25230649 27751004 28417953 27436335 25973237 25076336 24673382 23836894 22023705
12341 22023705 19757648 18046774 17491225 18132583 19785192 22075598 24263528 25457571
12333 25457571 25190341 23665368 21375901 18558094 15040933 10573599 5297580 -69356
12325 -69356 -4577850 -7701429 -9702681 -11328197 -13129438 -15063454 -16667706 -17523266 -17543998
12316a7543998O58031J269746K149095L512895N084991O050692N512004L222729
12308I916185q188k772927m105145m055710l195482j801709J33618K254008L762445
12299A27095M178737L787188L138037K482651J915960J598951J422924Q65047
12291A9516590k56641j173261r70728J25438R47691Q47304K56074k81546q21437
12282A8189484j417112j570204r60908k85442o02218j937962l155767l272952
12274D986919k455876j586827j200882j064510o59720O4858M57881k11184j795094
12265c464435l105459k954174j301696Q32190K477607L407424L788483L650809
12257C330749L009827K251985J975059K364443K921052K918420K071336P06517
$$ plain form
12316 -17543998 -16885967 -15616221 -13467126 -9954231 -4869240 1181452 6693456 9916185
12308 9916185 9907997 7135070 3029925 -1025785 -4221267 -6022976 -5889358 -3635350 127095
12299 127095 4305832 8093020 11231057 13713708 15629668 17228619 18651543 19516590
12291 19516590 19259949 18086688 17115960 17241398 18189089 19036393 19292467 19010921 18189484
12282 18189484 16772372 15202168 14241260 13955818 13353600 11415638 8259871 4986919
12274 4986919 2531043 944216 -256666 -1321176 -1980896 -1916038 -1458157 -1669341 -3464435
12265 -3464435 -6569894 -9524068 -10825764 -9993574 -7515967 -4108543 -320060 3330749
12257 3330749 6340576 8592561 10567620 12932063 15853115 18771535 20842871 21549388
12249B1549388o47519j710639k472919k922778k959365k623348k269965k364971
12241C577884l082011m102663m780268m553180l375853j855458q87456j025498
12233b0084503k112788l378916l789009k559869J37456K864815L845920K685832
12225b2391062R33158M81536J545304K648946K467924J079876o30045k088922
12217a5953285l162902l640500l157201j564144R15540L769332O177700P105243
12209i510217N852219K669927j259053m451082n796513n010226k803751m94954
12201b0803650R34679J470597J631509J580175R95837k61458j785779l009100
12193a9247190l643914l696074l371175l033643k870543k456895j086579J181639
$$ plain form
12249 21549388 20901869 19191230 16718311 13795533 10836168 8212820 5942855 3577884
12241 3577884 495873 -3606790 -8387058 -12940238 -16316091 -18171549 -19059005 -20084503
12233 -20084503 -22197291 -25576207 -29365216 -31925085 -31787629 -28922814 -25076894 -22391062
12225 -22391062 -21457904 -20976368 -19431064 -16782118 -14314194 -13234318 -13864363 -15953285
12217 -15953285 -19116187 -22756687 -25913888 -27478032 -26562492 -22793160 -16615460 -9510217
12209 -9510217 -3657998 -988071 -2247124 -6698206 -12494719 -17504945 -20308696 -20803650
12201 -20803650 -19868971 -18398374 -16766865 -15186690 -14190853 -14452311 -16238090 -19247190
12193 -19247190 -22891104 -26587178 -29958353 -32991996 -35862539 -38319434 -39406013 -38224374
12185c8224374L183101L732681K778092J100779p67830k669810m003574l663647
12177c8534582j248710K085617M435575M712811L272601J332498R6423J38795
12169b3708972J066994J729620J174941m04101j851433k188640j331505K67335
12161b5245761K154850L788549M435392L817148K710528K212646K284265J687041
12153b155342k50898k396546l046141k140340j415772k206229l805566m424676
12145b1841510l256440j020506J225618L075772M494124N171522M618228K779646
12137d753546L07497j806718k856426k817460k242199j731558j472228j284225
12129a8656863r91712n54851J05991J099814K224012K852042K437698J147384
$$ plain form
12185 -38224374 -35041273 -31308592 -28530500 -27429721 -28197551 -30867361 -34870935 -38534582
12177 -38534582 -39783292 -37697675 -33262100 -28549289 -25276688 -23944190 -23847767 -23708972
12169 -23708972 -22641978 -20912358 -19737417 -20141518 -21992951 -24181591 -25513096 -25245761
12161 -25245761 -23090911 -19302362 -14866970 -11049822 -8339294 -6126648 -3842383 -2155342
12153 -2155342 -2406240 -4802786 -7848927 -9989267 -11405039 -13611268 -17416834 -21841510
12145 -21841510 -25097950 -26118456 -24892838 -21817066 -17322942 -12151420 -7533192 -4753546
12137 -4753546 -4446049 -6252767 -9109193 -11926653 -14168852 -15900410 -17372638 -18656863
12129 -18656863 -19648575 -20203426 -20097435 -18997621 -16773609 -13921567 -11483869 -10336485
12121a0336485j42672n40755J34178J226149J812893J511680P85987L87740N01249
12112d660036O08754K54720l04082m23585J19916R46299J650806K229514K783332
12103C205638L020150K320641L57223k406493m860516n949184n363973l649938
12095a3326452j643163K00720J918749L562906M767436M896791L619150J305241
12087E301378j144165k909962l797210m233980m717697n255766n377621m650652
12079b6785675l063831r13739J451857L579901M756054M298933K237062m19218
12071a4858656k293403k621814j686242m43555J64977k76090j465442k528841
12063b6009066k514410j020213J503723M036503N631285N961582N419586M708812
$$ plain form
12121 -10336485 -10479157 -11019912 -10885734 -9659585 -7846692 -6335012 -5549025 -5161285 -4660036
12112 -4660036 -4051282 -3796562 -4100644 -4524229 -4404313 -3458014 -1807208 422306 3205638
12103 3205638 6225788 8546429 8903652 6497159 1636643 -4312541 -9676514 -13326452
12095 -13326452 -14969615 -14768895 -12850146 -9287240 -4519804 376987 3996137 5301378
12087 5301378 4157213 1247251 -2549959 -6783939 -11501636 -16757402 -22135023 -26785675
12079 -26785675 -29849506 -30763245 -29311388 -25731487 -20975433 -16676500 -14439438 -14858656
12071 -14858656 -17152059 -19773873 -21460115 -21903670 -21738693 -22014783 -23480225 -26009066
12063 -26009066 -28523476 -29543689 -28039966 -24003463 -18372178 -12410596 -6991010 -2282198
12055b282198M259734M027388L846669L776635L860411L699800K710411R04189
12047B4803039r53077k150674k663123k762714k435489j626132p49779l72222
12039A1089829m85736o53177q25324j410389k457563l409687l912004m269764
12031f333815m687618m543426l014802k48397K575675M302870M630384M005018
12023c314111L044242K033415P62457j098758l334667n082099n614681n053069
12015a7657271m067269l090726k118125j062251N4854J126885J869101J901235
12007b3043567J283205P25700Q01726J155863J023780L22747m31896j103722j923725
11998b1189889k447183j575354Q58887L314383M055333K972388J295239l2455
$$ plain form
12055 -2282198 1977536 6004924 9851593 13628228 17488639 21188439 23898850 24803039
12047 24803039 23849962 21699288 19036165 16273451 13837962 12211830 11462051 11089829
12039 11089829 10604093 9950916 9125592 7715203 5257640 1847953 -2064051 -6333815
12031 -6333815 -11021433 -15564859 -18579661 -18828058 -16252383 -11949513 -7319129 -3314111
12023 -3314111 -269869 1763546 2526003 1427245 -1907422 -6989521 -12604202 -17657271
12015 -17657271 -21724540 -24815266 -26933391 -27995642 -27940788 -26813903 -24944802 -23043567
12007 -23043567 -21760362 -21034662 -20232936 -19077073 -18053293 -17730546 -18162442 -19266164 -21189889
11998 -21189889 -23637072 -25212426 -24353539 -21039156 -16983823 -14011435 -12716196 -12748651
11990a2748651r29027j429236j280756m42924O12918J361167J680173J749946
11982a1426390J770931J878229K110873K359479K441556K242188J760969J170815
11974D308650Q86678J269973K035413K247406J255322n64595k291457l380262
11966E767128l705407l088740j519268K77874J273267J265124R49144P28633J49555
11957B097310j177308k732041l638239l627857l024382k150380j206842m10381
11949a5870120K47473J147983K485381L750008M230014L863256L111597K135287
11941E100879O74349j216226k846614l507765l107436k101982j073344m08889
11933h487028p2310M02623J419844K754059L726515L958288L636359L024218K133671
$$ plain form
11990 -12748651 -13677678 -15106914 -16387670 -16830594 -16217676 -14856509 -13176336 -11426390
11982 -11426390 -9655459 -7777230 -5666357 -3306878 -865322 1376866 3137835 4308650
11974 4308650 5195328 6465301 8500714 10748120 12003442 11438847 9147390 5767128
11966 5767128 2061721 -1027019 -2546287 -2268413 -995146 269978 1219122 1947755 2097310
11957 2097310 920002 -1812039 -5450278 -9078135 -12102517 -14252897 -15459739 -15870120
11949 -15870120 -15622647 -14474664 -11989283 -8239275 -4009261 -146005 2965592 5100879
11941 5100879 5775228 4559002 1712388 -1795377 -4902813 -7004795 -8078139 -8487028
11933 -8487028 -8559338 -8156715 -6736871 -3982812 -256297 3701991 7338350 10362568 12496239
11924A2496239J022945P362o85689j171752j588973j831480j877946k078047k715685
11915A576974l449164l564147k734085j269020K90082J559997K443275L229844
11907a916244M504179O533136Q637790R469680Q089566M716248N08051l155480
11899C7386926n293930n722230n066969m165528l289874k128844n64184Q97012
11891A2052379J686886J876444J969629K147151K054866J307531p9187j758665
11883B1257034l287715m225414m220975l172370j297266R33463K905126M066640
11875A2958523M261117L806583L014809J666721o94052l829292o495561p367866
11867G320982o184674l814125j346743O41614K070267K966766L190276K394816
$$ plain form
11924 12496239 13519184 13526546 12840857 11669105 10080132 8248652 6370706 4292659 1576974
11915 1576974 -1872190 -5436337 -8170422 -9439442 -9149360 -7589363 -5146088 -1916244
11907 -1916244 2587935 9121071 17758861 27228541 35318107 40034355 40542406 37386926
11899 37386926 32092996 26370766 21303797 17138269 13848395 11719551 11155367 12052379
11891 12052379 13739265 15615709 17585338 19732489 21787355 23094886 23015699 21257034
11883 21257034 17969319 13743905 9522930 6350560 5053294 5986757 8891883 12958523
11875 12958523 17219640 21026223 24041032 25707753 25013701 21184409 14688848 7320982
11867 7320982 1136308 -2677817 -4024560 -3382946 -1312679 1654087 4844363 7239179
11859G239179L42274k474846m583033m390167j632059K194890N049728N885134
11851G631100M943135K986351P41693j081932j922969j839304j547553j696724
11843H213797k217856k541357k296553j626296r55925o54438q38461j309196j681002
11834e907287j677116j302910p48084k56917p9611k45980k41854P21092K706006
11825g032661M505985M602413K746312K48641j376428j745275j519290j399060
11817i69363j509485j585367j434055j172300j106753j358790j573493j102337
11809a1811943M31362K758503N101335O558981O454284M670041J879602p11790
11801A5330375k135216k276128j752890j259176j041764r15585o98683n81277
$$ plain form
11859 7239179 7581453 5106607 523574 -3866593 -5498652 -3303762 1745966 7631100
11851 7631100 12574235 15560586 16302279 15220347 13297378 11458074 9910521 8213797
11843 8213797 5995941 3454584 1158031 -468265 -1424190 -2078628 -2917089 -4226285 -5907287
11834 -5907287 -7584403 -8887313 -9635397 -9892314 -9971925 -10217905 -10459759 -9738667 -7032661
11825 -7032661 -2526676 2075737 4822049 5070690 3694262 1948987 429697 -969363
11817 -969363 -2478848 -4064215 -5498270 -6670570 -7777323 -9136113 -10709606 -11811943
11809 -11811943 -11380581 -8622078 -3520743 3038238 9492522 14162563 16042165 15330375
11801 15330375 13195159 10919031 9166141 7906965 6865201 5949616 5250933 4669656
11793D669656r42798j755490k440137k609403k727706l522658m788163n372076
11785a9488775m508300k600944m56589J621561L525785M739223M756985L778563
11777h632491K284511J99255k699579n638382p050077o198271l962569j772955
11769c3470558l60532K38778K34895K00069J043132L106012N495146O904428O971228
11760i637402O309046N377011M008010K155830M79053k11693J80636J020935J639122
11751A1320548J816322J678696J376967R76996N78239L81477N11224P92027Q78478
11742B0310974O90369N31256N93928N29000j55734j284164j966558j530630k40087
11733A7478354J149500K359250L755551N543301P142943P616614O579222M444665
$$ plain form
11793 4669656 3726858 1971368 -468769 -3078172 -5805878 -9328536 -14116699 -19488775
11785 -19488775 -23997075 -26598019 -27054608 -25433047 -21907262 -17168039 -12411054 -8632491
11777 -8632491 -6347980 -6148725 -8848304 -14486686 -21536763 -27735034 -31697603 -33470558
11769 -33470558 -33831090 -33592312 -33357417 -33157348 -32114216 -29008204 -23513058 -16608630 -9637402
11760 -9637402 -3328356 2048655 6056665 8212495 8691548 8479855 8660491 9681426 11320548
11751 11320548 13136870 14815566 16192533 17169529 17747768 18129245 18640469 19432496 20310974
11742 20310974 21001343 21532599 22126527 22655527 22499793 21215629 19249071 17718441 17478354
11733 17478354 18627854 20987104 24742655 30285956 37428899 45045513 51624735 56069400
11725E6069400J831653r50887l711296n982889p178799p092650n982147m196489
11717B2805896k053175j22091Q27484N34935k95971o53716l40449j46556q45998
11708A9710359k247655l341068l214933j748008M17362K390688L579215L907313
11700A9453273L599801K802537J505202j39532j582159k189253j862040j215563
11692B0372266r86780j251615j340176n92487Q85273K325591L109377L310734
11684B5832183L402190L582272L527687K736647R99939j392605l733243n181243
11676B9773827n183274l810963j727152K04845J308151J219484j09282k323655
11668A9351981m617631o039500o118524n258547m379292m025723l845152l053910
$$ plain form
11725 56069400 57901053 56950166 53238870 47255981 40077182 32984532 27002385 22805896
11717 22805896 20752721 20630630 21458114 21993049 21697078 21043362 20702913 20556357 19710359
11708 19710359 17462704 14121636 10906703 9158695 9576057 11966745 15545960 19453273
11700 19453273 23053074 25855611 27360813 27221281 25639122 23449869 21587829 20372266
11692 20372266 19385486 18133871 16793695 16201208 17086481 19412072 22521449 25832183
11684 25832183 29234373 32816645 36344332 39080979 40080918 38688313 34955070 29773827
11676 29773827 24590553 20779590 19052438 19257283 20565434 21784918 21675636 19351981
11668 19351981 14734350 8694850 2576326 -2682221 -7061513 -11087236 -14932388 -17986298
11660a7986298j421519L63318J409138J591739J623058K148255K961816L251476
11652f059017K534868J196494R3140k35826Q0953N34308P21569O17186N60351
11643D4026J018497K184137L662735M643066M530802L417269J851701K21666j472018
11634B0101881l214876m562088m830626l752146j863889j64601O84568Q49216
11626C247439J014824J608711K363673K616942J924596L77034j480849k867680
11618H804690l062712j844820J95565J910752K365576J488109N4614r23548q83077
11609H105149M4361J317717K414456K958849K645903J408204k56439j477733j821499
11600A5338968j728367j910038k517107l190433l676611l924390l705104k687479
$$ plain form
11660 -17986298 -19407817 -19044499 -17635361 -16043622 -14420564 -12272309 -9310493 -6059017
11652 -6059017 -3524149 -2327655 -2234515 -2470341 -2389388 -1855080 -1133511 -516325 44026
11643 44026 1062523 3246660 6909395 11552461 16083263 19500532 21352233 21573899 20101881
11634 20101881 16887005 12324917 7494291 3742145 1878256 1713655 2398223 3247439
11626 3247439 4262263 5870974 8234647 10851589 12776185 13153219 11672370 8804690
11618 8804690 5741978 3897158 4092723 6003475 8369051 9857160 9911774 8988226 8105149
11609 8105149 8149510 9467227 11881683 14840532 17486435 18894639 18638200 17160467 15338968
11600 15338968 13610601 11700563 9183456 5993023 2316412 -1607978 -5313082 -8000561
11592h000561r41405J074149L044158M834353N989607N864331M512295K860286
11584A9237213J640918O87173l18089j020194r98414p23689j020968j713870j678317
11575A4091763l87645J312295K262196K295792K156350K482697L205817L717572
11567C1136837L376848K015293J53598j360909j998299j737287p49366P08579
11559C1545294K044966K486454J813298O34362m11966j467088l026860m852418
11551B8766042n852656n236602l473568j880401j396744j921901k697748l054253
11543C252169k748427j871312p39995J20758J99626n35781j439255j654948q60543
11534f277708M96883J650975K090226J758661R29611n242p39492j173153j330879
$$ plain form
11592 -8000561 -8941966 -7867817 -4823659 10694 6000301 11864632 16376927 19237213
11584 19237213 20878131 21565304 21247215 20227021 19228607 18504918 17483950 15770080 14091763
11575 14091763 13704118 15016413 17278609 19574401 21730751 24213448 27419265 31136837
11567 31136837 34513685 36528978 36682576 35321667 33323368 31586081 30836715 31545294
11559 31545294 33590260 36076714 37890012 38524374 38112408 36645320 33618460 28766042
11551 28766042 22913386 17676784 14203216 12322815 10926071 9004170 6306422 3252169
11543 3252169 503742 -1367570 -2107565 -1986807 -1787181 -2322962 -3762217 -5417165 -6277708
11534 -6277708 -5780825 -4129850 -2039624 -280963 648648 643406 -96086 -1269239 -2600118
11525b600118j171616n96557K78714R59033Q63316r9266j271476j717115j103088
11516f458173j04184K15957n40717j790089k660832k716681j917147l07975J813548
11507a4466293L642522M331407L800251K723842J656506N63764o52671j626061
11499b6733j897795j574095j188956r54564n00432N55128K029456L347205M159216
11490C948430M566358M701220M320088L074111J170887n31955j289039j174007
11482A8786093q32006o50864m16349K67397J448716K712752L428011L174012K120730
11473C0038492R14045j861q03950j785067k665933k884070k462884k027313j916674
11464A6404785j864430j690841j670339j894738j871314j236695m04188L6006
$$ plain form
11525 -2600118 -3771734 -4368291 -4089577 -3130544 -2267228 -2366494 -3637970 -5355085 -6458173
11516 -6458173 -6562357 -6346400 -6887117 -8677206 -11338038 -14054719 -15971866 -16279841 -14466293
11507 -14466293 -10823771 -6492364 -2692113 31729 1688235 2251999 1599328 -26733
11499 -26733 -1924528 -3498623 -4687579 -5642143 -6142575 -5587447 -3557991 -210786 3948430
11490 3948430 8514788 13216008 17536096 20610207 21781094 21249139 19960100 18786093
11482 18786093 17954087 17303223 16886874 17154271 18602987 21315739 24743750 27917762 30038492
11473 30038492 30952537 30950676 30146726 28361659 25695726 22811656 20348772 18321459 16404785
11464 16404785 14540355 12849514 11179175 9284437 7413123 6176428 5772240 5808246
11456E808246J66938L86094N28057J08706o58113q71605j24606R58725J630289
11447G932731J964772K556329L600581M619367M926709M141834K408646L26247
11439C2477216j446705k684770l618199m395246m706301m109644k609366p35136
11431H171849Q95814J979583K572146K893377L097395L181834L125475L055093
11423B8972566L089980K968298K090047K11137j995645l395712l491248k824641
11415B5624782k163864j574290o46439M94412R45789M2737j740311l288745m044523
11406A3649548m248034m105683l378879k054050q66359o16599j183803j695991
11398d499850j585816j026818l59288L88410J211406J781085J772949J419986
$$ plain form
11456 5808246 5975184 6361278 6889335 6998041 6339928 5468323 5343717 6302442 7932731
11447 7932731 9897503 12453832 16054413 20673780 25600489 29742323 32150969 32477216
11439 32477216 31030511 28345741 24727542 20332296 15625995 11516351 8906985 8171849
11431 8171849 9067663 11047246 13619392 16512769 19610164 22791998 25917473 28972566
11423 28972566 32062546 35030844 37120891 37332028 35336383 31940671 28449423 25624782
11415 25624782 23460918 21886628 21240189 21734601 22680390 22723127 20982816 17694071 13649548
11406 13649548 9401514 5295831 1916952 -137098 -1003457 -1620056 -2803859 -4499850
11398 -4499850 -6085666 -7112484 -7471772 -7083362 -5871956 -4090871 -2317922 -897936
11390h97936J428139K270919L663731M752226M777648L592116J635156m62089
11382B0759910k175936l121359l095795k276685j215372l95110J63391O81851
11374I324895J081398Q90234k88667k365497m771675o691225p360647o472928
11366a6654112m438895k117065k00763J083763J783492J980943J777874J288564
11358a5496199N58250l81836j357889k085201k331695j919632p17417J059357
11350b2672262K643188L264772K976053K512520K247136J776393P79245k12430
11342f685385l35033O03786J996743L015054K966450J487457j005536l247450
11334a203914m147847l872330l375106k921795j772896N14301L169197N000312
$$ plain form
11390 -897936 530203 2801122 6464853 11217079 15994727 19586843 21221999 20759910
11382 20759910 18583974 15462615 12366820 10090135 8874763 8479653 8643044 9324895
11374 9324895 10406293 11296527 11007860 8642363 3870688 -2820537 -10181184 -16654112
11366 -16654112 -21093007 -23210072 -23410835 -22327072 -20543580 -18562637 -16784763 -15496199
11358 -15496199 -14937949 -15319785 -16677674 -18762875 -21094570 -23014202 -23731619 -22672262
11350 -22672262 -20029074 -16764302 -13788249 -11275729 -9028593 -7252200 -6472955 -6685385
11342 -6685385 -7020418 -6416632 -4419889 -1404835 1561615 3049072 2043536 -1203914
11334 -1203914 -5351761 -9224091 -12599197 -15520992 -17293888 -16779587 -13610390 -8610078
11326h610078N616568N410698M724187L604635K224016R72814O8139n78617j046516
11317A2385846j244135j122636q01755m12585k3250K29642J79896r2367k82337
11308H816319l79126r60698k595147m911140o601589o599485n115587l267402
11300b1613855j766057l34103J454171L134280L606582K423772M57570r18594
11292a3556234j176391j026763j536995k933435m241910m117163k139658O64531
11284c0064018K647728K865144J559753l98253k142403k948884k376692o88085
11276c1545710J145219K245695K530096K405635K087715J643012J450207J978362
11268a6059769L064164L935392M076801L616106K742344J332166m68714j755419
$$ plain form
11326 -8610078 -2993510 2417188 7141375 10746010 12970026 13942840 14010979 13432362 12385846
11317 12385846 11141711 10019075 9217320 8804735 8781485 9011127 9191023 9098656 8816319
11308 8816319 8437193 7476495 4881348 -29792 -6631381 -13230866 -18346453 -21613855
11300 -21613855 -23379912 -23714015 -22259844 -19125564 -15518982 -13095210 -12637640 -13556234
11292 -13556234 -14732625 -15759388 -17296383 -20229818 -24471728 -28588891 -30728549 -30064018
11284 -30064018 -27416290 -24551146 -22991393 -23389646 -25532049 -28480933 -30857625 -31545710
11276 -31545710 -30400491 -28154796 -25624700 -23219065 -21131350 -19488338 -18038131 -16059769
11268 -16059769 -12995605 -9060213 -4983412 -1367306 1375038 2707204 2238490 483071
11260D83071j545977J31729K222531L674218M193948M040767L425350K289544
11252A8915181O18648j101750j901233j114180P44651K229263K355925J520762
11244B2267267P91669O21057O82812O76328O02676K50103q73371k752662m463997
11235A7801882m986279m242626l082938k415459k588658l412023m392798m923616
11227a2242515m527334l128783j117339Q78529K347868L167777L601829M003603
11219g016365M494508M916916N009540M571000L603956K459965J691891J516031
11211B1247442J536720J290980R20719Q71088R89987N08747r25022k733710m202885
11202A9504066n281662o190661o685981o283407m960442l075535p64922J960488
$$ plain form
11260 483071 -1062906 -931177 1291354 4965572 9159520 13200287 16625637 18915181
11252 18915181 19533829 18432079 16530846 15416666 16161317 18390580 20746505 22267267
11244 22267267 23058936 23679993 24362805 25039133 25641809 25891912 25018541 22265879 17801882
11235 17801882 12815603 8572977 5490039 3074580 485922 -2926101 -7318899 -12242515
11227 -12242515 -16769849 -19898632 -21015971 -20137442 -17789574 -14621797 -11019968 -7016365
11219 -7016365 -2521857 2395059 7404599 11975599 15579555 18039520 19731411 21247442
11211 21247442 22784162 24075142 24995861 25866949 26856936 27365683 26440661 23706951 19504066
11202 19504066 14222404 8031743 1345762 -4937645 -9898087 -12973622 -13738544 -11778056
11194a1778056M547056N982037N789837M551353L228474K281445J601057R39969
11186A7143172J13255r86228k219761l103646l138525k291075j041206N8975P98328
11177E333289J285856J623574J722114J483500J030857N33468j71598j432661
11169A1408399l073770m173746l945566k646778j179462O3115J351981K605193
11161D09366K968750J868230k6332j529204k418680l495989n081239o102798n170408
11152a8578304k321151P86221K473457K509334J850124J282905P73521Q4188n35714
11143a1675419o23727j66891M24028Q45200R74115N48463n85649j734633j512498
11134a3507011P03024L715615N422783M764363K481296J16124j280142j520086
$$ plain form
11194 -11778056 -7231000 -1248963 4540874 9092227 12320701 14602146 16203203 17143172
11186 17143172 17256427 16270199 14050438 10946792 7808267 5517192 4475986 4534961 5333289
11177 5333289 6619145 8242719 9964833 11448333 12479190 13012658 12841060 11408399
11169 11408399 8334629 4160883 215317 -2431461 -3610923 -3547808 -2195827 409366
11161 409366 3378116 5246346 5220014 3690810 1272130 -2223859 -7305098 -13407896 -18578304
11152 -18578304 -20899455 -20113234 -17639777 -15130443 -13280319 -11997414 -11223893 -11139705 -11675419
11143 -11675419 -12299146 -12466037 -12042009 -11196809 -10222694 -9674231 -10259880 -11994513 -13507011
11134 -13507011 -12803987 -9088372 -3665589 1098774 3580070 3696194 2416052 895966
11126H95966j000307l88979k48216n58339o85160n5168J200792K447772L249010
11117D857371L580367L413404K508887Q55342r33509k013519k130895j846193
11109H291255j874508k336178k737911k595665j966469j377668j279287j561325
11101g437756j614802r17570M28571J768648K447563K210537J181057k34020j312833
11092c480605j243946J98940K207376L452007L168935J671783j21460j429990
11084D423040j908856j588069p92465j1771L85241L68047J66173N7027K60810
11075A359177Q70157J707798K339403K443104K191523K107582K484344L066716
11067A8569804L359307L111756K408217J449197M83598j05513J8110P00683J217071
$$ plain form
11126 895966 -104341 -493320 -741536 -1299875 -1985035 -2040203 -839411 1608361 4857371
11117 4857371 8437738 11851142 14360029 15215371 14281862 12268343 10137448 8291255
11109 8291255 6416747 4080569 1342658 -1253007 -3219476 -4597144 -5876431 -7437756
11101 -7437756 -9052558 -9970128 -9541557 -7772909 -5325346 -3114809 -1933752 -2167772 -3480605
11092 -3480605 -4724551 -4525611 -2318235 1133772 4302707 5974490 5853030 4423040
11084 4423040 2514184 926115 133650 121879 507120 875167 1041340 1098367 1359177
11075 1359177 2229334 3937132 6276535 8719639 10911162 13018744 15503088 18569804
11067 18569804 21929111 25040867 27449084 28898281 29381879 29276366 29294476 29995159 31212230
11058C1212230Q50192m96237k363945m251493n835927o831355p003119o389168
11050a108822n248288l736472j887698N5816J624558K533628K788016K294971
11042b684291Q52542j205585k861079l419426l331646l438652l667188l206685
11034b2962010j914392p25552m02698n25528j60437Q83789J926363K301214J961204
11025a9618047J301322P17760L59066J32841p1137j52914P9647N20472O71304
11016a6059686P6223j195449k495086k937521j949251J97067K396104L596538
11008a8371061L748244L590564L538356L240243K298933Q34698r25204k999091
11000e044318n089318o146002n164330k244275J626483N576734R053795J1312279
$$ plain form
11058 31212230 32062422 31566185 29202240 24950747 19114820 12283465 5280346 -1108822
11050 -1108822 -6357110 -10093582 -11981280 -11925464 -10300906 -7767278 -4979262 -2684291
11042 -2684291 -1831749 -3037334 -5898413 -9317839 -12649485 -16088137 -19755325 -22962010
11034 -22962010 -24876402 -25601954 -26004652 -26530180 -26690617 -25806828 -23880465 -21579251 -19618047
11025 -19618047 -18316725 -17598965 -17239899 -17107058 -17178195 -17331109 -17251462 -16730990 -16059686
11016 -16059686 -15983463 -17178912 -19673998 -22611519 -24560770 -24363703 -21967599 -18371061
11008 -18371061 -14622817 -11032253 -7493897 -4253654 -1954721 -1120023 -2045227 -5044318
11000 -5044318 -10133636 -16279638 -21443968 -23688243 -22061760 -16485026 -7431231 3881048
10992C881048J1618998J0174708Q169059O586057N393014M171564L069809K658497
10984E5722754L050713L580069L358986J983607k35541k570139m422329n654256
10976E4813864o366948o491597n911299n002637m593071n027169n530374m955975
10968A0934794l149127j190908j82715q9387N399O93045J591034J903840J385005
10959A1900980N76782J82297L88732Q51425J186981J315774J336614J229538Q04490
10950A9773613q0247j344189k760000m115875n183291n540073m639687k287563
10942f177312R23610L784108N171198M676109K760799N02612r66185j185214p22008
10933H767717o22116j388169k650972l851808m894017n909594o691493o714694
$$ plain form
10992 3881048 15500046 25674754 33843813 40429870 45822884 49994448 53064257 55722754
10984 55722754 58773467 62353536 65712522 67696129 67460588 64890449 60468120 54813864
10976 54813864 48446916 41955319 36044020 31041383 26448312 21421143 15890769 10934794
10968 10934794 7785667 6594759 6412044 6322657 6328056 7021101 8612135 10515975 11900980
10959 11900980 12477762 12660059 13048791 13900216 15087197 16402971 17739585 18969123 19773613
10950 19773613 19693366 18349177 15589177 11473302 6290011 749938 -3889749 -6177312
10942 -6177312 -5253702 -1469594 3701604 8377713 11138512 11641124 10674939 9489725 8767717
10933 8767717 8145601 6757432 4106460 254652 -4639365 -10548959 -17240452 -23955146
10925b3955146n601303l328211j87759L101635N425786N947335M879328L294020
10917a0424315K099905J467489J216293J267018J464056J345237N45429o40397
10909a659285j434470j383185q03039l51659k86845k81762M9889O15365R89991
10900d545000J037362J094785J402983J625115J259528M09756k18537p7851P95218
10891B783359K101622L580196M817853N185710M354684K718317J013315l79700
10883B6175356j539708k559733l295647l523008l113497k087740o99919N82445
10875I938549J425877J941239K409765K743742K583595K029435J861202K656593
10867B7589997L864322M174028K875941N90723j433414k501278k791076k725326
$$ plain form
10925 -23955146 -29556449 -32884660 -33072419 -29970784 -24544998 -18597663 -13718335 -10424315
10917 -10424315 -8324410 -6856921 -5640628 -4373610 -2909554 -1564317 -1018888 -1659285
10909 -1659285 -3093755 -4476940 -5279979 -5631638 -5918483 -6200245 -6150356 -5534991 -4545000
10900 -4545000 -3507638 -2412853 -1009870 615245 1874773 2284529 2065992 1988141 2783359
10891 2783359 4884981 8465177 13283030 18468740 22823424 25541741 26555056 26175356
10883 26175356 24635648 22075915 18780268 15257260 12143763 10056023 9356104 9938549
10875 9938549 11364426 13305665 15715430 18459172 21042767 23072202 24933404 27589997
10867 27589997 31454319 35628347 38504288 39095011 37661597 35160319 32369243 29643917
10859B9643917k376726j578972m23390N58687P67225Q5246r33593j448765r62999
10850B3330630L54183J857336K825554K742836J493021m79469k351455l594898
10842B6177738m483075n621128o888601p185142n505372k131004J454138L734720
10834d47726M122570L023197J374784J26713k29074R9068M51453K89723m66629
10825H344079j570728k725384l697911m312182m427104l905486k641942p29283
10817a5665941J414258L214222M272961M466961L773278K221487J30179j758961
10809B068444k620269k142366p98404N33774J321338J821100K743240M400191
10801G327048O205237P091093O454616M686523K796746J527058P87228n4023j313911
$$ plain form
10859 29643917 27267191 25688219 25264829 25823516 26590741 26675987 25742394 24293629 23330630
10850 23330630 23684813 25542149 28367703 31110539 32603560 32124091 29772636 26177738
10842 26177738 21694663 16073535 9184934 1999792 -3505580 -5636584 -4182446 -447726
10834 -447726 3674844 6698041 8072825 8199538 7970464 8069532 8520985 8810708 8344079
10825 8344079 6773351 4047967 350056 -3962126 -8389230 -12294716 -14936658 -15665941
10817 -15665941 -14251683 -11037461 -6764500 -2297539 1475739 3697226 3827405 2068444
10809 2068444 -551825 -2694191 -3492595 -2958821 -1637483 183617 2926857 7327048
10801 7327048 13532285 20623378 27077994 31764517 34561263 36088321 36875549 36821526 35507615
10792C5507615k527935k977269k590085k026799j854552k021430k320229k933216
10784A6256100m072155n333241n967334n773981n237496m680785l727826j830886
10776b0367604R67552M015210O544291P954962P849623O213569L681277J410455
10768A8269335M06455P76186J628775J855578J096484j51468j354398k525129
10760B0001818l776924m670384m520861l279435j689361o16713n90543j783930
10752i26333l743257n107319m452940j895407P07366J673262J241630R37382J609256
10743i956360K756230L574219L902821M000973L927899L423816K195390K53073
10735A4078061j847037l186101l256050k551561k046635k072138k108064j737534
$$ plain form
10792 35507615 32979680 30002411 27412326 25385527 23530975 21509545 19189316 16256100
10784 16256100 12183945 6850704 883370 -4890611 -10128107 -14808892 -18536718 -20367604
10776 -20367604 -19400052 -15384842 -8840551 -885589 6964034 13177603 16858880 18269335
10768 18269335 18675790 19451976 21080751 22936329 24032813 23881345 22526947 20001818
10760 20001818 16224894 11554510 7033649 3754214 2064853 1448140 857597 -926333
10752 -926333 -4669590 -9776909 -14229849 -16125256 -15417890 -13744628 -12502998 -11565616 -9956360
10743 -9956360 -7200130 -3625911 276910 4277883 8205782 11629598 13824988 14078061
10735 14078061 12231024 9044923 5788873 3237312 1190677 -881461 -2989525 -4727059
10727d727059j286041j217601j311979r18299J40047J359346K231605K738445
10719b991536L104433L428185L762296M263989M911158N180503M422608K684963
10711B8766599Q57340k44595p48240j382256k383348l131669k930987j789443
10703A7013401k56457J171620K164067K332720J397184l63038k166665l406946
10695A7885886m101475m584342m941894m891870m100352k500965m02911J607633
10687f030290K973004L501417L355824K673707J389366m02345k120411l087903
10679B252369l191737k779341j907800k49965J958008L399858K777023L22815
10671B581230k333826l814590l974638l251701j830398P4136J653041J960172
$$ plain form
10727 -4727059 -6013100 -7230701 -8542680 -9460979 -9320932 -7961586 -5729981 -2991536
10719 -2991536 112897 3541082 7303378 11567367 16478525 21659028 26081636 28766599
10711 28766599 29623939 29379344 28631104 27248848 24865500 21733831 18802844 17013401
10703 17013401 16756944 17928564 20092631 22425351 23822535 23459497 21292832 17885886
10695 17885886 13784411 9200069 4258175 -633695 -4734047 -7235012 -7637923 -6030290
10687 -6030290 -3057286 444131 3799955 6473662 7863028 7460683 5340272 2252369
10679 2252369 -939368 -3718709 -5626509 -5876474 -3918466 -518608 2258415 2581230
10671 2581230 247404 -3567186 -7541824 -10793525 -12623923 -12549787 -10896746 -8936574
10663h936574Q92399o90660j767394j812930r01429L98309J355151J780406K372969
10654g309753L918127O125257P675051P457535N402716K177864j341556m213601
10646A9891640n739734o049264n936210n716772m653947k027311J504483M219819
10638d507296N001951M229468K966797J740231L59402j356909l059167m072229
10630A302248l906049k526574l53604J792243K864144K113398l13126l407271
10622b434591o050058p612026p838620o625869m296828j770536R7519J257288
10614c5273721K142739K835458L147657L377339M170293N518781O680360P345712
10606e5382Q070823R046618R169435P148919L241910p95818l367998m167577l845732
$$ plain form
10663 -8936574 -8044175 -8734835 -10502229 -12315159 -13216588 -12818279 -11463128 -9682722 -7309753
10654 -7309753 -3391626 2733631 10408682 17866217 23268933 25446797 24105241 19891640
10646 19891640 14151906 8102642 2166432 -3550340 -8204287 -10231598 -8727115 -4507296
10638 -4507296 494655 4724123 7690920 9431151 9790553 8433644 5374477 1302248
10630 1302248 -2603801 -5130375 -5483979 -3691736 -827592 1285806 972680 -2434591
10622 -2434591 -8484649 -16096675 -23935295 -30561164 -34857992 -36628528 -36531009 -35273721
10614 -35273721 -33130982 -30295524 -27147867 -23770528 -19600235 -14081454 -7401094 -55382
10606 -55382 8015441 17062059 26231494 33380413 36622323 35826505 32458507 28290930 24445198
10597B4445198l138460k360265j374746K3180J562684K478968K247119J158103
10589B5041781o0306r85259j612727j992853k133218k159419k273412k599258
10581A1225329l190941l973677m514861m171818k773065r45250M73732J136986
10573f733565J197395J046720J278372K374097L982367M953581M596757L504140
10565A6199864K617177J948785R28142l83691j282887j444908j123621l98675
10557A7060186R41546K679572M066399M603103M344351L382627J735474r7170
10549C8716088j201504j262246j009786j310476k191129l027674l301955k863485
10541B2547833j789483l74628Q96415J680509K077683K469531L041132L473164
$$ plain form
10597 24445198 21306738 18946473 17571727 17594907 19157591 21636559 23883678 25041781
10589 25041781 24981475 23996216 22383489 20390636 18257418 16097999 13824587 11225329
10581 11225329 8034388 4060711 -454150 -4625968 -7399033 -8344283 -7870551 -6733565
10573 -6733565 -5536170 -4489450 -3211078 -836981 3145386 8098967 12695724 16199864
10565 16199864 18817041 20765826 21693968 21310277 20027390 18582482 17458861 17060186
10557 17060186 18001732 20681304 24747703 29350806 33695157 37077784 38813258 38716088
10549 38716088 37514584 36252338 35242552 33932076 31740947 28713273 25411318 22547833
10541 22547833 20758350 20383722 21280137 22960646 25038329 27507860 30548992 34022156
10533C4022156L155522J884166L78806k14014M68995J612323K270521K384287
10525D5962762K350372K061268J093798l17888j188831p38363R33950L021942
10517E3179010M494420M594299L292325J180214j201760l504905m940643m433462
10509E2659498k016095P87613K770988M358525O199654P581088P693893P520925
10501H7556089Q622093J0647646J1959184J2236668J2480338J2955547J3455874
10494A69913439J5169313J9643314K6293011L3898247M3458505N4212819N6343686
10487D18932334L5340147j0489775o0901176q9062583q5743025o4092186m2329545
10480A01654191k7996533j9146920j3124417r276393o741674m531804l128187
$$ plain form
10533 34022156 37177678 39061844 39440650 39226636 39695631 41307954 43578475 45962762
10525 45962762 48313134 50374402 51468200 51150312 49961481 49223118 50157068 53179010
10517 53179010 57673430 62267729 65560054 66740268 65538508 62033603 57092960 52659498
10509 52659498 50643403 51431016 54202004 58560529 64760183 72341271 80035164 87556089
10501 87556089 96178182 106825828 118785012 131021680 143502018 156457565 169913439
10494 169913439 185082752 204726066 231019077 264917324 308375829 362588648 418932334
10487 418932334 454272481 443782706 382881530 293818947 208075922 143983736 101654191
10480 101654191 73657658 54510738 41386321 32109928 25368254 20836450 17708263
10473A7708263l324738m239812m443151m129553m317468m744081m410681l587833
10465a5489054l447481l971312l813558k226729Q1431J960749K716488K202562
10457b1986904J035143N91894J827288M053015N597732N560536M239997K107082
10449C025783o88777l740846o143141p136324o637178n115981l296024j840574
10441c1573062q83085Q9968J578488L448106N209667O510786O899181N586424
10433c133527K274524j889616m925820n717393m712018l085664j771698j205342
10425b4166554j301560j479539j178794n17737q3101j0339K92148J360680K988127
10416b4096669M483276N314346N329880M618115L413560K089587J097599Q05646
$$ plain form
10473 17708263 14383525 10143713 5700562 1571009 -2746459 -7490540 -11901221 -15489054
10465 -15489054 -18936535 -22907847 -26721405 -28948134 -28866703 -26905954 -24189466 -21986904
10457 -21986904 -20951761 -20359867 -18532579 -14479564 -8881832 -3321296 918701 3025783
10449 3025783 2337006 -1403840 -7546981 -14683305 -21320483 -26436464 -29732488 -31573062
10441 -31573062 -32456147 -32366179 -30787691 -27339585 -22129918 -15619132 -8719951 -3133527
10433 -3133527 -859003 -2748619 -7674439 -13391832 -18103850 -21189514 -22961212 -24166554
10425 -24166554 -25468114 -26947653 -28126447 -28644184 -28727285 -28737624 -28445476 -27084796 -24096669
10416 -24096669 -19613393 -14299047 -8969167 -4351052 -937492 1152095 2249694 3055340
10408C055340J216676J741009J460540q9707k409120m414192n224040m511742
10400i175236k454559K54009K508361L378134K701839R63369j254870l425292
10392f504245m909967n166501m235643k775122j584080j226506j873228l072409
10384c1347701l766577l074483j228611N66697J295260Q98914l0707q39896r94877
10375c8521981k46510R65991J595161R78582k75853p81018J41156J707747K590762
10366c1845963K449983K280458L162361M922622O321478O429379N366695L625307
10358B712320J282988j588404m111804n009457l983452k163009q90200m11346
10350a4162364q1416M42732P40321L97549k25074l93299n3917j1889q07623j783087
$$ plain form
10408 3055340 4272016 6013025 7473565 7383858 4974738 560546 -4663494 -9175236
10400 -9175236 -11629795 -11375786 -8867425 -5489291 -2787452 -1824083 -3078953 -6504245
10392 -6504245 -11414212 -16580713 -20816356 -23591478 -25175558 -26402064 -28275292 -31347701
10384 -31347701 -35114278 -38188761 -39417372 -38850675 -37555415 -36656501 -36687208 -37527104 -38521981
10375 -38521981 -38768491 -37802500 -36207339 -35228757 -35504610 -36285628 -36144472 -34436725 -31845963
10366 -31845963 -29395980 -27115522 -23953161 -19030539 -12709061 -6279682 -912987 2712320
10358 2712320 3995308 2406904 -1704900 -6714357 -10697809 -12860818 -13751018 -14162364
10350 -14162364 -14243780 -13801048 -13060727 -12663178 -12888252 -13281551 -13335468 -13347357 -14154980 -15938067
10340a5938067j813448q93837l32667j085526k429757k761073j344045J236971
10332b5361449M039311O467225Q096984Q552344P848482O464964M862568L195716
10324B4166145J587486L49433k34616j34270M37361R88556P84608n72099k466251
10315B4906353l669302l697796l383174l757084m700037n116420m270982k541628
10307f230070q91355N5822L26275J99725k98986j382831k920933m082149l945815
10298a9170317k536962r16107q5700r1773l39940m01873j84339L79221J311790
10289b2036000K310909K850926K655427J929859J137549O06140K34772m45046
10281a0755464j657539k743310k562526q79749J023351J643524R71054L61497
$$ plain form
10340 -15938067 -17751515 -18645352 -18978019 -20063545 -22493302 -25254375 -26598420 -25361449
10332 -25361449 -21322138 -14854913 -6757929 1794415 9642897 16107861 20970429 24166145
10324 24166145 25753631 26103064 25868448 25734178 26171539 27160095 27944703 27372604 24906353
10315 24906353 21237051 17539255 14156081 10398997 5698960 582540 -3688442 -6230070
10307 -6230070 -7121425 -7065603 -6739328 -6539603 -6838589 -8221420 -11142353 -15224502 -19170317
10298 -19170317 -21707279 -22623386 -22709086 -22800859 -23140799 -23542672 -23727011 -23347790 -22036000
10289 -22036000 -19725091 -16874165 -14218738 -12288879 -11151330 -10545190 -10310418 -10755464
10281 -10755464 -12413003 -15156313 -17718839 -18598588 -17575237 -15931713 -14960659 -14599162
10273a4599162P89306J833516K468824K276266J624019J099177J061601J426892
10265b019561J599297R04638n89615j888162k014712j034363R6117N62890L71594
10256d011877J81865P58685K422266M630003O080557N592746L090762l26431l251612
10247A5166964m814935m908395m009181k833424j799262o85038R08341K672390
10239c02540L581991L050302J724773O83186P3049q75841k517454m095678m655665
10230c333877m234649l786200m125472n213922o277257o320354m704294j657166
10222c9653191J693865M046829M821298M341291L303930K286488J625128J356584
10214a6177778J136475M58376q59648k440464l558125l452149j603036J836770
$$ plain form
10273 -14599162 -13809856 -11976340 -9507516 -7231250 -5607231 -4508054 -3446453 -2019561
10265 -2019561 -420264 484374 -105241 -1993403 -4008115 -5042478 -4946361 -4383471 -4011877
10256 -4011877 -3830012 -3071327 -649061 3980942 10061499 15654245 18745007 18418576 15166964
10247 15166964 10352029 5443634 1434453 -1398971 -3198233 -3883271 -2974930 -302540
10239 -302540 3279451 6329753 8054526 8737712 8810761 7934920 5417466 1321788 -3333877
10230 -3333877 -7568526 -11354726 -15480198 -20694120 -26971377 -33291731 -37996025 -39653191
10222 -39653191 -37959326 -33912497 -29091199 -24749908 -21445978 -19159490 -17534362 -16177778
10214 -16177778 -15041303 -14582927 -15442575 -17883039 -21441164 -24893313 -26496349 -24659579
10206b4659579N693481Q176517Q007607N236874J021996l141427n955637o607301
10198a2227469n082747k260551N59703K360735K764427K016388Q52737J70313
10190a0846464M54467J471979K632790L523068L915927L518443K172332L26512
10182G169054j086054j425074q24952J38347J033343J775557K514656L462448
10174A2757325M635881N615187N696701M449578K110668n49909k637242l508402
10166B8569787l108884k102614j434380j545855k097381k488709k415217j840665
10158A1536082q17152L24756Q55587J81618j474721l204243m232978m432669m125983
10149e389703l702408l400545l127485k435215r92469Q23828K121841K424741
$$ plain form
10206 -24659579 -18966098 -10789581 -2781974 2454900 3476896 335469 -5620168 -12227469
10198 -12227469 -17310216 -19570767 -19011064 -16650329 -13885902 -11869514 -11016777 -10846464
10190 -10846464 -10391997 -8920018 -6287228 -2764160 1151767 4670210 6842542 7169054
10182 7169054 6083000 4657926 3832974 3971321 5004664 6780221 9294877 12757325
10174 12757325 17393206 23008393 28705094 33154672 35265340 34715431 32078189 28569787
10166 28569787 25460903 23358289 21923909 20378054 18280673 15791964 13376747 11536082
10158 11536082 10718930 11043686 11899273 12080891 10606170 7401927 3168949 -1263720 -5389703
10149 -5389703 -9092111 -12492656 -15620141 -18055356 -19047825 -18223997 -16102156 -13677415
10141a3677415K089942J587148P20389r69244l154624m610031m363575k714170
10133b5091580q91557J82358O32711J205529K287883L430613L805566L065540
10125a1372937J698654N53315J18904L11993P99982J324407J753964K061507K311836
10116d38375K499138K377496J727974R09959P89234J747476K957555L119419J930540
10107A7620416M03265l60979k64672R7690L19246K82117k47369j420525k694486
10098A3734703l035508k012029l57694P64379P92752q6046j445546k893291l998358
10089A463362m339115l719762k262355l90957J167734J624875P64343o42366j351876
10080g686117p14932Q62389K472301L478568L686945L036758J441756r89637l680179
$$ plain form
10141 -13677415 -11587473 -10000325 -9279936 -10249180 -13403804 -18013835 -22377410 -25091580
10133 -25091580 -25983137 -25800779 -25168068 -23962539 -21674656 -18244043 -14438477 -11372937
10125 -11372937 -9674283 -9120968 -9002064 -8690071 -7890089 -6565682 -4811718 -2750211 -438375
10116 -438375 2060763 4438259 6166233 7076192 7865426 9612902 12570457 15689876 17620416
10107 17620416 18023681 17662702 17398030 17495720 17814966 18097083 17849714 16429189 13734703
10098 13734703 10699195 8687166 8329472 9093851 9886603 9800557 8355011 5461720 1463362
10089 1463362 -2875753 -6595515 -8857870 -9248827 -8081093 -6456218 -5691875 -6334241 -7686117
10080 -7686117 -8401049 -7538660 -5066359 -1587791 2099154 5135912 6577668 5588031 1907852
10071A907852n674556o175538n130598l282801j548811l28935N43895J278935
10063a8410557J750100J701423J204955P86862J053482K148595L527477M304214
10055a933449L952105K760742J602383J184356J459955J749201J473603P61117
10047A3010013J98699n0610o07424k049728l905012m958733m605561l380530j986201
10038h335087m15202J477622L025123L144884J636904m91347k050316k610303
10030d617722k455709k076864j782299j457873p02226M75568J254043Q40264l63008
10021a0885826j102839q53015l23379k11433k56732J9998L71045K91938m4851
10012a2995094k2887N37451J311904J994278K292864J715125J09406j681283k440941
$$ plain form
10071 1907852 -3766704 -9942242 -15072840 -18355641 -19904452 -20233387 -19689492 -18410557
10063 -18410557 -16660457 -14959034 -13754079 -12967217 -11913735 -9765140 -6237663 -1933449
10055 -1933449 2018656 4779398 6381781 7566137 9026092 10775293 12248896 13010013
10047 13010013 13208712 13158102 12550678 10500950 6595938 1637205 -2968356 -6348886 -8335087
10038 -8335087 -8750289 -7272667 -4247544 -1102660 534244 42897 -2007419 -4617722
10030 -4617722 -7073431 -9150295 -10932594 -12390467 -13092693 -12617125 -11363082 -10522818 -10885826
10021 -10885826 -11988665 -12841680 -13165059 -13376492 -13633224 -13613226 -13242181 -12950243 -12995094
10012 -12995094 -13017981 -12480530 -11168626 -9174348 -6881484 -5166359 -5056953 -6738236 -9179177
10003i179177j945645j167468j092494j888668l262102m933102o447805p043322
9995c6959783o170965m008895j269090J309847L172433L969721L689505K741729
9987c3525498J806771J549578K276073L600236M542583M331552L205140K200042
9979a0013523K115126K861811L735367L997314L253355J714103K12767l99705
9971G476615q0160L84352K47188n42791j560602k403662k819495k645176j848340
9962c792071n17562J203466K966648M084983L972639K824238J488978N57987l8984
9953A2750322m42108m45017m7430L6659r81743k924239m668118n200998m397591
9944f320263k868048j395744n33836m09380p02368q71757n18502L81774J501040
$$ plain form
10003 -9179177 -11124822 -12292290 -13384784 -15273452 -18535554 -23468656 -29916461 -36959783
9995 -36959783 -43130748 -47139643 -48408733 -47098886 -43926453 -39956732 -36267227 -33525498
9987 -33525498 -31718727 -30169149 -27893076 -24292840 -19750257 -15418705 -12213565 -10013523
9979 -10013523 -7898397 -5036586 -1301219 2696095 5949450 7663553 7876320 7476615
9971 7476615 7396455 7780807 8027995 7485204 5924602 3520940 701445 -1943731 -3792071
9962 -3792071 -4309633 -3106167 -139519 3945464 7918103 10742341 12231319 12789306 12750322
9953 12750322 12308214 11863197 11815767 11852426 10870683 7946444 3278326 -1922672 -6320263
9944 -6320263 -9188311 -10584055 -11117891 -11527271 -12229639 -13101396 -13619898 -13238124 -11737084
9935a1737084K376539K678222K326336J401796Q6524j221566j926705j619443
9927g635381m07843J231668K716477L311346K287867k55997k923139m063448l362420
9918i100870j868025m95463P86203K204243L446781M053165L944598L229560K038829
9909H239021Q73732N15080J143406J994422K211839J595044L30775j398155l442215
9900A2062949o211067j1168981j9114807k7098238k8912482k0872843o595516
9893a07910985N848312J1428899J1339124R261355O984853M461389J987013M51745
9885e6148295J61684P53332J941792L433226M450923M294208L324789K723371
9877c5064970L192940M272279M916050M519458L454861K735509L013092L891977
$$ plain form
9935 -11737084 -9360545 -6682323 -4355987 -2954191 -2867667 -4089233 -6015938 -7635381
9927 -7635381 -8043224 -6811556 -4095079 -783733 1504134 1248137 -1675002 -5738450 -9100870
9918 -9100870 -10968895 -11464358 -10678155 -8473912 -5027131 -973966 2970632 6200192 8239021
9909 8239021 9112753 9627833 10771239 12765661 14977500 16572544 16903319 15505164 12062949
9900 12062949 5851882 -5317099 -24431906 -51530144 -80442626 -101315469 -107910985
9893 -107910985 -102062673 -90633774 -79294650 -70033295 -63048442 -58587053 -56600040 -56148295
9885 -56148295 -55986611 -55233279 -53291487 -49858261 -45407338 -41113130 -37788341 -35064970
9877 -35064970 -31872030 -27599751 -22683701 -18164243 -14709382 -11973873 -8960781 -5068804
9869e068804M489418M576314M650484M900333M845860M274586L781125L837531
9861C0286847L887350L011788J178284p34424j933257k266667k011844j593609
9853B9824468j403681j516412j646336j595926j544083j690696j928849k162269
9845A6336216k631794l553436m643966n302299n063591l740684j581577M05756
9837i775375Q51994o27638k770364l882277l487775k344845j236212m08378R7371
9828b3583499L75699Q72303J947568L160176L578460K861563J499856Q962j453736
9819a0732648k588378k804503j927977n74464M99674J047591J116492O53847k65446
9810a5575812j104404j197055m08866P03603J344461J068023J11222p75232r85395
$$ plain form
9869 -5068804 -579386 3996928 8647412 13547745 18393605 22668191 26449316 30286847
9861 30286847 34174197 37185985 38364269 37629845 35696588 33429921 31418077 29824468
9853 29824468 28420787 26904375 25258039 23662113 22118030 20427334 18498485 16336216
9845 16336216 13704422 10150986 5507020 204721 -4858870 -8599554 -10181131 -9775375
9837 -9775375 -8923381 -9551019 -12321383 -16203660 -19691435 -22036280 -23272492 -23680870 -23583499
9828 -23583499 -23207800 -22335497 -20387929 -17227753 -13649293 -10787730 -9287874 -9278912 -10732648
9819 -10732648 -13321026 -16125529 -18053506 -18627970 -18128296 -17080705 -15964213 -15310366 -15575812
9810 -15575812 -16680216 -17877271 -18286137 -17582534 -16238073 -15170050 -15058828 -15834060 -16819455
9801a6819455o15758k74561m25381j111829k137180l080058l203495j932521L69009
9792b9231229K520526L661733L943277L916980L660532K828868J256819q44978
9784h287472l064881m816623n386112m372484k121854M62980K525110L625621
9776b1435715L773996L338844K782499K244115J478735L69855o82480j123758
9768i253909q39860j44639O39322J247022J269561L73305j178437k568486l147614
9759a3603735k899461k126871j006233L08025J362391J561936P35779n86186j528974
9750a7783329j501730n41807Q49988K156504L123791L634856L449810K287019
9742d324898K46390j987892l538323l947396l377932k310729j175585k10564N24912
$$ plain form
9801 -16819455 -17435213 -17709774 -18135155 -19246984 -21384164 -24464222 -27667717 -29600238 -29231229
9792 -29231229 -26710703 -23048970 -19105693 -15188713 -11528181 -8699313 -7442494 -8287472
9784 -8287472 -11352353 -16168976 -21555088 -25927572 -28049426 -27586446 -25061336 -21435715
9776 -21435715 -17661719 -14322875 -11540376 -9296261 -7817526 -7447671 -8130151 -9253909
9768 -9253909 -10093769 -10238408 -9599086 -8352064 -7082503 -6709198 -7887635 -10456121 -13603735
9759 -13603735 -16503196 -18630067 -19636300 -19328275 -17965884 -16403948 -15668169 -16254355 -17783329
9750 -17783329 -19285059 -19826866 -18976878 -16820374 -13696583 -10061727 -6611917 -4324898
9742 -4324898 -4078508 -6066400 -9604723 -13552119 -16930051 -19240780 -20416365 -20626929 -20102017
9733b0102017J070254J417254J480981J375688J627185K699891M134482M564400
9725a731882L046819K19239k309254l620303m040149m098822l694214k661732
9717a8890298j581914j364971k210570l457108m317369m313881l155553q21250
9709d0112914K080536M471348N555339N243686L868984J851764k75057j914059
9701a9230373k730944k777764k242010j341644n01537k08762m50699o25206l21434
9692c0430373M5898k66478j312166k256253k192678r46831R34299K793863M361847
9683b9268872N658078O481275O255479M717633K696629J683939K298036L455586
9675C977783L442326J695505p53129k468519k916481k642741k481427k647212
$$ plain form
9733 -20102017 -19031763 -17614509 -16133528 -14757840 -13130655 -10430764 -6296282 -1731882
9725 -1731882 1314937 1534176 -775078 -4395381 -8435530 -12534352 -16228566 -18890298
9717 -18890298 -20472212 -21837183 -24047753 -27504861 -31822230 -36136111 -39291664 -40112914
9709 -40112914 -38032378 -33561030 -28005691 -22762005 -18893021 -17041257 -17316314 -19230373
9701 -19230373 -21961317 -24739081 -26981091 -28322735 -28824272 -29033034 -29483733 -30108939 -30430373
9692 -30430373 -30384475 -30650953 -31963119 -34219372 -36412050 -37358881 -36424582 -33630719 -29268872
9683 -29268872 -23610794 -17129519 -10874040 -6156407 -3459778 -1775839 522197 3977783
9675 3977783 7420109 9115614 8362485 5893966 2977485 334744 -2146683 -4793895
9667d793895k460881j044963J522987L902741M680369L836385K682947K312870
9659A0638560K490776K221547J050499m98342j571804j768652j364209j035281
9651A0163094j360770k360032l432280l865068l470895k657851j845901r27891
9643i757594N49759K649278M599955N257084M109119J835430j82646r49716n31257
9634G579412K20763N09778K07385k12889k38221J62541M74173K8788j470200l658528
9624C603002n652758o579506o154136m818276l287490k000882j054096m89831
9616b6433973l41397l65782o4945Q29189K088906L374898M641911N880098O642950
9607c748145O249876M524070K115055Q4229o99153K9002J687959L070013L303297
$$ plain form
9667 -4793895 -7254776 -8299739 -6776752 -2874011 1806358 5642743 8325690 10638560
9659 10638560 13129336 15350883 16401382 15903040 14331236 12562584 11198375 10163094
9651 10163094 8802324 6442292 3010012 -855056 -4325951 -6983802 -8829703 -9757594
9643 -9757594 -9207835 -6558557 -1958602 3298482 7407601 9243031 9060385 8110669 7579412
9634 7579412 7800175 8309953 8517338 8304449 8066228 8228769 8702942 8731730 7261530 3603002
9624 3603002 -2049756 -8629262 -14783398 -19601674 -22889164 -24890046 -25944142 -26433973
9616 -26433973 -26775370 -27141152 -27206097 -26376908 -24288002 -20913104 -16271193 -10391095 -3748145
9607 -3748145 2501731 7025801 9140856 9225085 8525932 8554934 10242893 13312906 16616203
9598A6616203K751822K538060K996766L108714J849636l56897k139885k880288
9590B4484131l182910l636972l855867l110658j410102N13912J974268K595523
9582A4371325K057193K34400k290860m381974n328264n397968n148082m476046
9574a0360276k829634l19241J884206K556289J624914J27631q91967j154826q88144
9565a0251048k22998Q95422K376498L834781M758485M693985L385094J032208
9557A0502427j534927l238821l564501k950041k255560j902648j634746j037224
9549g616041j26021N88404N27179m55274j903594l096118l608747l529818l101857
9540b2321887k293818q85702J107802L312534N296135O809875P710438P844666
$$ plain form
9598 16616203 19368025 21906085 24902851 28011565 29861201 29504304 27364419 24484131
9590 24484131 21301221 17664249 13808382 10697724 9287622 9801534 11775802 14371325
9582 14371325 16428518 16662918 14372058 9990084 4661820 -736148 -5884230 -10360276
9574 -10360276 -13189910 -13509151 -11624945 -9068656 -7443742 -7316111 -8208078 -9362904 -10251048
9565 -10251048 -10474046 -9578624 -7202126 -3367345 1391140 6085125 9470219 10502427
9557 10502427 8967500 5728679 2164178 -785863 -3041423 -4944071 -6578817 -7616041
9549 -7616041 -7742062 -7153658 -6626479 -7081753 -8985347 -12081465 -15690212 -19220030 -22321887
9540 -22321887 -24615705 -25501407 -24393605 -21081071 -15784936 -8975061 -1264623 6580043
9532F580043P116967N565066L323233O40482k009330l973914m695463l963289
9524H583795k043865K29601J650937J443356R8849r41157p54949J74494Q47327
9515I288388J149560J759074K790002L320385K593138J135711J55132O3038J28502
9506B2382930m30144j485671k306742k483185k233973j928446j664123j428570
9498H422076j409178j836640k556334l062379l099738l004545l194190l444976
9490a3185904l021396j605838J44528J131270Q05644m33359j648961k029104j333645
9481b1176765j9530J018140J086329K90789n52486p15964k13511M40333R53514
9472a8889151J407553J707717J394341L55092o56385q33894n61518j147444l092723
$$ plain form
9532 6580043 13697010 19262076 22585309 23225791 21216461 17242547 12547084 8583795
9524 8583795 6539930 6769531 8420468 9863824 9962673 9021516 8266567 8441061 9288388
9515 9288388 10437948 12197022 14987024 18307409 20900547 22036258 22191390 22254428 22382930
9506 22382930 21952786 20467115 18160373 15677188 13443215 11514769 9850646 8422076
9498 8422076 7012898 5176258 2619924 -442455 -3542193 -6546738 -9740928 -13185904
9490 -13185904 -16207300 -17813138 -17668610 -16537340 -15731696 -16165055 -17814016 -19843120 -21176765
9481 -21176765 -21196295 -20178155 -19091826 -18801037 -19353523 -20069487 -20282998 -19842665 -18889151
9472 -18889151 -17481598 -15773881 -14379540 -14024448 -14680833 -15514727 -16076245 -17223689 -20316412
9463b0316412n202747n823790m562686k391420m79083N33085M85026k48336o74383
9454c8680746J08269J905800L628028M606157N160722N685466N827062N045117
9446f714125L527382J953997N43315j129195l354081n711339p360860p710580
9438b5955486o757225m906299k538673J84252L018007N312946O372793O190784
9430a9078901N445492M608536L451437J692875k67640j677071k229582k127030
9422a0181884j560726o25856L18019O80020J67300r12414j871575k058590j263420
9413a7309126M6804J098232J653745K165991K757824K556915P89244j749326l259786
9404a1249483l015603j960831j049750o857J708165L604639M746002N118735N448349
$$ plain form
9463 -20316412 -25519159 -31342949 -35905635 -38297055 -38776138 -38243053 -37758027 -38006363 -38680746
9454 -38680746 -38572477 -36666677 -33038649 -28432492 -23271770 -17586304 -11759242 -6714125
9446 -6714125 -3186743 -1232746 -689431 -1818626 -5172707 -10884046 -18244906 -25955486
9438 -25955486 -32712711 -37619010 -40157683 -39973431 -36955424 -31642478 -25269685 -19078901
9430 -19078901 -13633409 -9024873 -5573436 -3880561 -4148201 -5825272 -8054854 -10181884
9422 -10181884 -11742610 -12368466 -12050447 -11370427 -11203127 -12115541 -13987116 -16045706 -17309126
9413 -17309126 -17262322 -16164090 -14510345 -12344354 -9586530 -7029615 -6240371 -7989697 -11249483
9404 -11249483 -14265086 -16225917 -17275667 -17282524 -15574359 -11969720 -7223718 -2104983 3343366
9395C343366N854266N606630M252200K182991m5579k167274l660749l545526j453724
9386A0366601J419084L138791K837439J290339k35461j182592j645287j687786
9378A4301128j238687n05193K855L653k57147l65099j90029J64079O46185J222838
9368A3784583J646805J570373R50672J16856o71436j559250k836664m404848n602485
9359B994606n586626l976092j291598J239730K546811K531479J950395J469508
9351A878213J033055K43442r11227j965174k471879k341996j755196r64318j64385
9342g419465O24826J527820K545523L421698L932034M124998L993246L099013
9334A5849693J026734j761342m033185m983835m961890m777247m678604m375146
$$ plain form
9395 3343366 9197632 14804262 19056462 21239453 21193874 19026600 15365851 11820325 10366601
9386 10366601 11785685 14924476 17761915 19052254 18816793 17634201 15988914 14301128
9378 14301128 13062441 12557248 12560103 12563756 12306609 11941510 11751481 11915560 12561745 13784583
9368 13784583 15431388 17001761 17952433 18069289 17397853 15838603 13001939 8597091 2994606
9359 2994606 -2592020 -6568112 -7859710 -6619980 -4073169 -1541690 408705 1878213
9351 1878213 2911268 3154710 2243483 278309 -2193570 -4535566 -6290762 -7255080 -7419465
9342 -7419465 -6794639 -5266819 -2721296 700402 4632436 8757434 12750680 15849693
9334 15849693 16876427 15115085 11081900 6098065 1136175 -3641072 -8319676 -12694822
9326a2694822l732141k926572k049763j070981k07626J35056p2077l28832j75627
9317b3123385L40868Q77562J188844J180494Q62449M35185J67556k543m55705
9308a8528675j204183j506276o03262J274947L078054M103679M568036M908572
9300c909108M961452M188774K549871P84227k63370m63804m47689q19936j402978
9291E177439j431528n96474L13865J46490j257559k809442l432712l230174l055259
9282a0175354l152487k767545j246032Q96393K379118K521211J874051J465289
9274h205356J701326K157269K198541J524660K20233j369038k736068l464022
9266g972455l535439l259660k866043k402521k064112k207199k760959k963836
$$ plain form
9326 -12694822 -16426963 -19353535 -21403298 -22474279 -22681905 -22546849 -22618926 -22947758 -23123385
9317 -23123385 -22782517 -21904955 -20716111 -19535617 -18673168 -18237983 -18070427 -18072970 -18528675
9308 -18528675 -19732858 -21239134 -21842396 -20567449 -17489395 -13385716 -8817680 -3909108
9300 -3909108 1052344 5241118 7790989 8575216 8311846 7848042 7400353 6580417 5177439
9291 5177439 3745911 3149437 3463302 3609792 2352233 -457209 -3889921 -7120095 -10175354
9282 -10175354 -13327841 -16095386 -17341418 -16445025 -14065907 -11544696 -9670645 -8205356
9274 -8205356 -6504030 -4346761 -2148220 -623560 -403327 -1772365 -4508433 -7972455
9266 -7972455 -11507894 -14767554 -17633597 -20036118 -22100230 -24307429 -27068388 -30032224
9258c0032224k128743n37762Q15208J301176J133608Q78217R06714J298546J822450
9249b4542810J947402J301670K50252l64375j98045K35763L11687k41l53921n25006
9239b1937624l93498J99390J187594K099120K484314K377932K093966J774646
9231a0114160J408881J066917P99795M99814J83410K27462R65599K180013L333306
9222E51037M174196M743188M878473M157800K425909J45835j799141k551281j783760
9213A4942256j56391Q57941J29425j944139l636399l403658j142097J908184M216906
9204A1772028M967888M379328L240434K136340J177006M07893M6318P803m08624
9195B7726414j795505l734694n156319n560479n384252n182147n003904m671817
$$ plain form
9258 -30032224 -32160967 -32698729 -31883521 -30582345 -29448737 -28570520 -27663806 -26365260 -24542810
9249 -24542810 -22595408 -21293738 -21043486 -21407861 -21605906 -21370143 -21058456 -21058697 -21412618 -21937624
9239 -21937624 -22331122 -22131732 -20944138 -18845018 -16360704 -13982772 -11888806 -10114160
9231 -10114160 -8705279 -7638362 -6838567 -6338753 -6155343 -5927881 -4962282 -2782269 551037
9222 551037 4725233 9468421 14346894 18504694 20930603 21076438 19277297 16726016 14942256
9213 14942256 14785865 15643806 15773231 13829092 10192693 6789035 5646938 7555122 11772028
9204 11772028 16739916 21119244 24359678 26496018 27673024 28080917 28127235 28135038 27726414
9195 27726414 25930909 22196215 17039896 11479417 6095165 913018 -4090886 -8762703
9187h762703m136092l382141k448805j689188j497280j540151q00556J203514
9179b3053402L620516N110131N209659M465343L491913K448901J384894N63083
9171C241038K30357L20349N99298J026955J807659L023372M291819M958410M707816
9162B4207073L838850K823566J836009R71799O20576J042538J632922J261526
9154C8234859m43805k655052m401083n521604o227463o307970n453463m078189
9146C146230l071068k673164k182055r84765N18458J324721R64458q6297j137793
9137d181275k166038l692297n779018p479886p617114n978945l373432n78103
9129d0846108K207533M716940O058025N378557K911112o9265k268443l110108
$$ plain form
9187 -8762703 -12898795 -16280936 -18729741 -20418929 -21916209 -23456360 -24256916 -23053402
9179 -23053402 -19432886 -14322755 -9113096 -4647753 -1155840 1293061 2677955 3241038
9171 3241038 3471395 3791744 4391042 5417997 7225656 10249028 14540847 19499257 24207073
9162 24207073 28045923 30869489 32705498 33677297 34297873 35340411 36973333 38234859
9154 38234859 37791054 35136002 30734919 25213315 18985852 12677882 7224419 3146230
9146 3146230 75162 -2598002 -4780057 -5764822 -5246364 -3921643 -2957185 -3043482 -4181275
9137 -4181275 -6347313 -10039610 -15818628 -23298514 -30915628 -36894573 -40268005 -40846108
9129 -40846108 -38638575 -33921635 -27863610 -22485053 -19573941 -19643206 -21911649 -25021757
9121b5021757k672717j344216M21975K286816M029811N291821N498384M338960
9113g170923K263707K00305j266241k227245k963707l376866l036782j710563
9105a9288315K29638J908395K499377J809035M30325o33539n96078N63295J951213
9096a1126654K370673J491085L86536M77412J846885L039657K708736J033969
9088B228299p57184j842454k342671k678910k871597k458993r09858J711112M301529
9079e620727N275786L991829J527154k58628l37584R35597K484979L291574K803643
9070A4093623J199172o84277k023908k649255k832309k652622j951788q20418
9062A678218K54907P55838M72884l41957r43929n38963Q06353J902890J541091
$$ plain form
9121 -25021757 -27694474 -29038690 -28616715 -26329899 -22300088 -17008267 -11509883 -7170923
9113 -7170923 -4907216 -4706911 -5973152 -8200397 -11164104 -14540970 -17577752 -19288315
9105 -19288315 -19058677 -17150282 -14650905 -12841870 -12411545 -13045084 -13641162 -13077867 -11126654
9096 -11126654 -8755981 -7264896 -6878360 -6400948 -4554063 -1514406 1194330 2228299
9088 2228299 1471115 -371339 -2714010 -5392920 -8264517 -10723510 -11633368 -9922256 -5620727
9079 -5620727 -344941 3646888 5174042 4915414 4577830 5513427 7998406 11289980 14093623
9070 14093623 15292795 14608518 12584610 9935355 7103046 4450424 2498636 1678218
9062 1678218 1933125 2688963 3161847 2819890 1875961 1336998 2143351 4046241 5587332
9053E587332k65129k459338m050235m567386l832176k089376k19698J015541J949286
9044h931179L416346N123979N538561L732251N76112k280933l883526m001023
9036g09412k568528K0364K512547L623007L287402K573804K413313K829283L238207
9027A7219987K965943J534930r48520l502371m797889m308371k802661j522108
9019C838940r47765n07732N56260K209783L603464L924384L076540J537831j39464
9010A7152241j533435k423372l011537l775212m627899m531607k675818M1378
9002e385261J560342R10171p93134j854629j761022j051642k45280L90498N64027
8993g665930K67582O2100L60614O94880L85726l11881n16941l4293M76946O65859
$$ plain form
9053 5587332 5322203 2862865 -1187370 -5754756 -9586932 -11676308 -11896006 -10880465 -8931179
9044 -8931179 -5514833 -390854 5147707 8879958 9456070 7175137 3291611 -709412
9036 -709412 -3277940 -3257576 -745029 2877978 6165380 8739184 11152497 13981780 17219987
9027 17219987 20185930 21720860 20772340 17269969 12472080 8163709 5361048 3838940
9019 3838940 2891175 2383443 2939703 5149486 8752950 12677334 15753874 17291705 17152241
9010 17152241 15618806 13195434 10183897 6408685 1780786 -2750821 -5426639 -5385261
9002 -5385261 -3824919 -2914748 -3707882 -5562511 -7323533 -8375175 -8620455 -8229957 -7665930
8993 -7665930 -7398348 -7336248 -6975634 -6280754 -5895028 -6206909 -6723850 -6758143 -6281197 -5615338
8983e615338R99902J936132L310633M777571O100032O617649N187868J417749
8975B4732198l368609p073497q674686q700727q046204o951656n292509l338938
8967b6714628j778316j069477j035143j113286q77155k99393L46736P35353P03817
8958c1101492L74947J01450J73988N09883P19542N81630L95120P34774J832719
8949b5677439L254335M225973M338443L985652M033633M882389N854914N728339
8941A0626239L961489J254468j119124k291601k113893r76900L27377Q89365L32235
8932A0889655q49514j895220k604578l256516l918571m342687m464239m405691
8924a4847361l901392k372430P0652K201428K774491J821019M26970n74162j190544
$$ plain form
8983 -5615338 -4615436 -2679304 631329 5408900 11508932 18126581 23314449 24732198
8975 24732198 21363589 14290092 5615406 -3085321 -11131525 -18083181 -23375690 -26714628
8967 -26714628 -28492944 -29562421 -30597564 -31710850 -32588005 -32887398 -32540662 -31805309 -31101492
8958 -31101492 -30726545 -30625095 -30451107 -29941224 -29221682 -28640052 -28244932 -27510158 -25677439
8949 -25677439 -22423104 -18197131 -13858688 -9873036 -5839403 -957014 4897900 10626239
8941 10626239 14587728 15842196 14723072 12431471 10317578 9340678 9668055 10557420 10889655
8932 10889655 10040141 8144921 5540343 2283827 -1634744 -5977431 -10441670 -14847361
8924 -14847361 -18748753 -21121183 -21050531 -18849103 -16074612 -14253593 -13826623 -14400785 -15591329
8915a5591329j655399j835939j498101p65102L8063Q13121J625413K278788K327802
8906a4262683J689326J046505J392537L142746N766731Q225974R647326R679072
8898B6327534Q521383O770319N027617L418855J553067q49446l323716m872851
8890D2572762m899877l822502k691189k260890k498422k934527l313506l704981
8882A6446868l994556l616676k165739j59732J298700J749992J796186K029055
8874A3384098K053891J124733o09570k232721l317865m242140n104990n181623
8866d126187l988494k319461j506260j847225k365093k074798r89064J64464P56206
8857a8295912O07919j38160j226103k398282l371748l737875l108248j620958
$$ plain form
8915 -15591329 -17246728 -19082667 -20580768 -21345870 -21307807 -20494686 -18869273 -16590485 -14262683
8906 -14262683 -12573357 -11526852 -10134315 -6991569 -1224838 7001136 16648462 26327534
8898 26327534 34848917 41619236 46646853 50065708 51618775 50769329 47445613 42572762
8890 42572762 37672885 33850383 31159194 28898304 26399882 23465355 20151849 16446868
8882 16446868 12452312 8835636 6669897 6510165 7808865 9558857 11355043 13384098
8874 13384098 15437989 16562722 15953152 13720431 10402566 6160426 1055436 -4126187
8866 -4126187 -8114681 -10434142 -11940402 -13787627 -16152720 -18227518 -19216582 -19052118 -18295912
8857 -18295912 -17687993 -17826153 -19052256 -21450538 -24822286 -28560161 -31668409 -33289367
8849c3289367j70514K73069l33758j069631j087038l91413N03149J279118J858785
8840c2427600K059238J719894J166557J109481J871803K933616L455660L194655
8832a4916696K752636K896666L693560M376268M100928K807954J266265L17304
8824G294885K50072Q99584J991731L120956L662655L174033J868177L22624j289475
8815B1295242l280956n681991p786939q646513p722173n013191j074416K813976
8807a5096961N079184N103116L853051K800233K395589K038979J234606R5328
8799G503125j145540k329444k996189k557997j103621N81302K050598L618633
8791C620867N384795O477448N860080L514228L31222k789455n204587o296254
$$ plain form
8849 -33289367 -33459881 -33186812 -33520570 -34590201 -35677239 -36068652 -35565503 -34286385 -32427600
8840 -32427600 -30368362 -28648468 -27481911 -26372430 -24500627 -21567011 -18111351 -14916696
8832 -14916696 -12164060 -9267394 -5573834 -1197566 2903362 5711316 6977581 7294885
8824 7294885 7544957 8444541 10436272 13557228 17219883 20393916 22262093 22584717 21295242
8815 21295242 18014286 12332295 4545356 -4101157 -11823330 -16836521 -17910937 -15096961
8807 -15096961 -10017777 -4914661 -1061610 1738623 4134212 6173191 7407797 7503125
8799 7503125 6357585 4028141 1031952 -1526045 -2629666 -2048364 2234 3620867
8791 3620867 9005662 15483110 21343190 24857418 25188640 22399185 17194598 10898344
8783A0898344n737078l943773j762208K09053J595357J913671J039814q3480o1169
8774D068531J375766K982465L394212K389076O39269j090577k146402k095055
8766I517285j294512r33440j781083l067302l250342j845537J11811J445071K025517
8757I27468K361320K611450K532848K116808J712226J508060J300448Q82819L70403
8748A6323850k2785l13278o49442r91354j068729o29484L34522J480721K148909
8739A6612930J766291N39484m12734p5974J234745K027012J126499j277954m095568
8730A7444731o292640p143080o183907l679774r44541N39301M90808p2228j23284
8721e964614M31107J112694J565319J590668R70637k65715j593818k416059k671017
$$ plain form
8783 10898344 5161266 1217493 -544715 -335662 1259695 3173366 4213180 4129700 4068531
8774 4068531 5444297 8426762 11820974 14210050 14849319 13758742 11612340 9517285
8766 9517285 8222773 7289333 5508250 2440948 -809394 -2654931 -2543120 -1098049 927468
8757 927468 3288788 5900238 8433086 10549894 12262120 13770180 15070628 15953447 16323850
8748 16323850 16301065 15987787 15338345 14346991 13278262 12648778 12983300 14464021 16612930
8739 16612930 18379221 18918705 18505971 18429997 19664742 21691754 22818253 21540299 17444731
8730 17444731 11152091 4009011 -2174896 -5854670 -6799211 -6259910 -5769102 -5841330 -5964614
8721 -5964614 -5533507 -4420813 -2855494 -1264826 -294189 -559904 -2153722 -4569781 -7240798
8712g240798k725797k708796k255588j005843Q18972K442751L110130K641220
8704f923749J486834K79730o53565j352829j912840k255041k194147j596309m70754
8695a5592670R46157K191884K864783K995335K951256K849837K256036P27863
8687B190481j361463k813179k627869j059020M69052O14571o83795k297419l119093
8678a0687734k983029k382482j676806r47328m29608n51219j422479k653638l815320
8669b7549643m731920n130358m419141k308759M59906K495183L036032K616845
8661c5531855K304250K471271K584287K146373J510295J510273K415583L571854
8653a7017669M148575L968284L432847K877784K273434J416886J39861j553134
$$ plain form
8712 -7240798 -9966595 -12675391 -14930979 -15936822 -15117850 -12675099 -9564969 -6923749
8704 -6923749 -5436915 -5157185 -5810750 -7163579 -9076419 -11331460 -13525607 -15121916 -15592670
8695 -15592670 -14646513 -12454629 -9589846 -6594511 -3643255 -793418 1462618 2190481
8687 2190481 829018 -1984161 -4612030 -5671050 -5201998 -4587427 -5271222 -7568641 -10687734
8678 -10687734 -13670763 -16053245 -17730051 -18677379 -19106987 -19658206 -21080685 -23734323 -27549643
8669 -27549643 -32281563 -37411921 -41831062 -44139821 -43679915 -41184732 -38148700 -35531855
8661 -35531855 -33227605 -30756334 -28172047 -26025674 -24515379 -23005106 -20589523 -17017669
8653 -17017669 -12869094 -8900810 -5467963 -2590179 -316745 1100141 1240002 -313132
8645c13132l251777m174582l843088k692239j589053p38143M16135K041615L232080
8636a0912184K898591J046514j227581k790099l151466k355095p87902Q20324
8628a6458898J699361J674713J364751J526938K236332K845176K748580K024928
8620c38119J177228L47119q70804k662862m380992n148895m976967m731050m871654
8611b6456996m744464l460941j151406J012162J839389R36835j147452l156906
8603c6329779l730801k339969K77808K865623M775885O107774O930814O920694
8595a4521951N878920M192873K545745J396483Q80914R48472J338123J558865
8587D218444J181504K43044o81856q51829R8135J823899L444271M164948L828858
$$ plain form
8645 -313132 -3564909 -7739491 -11582579 -14274818 -15863871 -16602014 -16185879 -14144264 -10912184
8636 -10912184 -8013593 -6967079 -8194660 -10984759 -14136225 -16491320 -17279222 -16458898
8628 -16458898 -14759537 -13084824 -11720073 -10193135 -7956803 -5111627 -2363047 -338119
8620 -338119 839109 1186228 315424 -2347438 -6728430 -11877325 -16854292 -21585342 -26456996
8611 -26456996 -31201460 -34662401 -35813807 -34801645 -32962256 -32025421 -33172873 -36329779
8603 -36329779 -40060580 -42400549 -42122741 -39257118 -34481233 -28373459 -21442645 -14521951
8595 -14521951 -8643031 -4450158 -1904413 -507930 372984 1321456 2659579 4218444
8587 4218444 5399948 5642992 4961136 4109307 4207442 6031341 9475612 13640560 17469418
8578A7469418K870294J788919P38688m44299j955009l743047n400963o373897
8570D950104o457589o090652n959414o235244o334795n518103l645450j321600
8562c6612743N68351J406184J130961K48568m28431k68691P46677K047757K987163
8553b8174204L331409L216115K717858J711515K50995j130955j766736j444620
8545b1288623m55898Q60593K332814L739409M738355N143799N026499M447274
8537D544222L377742K012585Q29273R4981m41503j143208k016778k860410l543130
8528H53774l798420l088337j237361R05011J980935J393775k70872k058766l464933
8519h785194m422875m972732n180634n108732m678391l750650k410541r19641
$$ plain form
8578 17469418 20339712 22128631 22867319 22423020 20468011 16724964 11324001 4950104
8570 4950104 -1507485 -7598137 -13557551 -19792795 -26127590 -31645693 -35291143 -36612743
8562 -36612743 -36044392 -34638208 -33507247 -33258679 -33687110 -33955801 -33209124 -31161367 -28174204
8553 -28174204 -24842795 -21626680 -18908822 -17197307 -16946312 -18077267 -19844003 -21288623
8545 -21288623 -21744521 -20883928 -18551114 -14811705 -10073350 -4929551 96948 4544222
8537 4544222 7921964 9934549 10763822 10858803 10417300 9274092 7257314 4396904 853774
8528 853774 -2944646 -6032983 -7270344 -6365333 -4384398 -2990623 -3261495 -5320261 -8785194
8519 -8785194 -13208069 -18180801 -23361435 -28470167 -33148558 -36899208 -39309749 -40229390
8511d0229390O62350K451624M169753M964721M171412K157880J85385n45839L16328
8502b1695776K165204L868994M511508M059960L325463L060098L095011K560780
8494D951242R50609j275518l207527m324136m583114l900753k057859O63904L109714
8485i673438L997695L085931J324972j76345j051870j524268j785778j821718
8477g624819j591287j070313k63957N87750J044088J049929J306832K581690M594772
8468F14685N959298N409944L025465L03332q75629L63598L106795N283274N419365
8459B8610127L793663J711301o3542j690562l339672m681542n430838n738068
8451A3170867n730101n164829l908957k394214j255030p75863r25174j581215
$$ plain form
8511 -40229390 -39567040 -37115416 -32945663 -27980942 -23809530 -21651650 -21466265 -22012104 -21695776
8502 -21695776 -19530572 -15661578 -11150070 -7090110 -3764647 -704549 2390462 4951242
8494 4951242 5901851 4626333 1418806 -2905330 -7488444 -11389197 -13447056 -12783152 -9673438
8485 -9673438 -5675743 -2589812 -1264840 -1441185 -2493055 -4017323 -5803101 -7624819
8477 -7624819 -9216106 -10286419 -10550376 -9962626 -8918538 -7868609 -6561777 -3980087 614685
8468 614685 6573983 11983927 15009392 15312724 14437095 14800693 17907488 23190762 28610127
8459 28610127 32403790 34115091 34051549 32360987 29021315 24339773 18908935 13170867
8451 13170867 7440766 2275937 -1633020 -4027234 -5282264 -6058127 -6983301 -8564516
8443h564516k406212k799006k337030j113392N27279K253237L533477L686251
8435g219912K717252J834537K436420M490657O346581O302987M165755J277560
8427B2351837p41840j285037j052224j199672k208946l649836m901216n653944
8419A659122n611131m342282j981639L36076J429873J316350R02114N96675k1224
8410e716066j147209k205120k676932k790274k893417k656060j486774N18809
8402b1053043K585709M093035M947063N190395M692394L329143J206296j354249
8394C636743l853380n653702o235511n503682l737750j318516J263723L235769
8386a8166306L870527L244693K336526J972747J839012J007708n37863j471906
$$ plain form
8443 -8564516 -10970728 -13769734 -16106764 -17220156 -16692877 -14439640 -10906163 -7219912
8435 -7219912 -4502660 -2668123 -231703 4258954 10605535 16908522 21074277 22351837
8427 22351837 21609997 20324960 19272736 18073064 15864118 12214282 7313066 1659122
8419 1659122 -3952009 -8294291 -10275930 -9939854 -8509981 -7193631 -6291517 -5694842 -5716066
8410 -5716066 -6863275 -9068395 -11745327 -14535601 -17429018 -20085078 -21571852 -21053043
8402 -21053043 -18467334 -14374299 -9427236 -4236841 455553 3784696 4990992 3636743
8394 3636743 -216637 -5870339 -12105850 -17609532 -21347282 -22665798 -21402075 -18166306
8386 -18166306 -14295779 -11051086 -8714560 -6741813 -4902801 -3895093 -4432956 -5904862
8378e904862o15235J441090K736630J991318j53697k035545k659277k183091j101341
8369h484010M22540K297435M005501M707112L844255J590574j216152l575103
8361C592152m916844n328670n179392m552259l196577j074023J248610K934632
8353a6472371L550095L285074K588444J775017R99109L93146M2988j44324l96294
8344d379116q03671j098485p66515N12561K429520M063708M524675L757748K665229
8335A0905654K249511K636996L129645L194172L058119L161641L369650L116704
8327C4822092K159971P59255q17393k489815m025737n014204n388669n550924
8319A4454576n703459n457953m466937l090320j975951j242805n95065l7159J72827
$$ plain form
8378 -5904862 -6520097 -5079007 -2342377 -351059 -504756 -2540301 -5199578 -7382669 -8484010
8369 -8484010 -8061470 -5764035 -1758534 2948578 6792833 8383407 7167255 3592152
8361 3592152 -1324692 -6653362 -11832754 -16385013 -19581590 -20655613 -19407003 -16472371
8353 -16472371 -12922276 -9637202 -7048758 -5273741 -4274632 -3881486 -3838498 -3982822 -4379116
8344 -4379116 -5182787 -6281272 -7047787 -6535226 -4105706 -41998 4482677 8240425 10905654
8335 10905654 13155165 15792161 18921806 22115978 25174097 28335738 31705388 34822092
8327 34822092 36982063 37741318 36923925 34434110 30408373 25394169 20005500 14454576
8319 14454576 8751117 3293164 -1173773 -4264093 -6240044 -7482849 -8077914 -8115073 -7942246
8310g942246K51889Q55777K048043K865933K356914P48739q12260j505962j446943
8301b580116j141605p26510J18779J636096L446500M562603M072903J947142q66238
8292A0469554l176932m297854m113578k797235p84528J162064K304185K430189
8284A195865J784176N45594j210665k910653l335595j628099J595839M539068
8276E75530N728330N020770L179549R22941j348927l249102m332133m364868l449640
8267a317550j946802m90146J26699m14852j372821j471134k57973J378768K248820
8258c516991K033497J141067j39097j708522l063024l371212k427972j126156
8250a2178410o39459j246190k123840k244315j409227m41517l15646j046793j607769
$$ plain form
8310 -7942246 -7690357 -6834580 -4786537 -1920604 436310 1185049 372789 -1133173 -2580116
8301 -2580116 -3721721 -4448231 -4329452 -2693356 753144 5315747 9388650 11335792 10469554
8292 10469554 7292622 2994768 -1118810 -3916045 -4700573 -3538509 -1234324 1195865
8284 1195865 2980041 3525635 2314970 -595683 -3931278 -5559377 -3963538 575530
8276 575530 6303860 11324630 14504179 15427120 14078193 10829091 6496958 2132090 -1317550
8267 -1317550 -3264352 -3754498 -3627799 -4042651 -5415472 -6886606 -7144579 -5765811 -3516991
8258 -3516991 -1483494 -342427 -481524 -2190046 -5253070 -8624282 -11052254 -12178410
8250 -12178410 -12817869 -14064059 -16187899 -18432214 -19841441 -20282958 -20598604 -21645397 -23253166
8241b3253166j104458K00684J325855J749393J648331J173393K56988p64145j152857
8232a9919982p92027m97972p42734o88907O81837K879416M322676M342829L758412
8223f656452L278908K386802M46544j820992k888972k210095o88605N79678J328623
8214f244561J741814J719727J013864j65802j116790j242936n17176N96929J504313
8205b710618J773642J265648J19541j315775k516848k889235k131796o56711N44885
8196h517267P46797K20259m3506O43634K051801L388702M020720L790458K917137
8187I218735J842060J054345P83167P85431N50265k39517j480107k822143l962155
8178E730081m767394n223599n326896n038397m362752l431152k375474j098368
$$ plain form
8241 -23253166 -24357624 -24156940 -22831085 -21081692 -19433361 -18259968 -18002980 -18767125 -19919982
8232 -19919982 -20712009 -21209981 -21952715 -22641622 -21959785 -19080369 -14757693 -10414864 -6656452
8223 -6656452 -3377544 -990742 -544198 -2365190 -5254162 -7464257 -8152862 -7573184 -6244561
8214 -6244561 -4502747 -2783020 -1769156 -1934958 -3051748 -4294684 -4811860 -4214931 -2710618
8205 -2710618 -936976 328672 448213 -867562 -3384410 -6273645 -8405441 -9062152 -8517267
8196 -8517267 -7770470 -7550211 -7593717 -6950083 -4898282 -1509580 2511140 6301598 9218735
8187 9218735 11060795 12115140 12898307 13683738 14234003 13994486 12514379 9692236 5730081
8178 5730081 962687 -4260912 -9587808 -14626205 -18988957 -22420109 -24795583 -25893951
8170b5893951O11045K553547L908747L913770K786340J654704J404669J810099
8162g251030K015836J727682J606278K400579L873064M758629L826939J001216
8154A3959193k473975m870176n078809l247659o62049J082227J228022M52533
8146C89307J46648R09879J953523K201173J657412J191549J123328P22414o58555
8137I636678k503669l613114l361832k103347n85878N76226J012901P37702K79095
8128G4762K77154P70246J128874Q46826K16690R1858J079757K967190M735768
8119A2189125N146288L665835J049316j197750k162008k217758k286419k727501
8111A1459128l309503l988543n037334o266517o728134n680505l589043j683965
$$ plain form
8170 -25893951 -25282906 -22729359 -18820612 -14906842 -12120502 -10465798 -9061129 -7251030
8162 -7251030 -5235194 -3507512 -1901234 499345 4372409 9131038 12957977 13959193
8154 13959193 11485218 6615042 1536233 -1711426 -2373475 -1291248 -63226 389307
8146 389307 535955 1445834 3399357 5600530 7257942 8449491 9572819 10295233 9636678
8137 9636678 7133009 3519895 158063 -1945284 -2531162 -1954936 -942035 -204333 74762
8128 74762 351916 1122162 2251036 3097862 3314552 3406410 4486167 7453357 12189125
8119 12189125 17335413 21001248 22050564 20852814 18690806 16473048 14186629 11459128
8111 11459128 8149625 4161082 -876252 -7142769 -13870903 -19551408 -23140451 -24824416
8103b4824416n91238J50826J157512K231857K620602K011198R68840M14695Q24574
8094a5035550J864194K641592K381921J075476m76275j358828j337133r52729
8086a1197332r25111j522675k355281k572900j410409J058552L595975M581975
8078a0747206L462748J354710n889J06134R37928J281440O76862m02272j201509
8069d537054j243892m08622J117836K769800L698970L285133J666712l25346j795755
8060D227782k302414j866288p65014N57875J612181K161535K391053K651687L084654
8051A1753051L560071L816534L503579K294869K80708j819939l158364l504819
8043A6725690l306730l087913l092269l436586m135363m820335m820201l777858
$$ plain form
8103 -24824416 -25415654 -25264828 -24107316 -21875459 -19254857 -17243659 -16274819 -15860124 -15035550
8094 -15035550 -13171356 -10529764 -8147843 -7072367 -7548642 -8907470 -10244603 -11197332
8086 -11197332 -12122443 -13645118 -16000399 -18573299 -19983708 -18925156 -15329181 -10747206
8078 -10747206 -7284458 -5929748 -5935637 -5829503 -4891575 -3610135 -2933273 -3335545 -4537054
8069 -4537054 -5780946 -6189568 -5071732 -2301932 1397038 4682171 6348883 6023537 4227782
8060 4227782 1925368 59080 -705934 -148059 1464122 3625657 6016710 8668397 11753051
8051 11753051 15313122 19129656 22633235 24928104 25208812 23388873 20230509 16725690
8043 16725690 13418960 10331047 7238778 3802192 -333171 -5153506 -9973707 -13751565
8035a3751565j983590L1468J952179L572433M555106M581732L576790J652409
8027D186962q68412l187602m227757l579566k084316j038304q68479r03173l37795
8018a2908442R13472K218084K703423J815211j92045k306462l634623m232797
8010a5624179m774677n477207n777858n094417l492239j541587P9534P86751M10175
8001d0505704m32325o62954K66511J945088L681481N216932O536454P437389P760322
$$ plain form
8035 -13751565 -15735155 -15703687 -13751508 -10179075 -5623969 -1042237 2534553 4186962
8027 4186962 3318550 130948 -4096809 -7676375 -9760691 -10798995 -11667474 -12570647 -12908442
8018 -12908442 -11994970 -9776886 -7073463 -5258252 -5450297 -7756759 -11391382 -15624179
8010 -15624179 -20398856 -25876063 -31653921 -36748338 -40240577 -41782164 -41702630 -40915879 -40505704
8001 -40505704 -40938029 -41600983 -41334472 -39389384 -35707903 -30490971 -23954517 -16517128 -8756806
$$ [...]
##END NTUPLES=NMR SPECTRUM
##END=
